##TITLE=1H_EC-3264(9-3)
 CDCl3
 8 sc, 
 17.1.2022
##JCAMPDX= 6.0         $$ Bruker NMR JCAMP-DX V2.0
##DATA TYPE= NMR SPECTRUM
##DATA CLASS= NTUPLES
##ORIGIN= UXNMR, Bruker Analytische Messtechnik GmbH
##OWNER= root
$$ XWIN-NMR		Version 3.5
$$ Mon Jan 17 10:31:16 2022 Russian Standard Time (UT+4h)  she@DPX200
##.OBSERVE FREQUENCY= 200.131346
##.OBSERVE NUCLEUS= ^1H
##.ACQUISITION MODE= SIMULTANEOUS
##.ACQUISITION SCHEME= undefined
##.AVERAGES= 8
##.DIGITISER RES= 18
##SPECTROMETER/DATA SYSTEM= spect
##.PULSE SEQUENCE= zg30
##.SOLVENT NAME= DMSO
##.SHIFT REFERENCE= (INTERNAL, DMSO, 0, 15.7171)
##AUDIT TRAIL= $$ (NUMBER, WHEN, WHO, WHERE, WHAT)
$$ ##TITLE= Audit trail, XWIN-NMR		Version 3.5
$$ ##JCAMPDX= 5.01
$$ ##ORIGIN= Bruker BioSpin GmbH
$$ ##OWNER= she
$$ F:/spectra/data/she/nmr/H-F/1/pdata/1/auditp.txt
$$ ##AUDIT TRAIL=  $$ (NUMBER, WHEN, WHO, WHERE, WHAT)
(   1,<2022-01-17 10:30:02.01 +0400>,<she>,<DPX200>,
      <created by zg, POWCHK disabled, PULCHK disabled
       configuration hash MD5:
       00 E9 B6 7A A2 85 ED C7 34 08 36 98 17 FE 4E 26
       data hash MD5: 16K
       AC 23 4D 35 89 DB 0E 8D C1 43 A6 99 B3 F8 AA 21>)
(   2,<2022-01-17 10:30:04.37 +0400>,<she>,<DPX200>,
      <Start of raw data processing
       efp BC_mod = 2 LB = 0.24 FT_mod = 6 PKNL = 1 PHC0 = -15954.77 PHC1 = 19.00078 SI = 16K 
       data hash MD5: 16K
       C2 73 3E 66 48 AF B4 04 EA 8D 04 E0 20 2E 56 25>)
(   3,<2022-01-17 10:30:21.48 +0400>,<she>,<DPX200>,
      <pk PHC0 = 86.86775 PHC1 = -5.199999 
       data hash MD5: 16K
       CA B3 6B 6A 00 2A 86 28 06 48 59 2C A4 10 E5 6D>)
(   4,<2022-01-17 10:30:24.53 +0400>,<she>,<DPX200>,
      <abs ABSG = 5 
       data hash MD5: 16K
       59 91 D9 2C 7A 3C FA E1 D7 8A 5C 79 DA 36 39 44>)
$$ ##END=
$$ 
$$ hash MD5
$$ A1 80 F2 87 90 B3 F3 FE 12 EE BA 86 DF B3 3A 85
##$RELAX= 
##$RELAX= 
##$RELAX= 
##$RELAX= 
##$RELAX= 
##$RELAX= 
$$ Bruker specific parameters
$$ --------------------------
##$DU= <F:/spectra>
##$EXPNO= 1
##$NAME= <H-F>
##$PROCNO= 1
##$TYPE= <nmr>
##$USER= <she>
##$AMP= (0..31)
100 100 100 100 100 100 100 100 100 100 100 100 100 100 100 100 100 100 
100 100 100 100 100 100 100 100 100 100 100 100 100 100 
##$AQSEQ= 0
##$AQ_mod= 1
##$AUNM= <au_zg>
##$AUTOPOS= <>
##$BF1= 200.13
##$BF2= 200.13
##$BF3= 200.13
##$BF4= 200.13
##$BF5= 200.13
##$BF6= 200.13
##$BF7= 200.13
##$BF8= 200.13
##$BYTORDA= 1
##$CFDGTYP= 0
##$CFRGTYP= 5
##$CHEMSTR= <none>
##$CNST= (0..31)
1 1 145 1 1 1 1 1 1 1 1 1 1 1 1 1 1 1 1 1 1 1 1 1 1 1 1 1 1 1 1 1 
##$CPDPRG= <>
##$CPDPRG1= <>
##$CPDPRG2= <>
##$CPDPRG3= <>
##$CPDPRG4= <mlev>
##$CPDPRG5= <mlev>
##$CPDPRG6= <mlev>
##$CPDPRG7= <mlev>
##$CPDPRG8= <mlev>
##$CPDPRGB= <>
##$CPDPRGT= <>
##$D= (0..31)
0 1.2 0 0 0 0 0 0 0 0.06 0 0.03 0 0 0 0 0.0002 0 0 0 0 0 0 0 0 0 0 0 0 
0 0 0 
##$DATE= 1642401001
##$DBL= (0..7)
120 120 120 120 120 120 120 120 
##$DBP= (0..7)
150 150 150 150 150 150 150 150 
##$DBP07= 0
##$DBPNAM0= <>
##$DBPNAM1= <>
##$DBPNAM2= <>
##$DBPNAM3= <>
##$DBPNAM4= <>
$$ [...]
##$SUBNAM2= <"">
##$SUBNAM3= <"">
##$SUBNAM4= <"">
##$SUBNAM5= <"">
##$SUBNAM6= <"">
##$SUBNAM7= <"">
##$SUBNAM8= <"">
##$SUBNAM9= <"">
##$SW= 18.0517287032376
##$SWIBOX= (0..15)
0 0 2 0 0 0 0 0 0 0 0 0 0 0 0 0 
##$SW_h= 3612.71676300578
##$TD= 16384
##$TD0= 1
##$TE= 0
##$TE2= 300
##$TE3= 300
##$TEG= 300
##$TL= (0..7)
0 120 120 120 120 120 120 120 
##$TP= (0..7)
150 150 150 150 150 150 150 150 
##$TP07= 0
##$TPNAME0= <>
##$TPNAME1= <>
##$TPNAME2= <>
##$TPNAME3= <>
##$TPNAME4= <>
##$TPNAME5= <>
##$TPNAME6= <>
##$TPNAME7= <>
##$TPOAL= (0..7)
0.5 0.5 0.5 0.5 0.5 0.5 0.5 0.5 
##$TPOFFS= (0..7)
0 0 0 0 0 0 0 0 
##$TUNHIN= 0
##$TUNHOUT= 0
##$TUNXOUT= 0
##$USERA1= <user>
##$USERA2= <user>
##$USERA3= <user>
##$USERA4= <user>
##$USERA5= <user>
##$V9= 5
##$VALIST= <valist>
##$VCLIST= <CCCCCCCCCCCCCCC>
##$VD= 0
##$VDLIST= <DDDDDDDDDDDDDDD>
##$VPLIST= <PPPPPPPPPPPPPPP>
##$VTLIST= <TTTTTTTTTTTTTTT>
##$WBST= 1024
##$WBSW= 4
##$XGAIN= (0..3)
0 0 0 0 
##$XL= 0
##$YL= 0
##$YMAX_a= 178281
##$YMIN_a= -247450
##$ZGOPTNS= <>
##$ZL1= 120
##$ZL2= 120
##$ZL3= 120
##$ZL4= 120
##$ABSF1= 15.65104
##$ABSF2= -2.400807
##$ABSG= 5
##$ABSL= 3
##$ALPHA= 0
##$AQORDER= 0
##$ASSFAC= 0
##$ASSFACI= 0
##$ASSFACX= 0
##$ASSWID= 0
##$AUNMP= <proc_1d>
##$AZFE= 0.1
##$AZFW= 0.1
##$BCFW= 0
##$BC_mod= 2
##$BYTORDP= 0
##$COROFFS= 0
##$CY= -3
##$DATMOD= 1
##$DC= 0
##$DFILT= <>
##$DTYPP= 0
##$F1P= 0
##$F2P= 0
##$FCOR= 1
##$FTSIZE= 16384
##$FT_mod= 6
##$GAMMA= 0
##$GB= 0
##$INTBC= 1
##$INTSCL= 0
##$ISEN= 128
##$LB= 0.24
##$LEV0= 0
##$LPBIN= 0
##$MAXI= 10000
##$MC2= 0
##$MEAN= 0
##$ME_mod= 0
##$MI= 1.114404
##$NCOEF= 0
##$NC_proc= -7
##$NLEV= 6
##$NOISF1= 3.799351
##$NOISF2= 2.8
##$NSP= 0
##$NTH_PI= 0
##$NZP= 0
##$OFFSET= 15.71714
##$PC= 1
##$PHC0= -15867.9
##$PHC1= 13.80078
##$PH_mod= 1
##$PKNL= yes
##$PPARMOD= 0
##$PSCAL= 0
##$PSIGN= 0
##$REVERSE= no
##$SF= 200.130006887811
##$SI= 16384
##$SIGF1= 3
##$SIGF2= 2
##$SINO= 5.538805
##$SIOLD= 16384
##$SREGLST= <1H.CDCl3>
##$SSB= 0
##$STSI= 16384
##$STSR= 0
##$SW_p= 3612.71676300578
##$SYMM= 0
##$S_DEV= 0
##$TDeff= 16384
##$TDoff= 0
##$TI= <>
##$TILT= no
##$TM1= 0
##$TM2= 0
##$TOPLEV= 0
##$USERP1= <user>
##$USERP2= <user>
##$USERP3= <user>
##$USERP4= <user>
##$USERP5= <user>
##$WDW= 1
##$XDIM= 16384
##$YMAX_p= 419577125
##$YMIN_p= -1422357
$$ End of Bruker specific parameters
$$ ---------------------------------
##NTUPLES= NMR SPECTRUM
##VAR_NAME=  FREQUENCY,     SPECTRUM/REAL,   SPECTRUM/IMAG
##SYMBOL=    X,             R,               I
##VAR_TYPE=  INDEPENDENT,   DEPENDENT,       DEPENDENT
##VAR_FORM=  AFFN,          ASDF,            ASDF
##VAR_DIM=   16384,         16384,           16384
##UNITS=     HZ,            ARBITRARY UNITS, ARBITRARY UNITS
##FACTOR=    0.220516191357247, 1,           1
##FIRST=     3145.47137603318, 0,            0
##LAST=      -467.2453869726, 0,             0
##MIN=       -467.2453869726, -1422357,      0
##MAX=       3145.47137603318, 419577125,    0
$$ Real data points
##PAGE= N=1
##DATA TABLE= (X++(R..R)), XYDATA
$$ [...]
7169A264065M22948L4310j75455m2087Q3827J38037J93896J28974Q3873p5892
7159B056496o5249m0926Q0754K56414R5315N2185k7207J44617J41168j11966l739
7148B577862L1979K55695j9384K09857J74074o7340P9139L0114j8826J12395j2326
7137C353239R9649J25863N6908K93300M4902L1372K05022j06269K23849L30671
7127D658506l9194J74470R6126R4567L05333r563K85331K02052M31515K88213
7117F487356N51677M32706O8814L41781N44014K80914M90761N43043N13125O19169
7107A0873360N92514M43874R18225Q13946P11044R52363R97089J313333J678204
7098A9293952J503199J771403J994113K639477K658830L042978L684060M371248
$$ plain form
7169 1264065 1687013 1721323 1545868 1503781 1587608 1725645 1919541 2048515 2132388 2056496
7159 2056496 1991247 1950321 2031075 2287489 2382804 2434989 2407782 2552399 2693567 2581601 2577862
7148 2577862 2609841 2865536 2846152 3056009 3230083 3162743 3241882 3271996 3253170 3365565 3353239
7137 3353239 3452888 3578751 3635659 3928959 3973861 4005233 4210255 4103986 4327835 4658506
7127 4658506 4619312 4793782 4889908 4984475 5289808 5280245 5565576 5767628 6199143 6487356
7117 6487356 7039033 7471739 7540553 7882334 8426348 8707262 9198023 9741066 10254191 10873360
7107 10873360 11465874 11909748 12827973 13641919 14352963 15305326 16302415 17615748 19293952
7098 19293952 20797151 22568554 24562667 27202144 29860974 32903952 36588012 40959260
7090D0959260N408345O597457Q185317J0052762J1743348J2994513J2890019J0162921
7082A18993942L228746n026916j1771833j6040934j5573582j2746842r719121
7075E1343460p243281n473451m370045l514865k619889k044692j822365j187796
7067B3067076j518817j165348j087051j093575j100319r36746r37768q41380o33824
7058A3752248o42887n90002m35351m05546j93365l78173k22220j96283k27508
7049A0460913o6604M6740k5263R7350L70596J04658O6177R5969K84890J4429l1171
7038A1418684K08360L92168O93636N52589Q14137N42989j90046p32110j041408
7029A2658999j318916j390634j244528r47775p69919k38714l27951o42312m91635
$$ plain form
7090 40959260 46367605 52965062 61150379 71203141 82946489 95941002 108831021 118993942
7082 118993942 122222688 117195772 105423939 89383005 73809423 61062581 51343460
7075 51343460 44100179 38626728 34256683 30741818 28121929 26077237 24254872 23067076
7067 23067076 21548259 20382911 19295860 18202285 17101966 16165220 15227452 14386072 13752248
7058 13752248 13109361 12519359 12084008 11678462 11485097 11106924 10884704 10688421 10460913
7049 10460913 10394309 10441049 10415786 10513136 10883732 10988390 11054567 11150536 11435426 11449855 11418684
7038 11418684 11627044 12019212 12712848 13265437 14079574 14622563 14432517 13700407 12658999
7029 12658999 11340083 9949449 8704921 7757146 6987227 6748513 6420562 5778250 5286615
7020E286615m3462k3202j48688l08253q6354P6647n747n5589l57895j02591j27327
7009D104154k38669j12422r1839q4872k23005k2188J66690L08748L44930N8847
6999D210374J14903P7656j41443k79866j76469l1213k34135l59059j78257k81259
6989B721232j55590j12466K7118L5516o1879l7421j98703J1903j56177J2195L6967
6978B122695J11172R8749l0205j58503j17050Q7012r0903j39800k90830q9683
6968A502654p8747L0802J8422j8294j36235J1722K0415l0858j24365M0427r672
6957A226271k05441q9161k8394P3978J24988R5799r1040j24528j68981K16952
6947A030443L7144j22664R2767K0753j07239m6990N4807o3487m2359m9034k51447
$$ plain form
7020 5286615 5243153 5219951 5071263 4763010 4676656 4753303 4747556 4691967 4334072 4231481 4104154
7009 4104154 3865485 3753063 3661224 3576352 3353347 3331159 3497849 3806597 4151527 4210374
6999 4210374 4325277 4402933 4261490 3981624 3805155 3773942 3539807 3180748 3002491 2721232
6989 2721232 2565642 2453176 2480294 2515810 2453931 2416510 2217807 2229710 2073533 2085728 2122695
6978 2122695 2233867 2332616 2302411 2143908 2026858 2113870 2022967 1883167 1592337 1502654
6968 1502654 1423907 1454709 1473131 1454837 1318602 1330324 1350739 1319881 1195516 1235943 1226271
6957 1226271 1020830 931669 903275 977253 1102241 1198040 1107000 982472 813491 1030443
6947 1030443 1067587 944923 1037690 1058443 951204 904214 959021 895534 853175 804141 552694
6936E52694j42308J5525J42049K57762p6168q4935M8394K2880j88947J33677r1617
6925E89006J9692k71973P7142Q1781M7187p3641j84699N035R2135j8462o8469
6914B94734L7666n9195N178r3185Q8404J15896Q272R8144m0639j78438Q1767j95753
6902A62851m1742R8417O2312j23255K33309L6015j97230R7281j54331j38951l1076
6891C600J5066J25432J14584j14511Q384M2187J57464q0565j36426N6789P9473
6880B71477J20566l1406k64413j06522r9155J15292K74973l4730l7206J64182
6870C73058K4618j01337k45874P9405P725j58596M2540J27070k2898j50003J81583
6859A57291r7382K00998j70846j91978J90255P9352o6538r2006o5029J85709N270
$$ plain form
6936 552694 410386 425911 567960 825722 749554 664619 713013 735893 546946 680623 589006
6925 589006 608698 336725 413867 495648 542835 469194 284495 289530 381665 363203 294734
6914 294734 332400 273205 278383 185198 273602 389498 397770 495914 455275 276837 358604 162851
6902 162851 121109 219526 281838 158583 391892 427907 230677 327958 173627 34676 3600
6891 3600 18666 144098 258682 144171 152555 194742 352206 271641 135215 192004 271477
6880 271477 392043 360637 96224 -10298 -109453 5839 280812 246082 208876 373058
6870 373058 397676 296339 50465 129870 137595 -21001 21539 148609 125711 -24292 157291
6859 157291 59909 260907 90061 -101917 88338 167690 101152 9146 -55883 129826 135096
6848A35096o6303J3611j27671L3751J3162p3293j5366j02838O4996r4251L21197
6837A02091O0152n8383K6419J17455j39649m2988j16979J98879P1118j42455j57170
6826h1510l0518p040O2318J04160j65612o5632K8609J21927J58742J84230k08856
6815A00818M0950r996p9843j03762K05478j02908j97552R7927J07302j61317L05957
6804B03054j8570k46706k4326M691L3846P0322j23373P0087J58960q6672p5689
6793c4376R1651J08654j49601j82612J69524P5318j1519L5586k08662k6952J82632
6782D9643j22400p721j88967q0771K50886L03602m5832j26911j24156J46530K02890
6771B56793m0935o7303k4636J15312P5441k5707j47137J14586k37467l32931P1459
$$ plain form
6848 135096 68793 82404 -45267 -11516 1646 -71647 -87013 -189851 -124855 -219106 102091
6837 102091 162243 103860 130279 247734 108085 65097 -51882 146997 218115 75660 -81510
6826 -81510 -112028 -119068 -56750 47410 -118202 -183834 -155225 -33298 125444 309674 100818
6815 100818 141768 131772 51929 -51833 153645 50737 -146815 -48888 58414 -102903 203054
6804 203054 184484 -62222 -86548 -81857 -48011 22311 -101062 -30975 127985 41313 -34376
6793 -34376 57275 165929 16328 -166284 3240 78558 67039 102625 -106037 -132989 49643
6782 49643 -72757 -80478 -269445 -350216 -99330 204272 158440 31529 -92627 53903 256793
6771 256793 215858 148555 123919 239231 314672 288965 141828 256414 18947 -313984 -242525
6760b42525L8684O1040J47988K75981K4354j30385K2005j185k22540j06208J88373
6749E5582j61181p3258L3917J45985j66034m1675N2244J00827j8250J25538n1758
6738A937J23426k25112J13188J37326p7716N93l5936M8117j3811J6691k4299K6338
6726I0742L4885l9115L4629J18144K8988j26550m5844J10921k9637O104O0340
6715B43607M6376j02900j26482j69740l158P7427P4988l7649R0059j38181J00915
6704E5262J44259Q6665J05347j98484N496j5790R0172m9654L9099q1103k5143
6693A56126J29617n3213J16867L37428o4847N4238J19100j0098j25379L9332J19007
6682H18178k82745O5553M2759q3250M1534N302j72718k10088p1893Q2550j03504
$$ plain form
6760 -242525 -203841 -142801 5187 281168 305522 175137 197142 195957 -26583 -132791 55582
6749 55582 -105599 -178857 -144940 1045 -164989 -206664 -154420 -53593 -71843 53695 1937
6738 1937 125363 -99749 13439 150765 73049 73642 37706 85823 72012 88703 64404 90742
6726 90742 125627 86512 121141 239285 268273 141723 95879 206800 177163 183267 243607
6715 243607 289983 187083 60601 -109139 -112297 -34870 40118 2469 92528 -45653 55262
6704 55262 199521 286186 391533 193049 198545 182755 272927 223273 262372 181269 156126
6693 156126 285743 232530 349397 686825 621978 676216 795316 785218 659839 699171 818178
6682 818178 535433 600986 643745 560495 602029 607331 434613 224525 152632 235182 131678
6671A31678j17506K313J85596j47840J64811j52589K8801R5971J0531q1883j17136
6660B747o0394n465J97757K1289J30147L5745j61812j4651k37239J29317o4255
6649b6814J56531o1177k5429J17394m1370q7192R7745K2458J166J37654n4882
6638B36084j35332j0947N2408r3958J72499j94635k36958J68141K15254j18025
6628E4531l1161m2074l4733q3871R6737q7180J41207J88912O0288q3239j06487
6617G2930J20064k028j63705j07540K38158j3716j01889M2553o3317R0100Q827
6606A20437J82631j30967j84902K2456q164n4258J38217k60076m6491j0565j39562
6595c71244K6006P8870L12289j11209m176M2129j44534O5683J57431n3791o5986
$$ plain form
6671 131678 14172 16485 202081 54241 219052 66463 95264 191235 201766 119883 2747
6660 2747 -57647 -63112 134645 155934 286081 321826 160014 145363 -91876 37441 -26814
6649 -26814 129717 68540 43111 160505 119135 31943 129688 152146 153312 290966 236084
6638 236084 100752 89805 142213 48255 220754 26119 -210839 -42698 172556 54531
6628 54531 23370 -18704 -53437 -137308 -40571 -127751 13456 202368 262656 179417 72930
6617 72930 192994 190966 27261 -80279 157879 144163 42274 84827 21510 111610 120437
6606 120437 303068 172101 -12801 9655 1491 -52767 85450 -174626 -221117 -231682 -371244
6595 -371244 -345238 -266368 45921 -65288 -69464 -27335 -171869 -106186 51245 -2546 -68532
6584f8532M5830K3699N7951N6219j7771O7773l3890p9129o9365o8882K27087r0443
6572E0547R0867P8809m8861K3332j2546q5092j32755M2685k7664k2993n5281j0766
6560a09718J08952j52755l7843K01621K27699M6774j26780j26352P307J48346
6550A87251Q300l0869Q3673l55531L6476O5445o7033P5014o6554M408j3098J9534
6538e2984J70328j32196Q520M6450j09247Q7377K26328j65867j42535L15509k00575
6527E1108j14680o301M8118Q7893p5988L7625Q2645j47577M4348K05499j72197
6516D0493q7357K07580o0885j07592M2969J03707Q6481j55280m0402O6758J42916
6505B39388m5068m6110K5406O604j05464j88879J25891J47827K0380j57586J43143
$$ plain form
6584 -68532 -22702 997 58948 115167 97396 165169 131279 52150 -17215 -86097 140990 50547
6572 50547 141414 220223 171362 194694 182148 97056 -35699 6986 -20678 -43671 -98952 -109718
6560 -109718 -766 -153521 -191364 10257 237956 284730 157950 31598 38905 187251
6550 187251 195551 164682 248355 -107176 -70700 -5255 -72288 2726 -63828 -59420 -72518 -52984
6538 -52984 117344 -14852 -6332 40118 -69129 18248 244576 78709 -63826 251683 51108
6527 51108 -63572 -69873 -21755 66138 -9850 27775 110420 -37157 7191 212690 40493
6516 40493 -46864 160716 99831 -7761 35208 138915 225396 70116 29714 96472 239388
6505 239388 194320 148210 173616 180220 74756 -114123 11768 159595 179975 22389 165532
6494A65532j28832j5471O9592J17456o9452J05987m1406l3208Q784j13632M54
6483F5804J11666J9385j3565p615j51250Q4916m1591J05432J27723j37298J72093
6472C35700k19088j24615K91364J25303j12625j19824J49209J4317j37958n6544
6462A45239K0314j4599p7342K05020j55169J8672J72291N7202j9958J72633o8811
6451D55492p6550p9335k80977j26235K67138M3725J58355J28605k79835q386j9556
6440A82441k4078N3071J61861M732K2263j35410J44237j2722o373K75729r5698
6429E70053j78801J07520q8571J34349j19934j51355Q8390K9487K3081k1250O420
6418C99389M1243N9290K2011j50488K00119L1467l9464Q7404j93265q8290M3997
$$ plain form
6494 165532 36700 21229 90821 208277 138825 244812 203406 170198 178982 65350 65804
6483 65804 177470 196855 183290 175675 24425 109341 67750 173182 300905 163607 335700
6472 335700 116612 -8003 283361 408664 296039 176215 325424 339741 201783 145239
6462 145239 165553 150954 73612 278632 123463 142135 314426 371628 351670 524303 455492
6451 455492 378942 299607 18630 -107605 159533 203258 361613 490218 210383 201997 182441
6440 182441 158363 211434 373295 378027 400290 264880 409117 396395 390022 665751 570053
6429 570053 391252 498772 410201 544550 424616 273261 361651 391138 414219 392969 399389
6418 399389 440632 499922 521933 371445 571564 603031 563567 650971 457706 369416 413413
6407D13413n7426K32652J22936k17271j94196L02134N2953l3521j27021j6238
6397D78415Q8819P3505K3098l15407j27025J40650j2541J79879N894l3891J01038
6386F02434m2716m5831j41864J98889K45865j59764j61334Q6736o6828r5073M9011
6375D69525Q4981k3156j06328P1154K07641r2026O5019N9157k01347l2244J00432
6364F02808j41659o5283R1171l1459j18669J52635p5413L0178j41914N7807J10577
6353D70779J25038M1777k36532j63323J41551J74603O340m3941l23415K7891k03478
6342A7290J70371J1502M5870J11322j79915J06819K72064j00303k27468Q0816
6332C08368K05630j12516K4648k13222M3492J09862j28650K0396r1618J94368
$$ plain form
6407 413413 355987 588639 711575 494304 300108 602242 655195 621674 494653 478415
6397 478415 567234 640739 663837 348430 221405 362055 349514 529393 535287 501396 602434
6386 602434 559718 513887 372023 570912 816777 657013 495679 582415 515587 420514 469525
6375 469525 554506 531350 425022 496176 703817 611791 676810 735967 534620 502376 602808
6364 602808 461149 395866 487037 455578 336909 489544 414131 444309 302395 360202 470779
6353 470779 595817 637594 401062 237739 379290 553893 560233 516292 192877 220768 17290
6342 17290 187661 199163 245033 356355 176440 283259 555323 455020 227552 308368
6332 308368 513998 401482 426130 212908 256400 366262 237612 258008 166390 360758
6322C60758j25761P9843J09282R2639J7187r294k67994n2589J0592J42362l5413
6311C21612r217K4064N3953O5866o0455N2847j12358p7633J798P5598j09223P8905
6299C05757J47993j026l55712J19856J0421K4760k8815n7113r431L51056j48158
6288C59588j5469J02490l53142K4236m5267J32797R111Q0674j12470j10836K21377
6277B93089J93939j61542j60551j01361J34855O0388K9002K9419Q2341j24126
6267B75453o3995j0044M9917M274j44421O8522o0747j90016J38401K55336m6575
6256B76105j01433j11289R7025Q7491n8484o8943n849P0629r59P2128k57840Q5863
6244H4444p2744N4438J46225K023J1942J91651o3713Q891P7806j67962L2374p5077
$$ plain form
6322 360758 234997 314840 424122 516761 533948 524654 256660 204071 214663 357025 321612
6311 321612 312395 336459 390412 456278 395823 448670 336312 258679 260477 336075 226852 305757
6299 305757 453750 452724 97012 216868 227289 252049 223234 166121 156690 507746 359588
6288 359588 344119 446609 93467 117703 72436 205233 214344 295018 182548 71712 293089
6277 293089 487028 325486 164935 63574 198429 258817 287819 317238 399579 275453
6267 275453 211458 201414 251331 255605 111184 179706 118959 -71057 67344 322680 276105
6256 276105 174672 63383 160408 247899 189415 120472 114623 185252 184293 256421 -1419 84444
6244 84444 11700 66138 212363 214386 226328 417979 354266 363157 440963 273001 305375 230298
6232B30298k33814j8109J17530j54675j3397o894K50397o4925J99756P0223k93295
6221H3095p014o0522n2622J291N9475N4800J2316J3227P6877J5856K04345j12728
6209B88396k21796K51757J57601p1349p2475p1473j74513q2047J64099L6546R7881
6198C02627j38231P2945m7927q5433p3510P2523J63029m7471R2101q0718L83552
6187F13487l1664o1973j33115j1187P8498L7828l6283J1466j1249m2345m2947
6176C70516K23218O7831r1689K4344M0302l8707J81395K4193k10793n6084k6126
6165E08400Q9376P8017j1559j39846K3151Q9187p0525J1441p383l3146J66374
6154G03487M1596r7130k2063J30589M701M71N485M3739p1995J97435K39871l9695
$$ plain form
6232 230298 -3516 -21625 95905 -58770 -72167 -79061 171336 106411 306167 376390 83095
6221 83095 76081 15559 -37063 -35772 23703 78503 90819 104046 180923 196779 401124 288396
6209 288396 66600 318357 475958 404609 332134 260661 86148 4101 168200 204746 302627
6198 302627 164396 237341 189414 103981 30471 102994 266023 218552 310653 229935 613487
6187 613487 581823 519850 386735 375548 454046 491874 455591 467057 455808 413463 370516
6176 370516 593734 661565 569876 594220 634522 595815 777210 801403 590610 534526 508400
6165 508400 597776 675793 664234 524388 547539 636726 566201 577642 570259 537113 703487
6154 703487 745083 647953 625890 756479 761180 761651 767136 810875 738880 936315 1176186 1136491
6142A136491m4079l63046n9134m2792J7813N9212R9799L5971j66812p8475j05023
6131D89925K20869L3858l50499R8987k0166l7887R3101n7281J61692J75202j31076
6120F76725L9151o211M0006j29099j22993J05912j21994M7778l0058j05712M790
6109C98295m3637L1043J81965j13238J07333p2991o3948j05311R9749J67112p3020
6098E13352o2115J57661j99625O2994J42455j18970O0009q3854K1796J10871k58472
6087C46102l4518P1486J72654J49300j41865P7267n6331l2622q7585r9198M4968
6076D09658j40957K17942j9566J37061K23561q0492k42493K4001q2696j22350
6066C23669P251J90693K06877j48772j41460j67884J37378n0247J27421o0247
$$ plain form
6142 1136491 1092412 729366 670232 627440 645253 704465 804264 840235 673423 594948 489925
6131 489925 710794 744652 394153 493140 472974 435087 528188 470907 632599 807801 676725
6120 676725 715876 709665 749671 620572 497579 603491 481497 529275 499217 393505 398295
6109 398295 354658 385701 567666 454428 561761 488770 424822 319511 419260 586372 513352
6098 513352 451237 608898 409273 472267 614722 495752 555761 471907 493703 604574 346102
6087 346102 311584 383070 555724 705024 563159 640426 584095 551473 463888 364690 409658
6076 409658 268701 486643 467077 604138 827699 747207 504714 528715 446019 323669
6066 323669 330920 521613 728490 579718 438258 270374 407752 357505 484926 424679
6056D24679n1400J35072O4057j14949L5233j40014K30840J35454R9000J60733
6046I78705j68605P954j6423J1581Q0443o0265L8966m0587k20447Q7526m0923
6035F57925j47438l3811P7690M411m0578J21460J56840O3459r1711M7787Q1367
6024H97401q6136p7412m2792J28631j36839K7800K9665l2392J41928J07885j9002
6013I38737k14409n2949p5544K13542J75982J66457K16j1314j68150l5219J60569
6002A097918K4611n4406j02528l8882J90592k2746O4349J11135j36170k36156
5992H97717K3309R9417P2574R4214n3070l8430k03207L22525J20564j55744r9734
5981A080135o3646K81941K90138N889j20273j73407j3054l2073J42786J31238
$$ plain form
6056 424679 373279 508351 572408 457459 492692 352678 583518 718972 817972 978705
6046 978705 810100 818054 801631 813212 893655 833390 872356 831769 611322 698848 657925
6035 657925 510487 476676 554366 558777 518199 639659 796499 859958 768247 816034 897401
6024 897401 811265 733853 691061 819692 682853 710653 740318 707926 849854 957739 938737
6013 938737 724328 671379 595835 809377 985359 1151816 1152032 1140718 972568 937349 1097918
6002 1097918 1122529 1068123 965595 926713 1117305 1094559 1158908 1270043 1133873 897717
5992 897717 921026 1020443 1093017 1187231 1134161 1095731 892524 1215049 1335613 1179869 1080135
5981 1080135 1016489 1298430 1588568 1594457 1474184 1300777 1287723 1255650 1398436 1529674
5971A529674j1119J04831O378l7550j82146P0652K56426J26565J7393j92436M5178
5960A733846J25740J21057O3893j7257j55573J42078J68784j28260P144J6698
5950B078150l0080M3602P4194J40348m4295J11523J39540k0858J56621m1357J52079
5939B759467M2405j20778J82267J99307j31991K29012K41227j26712J11380n4459
5929C331125Q0996m712L1388m3158J13893L1344L1678K41107O2389K01092L1617
5918D108759j64881J47755K66838J38382p598J54723J65353Q5593j81648J87930
5908D901206J97298N6323K22226K14947J6566L3769L65771J05004J72728l2203
5898F253635M39537L47780Q4731K91641L95165J78304K79817K07694K16334L31917
$$ plain form
5971 1529674 1518555 1623386 1629764 1592214 1410068 1480720 1737146 1863711 1881104 1688668 1733846
5960 1733846 1859586 1980643 2044536 2027279 1871706 2013784 2182568 2054308 2061452 2078150
5950 2078150 2048070 2091672 2165866 2306214 2261919 2373442 2512982 2492124 2648745 2607388 2759467
5939 2759467 2801872 2681094 2863361 3062668 2930677 3159689 3400916 3274204 3385584 3331125
5929 3331125 3412121 3407409 3438797 3395639 3509532 3540876 3572554 3813661 3876050 4077142 4108759
5918 4108759 3943878 4091633 4358471 4496853 4489255 4643978 4809331 4894924 4713276 4901206
5908 4901206 5098504 5154827 5377053 5592000 5608566 5642335 6008106 6113110 6285838 6253635
5898 6253635 6693172 7040952 7125683 7417324 7812489 7990793 8270610 8478304 8694638 9026555
5888I026555L32588K73916L23774N16999O00833O09556P02164P05952O26756P05406
5878A4424499P05941O17567L24135K95369L25003M18817N42854M07955J62598
5869A8224738M31401P14750P37084N96318Q06422J208517J222482J568707J946731
5860B7457150K138488K113067K416309K786585L292363L763724M222469M686373
5852E2876528M989636N791160N835800N500421L641843L1362l247548n373526
5844G0045676n493055m383596l319078k704271j836106j377314n46749j6240J77258
5835E0546525P94114J143262J694828K260468K900397L117058L623596M460599
5827G0540847N399994O451579P520062Q768960J0080281J1010876J0590197P553814
$$ plain form
5888 9026555 9359143 9633059 9956833 10473832 11074665 11684221 12386385 13092337 13719093 14424499
5878 14424499 15130440 15748007 16072142 16367511 16692514 17111331 17654185 18062140 18224738
5869 18224738 18656139 19370889 20107973 20704291 21510713 22719230 23941712 25510419 27457150
5860 27457150 29595638 31708705 34125014 36911599 40203962 43967686 48190155 52876528
5852 52876528 57866164 63657324 69493124 74993545 78635388 78666750 75419202 70045676
5844 70045676 64552621 60169025 56849947 54145676 52309570 50932256 50385507 50369267 50546525
5835 50546525 51340639 52483901 54178729 56439197 59339594 62456652 66080248 70540847
5827 70540847 75940841 82392420 89912482 98681442 108761723 119772599 130362796 137916610
5819A37916610P21002q017457j3666550j4265055j2124755r715302p513388n723765
5811F7611340m818272l886290l017493k236854j777446j195826p91881o90515
5803D9196763j67470M22865N52354R14694J596627J867042K760013L276250L963256
5794F4382394M787847N194405M737324K530887j245263n486732p949080q038686
5786E8913096o595106n185565m112400l314694k489812k036612j615157j642975
5778C1920775j214320j125961j115370p95248p19933l07682n40426p47798k29077
5769B5124960N1902j44884J262M83k45979n27860n93847o80419n07272m06923
5759B2071423m03918j93862l74141l35632l73083m98117k88422l09360l38536
$$ plain form
5819 137916610 138637612 130620155 116953605 102688550 90563795 80848493 73335105 67611340
5811 67611340 62793068 58906778 55889285 53652431 51874985 50679159 49887278 49196763
5803 49196763 49029293 49452158 50004512 50919206 52515833 54382875 57142888 60419138 64382394
5794 64382394 69170241 74364646 79101970 81632857 80387594 74900862 66951782 58913096
5786 58913096 52317990 47132425 43020025 39705331 37215519 35178907 33563750 31920775
5778 31920775 30706455 29580494 28465124 27669876 26949943 26642261 26101835 25354037 25124960
5769 25124960 25176862 25031978 25033240 25033723 24787744 24259884 23666037 22985618 22478346 22071423
5759 22071423 21667505 21473643 21099502 20763870 20390787 19892670 19604248 19294888 18956352
5750A8956352l69282K496j9568j37901j31432L5150j5113J708l0954J52281J25768
5739A8569505J97634P4629J30690k8167j50896l27083n05183l56163l13977k55862
5729A7035127j05812l8306k28819m86312l41025m84949n61759m17931m84310l25480
5719A3560424l05998l66361m05565k05989k57637j64130j56293k11690m2887O0359
5709A1504233N3666j47908N6080j68645k27109K0868j84417k27578j02293k7450
5699A0549447O3145R2457j33449j96099k73498j02308k96601j66912j34594l41568
5689I060020j87308j8164J18253J20911l8679O2669P1030n7036k45142k28561
5679H657993k04399l19387l98562j03993J76162k59028K0007j56169N8543j18403
$$ plain form
5750 18956352 18587070 18589566 18569998 18432097 18300665 18335815 18320702 18322410 18291456 18443737 18569505
5739 18569505 18767139 18841768 18972458 18944291 18793395 18466312 17961129 17604966 17290989 17035127
5729 17035127 16929315 16891009 16662190 16175878 15834853 15349904 14788145 14370214 13885904 13560424
5719 13560424 13254426 12888065 12482500 12276511 12018874 11854744 11698451 11486761 11443874 11504233
5709 11504233 11557899 11409991 11466071 11297426 11070317 11091185 10906768 10679190 10576897 10549447
5699 10549447 10612592 10705049 10571600 10375501 10102003 9999695 9703094 9536182 9401588 9060020
5689 9060020 8872712 8854548 8972801 9093712 9055033 9117702 9188732 9131696 8886554 8657993
5679 8657993 8453594 8134207 7735645 7631652 7807814 7548786 7568793 7412624 7471167 7352764
5669G352764Q465L59065R9579M90485L204J20977M47937M50783K82600N04223
5659A0120082K74926L68163L27809K40194P5145j25628p8585l10419o02056l45140
5649I944491j84186j3551j08251p1251l4353n8801J7266K34468L78699N11735
5639A0616266L58582M81692N12183K32979L19136M58504L37976J33754O2844o8056
5629A3445860P7128p6252Q8886J72558k51544k31935l0922k09203k55030k31557
5619A2497989M5822J47533q1217L04027J69655K34407L04382M65079M57647M33274
5609A4978598N02213M62255K36068M0083O3264n38130p59466q90995j002666n76737
5599A2514487l05544n90078l66497l77201j91271l3657n9459k87729j57590l02085
$$ plain form
5669 7352764 7361229 7720294 7819873 8310358 8313562 8434539 8882476 9333259 9615859 10120082
5659 10120082 10395008 10763171 11090980 11331174 11406319 11280691 11202106 10891687 10289631 9944491
5649 9944491 9760305 9746754 9638503 9567252 9532899 9474098 9491364 9725832 10104531 10616266
5639 10616266 10974848 11456540 11968723 12201702 12520838 12979342 13317318 13451072 13513916 13445860
5629 13445860 13522988 13446736 13535622 13708180 13456636 13224701 13193779 12984576 12729546 12497989
5619 12497989 12543811 12691344 12610127 12914154 13083809 13318216 13622598 14087677 14545324 14978598
5609 14978598 15480811 15943066 16179134 16219217 16282481 15744351 14984885 14093890 13091224 12514487
5599 12514487 12208943 11618865 11252368 10875167 10683896 10650239 10590780 10303051 10145461 9843376
5589I843376n824R3101l5761j47346M0918J76158J71351p743J23986j29890K78871
5578A0401197K45430l96108o4829k80070m79435l61785j19279j60982k22342J65210
5568H727007L34357J40288J79432N9433m69432m86078l66365l95653n3801j66685
5558G502503k35466k78966l68841k49671L6784k43903N5587K13354j13730j64068
5548F153583q659L1901K0896J02261q1343m6191N1063N818o2104r2198k4406J39461
5536F190082Q2832J79985O235l465l354n7078Q4029k8643j22383J08449q8632
5525F348057n1210J80701r3501k1825J28674N5714q7298m0682J23537J12358K67103
5514F921628M1823K23628P8609m3913j34030n3663j05571Q4090K47060K46081
$$ plain form
5589 9843376 9837552 9930653 9894892 9747546 9788464 9964622 10135973 10128230 10252216 10122326 10401197
5578 10401197 10646627 10250519 10185690 9905620 9426185 9064400 8945121 8784139 8561797 8727007
5568 8727007 9061364 9201652 9381084 9440517 8971085 8485007 8118642 7722989 7669188 7502503
5558 7502503 7267037 6988071 6619230 6369559 6406343 6162440 6218027 6431381 6317651 6153583
5548 6153583 6144924 6176825 6197721 6299982 6218639 6172448 6223511 6229329 6167225 6075027 6050621 6190082
5536 6190082 6272914 6452899 6459134 6455669 6452315 6395237 6479266 6450623 6328240 6436689 6348057
5525 6348057 6296847 6477548 6384047 6362222 6490896 6546610 6459312 6418630 6542167 6654525 6921628
5514 6921628 6963451 7187079 7265688 7221775 7087745 7034082 6928511 7012601 7259661 7505742
5504G505742J33728J61639J29070k4123O0634K57381L79028J73675M36778K48582
5494I462134K04310K20102L27101K88721K29662M01973L67285M58857M51385M26392
5484A2837922J87658M72293L55377M87477N20527M02689O95219O10115P56502
5475A7325779J162348J249679J491582J697236J404032J859224K263443K729383
5467C1182706L081294L902245M523300N010433N537753N497695M454416K030195
5459F5220037j646744m338118n769976n233251m129942k880568k159888j542854
5451C7518696q96323n16537Q9372K89181O59732J203653J755366K291369K352889
5442D4747398K864497L348945L895670M562995N674203P127093Q098877R243020
$$ plain form
5504 7505742 7639470 7801109 7930179 7906056 7966690 8224071 8603099 8776774 9213552 9462134
5494 9462134 9666444 9886546 10213647 10502368 10732030 11134003 11501288 11960145 12411530 12837922
5484 12837922 13025580 13497873 13853250 14340727 14861254 15263943 15959162 16569277 17325779
5475 17325779 18488127 19737806 21229388 22926624 24330656 26189880 28453323 31182706
5467 31182706 34264000 38166245 42689545 47699978 53237731 58735426 63189842 65220037
5459 65220037 63573293 59235175 53465199 48231948 44102006 41221438 39061550 37518696
5451 37518696 36622373 36105836 36195208 36484389 37144121 38347774 40103140 42394509 44747398
5442 44747398 47611895 50960840 54856510 59419505 65093708 72220801 80319678 89562698
5434H9562698J0139847R598403O589897O55070o752130j1533829j1418975j0463173
5426G6377808q353521o650763n329987m262643l532076k821991k103171j463594
5418D1860062j037412n89960j82192L66057P82318Q99404J319601J974682K314940
5409D7707500K574782L169208M144899M153101L721520K375830j1391l349698
5401F4485751n622124o148163n470743m425103l434018l215714k489831k260804
5393C1419251j757041j438878j226553j188848j592864j410307j174490r44074
5385B0686196p38217p59766o98547o63570n14976k65797l73579l47890k28770
5376A6095084l12150j36917k25694j42897j0398J17840J29554q0859j4415K84562
$$ plain form
5434 89562698 99702545 109300948 115890845 116545915 109793785 98259956 86840981 76377808
5426 76377808 68024287 61373524 56043537 51780894 48248818 45426827 43323656 41860062
5418 41860062 40822650 40232690 40050498 40416555 41198873 42098277 43417878 45392560 47707500
5409 47707500 50282282 53451490 57596389 61749490 65471010 67846840 67835449 64485751
5401 64485751 58863627 52715464 47244721 42819618 39385600 36169886 33680055 31419251
5393 31419251 29662210 28223332 26996779 25807931 24215067 22804760 21630270 20686196
5385 20686196 19947979 19188213 18489666 17826096 17311120 17045323 16671744 16323854 16095084
5376 16095084 15782934 15646017 15420323 15277426 15267028 15384868 15514422 15433563 15419148 15703710
5366A5703710L87479N60398L125J8288k03066n12136n91939n63872o10483n26331
5356A3665173l58051k01861k72190k92179j96088j05931j94595k75188k92197
5347A1476893l4562m0250k06365k48077q6984m2610N8888K57606L00603M37124
5337A1872266O4262k949J43103K56296l17078L411p8914J66124L25624K05211
5327A2637356O4552K17177K49012j17869j45599k44135l92305l85998k41721n14927
5317A1125543r6660m78752l39294l7895j66113j15330p4144n6684j28755L6755
5307I668671N6305n1803J39678J42282K14905K44624L58343M30750L36053M11031
5297A1950839L49651L24796J19211K9819R5175J00927j18612j22470m68484l94163
$$ plain form
5366 15703710 16091189 16651587 16654712 16673000 16469934 15957798 15365859 14801987 14191504 13665173
5356 13665173 13307122 13105261 12833071 12540892 12344804 12238873 12044278 11769090 11476893
5347 11476893 11442331 11402081 11195716 10947639 10860655 10818045 10876933 11134539 11435142 11872266
5337 11872266 11936528 11933579 12076682 12332978 12015900 12019311 11940397 12106521 12432145 12637356
5327 12637356 12701908 12919085 13168097 13050228 12904629 12660494 12268189 11882191 11640470 11125543
5317 11125543 11028883 10550131 10210837 10172942 10006829 9891499 9817355 9760671 9631916 9668671
5307 9668671 9724976 9673173 9812851 9955133 10170038 10414662 10773005 11203755 11539808 11950839
5297 11950839 12300490 12625286 12744497 12774316 12869491 12970418 12851806 12729336 12260852 11866689
5287A1866689k82221o3129k89450l1791j42675k19924k95151r3292r7567o2628
5277A0288861L1872j76123M3002L20411J61340o9093K4290L77955O55426J60659
5267A1818600M15869L75867O9024M44128n1245j82160r3250j47946J7674q3285
5257A2583276j80803j47649k00385n8563k39041k45052k656l27778J49225k9328
5247A1301246k00462r1023J16818J15507J16856M9638n2953J27920J92782M6237
5237A1722566J5027L60041j57234j62586R0632J11818R6286m9980J5785k47121
5227A1795234m86580o90619k24555l33380m32586l88473k40318P8522l02338j01664
5217H673243q6218k40386J0607m827k37367P3241R4374P4521k80524J01203J69994
$$ plain form
5287 11866689 11584468 11521339 11231889 11200098 11057423 10837499 10542348 10449056 10351489 10288861
5277 10288861 10320733 10144610 10187612 10508023 10669363 10600270 10624560 11002515 11657941 11818600
5267 11818600 12234469 12610336 12679360 13123488 13072243 12890083 12796833 12648887 12666561 12583276
5257 12583276 12402473 12254824 12054439 11995876 11756835 11511783 11509127 11181349 11330574 11301246
5247 11301246 11100784 11009761 11126579 11242086 11358942 11408580 11355627 11483547 11676329 11722566
5237 11722566 11737593 12097634 11940400 11777814 11868446 11980264 12076550 12026570 12042355 11795234
5227 11795234 11308654 10618035 10393480 10060100 9627514 9239041 8998723 9077245 8774907 8673243
5217 8673243 8587025 8346639 8357246 8352419 8115052 8188293 8282667 8357188 8076664 8177867 8347861
5206H347861n5429o9163j0804M2557l48226j63849J12074l57485l32836j84216
5196F980484l77580j40148j67286L3560k8444r1896m2028j29362J5047o5260M4493
5185F031580q4241L0255o9593o1073R120l6008J6321J21223n7232l91765j17686
5174E390901K7602j64687j68582n332l9237j59899j35838j54107n540J24033p8325
5163D630989p8353j39014J74342n0290m1354j58958L8494j22669l8930k1236J28007
5152D321028R2428q0845J31865j71814j25552L6146M1071J0133j44572K20059
5142D329947j66490j48965k9230M653j94202K16722j32150j63997O5600o0855
5132C721033o6202r0121J65566k41073o1479O1341j34540K665J20942k35336j65296
$$ plain form
5206 8347861 8292432 8223269 8212465 8255022 7906796 7742947 7855021 7497536 7164700 6980484
5196 6980484 6602904 6462756 6295470 6329030 6300586 6208690 6166662 6037300 6052347 5987087 6031580
5185 6031580 5947339 5977594 5908001 5846928 5856048 5820040 5836361 5957584 5900352 5508587 5390901
5174 5390901 5418503 5253816 5085234 5079902 5040665 4880766 4744928 4590821 4585281 4709314 4630989
5163 4630989 4552636 4413622 4587964 4537674 4496320 4337362 4375856 4253187 4214257 4193021 4321028
5152 4321028 4413456 4332611 4464476 4292662 4167110 4203256 4244327 4254460 4109888 4329947
5142 4329947 4163457 4014492 3985262 3989915 3795713 4012435 3880285 3716288 3781888 3721033
5132 3721033 3654831 3564710 3730276 3489203 3427724 3489065 3354525 3357190 3478132 3242796 3077500
5121C077500Q0744J40949R7238m4664j39699Q4589l0842P126q1323J30897r4253
5110C228262J8995m3696j00323p5180j44922j71548R2398j95870q0329Q9796J77565
5099B795148o6361n9422J51556l48814J62658q2112j69287r7805R763j7873m5876
5088B231575P0814k15786J53704J62958j12423m6228n585J67992K739k74241p4817
5077B060702p934j17110j25082n3265j33133m5298L0328n8476J08034q7660k2810
5066A548296k1809J56446p773k58074J79853R4064j02467j31359o3589J46963
5056A540551k5823L847l701Q8183o3402o0652o065r2001k21114j1086J89408P4018
5044A412163k44864j01460N6573J16417k9218r191K24054j79563O3423k6197N7551
$$ plain form
5121 3077500 3158244 3299193 3396431 3351767 3212068 3296657 3265815 3272941 3191618 3322515 3228262
5110 3228262 3247257 3203561 3103238 3028058 2883136 2711588 2803986 2608116 2527787 2617583 2795148
5099 2795148 2728787 2669365 2820921 2472107 2634765 2552653 2383366 2285561 2295324 2277451 2231575
5088 2231575 2302389 2086603 2240307 2403265 2290842 2244614 2239029 2407021 2409760 2135519 2060702
5077 2060702 2052768 1935658 1810576 1757311 1624178 1578880 1609208 1550732 1658766 1571106 1548296
5066 1548296 1526487 1682933 1675160 1417086 1596939 1691003 1588536 1457177 1393588 1540551
5056 1540551 1514728 1518575 1514874 1603057 1539655 1479003 1472938 1380937 1159823 1148737 1338145 1412163
5044 1412163 1167299 1065839 1122412 1238829 1209611 1200420 1424474 1244911 1308334 1282137 1339688
5033A339688L1416l36545j53691K00398k7027M6221r080j16818r2313J29063r522
5022A001790n9778o5371k45471L60076J31316k22659l85184m7822J12224p2367
5012E06754J98432m6632l121j07984J18880j74109J29337M2817P893j02474n3427
5001E16366L61814k42719j20937L47230j70908k23363K9517j33773N0385J96033
4991F09645l13016p3585J76027j11540M0326M0163j8396n4692m319K22358O767
4980E19738j50125l6332n6775o3265j34640J71765J15625q3983J70514j38142
4970C14380n8389K24186K3186N0337k3699L0693j9283j37676l4420j26196k0241
4959B22878K22201j61706N8879l2616J29950j98755l8694J31026j05599l1246
$$ plain form
5033 1339688 1371104 1034559 880868 1081266 1054239 1100460 1091380 974562 882249 1011312 1001790
5022 1001790 942012 876641 631170 991246 1122562 899903 514719 466897 579121 506754
5012 506754 705186 658554 655433 547449 666329 492220 621557 664374 672267 569793 516366
5001 516366 878180 635461 514524 861754 690846 467483 497000 363227 413612 609645
4991 609645 296629 223044 399071 287531 327857 368020 349624 294932 290613 512971 519738
4980 519738 369613 333281 276506 213241 78601 250366 365991 282008 452522 314380
4970 314380 255991 480177 503363 553700 530001 560694 541411 403735 369315 243119 222878
4959 222878 445079 283373 342252 309636 439586 240831 202137 333163 227564 196318
4949A96318L52759J4707N4303L5442j35125o5838m7611j17684j7525J90605l7213
4938D23138J00244j71499j23437K09354j75118J6640M51708j03164k22880J1265
4928D16251J96676k16601k25721o1659M7132L42M8005j29719L6878L34802j47533
4917B98853R750n3051L5827l7733l20219P8929L25858M024J1812K3405Q8533o1834
4905D04154k20218r6559P7306k9961l5581l1875R4376J96642k18406j01166J59853
4894A98565K03029k7678k03663n6332R9548O1126k7241j49717k3690N5925J51063
4883B80935N766p5055J11821m8278j04777L10815P3682j20923j11406k27298R0741
4872A86023K5545J91409K1825j07733Q9197K01617m4305k64821r8891Q2693k9564
$$ plain form
4949 196318 549077 563784 618087 653529 518404 452566 404955 287271 269746 460351 423138
4938 423138 523382 351883 228446 437800 262682 279322 731030 627866 404986 416251
4928 416251 612927 396326 170605 108946 156078 156420 204425 74706 111584 446386 298853
4917 298853 308603 255552 291379 253646 -66573 12356 338214 342238 354050 377455 465988 404154
4905 404154 183936 87377 164683 134722 99141 67266 161642 358284 139878 38712 198565
4894 198565 401594 373916 170253 113921 213469 274595 247354 97637 73947 129872 280935
4883 280935 286701 211646 323467 275189 170412 481227 554909 433986 322580 95282 186023
4872 186023 211568 402977 424802 317069 406266 607883 563578 298757 199866 282559 252995
4861B52995o552Q2403l211J15069J9242k21758m0655N8648j86324k1627R7611
4850A45841k209k7072r2831N4399J50676O3342j07285J7906Q0107j12654J11590
4839B81810r965j41408P4814N7832j03394n6984J10660k531j03078R4966N2634
4828B55356M9227Q6150j50690Q3869N5422J4915J51323j78508M3450l9899q1774
4817B88841R0641K35525j43093L5611j00438k00052M077m7920J54896J81338j85876
4806C13550J42085o9258j71316J81639m9719P2535K9710J2139K46101J62997J25021
4795I95484K7547j39190J91634J10344l4514K37707J7429K42547K27670L24558
4785B201216K26727M26621O81170K52504J18699k71341m75821n42953n24061n69928
$$ plain form
4861 252995 246443 328846 325635 440704 459946 238188 197533 256181 69857 48230 145841
4850 145841 143632 116560 23729 78128 228804 292146 184861 202767 282874 170220 281810
4839 281810 271845 130437 205251 263083 159689 102705 213365 210834 107756 202722 255356
4828 255356 304583 390733 240043 323912 379334 394249 545572 367064 410514 370615 288841
4817 288841 379482 615007 471914 507525 407087 207035 211112 163192 318088 499426 313550
4806 313550 455635 386377 215061 396700 346981 419516 449226 461365 707466 870463 995484
4795 995484 1023031 883841 1075475 1185819 1151305 1389012 1406441 1648988 1876658 2201216
4785 2201216 2427943 2854564 3535734 3788238 3906937 3635596 3159775 2616822 2092761 1522833
4775A522833k57748q149m1838j07444j20057n835L8598j36801r7474p4378o2007
4764F49700j414J68820j99551o3502M568M243J52290p3950j94917K6690P99M2437
4752E16213J51261R6978k7104L9847j10106j22269l4422N4686Q1030l6183K4921
4741F34852j4624R8073O7193Q727M7971R2403o2616M7639k7338n3408J76409M5193
4729A060474J40968K7758J83328K28788M59422K56284J59796M32481M71381L56103
4719C776783K0676j53407j77795k90550n62709n06406k88216k89397l14636j86129
4709A028214q3478J25205O9248n9951j48608j61888j69395J53018j99119k6664
4699E26582o3703j41653Q2151n356J60298k3765O3734Q5074M0368P0833j72133
$$ plain form
4775 1522833 1265085 1256936 1215098 1107654 987597 981762 1020360 883559 786085 711707 649700
4764 649700 648286 817106 617555 554053 558621 562864 715154 641204 446287 472977 473776 516213
4752 516213 667474 764452 737348 777195 667089 544820 510398 565084 646114 609931 634852
4741 634852 620228 718301 785494 794221 842192 934595 871979 919618 892280 838872 1015281 1060474
4729 1060474 1201442 1229200 1412528 1641316 2100738 2357022 2516818 2949299 3420680 3776783
4719 3776783 3797459 3644052 3466257 3175707 2612998 2106592 1818376 1528979 1214343 1028214
4709 1028214 944736 1069941 1139189 1079238 930630 768742 599347 752365 553246 526582
4699 526582 462879 321226 403377 398021 558319 534554 598288 683362 723730 794563 622430
4688F22430l02283J10916J4275k67468R9521J12436J92504m1176m188K07240M2003
4677G86210j11694j96281L7065j9627n2487o4557K61437J8630j47506K5022n5933
4666D80279q16j47869J47113P2211j69092J17066j3474R0417P1433j17332q3089
4655D46847p5241Q6299j02591M5496Q3104r00j10501J7936j15244K676K17283
4644D95164J26428l0698P0471k82089l6877O4789j02058K20378j01673Q0242J5944
4633E20021l8997P404k67898j78J95865j7862n9903q8253L82752j86738j80572
4622B65641P0017M9469k8679R1106P3664j32629J87570j35255k146O9446J92244
4611G00448K00935m08780r1419j40257k5004K03793J47194j02392R5853J35407
$$ plain form
4688 622430 320147 431063 445338 177870 277391 389827 582331 541155 536967 744207 786210
4677 786210 674516 478235 515300 495673 443186 378629 640066 658696 511190 536212 480279
4666 480279 479463 331594 478707 550918 381826 498892 485418 575835 647268 529936 446847
4655 446847 371606 457905 355314 400810 483914 483014 372513 390449 275205 277881 495164
4644 495164 621592 590894 661365 379276 342399 407188 305130 525508 423835 504077 520021
4633 520021 481024 488428 220530 220352 416217 398355 338452 250199 632951 446213 265641
4622 265641 335658 385127 356448 447554 521218 388589 576159 440904 438758 508204 700448
4611 700448 901383 492603 401184 260927 235923 439716 586910 484518 580371 715778
4601G15778j48580j06618L2323J16639k18101j06881K06286Q749k13500R2990
4591C79085n3820O1226p7581J31590K35616j87388O7964J94475n5874j7112n0809
4580F27372j21206N95J17308J04895k10613l284m0759J6376j02186j09174L00462
4569E79786k0193L9973k07868P9764L21235j01002j8666p1372J5477P8955j10296
4558E85793K380n847l3067J68556J3398J763N8884J373m047j33479o1974o0730
4546E33003J45706o3130o3486l4341J96615K0335j33302L3894L3282L9483M2860
4535G50919J02383l48359o9245J8289O4198J91203j99851k03900J16216J79545
4525F01398Q2688M9911j5266J31852J85159j03527j31346M547p0688L09356O9387
$$ plain form
4601 715778 567198 460580 492903 609542 391441 284560 490846 499595 286095 379085
4591 379085 325265 386491 308910 440500 676116 488728 556692 751167 695293 678181 627372
4580 627372 506166 506761 624069 728964 518351 515067 474308 490684 388498 279324 579786
4569 579786 559593 599566 391698 471462 792697 691695 673029 601657 617134 696089 585793
4558 585793 588173 582326 549259 717815 731213 732976 791860 793233 789186 655707 593733 533003
4546 533003 678709 615579 552093 517752 714367 734702 601400 635294 668576 708059 750919
4535 750919 853302 504943 435698 453987 518185 709388 509537 305637 421853 601398
4525 601398 684086 733997 718731 850583 1035742 932215 800869 805416 734728 1044084 1113471
4514A113471j04686L8499j90231p1401J55384J28961l4981q1756j4583k12813
4504G25864K0359J69689Q0625J41477j99060q4889J8019J21480J4019J88134j92182
4493A003535J14137Q1505J30837r413m7339R980l468l7303k692M0697p2239K85099
4481A493336m1862j62508J2646p551o9455M6972j16616r4109K99092K28438k17940
4470A370443K59316K75613K67091K41738k3992o6893L23444K08984L14928L1211
4460C201883l28778j48889j46829l60972l63276K5032j46731J29277m2238m1216
4450A777263J39194j93805j04956J73259P979K7229j58217j3506P9337j21538
4440A612239K01028j64192k08400O3745K21972P5553P8768r253j09038N8209L1184
$$ plain form
4514 1113471 1008785 1047284 857053 785652 941036 1069997 1035016 953260 938677 725864
4504 725864 746223 915912 996537 1138014 938954 854065 872084 993564 1007583 1195717 1003535
4493 1003535 1117672 1199177 1330014 1320601 1273262 1283242 1279774 1242471 1239779 1280476 1208237 1493336
4481 1493336 1451474 1288966 1301612 1294061 1224606 1271578 1154962 1060853 1359945 1588383 1370443
4470 1370443 1629759 1905372 2172463 2414201 2390209 2323316 2646760 2855744 3170672 3201883
4460 3201883 2873105 2724216 2577387 2216415 1853139 1878171 1731440 1860717 1818479 1777263
4450 1777263 1916457 1722652 1617696 1790955 1798934 1826163 1667946 1654440 1733777 1612239
4440 1612239 1813267 1649075 1440675 1504420 1726392 1801945 1880713 1871460 1762422 1820631 1851815
4429A851815M8433J08076m5941J86071L8717o981n3918J22033j27008j76201J5951
4418A961047m9290L09904j05306q1796J72559j31495N9497J73851J5288r3084
4408B231175R6414N9554L5935R174q7m1503k77307M4855P345j14447M3643N4771
4396B149522n605J76809r6008M8410j34343k0556J09883J56833P6341M653K5561
4385B491500O2705j06131J43254M4347n6740R1736K82075o1307K09762J06386
4375C207587j21404j1116L1051J33266P7867N5961j19953M8997M4281L3696J93540
4364C573773j58644K19523L16882j60146O6530J28049R4430m3675J20969J56005
4354D313696K34825Q2236L2599Q2064Q873K57482p954l4715K20270K66436M14353
$$ plain form
4429 1851815 1900248 2008324 1962383 2148454 2187171 2180190 2126272 2248305 2121297 1945096 1961047
4418 1961047 1911757 2221661 2116355 2034559 2207118 2075623 2135120 2308971 2324259 2231175
4408 2231175 2327589 2387143 2423078 2432252 2432165 2390662 2113355 2158210 2165555 2051108 2094751 2149522
4396 2149522 2143917 2320726 2224718 2273128 2138785 2118229 2228112 2384945 2461286 2465939 2491500
4385 2491500 2554205 2448074 2591328 2635675 2578935 2670671 2952746 2891439 3101201 3207587
4375 3207587 3086183 3075067 3106118 3239384 3317251 3373212 3253259 3302256 3346537 3380233 3573773
4364 3573773 3415129 3634652 3951534 3791388 3857918 3985967 4080397 4036722 4157691 4313696
4354 4313696 4548521 4630757 4663356 4745420 4754293 5011775 5003821 4969106 5189376 5455812 5870165
4343E870165P2192J43196o5431K59702K85954L48664L13176K35442N53211K73148
4333H289419J38244K4113N7483K4446L1676J12792J16373J58420j74462J07057
4323H885561L05415J18505N5802P4594O5131K77559J93955Q7211Q5893K40795
4313A0390421J93922K47280K74447K52467M09681K29590K94283M74445K59639
4304A3026175L95901M44298M09906M02673K15819R5112r9778m9069p3024J05879
4294A4873892J61716l156k05817l25676j09211q7782k01183n8014K6662l5747
4284A4035684J6095L4903N3640M7611q7454K53169K63240K96231R6962K01991
4274A5212072L12629K48934J59292K25261M50662L9244j806J44920n7529j18841
$$ plain form
4343 5870165 5942357 6085553 6020122 6279824 6565778 6914442 7227618 7463060 8016271 8289419
4333 8289419 8427663 8451776 8509259 8533705 8565381 8678173 8794546 8952966 8778504 8885561
4323 8885561 9190976 9309481 9365283 9439877 9505008 9782567 9976522 10063733 10149626 10390421
4313 10390421 10584343 10831623 11106070 11358537 11768218 11997808 12292091 12766536 13026175
4304 13026175 13422076 13866374 14276280 14678953 14894772 14989884 14890106 14841037 14768013 14873892
4294 14873892 15035608 15032452 14826635 14500959 14391748 14303966 14102783 14044769 14071431 14035684
4284 14035684 14051779 14086682 14140322 14187933 14100479 14353648 14616888 14913119 15010081 15212072
4274 15212072 15524701 15773635 15932927 16158188 16608850 16648094 16646288 16791208 16733679 16614838
4264A6614838j34945r0784L08489J86440R8915K29943K40784m6790N0159l4788
4254A7422261o3333j24132J4621Q7570K2420J67471K24479l03289J31753L78548
4244A7958369K76745j59493J65733L04021K67921N0143J17260K82799K23726J67670
4234A9654894K75051K37678n5251K35249K67960J71187M22767L26889K82329M85164
4224B2303917O34168Q35762N53444M36573M17674N93522N55039N17384L92066
4215B7239549P04160N87241O89682N20831P07111R40692R07150J025827J081374
4206C4403617J186683J150875J225344J577520J536476J637031J848079K018438
4198D6584063J861316K142554K200932K611476L060840L083879L670849M593048
$$ plain form
4264 16614838 16479893 16389109 16697598 16884038 16982953 17212896 17453680 17406890 17457049 17422261
4254 17422261 17358928 17234796 17249417 17336987 17359407 17526878 17751357 17448068 17579821 17958369
4244 17958369 18235114 18075621 18241354 18545375 18813296 18863439 18980699 19263498 19487224 19654894
4234 19654894 19929945 20167623 20112372 20347621 20615581 20786768 21209535 21536424 21818753 22303917
4224 22303917 22938085 23773847 24327291 24763864 25181538 25775060 26330099 26847483 27239549
4215 27239549 27943709 28530950 29220632 29741463 30448574 31389266 32296416 33322243 34403617
4206 34403617 35590300 36741175 37966519 39544039 41080515 42717546 44565625 46584063
4198 46584063 48445379 50587933 52788865 55400341 58461181 61545060 65215909 69808957
4190F9808957N070545N730023O935505Q177106R197290J0513620J2519361J4743586
4182A42695993J8517033K3179088K8598080L5081594M1683013M7637807M7014344
4175C84406952L3902858J267315l2229702n3234135n2917008m0618622l0342200
4168B10235458k4160726k0267573j6841971j3642747j0850021r098526p549441
4161A07824453o483260n442749m382434l854059l507864k961485k938304j865723
4153G6388575j590255j573847j879384k112199k504497j862564j468011p34444
4145F2663374j60924O27764J041621K234158K887282L672302L503283L012792
4137G9481652Q07663j881502m027545n107683n365853m349470l868675l330181
$$ plain form
4190 69808957 74879502 80609525 87545030 95722136 104919426 115433046 127952407 142695993
4182 142695993 161213026 184392114 212990194 248071788 289754801 337392608 384406952
4175 384406952 418309810 419577125 387347423 334113288 281196280 240577658 210235458
4168 210235458 186074732 165807159 148965188 135322441 124472420 115373894 107824453
4161 107824453 101341193 95898444 91516010 87661951 84154087 81192602 78254298 76388575
4153 76388575 74798320 73224473 71345089 69232890 66728393 64865829 63397818 62663374
4145 62663374 62502450 63130214 64171835 66405993 69293275 72965577 76468860 79481652
4137 79481652 80289315 78407813 74380268 69272585 63906732 59557262 55688587 52358406
4129E2358406l360039k893895k165687j808849j470609j318853j050472q17788
4121C7472214n59074m36234k18701O9195k87949k93543p83584p82554q14763r26025
4111C2438982n26558k97654m72640m9251j1996p3905J214J58767K51942M08176
4101C1827077P77390O65006Q47325J025391Q59314Q35138l78915j314379j265805
4092C3877542j603746j092153p00246l15322r7316J06642N28121N87587L10663
4083C1601772r20671j921779j559512j158715q70196q19401n18559m64268m26781
4074B2941890k86016l07082J0944j97979l49209j6140m75418k20464j85092j91375
4064B0724059j35314k6150j76188n3213K6493R0357j63434J87069O3692j23143
$$ plain form
4129 52358406 48998367 46104472 43938785 42129936 40659327 39340474 38290002 37472214
4121 37472214 36913140 36476906 36258205 36327400 36039451 35745908 34962324 34179770 33365007 32438982
4111 32438982 31912424 31614770 31142130 31092879 31080883 31006978 31008192 31166959 31418901 31827077
4101 31827077 32604467 33269473 34116798 35142189 36001503 36836641 36457726 35143347 33877542
4092 33877542 32273796 31181643 30481397 30166075 30068759 30175401 30703522 31291109 31601772
4083 31601772 30681101 28759322 27199810 26041095 25170899 24351498 23832939 23368671 22941890
4074 22941890 22655874 22348792 22359736 22161757 21812548 21796408 21320990 21100526 20915434 20724059
4064 20724059 20588745 20562595 20386407 20333194 20359687 20450044 20286610 20473679 20537371 20414228
4054B0414228J72067K23180J51143J72687m7984K21992K98494M60356K92027J76438
4044B2534628M27504M07190L46829N33220N60514L41540N35997M45719K42930
4035B6376071p0099p1515j07118k41945j68550l93454l93844l21616j05181J74038
4025B4676787O45960K07634J46283M1016M9571K75506M12367J27018K46560J43428
4015B6972130L03072M66730N65593L02894Q6568N69055M06675P24467Q27192R50437
4005C2174813J225884J371265J569826J717233J610695J647151J493435J243920
3997D4054222O89139k30405j461005j546026j055983n60839K74N13503J051886
3988D1454766J597065K059857K631428L294474L480173K771721N20359k530519
$$ plain form
4054 20414228 20586295 20809475 20960618 21133305 21085321 21307313 21605807 22066163 22358190 22534628
4044 22534628 22962132 23369322 23716151 24249371 24809885 25151425 25687422 26133141 26376071
4035 26376071 26305972 26234457 26127339 25885394 25716844 25323390 24929546 24607930 24502749 24676787
4025 24676787 25322747 25530381 25676664 25717680 25767251 26042757 26455124 26582142 26828702 26972130
4015 26972130 27275202 27741932 28307525 28610419 28696987 29266042 29672717 30397184 31224376 32174813
4005 32174813 33400697 34771962 36341788 38059021 39669716 41316867 42810302 44054222
3997 44054222 44743361 44512956 43051951 41505925 40449942 39889103 39889377 40402880 41454766
3988 41454766 43051831 45111688 47743116 51037590 54517763 57289484 57809843 55279324
3980E5279324l916969k974225j727949p06041j15528N69206R67864J185638L52022
3971D8913342j43312L7752J80093J76168M58856J312850J706892K431543K415994
3962E7490178K434369K206755J409082N12339K88553K0011j108124k373710k142027
3953E8737426j834282k010549k684518l131874k553053j949207j415785q76587
3945D2281571l78148k7407m433K59485r4424n69179o28961m13122k04244j39639
3935D0081499J72535P88250J111479J925207K313846K931127L220732L402170
3927E5946845K416531K95632j344227l080828l413026k596418j389796p00474
3919D6134239l67787K29445R10704J186885J316619P99584p31424k250738k623925
$$ plain form
3980 55279324 51362355 48388130 46660181 45954140 45838612 46407818 47375682 48561320 48913342
3971 48913342 48770030 48807782 48987875 49164043 49622899 50935749 52642641 55074184 57490178
3962 57490178 59924547 62131302 63540384 64052723 64341276 64361287 63253163 60879453 58737426
3953 58737426 56903144 54892595 52208077 49076203 46523150 44573943 43158158 42281571
3945 42281571 41903423 41876016 41871583 42131068 42036644 41467465 40838504 40425382 40221138 40081499
3935 40081499 40254034 41042284 42153763 44078970 46392816 49323943 52544675 55946845
3927 55946845 58363376 58659008 57314781 54233953 50820927 48224509 46834713 46134239
3919 46134239 45766452 45995897 46906601 48093486 49410105 50209689 49478265 47227527 44603602
3910D4603602k607895k244841j876666j492322j117033q68288n27992o01706j93264
3901C3073595O4748Q0263K59093r1200j11030J19259M19710N57035n4050l20025
3891C3997398Q5332M13311K98764M96159M91205P43946Q07644O51677L63373M5918
3881C8394727N8547K98023L7485m85703j124494j468296j276867j168411j017237
3872C2247774q71572l66945j22112J20584K2507K14907O09698P53738Q32323Q74571
3862C4315473J090850J338317J571747J972904K116985K390665K488930J955439
3854D9241310J327411J218186P97035M10723J05305j97773r05616j597592j672305
3845D8726684j630178j606573j293913q92001n3359M66189K42893O02523J032869
$$ plain form
3910 44603602 41995707 39750866 37874200 36381878 35264845 34396557 33868565 33266859 33073595
3901 33073595 33138343 33218606 33477699 33386499 33275469 33394728 33814438 34371473 34317423 33997398
3891 33997398 34082730 34496041 34794805 35290964 35782169 36526115 37333759 37985436 38348809 38394727
3881 38394727 38453274 38751297 38788782 38303079 37178585 35710289 34433422 33265011 32247774
3872 32247774 31376202 31009257 30887145 31007729 31030236 31245143 31854841 32608579 33440902 34315473
3862 34315473 35406323 36744640 38316387 40289291 42406276 44796941 47285871 49241310
3854 49241310 50568721 51786907 52583942 52994665 53099970 52902197 51996581 50398989 48726684
3845 48726684 47096506 45489933 44196020 43304019 43250660 43716849 43959742 44562265 45595134
3836D5595134J160821Q03143N67912O59425P07637J052809J813009K357619K627621
3827E7345130K729264K803199K657196K058197R43584j58958p01582l12783J33182
3818F7496429J3443q2653q89145j002839p49647r92751n76269l98170p62518n58327
3808F1497553n22289o93439r25175j589756k119332j640472j136879o50785m5588
3799E2173838J73610O58410R64568R45655J065866Q41413P70547J302495J739021
3790F0635423J743372K277107K181037J900811R80946n15337j734067k335849
3782F5133443k658251k874790k395998j680213j468074j675965j884229k156060
3774D8339863j999282j456268j242185o82896l30101k97818j55502J27302K38243
$$ plain form
3836 45595134 46755955 47559098 48127010 48786435 49494072 50546881 52359890 54717509 57345130
3827 57345130 60074394 62877593 65534789 67592986 68536570 68377612 67676030 67363247 67496429
3818 67496429 67509872 67427219 66538074 65535235 64785588 63792837 63216568 62818398 62055880 61497553
3808 61497553 60975264 60281825 59356650 57766894 55647562 54007090 52870211 52219426 52173838
3799 52173838 52347448 53005858 53970426 54916081 55981947 56823360 57593907 58896402 60635423
3790 60635423 62378795 64655902 66836939 68737750 69718696 69203359 67469292 65133443
3782 65133443 62475192 59600402 57204404 55524191 54056117 52380152 50495923 48339863
3774 48339863 46340581 44884313 43642128 42959232 42629131 42331313 42175811 42303113 42541356
3765D2541356K17661N93108P35257M74065L41575O40830L08069k55904p65795
3756D4830222j103820j463619j440664j496547j092443j030046j110564j052131
3748C5040388j403299j116237q49817o55293p67637o60790l55405n54056O290
3739B8684144j75479k63871j30140j19301k28638k17332l09646J6323j90263j43105
3729B6922692l88209j92357m1715k04977j18191j32629J32963L8514j47902q6374
3719B5781815L02612K35692L45504K56649K91445N54307M45099N46335Q33990
3710B9593448O70000R53616R27092J157940J102803J191452J267398J141938R87531
3701C8993218J090123Q91227P64437Q83566Q83346R72435Q60658M90186l3909
$$ plain form
3765 42541356 42759017 43352125 44087382 44561447 44903022 45543852 45851921 45596017 44830222
3756 44830222 43726402 42262783 40822119 39325572 38233129 37203083 36092519 35040388
3748 35040388 33637089 32520852 31671035 31015742 30248105 29587315 29231910 28677854 28684144
3739 28684144 28508665 28244794 28114654 27995353 27766715 27549383 27239737 27256060 27065797 26922692
3729 26922692 26534483 26342126 26300411 26095434 25977243 25844614 25977577 26016091 25868189 25781815
3719 25781815 26084427 26320119 26665623 26922272 27213717 27768024 28213123 28759458 29593448
3710 29593448 30263448 31217064 32144156 33302096 34404899 35596351 36863749 38005687 38993218
3701 38993218 40083341 40974568 41739005 42622571 43505917 44478352 45339010 45829196 45795287
3692D5795287m14148r34878j013435p52542n03235l83500J66743L79145N91189
3683D2930626P73565Q60679J641615J654578K017056K578828K804154K752534
3675E8013635K514559K353324J915020J952533K326057K678601K758731K271686
3667G6784146J537142N51099n88720j465462k180962j845986j653691j314335
3659F9823231j130716n79740l76539r7128j72901m20181l49683j3719J048920
3650F7731544J175405J564518J844032J966296J591144J102800O44949K09824
3642G7830512P93491J545487J560231J222202J011862Q69682N88838O26800M90512
3633H6539617K68382O1416l12099P5013J61011p96185j743576k405968k917327
$$ plain form
3692 45795287 45381139 44446261 43432826 42680284 42177049 41793549 41960292 42339437 42930626
3683 42930626 43704191 44564870 46206485 47861063 49878119 52456947 55261101 58013635
3675 58013635 60528194 62881518 64796538 66749071 69075128 71753729 74512460 76784146
3667 76784146 78321288 78872387 78283667 76818205 74637243 72791257 71137566 69823231
3659 69823231 68692515 68112775 67736236 67639108 67466207 67046026 66696343 66682624 67731544
3650 67731544 68906949 70471467 72315499 74281795 75872939 76975739 77620688 77830512
3642 77830512 78624003 80169490 81729721 82951923 83963785 84833467 85422305 86049105 86539617
3633 86539617 86807999 86869415 86557316 86632329 86793340 85997155 84253579 81847611 78930284
3624G8930284k585782k224056j995546j693811r22039n34330l50428k72507m88540
3615F7863245p27731q21009m73447k23590K10924M01940Q38531J318274J493081
3606F9880218J850841J662506J166142J005482L94187N48473j26101o40679j422745
3597G4318324j645477j838081k449172k895218k766995k510985j967765j424803
3589E6819828j156768r20096q66338o39250o61540k21840l13245n85250m19744
3580E1035757l20783k67666k30864m2507L16606J40707P7336q8001j99698n73735
3570D9847152j84658k74625m77876o12237j285988j315735j264951j246876j055297
3561D2128909j374675q54305o20010q39243r99079r84137o67910n63408p07910
$$ plain form
3624 78930284 76344502 74120446 72124900 70431089 69509050 68974720 68624292 68351785 67863245
3615 67863245 67135514 66314505 65841058 65617468 65828392 66230332 67068863 68387137 69880218
3606 69880218 71731059 73393565 74559707 75565189 75959376 76507849 76381748 75741069 74318324
3597 74318324 72672847 70834766 68385594 65490376 62723381 60212396 58244631 56819828
3589 56819828 55663060 54742964 53876626 53237376 52575836 52353996 52040751 51455501 51035757
3580 51035757 50714974 50447308 50216444 50173937 50490543 50631250 50708586 50620585 50420887 49847152
3570 49847152 49662494 49387869 48909993 48297756 47011768 45696033 44431082 43184206 42128909
3561 42128909 40754234 39899929 39279919 38440676 37441597 36457460 35789550 35226142 34518232
3552C4518232n11920l50781n51426n30353m78018l25771n68816l97801m07237
3543C0396109o96125o52984k39755k99395n97423l16415l33607l22162j38765
3534B6799478l36869m20690l29335m82270m26291k84435o04115k43133n63065
3525B3109275l37465k69297m23726m38825n21974k23741m81681m36367m16111
3516A9560088n03552m74032k62255k14834l30827l47353p0322m07913j40931q9526
3506A6718543j06198j84073l52556j30259j65525k20806n9853n97416m54569k46385
3496A4200903j14949k426j42466j63726j75390j97839m11648j78820j73636j99628
3486A2440375j91451j46308l27365j64424r2643J08423l47622o8816j36019P5391
$$ plain form
3552 34518232 34006312 33655531 33104105 32573752 32095734 31769963 31201147 30803346 30396109
3543 30396109 29699984 29047000 28807245 28507850 27910427 27594012 27260405 26938243 26799478
3534 26799478 26462609 26041919 25712584 25230314 24804023 24519588 23915473 23672340 23109275
3525 23109275 22771810 22502513 22078787 21639962 21117988 20894247 20412566 19976199 19560088
3516 19560088 19056536 18582504 18320249 18105415 17774588 17427235 17356913 16949000 16808069 16718543
3506 16718543 16612345 16428272 16075716 15945457 15779932 15559126 15499273 14901857 14447288 14200903
3496 14200903 14085954 14083528 13941062 13777336 13601946 13404107 12992459 12813639 12640003 12440375
3486 12440375 12248924 12102616 11775251 11610827 11518184 11626607 11278985 11210169 11074150 11149541
3476A1149541j04677k27461j27848J85722O8753j79439j48259j42003R1608j92347
3466A0373590j85894j47103l721j35272M8960j20183k14191j4807j28784o806
3456I465789k64475j16825J1703j72229j69109J38737P3389j02058l7623q2953
3446H744346P0994j55333N266p836K98059j43191O3274N5768O9754R408n7087
3435H953422k40627m3287j43990j52019J81897N7832o2308j11566J1721J82697
3425H633772J886j69616j01828J51609P8890q7913m3781N9620j49591j08589P0290
3414H334749j86823Q1326J4420K17307J04391k5562J9815J3711j7509k13507j9035
3403H323283l896J46629p6659j46998j03857j43438j29377q7283R1066j13947
$$ plain form
3476 11149541 11044864 10817403 10689555 10875277 10944030 10764591 10616332 10474329 10565937 10373590
3466 10373590 10187696 10040593 10036872 9901600 9950560 9830377 9616186 9601379 9472595 9465789
3456 9465789 9201314 9084489 9096192 8923963 8754854 8893591 8966980 8864922 8827299 8744346
3446 8744346 8815340 8660007 8665273 8657437 8955496 8812305 8875579 8931347 9001101 9010509 8953422
3435 8953422 8712795 8669508 8525518 8373499 8555396 8613228 8550920 8439354 8451075 8633772
3425 8633772 8635658 8466042 8364214 8515823 8594713 8506800 8463019 8522639 8373048 8264459 8334749
3414 8334749 8147926 8229252 8243672 8460979 8565370 8539808 8559623 8573334 8555825 8342318 8323283
3403 8323283 8319387 8466016 8389357 8242359 8138502 7995064 7865687 7778404 7869470 7755523
3393G755523J85117J17045m7874Q15j23521l4398J2373m1755L08644j32195k9237
3382G970537r0392K13225J20484L3091L2708k93493M2391J58769j31060j36737
3372G919523q5872r0280j4994j18651k22860l3717J44211m0745Q0465j9577O772
3361G524275j40841J1993K58556k94607J87561R3215J3457J01928k2044J12681
3351G846174R3771O6937j4227P6642R0770k2031j13923j6799m6773J5684o6926
3340G909299Q1310J02381P3089L4333j13109O161M1506j30080J88020M7928k3147
3329H217691K8719J20979K30823O6868K17211J44911J75790p325L16114J33382
3319I645163L6903K02725J42793K8363J71150p8383r3981J83014j14417m5400
$$ plain form
3393 7755523 7940640 8057685 8009811 8010626 7887105 7852707 7865080 7823325 8131969 7999774 7970537
3382 7970537 7880145 8093370 8213854 8246945 8279653 7986160 8028551 8187320 8056260 7919523
3372 7919523 7833651 7743371 7728377 7609726 7386866 7353149 7497360 7456615 7537080 7517503 7524275
3361 7524275 7383434 7395427 7653983 7359376 7546937 7640152 7653609 7755537 7733493 7846174
3351 7846174 7939945 8006882 7992655 8069297 8160067 8138036 8024113 8007314 7960541 7976225 7909299
3340 7909299 7990609 8092990 8166079 8200412 8087303 8093464 8134970 8004890 8192910 8240838 8217691
3329 8217691 8246410 8367389 8598212 8665080 8882291 9027202 9202992 9195667 9511781 9645163
3319 9645163 9682066 9884791 10027584 10055947 10227097 10148714 10054733 10237747 10123330 10077930
3309A0077930K77159J90723o9861J66602M6322R0050J45954k2237K07531J28789
3299A1238962N1223L8261K3707L15592L57287K41133J63287M19189K12817K84765
3289A3346223K88366L04048L10198L12456L40798L39280L25661L34373J94825
3280A6096228L67106M17334L63722L64798M46645N50263M67127L82992P59526
3271B0215741Q51549J048360Q08537J021947J115554J482769J487810J592507
3263B9624774J709554J621273J736761J634450J222102O82052L95247j79492q53957
3254C7592764j353411j609091j982724k384125k526327j951421k081752j833165
3246B1870748j434204j316583j075029r20437j032310q09844q30814o11496o30848
$$ plain form
3309 10077930 10355089 10545812 10475951 10642553 10688875 10778925 10924879 10902642 11110173 11238962
3299 11238962 11290185 11328446 11352153 11667745 12025032 12266165 12429452 12848641 13061458 13346223
3289 13346223 13634589 13938637 14248835 14561291 14902089 15241369 15567030 15901403 16096228
3280 16096228 16463334 16880668 17244390 17609188 18055833 18606096 19073223 19456215 20215741
3271 20215741 21067290 22115650 22924187 23946134 25061688 26544457 28032267 29624774
3263 29624774 31334328 32955601 34692362 36326812 37548914 38230966 38626213 38446721 37592764
3254 37592764 36239353 34630262 32647538 30263413 27737086 25785665 23703913 21870748
3246 21870748 20436544 19119961 18044932 17124495 16092185 15282341 14451527 13840031 13209183
3237A3209183l53192k73406n19466m95105k00743l24519k09656k20448m18828
3228A0193820j94249j1280j09108m529j39722K3727j73487k70408k8325k94764
3218H991675J11906Q9981o3264j38985k37645O6902P5959j07419k56840j66511
3208H365759l3405l4717m8978j36933j00163r5032k86181j10972k43355K8455
3198G304478j41101l39298N2833k09474M9878K1333J12544R3682j71973j97344
3188F575558J23492J00777L1233P038o8328J45045J0875M4553j7732j43640p3355
3177F735516l5002j85105J498o3044P3202M2227q7029L504k64407K9958K38458
3166F489776r6046r3704R108K10222Q7017R4079R2945k71462J3490J25361Q0094
$$ plain form
3237 13209183 12855991 12582585 12063119 11568014 11367271 11042752 10833096 10612648 10193820
3228 10193820 9999571 9988291 9879183 9874654 9734932 9758659 9585172 9314764 9286439 8991675
3218 8991675 9103581 9193562 9130298 8991313 8753668 8820570 8896529 8789110 8532270 8365759
3208 8365759 8332354 8297637 8248659 8111726 8011563 7916531 7630350 7519378 7276023 7304478
3198 7304478 7163377 6824079 6876912 6667438 6717316 6738649 6851193 6944875 6772902 6575558
3188 6575558 6699050 6799827 6831060 6838098 6769770 6914815 6925690 6970243 6952511 6808871 6735516
3177 6735516 6700514 6515409 6516907 6453863 6527065 6569292 6482263 6485767 6221360 6251318 6489776
3166 6489776 6393730 6300026 6309134 6519356 6606373 6700452 6793397 6521935 6535425 6660786 6740880
3155F740880J8276q2211j21095j84037k05542J6050k06824J34339p9988J42567
3145F172415j66990p8165j0594J12438j48295j06480j4267q4793R9055M4450Q1005
3134E899779K1238n3532q6063k5503q335Q8932J47579P2934n7416L1534k87261
3123E743886n6637o2618J00250p9798k3650J76135j20810q4402Q0709o9357J64343
3112E768051r1791m58819o5707l27647j49238J71690K19478j20127P9341K03512
3102E228743m16370j03572j73726N2996Q929j67465k6757J14321R5658j27627
3092D485130K9389j39973k74411K0128p7784K71128M4452K109j55904k51669q2925
3081C869670k4038J3350j08088L428J49609k45622r5634l7707j57364k1422l591
$$ plain form
3155 6740880 6759156 6676945 6555850 6371813 6166271 6182321 5975497 6109836 6029848 6172415
3145 6172415 6005425 5927260 5916666 6029104 5880809 5774329 5760062 5675269 5774324 5818774 5899779
3134 5899779 5921017 5867485 5781422 5755919 5747584 5836516 5984095 6057029 5999613 6031147 5743886
3123 5743886 5687249 5624631 5724881 5645083 5621433 5797568 5676758 5592356 5673065 5603708 5768051
3112 5768051 5676260 5217441 5151734 4824087 4674849 4846539 5066017 4945890 5025231 5228743
3102 5228743 4812373 4708801 4535075 4588071 4597000 4429535 4402778 4517099 4612757 4485130
3092 4485130 4514519 4374546 4100135 4120263 4042479 4313607 4358059 4360168 4204264 3952595 3869670
3081 3869670 3845632 3858982 3750894 3754322 3903931 3658309 3562675 3524968 3367604 3346182 3342591
3070C342591J18824l9816j18916n8116l9360j23505j22240r4070K9908l4198r5847
3059B765255J46262j31857n8471N0370j63975L3159j89913k66186L03843L1930
3049B520417l3984K7060J75730j29438m9287n2500j26592L5586r6214J0141j40777
3038B140142l0017j20048J15763l6466j06250K00913N1134j63145k43754L3733
3028A842005P9229k13619K06256j82799J14695o642m2869k24532k9544J59200
3018A701380j11594M2826J07154m4608r9572r1330j6486j9137k1846J04041J09232
3007A660060j55997j54280K07572J49878j61817j6005N4324K5024k19216n0152
2997A339391k6486m3735N6231K75579j81591M5840O3937M9624J39945j57701Q9836
$$ plain form
3070 3342591 3461415 3421599 3302683 3244567 3205207 3081702 2959462 2865392 2895300 2861102 2765255
3059 2765255 2911517 2779660 2721189 2771559 2607584 2640743 2450830 2184644 2488487 2520417
3049 2520417 2486433 2513493 2689223 2559785 2510498 2457998 2331406 2366992 2270778 2280919 2140142
3038 2140142 2110125 1990077 2105840 2069374 1963124 2164037 2215171 2052026 1808272 1842005
3028 1842005 1921234 1707615 1913871 1731072 1845767 1839125 1796256 1571724 1542180 1701380
3018 1701380 1589786 1632612 1739766 1695158 1595586 1504256 1487770 1468633 1446787 1550828 1660060
3007 1660060 1504063 1349783 1557355 1707233 1545416 1529411 1583735 1608759 1389543 1339391
2997 1339391 1312905 1269170 1325401 1600980 1419389 1465229 1529166 1578790 1718735 1561034 1650870
2986A650870j25437j16223J93766l2284M1211l314r8827J56755J0383r2631J7055
2975A601324K5571l64785L20300R4926K8435o5390p4940j15790J69625j3686J28169
2964A733759K2067q2509j90962J69344j2202j3919L0149J10621j1776m7804K69268
2953A976036j08601J72045J20241q2543l0547K28907K14188j00427J55778j10866
2943B434211j54206K1472J32708n2415j32534j8161R8837P0846n9785J10198j21513
2932B329658J32396J57776p1710j30292J43848k0960J65213N9720P4917k24276
2922B616290K03604K79853K49492K22932J75326J1851j4588k04138k71302m23966
2912B845354k98883j09345L463n737j35228k53711l6562J13896j06156j38554
$$ plain form
2986 1650870 1525433 1409210 1602976 1570692 1611903 1608589 1509762 1666517 1676900 1584269 1601324
2975 1601324 1626895 1262110 1582410 1677336 1705771 1640381 1565441 1449651 1619276 1605590 1733759
2964 1733759 1755826 1673317 1482355 1651699 1639497 1625578 1655727 1766348 1754572 1706768 1976036
2953 1976036 1867435 2039480 2159721 2077178 2046631 2275538 2489726 2389299 2545077 2434211
2943 2434211 2280005 2301477 2434185 2381770 2249236 2231075 2329912 2400758 2340973 2451171 2329658
2932 2329658 2462054 2619830 2548120 2417828 2561676 2540716 2705929 2765649 2840566 2616290
2922 2616290 2819894 3099747 3349239 3572171 3747497 3759348 3744760 3540622 3269320 2845354
2912 2845354 2546471 2437126 2440589 2434852 2299624 2045913 2009351 2123247 2017091 1878537
2902A878537M4006l1151l4662M9718K4175R7613k31820k5674j1495O8438R0368
2891A918053J19726j30831J62474j15963M2502k4779J42261j21840j03535j26694
2881A761374j85090L4223n8418k04811n0784j50959L8674J60050q5642r5371j30747
2870A032499R5344q0570m4373M2040O2365r5144q3592Q427J48312j22224j53171
2859H09913O2803O6458p8534N6035k74880O0292O9125j31484j78858j56619O1522
2848C65773P6456K03530J3159j79803k3745Q9719K6425n2387m6557j18202J26354
2837D80722R4170k48963Q0597P151J49110l4073K9662j26407q9430J53325L2138
2826E28002j55701j0399K6198m8666l9143j96252K5503J45124N0641J62565k5069
$$ plain form
2902 1878537 1922543 1891392 1856730 1906448 1930623 2028236 1796416 1770742 1759247 1827685 1918053
2891 1918053 2037779 1906948 2069422 1953459 1995961 1971182 2113443 1991603 1888068 1761374
2881 1761374 1576284 1610507 1552089 1347278 1296494 1145535 1184209 1344259 1258617 1163246 1032499
2870 1032499 1127843 1047273 1002900 1044940 1107305 1012161 928569 936996 1085308 963084 809913
2859 809913 872716 939174 860640 916675 641795 702087 771212 639728 460870 304251 365773
2848 365773 442229 645759 658918 479115 455370 545089 571514 519127 472570 354368 480722
2837 480722 574892 325929 406526 413677 562787 528714 558376 431969 342539 495864 528002
2826 528002 372301 361902 388100 339434 300291 104039 129542 274666 325307 487872 462803
2815D62803j05191K2477O274q7969j8437k8768k0558K00411j27206o0675J38095
2804C81256R0832o0215N3509p3763J39479m2596j38599J37387L3302k46087k3266
2793B51239j35339R609J11935Q497o0647J259O2761M0075l8430j99372n530J51427
2781A97484P4709l9425o2315J6783J64493l8342k40167J36969N2014r6990J30332
2770B95545J8233Q7340q9613M9224k47893m8672R2373K7219m5295j41071K32588
2759B29978R6480k57268r8552J18930n3230K5450R341k3182N2256m7084N1763
2748A04882J65090l2184m5707j77293Q8587M4099J6708R6793n7645K2871j62722
2737F3479J13049n0348m659l5966L0192l0283q3105O6102M1881k9097j20749Q0801
$$ plain form
2815 462803 357612 380089 386363 298394 279957 251189 230631 431042 303836 243161 381256
2804 381256 472088 411873 465382 391619 531098 488502 349903 487290 520592 274505 251239
2793 251239 115900 125509 237444 245941 185294 186553 249314 289389 250959 51587 46057 197484
2781 197484 272193 232768 170453 187236 351729 313387 73220 210189 262203 165213 295545
2770 295545 313778 401118 311505 360729 112836 64164 156537 183756 138461 -2610 229978
2759 229978 326458 69190 -29362 89568 36338 61788 71129 47947 100203 53119 104882
2748 104882 269972 237788 192081 14788 103375 147474 164182 260975 203330 226201 63479
2737 63479 176528 126180 121521 85555 115747 85464 2359 68461 110342 81245 -39504 41297
2725D1297q2288K37966L3842j93802j83854J682K35183J2790J6307j53759J41003
2714A06367m1875k06195J13098j09075J0723K21707o1544j4480j48496j84478
2704c14248K36264J117j71375q394O4154m985p3963J31981j5884P081R6609R3170
2692D1527J49999p9152j93296j03739J03686l6977J34200J53044l3577k49443
2682a13728K5766K10084l5902n1631J1018J30803j12864L4867n0687O6837j340
2671A13223j46439l2115K17013j68941J20545R2719j32336K3222r245k00200j09462
2660b32016K41497o5145J48933j0929m0551j4655J17148O9491l15685j8321J23516
2649C283J09275j25678O8451J16789m0869j96450j46040K23902J3741O9964L7634
$$ plain form
2725 41297 -40991 196975 230817 37015 -146839 -145157 90026 102816 119123 -34636 106367
2714 106367 64492 -141703 -28605 -137680 -126957 94750 33206 18726 -129770 -314248
2704 -314248 -77984 -76867 -248242 -256636 -192482 -197467 -271430 -139449 -155333 -148252 -51643 41527
2692 41527 191526 112374 -80922 -184661 -80975 -117952 16248 169292 135715 -113728
2682 -113728 -87962 122122 86220 34589 45607 176410 63546 98413 47726 114563 113223
2671 113223 -33216 -65331 151682 -17259 103286 196005 63669 86891 77646 -122554 -232016
2660 -232016 9481 -55664 93269 82340 41789 27134 144282 213773 -101912 -120233 3283
2649 3283 112558 -13120 55331 172120 131251 -65199 -211239 12663 26404 96368 134002
2638A34002j03155j26586r35L8386r1066k19J4372P6406Q7905j02229n3581k7963
2626a54663L9647J8177P3850J1989J24620M5418n0977j20217J24756k9914o0407
2615B2279l4314J67293Q0803j22181j19301K8655R9378j76345J06874L9511p676
2604H4976N0803k99408N4999J10686J48324r9658j53291j34091J36058R9014p0151
2593g1739M8795j55961j39589J27897K74295m8082Q288J57735M9652j44789J0931
2582A17433r6979q9044j16531q2412J69474R8022j03451o6953r0541J81123j02525
2571a82384P6316J97604n0650p6108O3326L3529j8973P0505j36527l3000P5515
2560A9153o5933j30975K49026M576k75093q0491j5064R9876J36006J40312j92295
$$ plain form
2638 134002 30847 -95739 -96674 -58288 -149354 -149573 -135201 -58795 29110 -73119 -126700 -154663
2626 -154663 -115016 -96839 -22989 -11000 113620 159038 108061 -12156 112600 82686 22279
2615 22279 -12035 155258 236061 113880 -5421 23234 122612 -53733 53141 92652 84976
2604 84976 135779 -163629 -108630 2056 150380 50722 -102569 -236660 -100602 -1588 -71739
2593 -71739 -22944 -178905 -318494 -190597 83698 35616 43904 201639 251291 106502 117433
2582 117433 20454 -68590 -185121 -267533 -98059 -37 -103488 -170441 -260982 -79859 -182384
2571 -182384 -106068 91536 40886 -35222 28104 61633 42660 113165 -23362 -56362 19153
2560 19153 -46780 -177755 71271 75847 -199246 -279737 -294801 -194925 -58919 81393 -110902
2549a10902N8498r302K8710k6104k2580O7035Q8324p8671l04571J03327K00325
2538e911J33930j20836K5251j9657J0797m1228r6007P1454k4758j54527j20772
2527c42264J04715j0017O3566J90891K55879n2868k01395r2996J45742j28137
2517f6884j67262K40297j52599Q6148R2691Q8935J49423k28035j87174p074O9233
2506h2301j8041j6469l8135j13599K8764Q6961K43936j1904j58047K0408l8464
2495i6891j73346J15408J71667j28582K60738l6907N4936j20471j82900j4219
2485a50567p7472j926J95725J11258j52076Q9206l9558j36128N2716J13114K558
2474F850K0720j08666O4934J41866O9048k49947J00977P9128j99485M9710j22987
$$ plain form
2549 -110902 -52404 -61706 -32996 -59100 -81680 -14645 73679 -4992 -309563 -206236 -5911
2538 -5911 128019 7183 32434 12777 23574 -17654 -113661 -42207 -66965 -221492 -342264
2527 -342264 -237549 -247566 -184000 6891 262770 209902 8507 -84489 61253 -66884
2517 -66884 -234146 6151 -146448 -60300 32391 121326 270749 42714 -144460 -151534 -82301
2506 -82301 -100342 -116811 -154946 -268545 -239781 -152820 91116 79212 -78835 -58427 -96891
2495 -96891 -270237 -154829 16838 -111744 148994 112087 167023 46552 -136348 -150567
2485 -150567 -228039 -229965 -34240 77018 -75058 14148 -25410 -161538 -108822 4292 6850
2474 6850 27570 -81096 -16162 125704 194752 -55195 45782 124910 -74575 -24865 -147852
2463a47852K09404O4997q8768R308k55252K2357KJ13591J67338k63326J40365
2452b7836L2199j04008J6497L9915O5472k22939R3541P1624J27694J8554j46392
2441c5679m7365l5389J06341O4449l6369r0949j21279P0629K36471j92971R000
2430g3111O6131n3247J37211k46026k48561K44944J88294m7791m5959O7177l035
2419a3973p7986k03606J4720K02917m1594k2121J43336J27428k05730k6196o059
2408a08864P3915l6528k2242J22009m9647J53931J6565j98924o7506J4282J29300
2397B6291j2883L7176n3207J61143Q5653j0130j89443k2105J24682L57712N518
2386E10407j95120K21968q5167k07024j20190q1794J35662p5962j25916J89336
$$ plain form
2463 -147852 61552 126549 37781 47089 -208163 -185806 -185804 -72213 95125 -168201 -27836
2452 -27836 4363 -99645 -83148 -43233 22239 -200700 -107159 -35535 92159 110713 -35679
2441 -35679 -83044 -118433 -12092 52357 15988 -74961 -196240 -125611 110860 -82111 -73111
2430 -73111 -6980 -60227 76984 -169042 -417603 -172659 15635 -32156 -78115 -10938 -13973
2419 -13973 -91959 -295565 -280845 -77928 -119522 -141643 1693 129121 -76609 -102805 -108864
2408 -108864 -34949 -71477 -93719 28290 -21357 132574 149139 -49785 -117291 -103009 26291
2397 26291 13408 50584 -2623 158520 244173 234043 44600 22495 147177 504889 510407
2386 510407 315287 537255 452088 245064 124874 43080 178742 102780 -23136 166200
2376A66200r7107j01755K2808P318L9073O5646o4229J44633M7698j63084j32966
2365f5765q9768K20371j24568q5791K01467M9370R9969j70476j52413J55915q7253
2354d8942j04029J45601O419O5502n7080K289l8799J89222O8428r4346r1332j20907
2342g7974J14397M0755j42667J18113R4417o1261j00785K3877J9148n5061j269
2331b8310n6549J49585p1657O2597J03506j19685M5915p5229j42485O0326Q5078
2320A3092J09704K27304n4208P8731o6729n2211P3590k2306n5264j57014k150
2309I2539K75110j8170k99862M701J14020q6484q3215q0071J55623L20700j09128
2298B85763j19596j3069o913J74344k80985j32523J53871J44302L1184P2416j82121
$$ plain form
2376 166200 69093 -32662 -9854 -2536 36537 102183 37954 182587 230285 67201 -65765
2365 -65765 -155533 64838 -59730 -145521 55946 105316 205285 34809 -117604 38311 -48942
2354 -48942 -152971 -7370 -951 64551 7471 9760 -29039 160183 228611 134265 42933 -77974
2342 -77974 36423 77178 -65489 52624 147041 85780 -15005 8872 28020 -27041 -28310
2331 -28310 -84859 64726 -6931 55666 159172 39487 85402 10173 -132312 -71986 13092
2320 13092 122796 350100 295892 374623 307894 255683 329273 306967 251703 94689 92539
2309 92539 367649 349479 49617 54318 168338 81854 -1361 -81432 74191 394891 285763
2298 285763 166167 153098 146185 320529 39544 -92979 60892 205194 236378 308794 126673
2287A26673k05344J34768J05413K14682n7171n7346J8728K3245n8014M5987p1837
2276B19784K3526J04937j21798J12406j6593J23588N9524j08418k7416q2274q4864
2265B02402L4645q2343J73613J04626n4720j76044q0069K81549l5157k05797L1441
2254A94146L07415j6654j77230J68740l5817K6309j51645K08680J02062j71015
2244D54991J18584k45379o4822J02018J54981r5909K9522J0156J30660j18729
2234D76073J0678R1659j19535O248j84545r842K04905j23432J80331L139q7434
2223D48245M3871O7719J27809n392p9693J31352J0427j47851J13521N1392j77846
2212E83554k3648J75833K82956L4947R5316J87265j54632j62775j2814O2234K17002
$$ plain form
2287 126673 -78671 56097 161510 376192 319021 261675 280403 303648 245634 291621 219784
2276 219784 243310 348247 226449 338855 322262 445850 505374 396956 369540 287266 202402
2265 202402 237047 154704 328317 432943 378223 202179 122110 403659 368502 162705 194146
2254 194146 501561 484907 307677 476417 440600 466909 315264 523944 626006 454991
2244 454991 573575 328196 263374 365392 520373 424464 453986 464142 594802 476073
2234 476073 486751 578410 458875 465123 280578 270736 475641 352209 532540 535679 448245
2223 448245 492116 559835 687644 682252 602559 733911 744338 596487 710008 761400 583554
2212 583554 559906 735739 1018695 1053642 1148958 1336223 1181591 1018816 1006002 1068236 1285238
2201A285238J88110l8945J12066J69709j12218q3384L6902J55899r0767J97887
2191A820497O8456m1092L29393N9314k30447J3329J79819l5818K683J68040p4345
2180B259829J57842l3096O7009J40327q6234J04294J9321L7144J41398L4980Q7097
2169B929911R2151K18540J75123q7872R2017j3254m4006L40258J8161K88374K99053
2158D308456K23563J75724J19826K79904J78145K37959K65924M30554M66911L94068
2148G081034M09074L20859M11178M00783N33736N50277O63628M20706O12779R00522
2138A2304576J041891J167480J550985J444617J561194J374574J550410K138870
2130B4134597K465157K872301L383948M779439O090373P705083R707265J2522609
$$ plain form
2201 1285238 1473348 1434403 1546469 1716178 1603960 1520576 1557478 1713377 1622610 1820497
2191 1820497 1888953 1847861 2177254 2236568 2006121 2019450 2199269 2163451 2166134 2334174 2259829
2180 2259829 2417671 2384575 2451584 2591911 2505677 2609971 2629292 2666436 2807834 2842814 2929911
2169 2929911 3022062 3240602 3415725 3327853 3419870 3406616 3362610 3702868 3721029 4009403 4308456
2158 4308456 4532019 4707743 4827569 5107473 5285618 5523577 5789501 6220055 6686966 7081034
2148 7081034 7490108 7810967 8222145 8622928 9156664 9706941 10370569 10791275 11404054 12304576
2138 12304576 13346467 14513947 16064932 17509549 19070743 20445317 21995727 24134597
2130 24134597 26599754 29472055 32856003 37635442 43725815 51430898 61138163 73660772
2122G3660772J4657405J7560975J4831152N118767j8548813k5838267j7888165
2115F3553826j2374803q642172o545832m736920m023863k993602k198372j531445
2107B0506817j664033r40404o07283p85816j343922j336192j270038p76618q03084
2098A0979427n98087n19728m50967n20208n01035m15642o0693k40076m25840m23119
2088F824032m5146l25871k47056k07770j51100l23614j04080k07988k41466m65297
2078D504644k6750m7306J8271j24624n1895Q5624m34427l92153o8760j48544j80856
2067C133224L7323L472k17041J4242k41243m4878N7583q8855L9356J35995k24423
2056B604755q4304k41251N2907j73600k68265J95836J9937N4839K3769k88623
$$ plain form
2122 73660772 88318177 105879152 120710304 125829071 107280258 81441991 63553826
2115 63553826 51179023 42536851 35991019 31254099 27230236 24236634 22038262 20506817
2107 20506817 18842784 17902380 17295097 16509281 15165359 13829167 12559129 11782511 10979427
2098 10979427 10381340 9861612 9410645 8890437 8389402 7973760 7913067 7672991 7247151 6824032
2088 6824032 6778886 6453015 6205959 5998189 5847089 5523475 5419395 5211407 4969941 4504644
2078 4504644 4477894 4430588 4448859 4324235 4272340 4357964 3923537 3531384 3462624 3314080 3133224
2067 3133224 3170547 3174019 2956978 2971220 2729977 2685099 2742682 2653827 2693183 2829178 2604755
2056 2604755 2520451 2279200 2332107 2158507 1890242 2086078 2106015 2160854 2184623 1896000
2046A896000j38093j23349l2858K057k5962P0075k3136r8352L7832l470j60395
2035A400349n067k0432R3322j33546m5435L19905j33621k47024j4171J25386l0071
2024A309595k26487j44157K62958K14985k76965j02134j93473m5161K24407J82272
2014A205840p9934n7959k98787K6912J31466M111n9817k5947n6636j57729O6384
2003F97904j40522l6384j71320J24431Q8557J6178j03238Q1260n1662m277J51483
1992F52410n590N9538Q4784m3044l63607o3562J23966J6269J05053p3264k4293
1981D68660P819Q762k3111l12825J12143J91274P5382j21959r7033j08529k450
1970A98133J99467k176j83921O7944K57726j62780j07602K6916K25884k2701j60937
$$ plain form
2046 1896000 1757907 1634558 1601700 1603757 1577795 1647870 1624734 1526382 1564214 1560744 1400349
2035 1400349 1395282 1374850 1468172 1334626 1289191 1609096 1475475 1228451 1214280 1339666 1309595
2024 1309595 1083108 938951 1201909 1416894 1139929 1037795 844322 799161 1023568 1205840
2014 1205840 1125906 1067947 769160 796072 927538 931649 871832 845885 789249 631520 697904
2003 697904 557382 520998 349678 474109 562666 578844 475606 556866 505204 500927 652410
1992 652410 646820 706358 791142 748098 384491 320929 444895 461164 566217 492953 468660
1981 468660 476479 485241 462130 149305 261448 452722 528104 406145 309112 200583 198133
1970 198133 397600 395424 211503 279447 537173 374393 266791 293707 519591 496890 335953
1959C35953J02611k9279n0864k13799Q5069Q2767N8421j40270P2078J7928n7530
1948B63085j81214K21541j37145o7072Q2091L8156L655J31706k4917J39285j7656
1937D51515j13250J15875o3570r5608r1846j7633J85666j12482J26783L0897k44374
1926A71973O451J38217J8890j87800r7617R5093o6896k31911K64991O2538j99618
1915b5689r4691L36924M3965j98363O8745J53837n6954N0039j2980k30826J61760
1904A95767o916L0056J04127k52081j0268l8162J27382J52788k73641k2633L2675
1893C9094o984J75299j09137k04096K1798N3078j8332K1361J33478j4166k25051
1882a33658J77747J28593N6479m9076L890j75509p6389K18830J09037N821j11387
$$ plain form
1959 335953 438564 409285 358421 144622 229691 312458 370879 230609 302687 320615 263085
1948 263085 81871 303412 166267 99195 181286 219442 223097 354803 329886 469171 451515
1937 451515 338265 454140 390570 294962 203116 185483 371149 258667 385450 416347 171973
1926 171973 178424 316641 335531 147731 50114 145207 78311 -153600 111391 173929 -25689
1915 -25689 -120380 216544 260509 62146 130891 284728 227774 277813 264833 34007 195767
1904 195767 188851 218907 323034 70953 60685 22523 149905 302693 29052 6419 39094
1893 39094 32110 207409 98272 -105824 -84026 -30948 -49280 -27919 105559 91393 -133658
1882 -133658 44089 172682 229161 180085 183975 8466 -67923 150907 259944 265765 154378
1871A54378r6211k2081J5900J13791J12406M7150J53346j39379l3146j54310n5328
1860I6516J23904l065K40965M3187K5437m9223j2649J20854k39086M0832J22174
1849E09846m7353J4659l3934K4837K6189n0073j15576r3506o2668J67111k28189
1838A11343J08835r8914Q7772j08183J9571J01520k16768J2416R6653J02248J50618
1827C67111j79962K036N3051P1844n3427j54840j41491J91293J49975L3811n6500
1816B82901j29870o0859r6794r804J12927k7847j35306K00542l2750N1062r9682
1805E4520m4237L1536n9524r5608M9895J1651J48816l2938k22520J31909n1506
1794g8006J2848J25842n4238Q3463j4486O2887j52051k1152k2705O05M5073j09790
$$ plain form
1871 154378 58167 36086 51986 165777 278183 325333 478679 339300 306154 151844 96516
1860 96516 220420 217355 458320 501507 526944 477721 465072 585926 346840 387672 509846
1849 509846 462493 477152 443218 468055 494244 444171 328595 235089 172421 339532 111343
1838 111343 220178 121264 209036 100853 120424 221944 5176 17592 114245 216493 367111
1827 367111 187149 189185 242236 314080 260653 105813 -35678 155615 305590 339401 282901
1816 282901 153031 92172 -4622 -14426 98501 70654 -64652 135890 103140 154202 54520
1805 54520 10283 41819 -17705 -113313 -63418 -51767 97049 64111 -158409 -26500 -78006
1794 -78006 -65158 60684 6446 89909 75423 138310 -13741 -34893 -57598 -56993 -11920 -121710
1782a21710P4459J46970N7914o2893j53603n5242L3498K8045J82050l2883k54338
1771a57733j06116N0493L70338k39933Q5027K07079o472q9473r7346j65395J09042
1760d0489M4160j29706K4374J47680J18548K3031J6073j50847j29011k8395j63134
1749b67716K24083K89943k08559q1317n2577K7413q2640J15412j76995K5256J90761
1738C064J36621o8735p1765l1823j60508r651o9995l4699M4468N9311K3505J5449
1726a64758q5864L281Q3046Q3031K0468p4553j49964o5806M0257K09808K48775
1715A47721j63624L7745R9716k0313q5934j10655J80799Q9701l29592j56441J40260
1704a70617N3317K06287K69429j04250j67132m7880j55351K10787j13113J25383
$$ plain form
1782 -121710 -47251 99719 157633 94740 -58863 -114105 -80607 -52562 129488 96605 -157733
1771 -157733 -263849 -213356 156982 -82951 2076 209155 202683 113210 15864 -149531 -40489
1760 -40489 3671 -126035 -101661 46019 164567 187598 203671 52824 -76187 -104582 -267716
1749 -267716 -43633 246310 37751 -43566 -96143 -68730 -151370 -35958 -212953 -187697 3064
1738 3064 139685 70950 -815 -32638 -193146 -202797 -272792 -307491 -263023 -203712 -180207 -164758
1726 -164758 -250622 -247341 -164295 -81264 -60796 -135349 -285313 -351119 -310862 -101054 147721
1715 147721 -15903 21842 121558 101245 15311 -95344 85455 175156 -154436 -310877 -170617
1704 -170617 -117300 88987 358416 254166 87034 39154 -116197 94590 -18523 106860
1694A06860j5826J15182L666j73562j08506O4843M4718j59532J13768J08533j3608
1683H6536m6824j7703J31122o4773o2791j0081p3345R0724j63467K54619J84567
1672C08584k59170j92806N8719R9003l5310P9380M9001q5599j58777m8526J46251
1661c9250N2442J24095r5363L5437j78598O5199J87619p636J3210j1490k95514
1650a49849l1999q051j37809R527J07376J22963J76138P1430J6196j36119L1289
1639G1092K34545j07775J17952j18107j14063n0388M3280J2296R1485P932j49465
1628C8784j04392m1023J44194o2000j07423J8203m6028J90856J10732j34576q7359
1617h0032n0801O9086l9626j592L002J43244k22640J42055J81443j69787R5473
$$ plain form
1694 106860 91034 206216 209882 36320 -72186 -7343 37375 -122157 -8389 100144 86536
1683 86536 39712 22009 153131 88358 25567 15486 -57859 32865 -130602 124017 308584
1672 308584 49414 -143392 -84673 14330 -20980 58400 107401 21802 -136975 -185501 -39250
1661 -39250 13192 137287 41924 77361 -101237 -36038 151581 143945 157155 145665 -149849
1650 -149849 -181848 -189899 -327708 -318181 -210805 -87842 88296 159726 175922 39803 71092
1639 71092 305637 197862 315814 197707 83644 33256 76536 88832 180317 188249 38784
1628 38784 -65608 -106631 37563 -24437 -131860 -113657 -159685 31171 141903 7327 -80032
1617 -80032 -130833 -61747 -101373 -102965 -99963 43281 -179359 -37304 144139 -25648 69825
1606F9825K6646O5059j15715P9845j36698j13607j204L9394J98253k1001j02314
1595a1517j02985O3551M9678j5100j60645L01579J07503j25670k67751p1924R5268
1584a38013J29326n7799j23191K07318J08640j03905P279j47649m7410L9467Q4882
1573d1055L20654j20604j18874K7792l6409Q9122q5058q2874J36662N8801n1275
1562I6882j50121j37936M8093J54926l6004K2258p9187Q5216J00142p6688L189
1551C0770J58088o2823O9904R2596j55629o9820j7620J44659n5258P4094K1699
1540B30660l20217j66581N3811J30342k35849L9787J56396n671l6833J8379m6428
1529a82204O2211J10081K88728j67131m209N6006q0721m1203o1453j47509O6971
$$ plain form
1606 69825 96471 161530 45815 125660 -11038 -124645 -125849 -86455 111798 90797 -11517
1595 -11517 -114502 -50951 -1273 -16373 -177018 124561 232064 106394 -161357 -233281 -138013
1584 -138013 -8687 -66486 -189677 17641 126281 22376 29655 -117994 -165404 -125937 -41055
1573 -41055 279599 158995 40121 67913 31504 120626 35568 -47306 89356 148157 96882
1562 96882 -53239 -191175 -143082 11844 -24160 -1902 -81089 4127 104269 27581 30770
1551 30770 188858 126035 195939 288535 132906 63086 45466 190125 134867 208961 230660
1540 230660 -89557 -256138 -202327 -71985 -307834 -268047 -111651 -117322 -154155 -135776 -182204
1529 -182204 -119993 -9912 278816 111685 107476 163482 82761 41558 -19895 -167404 -100433
1518a00433p5237J04288Q7884j8198j2173j38776J14222k7790K02932j73733j33253
1507a70267n7804j07658K3872K57751Q884N267m6561m7190M9707j14820P9278
1496a19541J28825J63589k06588R5923j04245j09449J41139K01933j6066j50928
1486B4592K5647M086k73637J0436K49884j48884r8683m5078J18022Q6539J2846
1475c4230n1597j33605l6919N8753J85480K25943j87822l0998Q530L7484m0093
1464I26j913J53084j08219k22093j0628J12588M4318k22769K1728K00509l0921
1453f3390j10446J31661j16058J3555L4076L0268o2368J33642Q2548J4169N6174
1442A43831J5026o0432j22781n1223p8620K24844q7757L5396O8003l90877J00907
$$ plain form
1518 -100433 -175670 -71382 16502 -1696 -13869 -152645 -38423 -66213 136719 -37014 -170267
1507 -170267 -228071 -335729 -311857 -54106 -45222 -39955 -86516 -133706 -83999 -198819 -119541
1496 -119541 9284 172873 -33715 62208 -42037 -151486 -10347 191586 175520 24592
1486 24592 50239 54325 -219312 -208876 41008 -107876 -206559 -251637 -133615 -47076 -34230
1475 -34230 -85827 -219432 -256351 -197598 -12118 213825 26003 -4995 3535 41019 926
1464 926 -987 152097 43878 -178215 -188843 -76255 -31937 -254706 -232978 -32469 -63390
1453 -63390 -173836 -42175 -158233 -144678 -110602 -80334 -142702 -9060 73488 87657 143831
1442 143831 158857 98425 -24356 -75579 -154199 70645 -17112 18284 86287 -304590 -203683
1431b03683R7265J08158J52846n4663j94242q8930K23068Q4119j29038o2552K8227
1420c9425j76652J09136J9219q222p0695M9741J22641j86055J61624K58752q5991
1409A54073j13334p3399Q63J22908j56346r2769Q8037j06772O7703P9940p4105
1398a03201k21752Q1174J4341n0782R9227j05734K57320L4021n0956K78908j67062
1387F5504k16292k19124L9581J52722n4118j10924p470O8437J7667m5369J16755
1376a92631R7392k1399J22488J62718L5408j36179k42973j02687R3771J10536
1366g3556j23078L1165J19007j24944r5962R6904J49420L3655j6400J30892k07943
1355h0840P0487K3400j94584O91J66976J09422r1973j45123r9714J48646m1742
$$ plain form
1431 -203683 -106418 1740 154586 99923 -94319 -183249 39819 123938 -5100 -67652 -39425
1420 -39425 -216077 -106941 -87722 -95944 -166639 -116898 5743 -180312 -18688 240064 154073
1409 154073 40739 -32660 -31797 91111 -65235 -158004 -69967 -176739 -109036 -29096 -103201
1398 -103201 -324953 -243779 -229438 -280220 -180993 -286727 -29407 4614 -46342 232566 65504
1387 65504 -150788 -369912 -330331 -177609 -231727 -342651 -350121 -281684 -264017 -309386 -192631
1376 -192631 -95239 -116638 5850 168568 203976 67797 -175176 -277863 -184092 -73556
1366 -73556 -196634 -165469 -46462 -171406 -267368 -170464 -21044 12611 -3789 127103 -80840
1355 -80840 -10353 13047 -181537 -180846 -13870 95552 3579 -141544 -241258 -92612 -134354
1344a34354p4621O7778M8557p6999k1682J23096K8096j37918J23088J29433K9020
1333A03494J53644n0969k56658r8004r4001K81326r2193j10539k2731K28940Q1746
1322A24055j58865l02257J75482M7951n5597J22402J76009j05991l4956o3302
1312g5069k999L6011L8151K36589j23287k14213O4485Q2451k36063J66299J3064
1301a4581m7260J16167P1662k30645r5828J59517j939j47025M7251l4446Q5671
1290i1456R3432j5273O6372J3438r9370j69331j6782p854j01739l1983K9910O4083
1278b66553N8595K56945J06265j14708l6930p5455j7109O6903j0537K45011j22887
1267H9540l0934q2192K21471r7088j97227J64913j72292k2259N7522M095J20335
$$ plain form
1344 -134354 -208975 -141197 -92640 -169639 -191321 -68225 -40129 -178047 -54959 74474 103494
1333 103494 257138 206169 -50489 -148493 -242494 38832 -53361 -163900 -186631 42309 124055
1322 124055 -34810 -337067 -161585 -113634 -169231 -46829 129180 23189 -11767 -75069
1312 -75069 -78068 -42057 -3906 232683 109396 -104817 -40332 42119 -193944 -27645 -14581
1301 -14581 -61841 54326 125988 -104657 -200485 -40968 -42907 -189932 -142681 -177127 -91456
1290 -91456 1976 -13297 53075 66513 -32857 -202188 -218970 -226824 -328563 -360546 -330636 -266553
1278 -266553 -207958 48987 155252 40544 3614 -71841 -88950 -22047 -32584 212427 89540
1267 89540 58606 -23586 197885 100797 -96430 68483 -103809 -126068 -68546 -64451 55884
1256E5884J08727j00007j50807Q4829j65743k49437n0231J96305J20175L0568
1246a19737j9251M8990J4848p7629J10913L59400n6283l2902r8304O1713J23729
1235C15487k18311o7293o1299p9968L7982j9203o8242Q3948J72653p53j52281
1224e7280j31760q612J70243j08465J28531j29645N8319j7483j33990K1669p6346
1213b84819L04767J44237m8335r7719K3497J05541m63855N45J00052Q2645L6420
$$ plain form
1256 55884 164611 64604 -86203 -1374 -167117 -416554 -466785 -270480 -150305 -119737
1246 -119737 -138988 -89998 -75150 -152779 -41866 317534 261251 228349 130045 191758 315487
1235 315487 97176 29883 -31416 -111384 -73402 -92605 -160847 -76899 95754 95001 -57280
1224 -57280 -189040 -197652 -27409 -135874 -7343 -136988 -78669 -96152 -230142 -208473 -284819
1213 -284819 19948 164185 115850 18131 41628 147169 -316686 -316141 -216089 -133444 -97024
$$ [...]
##END NTUPLES=NMR SPECTRUM
##END=
