##TITLE=1H_EC-3264(9-2)
 CDCl3
 8 sc, 
 14.1.2022
##JCAMPDX= 6.0         $$ Bruker NMR JCAMP-DX V2.0
##DATA TYPE= NMR SPECTRUM
##DATA CLASS= NTUPLES
##ORIGIN= UXNMR, Bruker Analytische Messtechnik GmbH
##OWNER= root
$$ XWIN-NMR		Version 3.5
$$ Fri Jan 14 14:25:55 2022 Russian Standard Time (UT+4h)  she@DPX200
##.OBSERVE FREQUENCY= 200.131346
##.OBSERVE NUCLEUS= ^1H
##.ACQUISITION MODE= SIMULTANEOUS
##.ACQUISITION SCHEME= undefined
##.AVERAGES= 8
##.DIGITISER RES= 18
##SPECTROMETER/DATA SYSTEM= spect
##.PULSE SEQUENCE= zg30
##.SOLVENT NAME= CDCl3
##.SHIFT REFERENCE= (INTERNAL, CDCl3, 0, 15.7149)
##AUDIT TRAIL= $$ (NUMBER, WHEN, WHO, WHERE, WHAT)
$$ ##TITLE= Audit trail, XWIN-NMR		Version 3.5
$$ ##JCAMPDX= 5.01
$$ ##ORIGIN= Bruker BioSpin GmbH
$$ ##OWNER= she
$$ F:/spectra/data/she/nmr/H-F/1/pdata/1/auditp.txt
$$ ##AUDIT TRAIL=  $$ (NUMBER, WHEN, WHO, WHERE, WHAT)
(   1,<2022-01-14 14:25:00.51 +0400>,<she>,<DPX200>,
      <created by zg, POWCHK disabled, PULCHK disabled
       configuration hash MD5:
       00 E9 B6 7A A2 85 ED C7 34 08 36 98 17 FE 4E 26
       data hash MD5: 16K
       95 54 7F 08 C3 C7 CE 9C 14 E8 E8 9D DB 1A 61 04>)
(   2,<2022-01-14 14:25:02.68 +0400>,<she>,<DPX200>,
      <Start of raw data processing
       efp BC_mod = 2 LB = 0.24 FT_mod = 6 PKNL = 1 PHC0 = -15870.71 PHC1 = 13.40078 SI = 16K 
       data hash MD5: 16K
       9A 44 04 D7 CD DA 59 73 23 A0 2E FC 56 A9 89 4B>)
(   3,<2022-01-14 14:25:16.54 +0400>,<she>,<DPX200>,
      <pk PHC0 = 2.549798 PHC1 = -4.4 
       data hash MD5: 16K
       E4 D9 60 1E 05 19 1B 91 0B 36 32 E8 F9 9F 3B 50>)
(   4,<2022-01-14 14:25:19.56 +0400>,<she>,<DPX200>,
      <abs ABSG = 5 
       data hash MD5: 16K
       0B FA FA 20 EC 06 D9 7B 47 E0 30 80 42 1C 30 06>)
$$ ##END=
$$ 
$$ hash MD5
$$ E7 8A 00 A0 65 CB 28 17 CF DF 0E E9 2D 95 2C 52
##$RELAX= 
##$RELAX= 
##$RELAX= 
##$RELAX= 
##$RELAX= 
##$RELAX= 
$$ Bruker specific parameters
$$ --------------------------
##$DU= <F:/spectra>
##$EXPNO= 1
##$NAME= <H-F>
##$PROCNO= 1
##$TYPE= <nmr>
##$USER= <she>
##$AMP= (0..31)
100 100 100 100 100 100 100 100 100 100 100 100 100 100 100 100 100 100 
100 100 100 100 100 100 100 100 100 100 100 100 100 100 
##$AQSEQ= 0
##$AQ_mod= 1
##$AUNM= <au_zg>
##$AUTOPOS= <>
##$BF1= 200.13
##$BF2= 200.13
##$BF3= 200.13
##$BF4= 200.13
##$BF5= 200.13
##$BF6= 200.13
##$BF7= 200.13
##$BF8= 200.13
##$BYTORDA= 1
##$CFDGTYP= 0
##$CFRGTYP= 5
##$CHEMSTR= <none>
##$CNST= (0..31)
1 1 145 1 1 1 1 1 1 1 1 1 1 1 1 1 1 1 1 1 1 1 1 1 1 1 1 1 1 1 1 1 
##$CPDPRG= <>
##$CPDPRG1= <>
##$CPDPRG2= <>
##$CPDPRG3= <>
##$CPDPRG4= <mlev>
##$CPDPRG5= <mlev>
##$CPDPRG6= <mlev>
##$CPDPRG7= <mlev>
##$CPDPRG8= <mlev>
##$CPDPRGB= <>
##$CPDPRGT= <>
##$D= (0..31)
0 1.2 0 0 0 0 0 0 0 0.06 0 0.03 0 0 0 0 0.0002 0 0 0 0 0 0 0 0 0 0 0 0 
0 0 0 
##$DATE= 1642155899
##$DBL= (0..7)
120 120 120 120 120 120 120 120 
##$DBP= (0..7)
150 150 150 150 150 150 150 150 
##$DBP07= 0
##$DBPNAM0= <>
##$DBPNAM1= <>
##$DBPNAM2= <>
##$DBPNAM3= <>
##$DBPNAM4= <>
$$ [...]
##$SUBNAM2= <"">
##$SUBNAM3= <"">
##$SUBNAM4= <"">
##$SUBNAM5= <"">
##$SUBNAM6= <"">
##$SUBNAM7= <"">
##$SUBNAM8= <"">
##$SUBNAM9= <"">
##$SW= 18.0517287032376
##$SWIBOX= (0..15)
0 0 2 0 0 0 0 0 0 0 0 0 0 0 0 0 
##$SW_h= 3612.71676300578
##$TD= 16384
##$TD0= 1
##$TE= 0
##$TE2= 300
##$TE3= 300
##$TEG= 300
##$TL= (0..7)
0 120 120 120 120 120 120 120 
##$TP= (0..7)
150 150 150 150 150 150 150 150 
##$TP07= 0
##$TPNAME0= <>
##$TPNAME1= <>
##$TPNAME2= <>
##$TPNAME3= <>
##$TPNAME4= <>
##$TPNAME5= <>
##$TPNAME6= <>
##$TPNAME7= <>
##$TPOAL= (0..7)
0.5 0.5 0.5 0.5 0.5 0.5 0.5 0.5 
##$TPOFFS= (0..7)
0 0 0 0 0 0 0 0 
##$TUNHIN= 0
##$TUNHOUT= 0
##$TUNXOUT= 0
##$USERA1= <user>
##$USERA2= <user>
##$USERA3= <user>
##$USERA4= <user>
##$USERA5= <user>
##$V9= 5
##$VALIST= <valist>
##$VCLIST= <CCCCCCCCCCCCCCC>
##$VD= 0
##$VDLIST= <DDDDDDDDDDDDDDD>
##$VPLIST= <PPPPPPPPPPPPPPP>
##$VTLIST= <TTTTTTTTTTTTTTT>
##$WBST= 1024
##$WBSW= 4
##$XGAIN= (0..3)
0 0 0 0 
##$XL= 0
##$YL= 0
##$YMAX_a= 134139
##$YMIN_a= -176029
##$ZGOPTNS= <>
##$ZL1= 120
##$ZL2= 120
##$ZL3= 120
##$ZL4= 120
##$ABSF1= 15.72596
##$ABSF2= -2.32589
##$ABSG= 5
##$ABSL= 3
##$ALPHA= 0
##$AQORDER= 0
##$ASSFAC= 0
##$ASSFACI= 0
##$ASSFACX= 0
##$ASSWID= 0
##$AUNMP= <proc_1d>
##$AZFE= 0.1
##$AZFW= 0.1
##$BCFW= 0
##$BC_mod= 2
##$BYTORDP= 0
##$COROFFS= 0
##$CY= -3
##$DATMOD= 1
##$DC= 0
##$DFILT= <>
##$DTYPP= 0
##$F1P= 0
##$F2P= 0
##$FCOR= 1
##$FTSIZE= 16384
##$FT_mod= 6
##$GAMMA= 0
##$GB= 0
##$INTBC= 1
##$INTSCL= 0
##$ISEN= 128
##$LB= 0.24
##$LEV0= 0
##$LPBIN= 0
##$MAXI= 10000
##$MC2= 0
##$MEAN= 0
##$ME_mod= 0
##$MI= 1.114404
##$NCOEF= 0
##$NC_proc= -7
##$NLEV= 6
##$NOISF1= 3.799351
##$NOISF2= 2.8
##$NSP= 0
##$NTH_PI= 0
##$NZP= 0
##$OFFSET= 15.71494
##$PC= 1
##$PHC0= -15868.16
##$PHC1= 9.00078
##$PH_mod= 1
##$PKNL= yes
##$PPARMOD= 0
##$PSCAL= 0
##$PSIGN= 0
##$REVERSE= no
##$SF= 200.130007327997
##$SI= 16384
##$SIGF1= 3
##$SIGF2= 2
##$SINO= 5.538805
##$SIOLD= 16384
##$SREGLST= <1H.CDCl3>
##$SSB= 0
##$STSI= 16384
##$STSR= 0
##$SW_p= 3612.71676300578
##$SYMM= 0
##$S_DEV= 0
##$TDeff= 16384
##$TDoff= 0
##$TI= <>
##$TILT= no
##$TM1= 0
##$TM2= 0
##$TOPLEV= 0
##$USERP1= <user>
##$USERP2= <user>
##$USERP3= <user>
##$USERP4= <user>
##$USERP5= <user>
##$WDW= 1
##$XDIM= 16384
##$YMAX_p= 281267044
##$YMIN_p= -1359726
$$ End of Bruker specific parameters
$$ ---------------------------------
##NTUPLES= NMR SPECTRUM
##VAR_NAME=  FREQUENCY,     SPECTRUM/REAL,   SPECTRUM/IMAG
##SYMBOL=    X,             R,               I
##VAR_TYPE=  INDEPENDENT,   DEPENDENT,       DEPENDENT
##VAR_FORM=  AFFN,          ASDF,            ASDF
##VAR_DIM=   16384,         16384,           16384
##UNITS=     HZ,            ARBITRARY UNITS, ARBITRARY UNITS
##FACTOR=    0.220516191357247, 1,           1
##FIRST=     3145.03107158947, 0,            0
##LAST=      -467.685691416311, 0,           0
##MIN=       -467.685691416311, -1359726,    0
##MAX=       3145.03107158947, 281267044,    0
$$ Real data points
##PAGE= N=1
##DATA TABLE= (X++(R..R)), XYDATA
$$ [...]
7162A669735J37419P4446o1432Q9117k2618J70171O2239J08016j48215K55450
$$ 1669735 1807154 1881600 1820168 1909285 1886667 2056838 2119077 2227093 2078878 2334328
7152B334328P3613j57383L9378K1306L3137L9543o0183o9635J88826M6575J17780
$$ 2334328 2407941 2250558 2289936 2311242 2344379 2383922 2323739 2254104 2442930 2489505 2607285
7141B607285J70183K66O3330l7611J32644q127M0856j52908m8884J27237L40958
$$ 2607285 2777468 2777734 2841064 2803453 2936097 2927970 2968826 2815918 2767034 2894271 3235229
7130C235229K82649K1330J71983M1504L4393L5768L18093R9026O5878J41949M34093
$$ 3235229 3517878 3539208 3711191 3752695 3787088 3822856 4140949 4239975 4305853 4447802 4881895
7119D881895K36271J14027J88528K24601L09843K53626N04352L54795K71566L61191
$$ 4881895 5118166 5232193 5420721 5645322 5955165 6208791 6713143 7067938 7339504 7700695
7109G700695L30283O29354O67752N27414O01906O49348Q54742Q96499J026482
$$ 7700695 8030978 8660332 9328084 9855498 10457404 11106752 11961494 12857993 13884475
7100A3884475J285638J341694J752340K064592K280179K862620L369590M134391
$$ 13884475 15170113 16511807 18264147 20328739 22608918 25471538 28841128 32975519
7092C2975519N352742O785215P798488R266015R532413P729515L231783k974216
$$ 32975519 38328261 45113476 52911964 62177979 71710392 79439907 82671690 79697474
7084G9697474q396500j1421497j1095126r053014o297993m633940l427810k691172
$$ 79697474 71300974 59879477 48784351 39731337 33433344 28799404 25371594 22680422
7076B2680422j969208j598815j520100j411448j561244r07754j017214r02676
$$ 22680422 20711214 19112399 17592299 16180851 14619607 13711853 12694639 11791963
7068A1791963q01561r15937m62384j1753n87219n06828j62236k82835k99940l56200
$$ 11791963 10990402 10074465 9612081 9600328 9013109 8506281 8344045 8061210 7761270 7405070
7058G405070k60809j20670k04371m33732j19500j58096r2989J41997j02558Q2661
$$ 7405070 7144261 7023591 6819220 6385488 6265988 6107892 6014903 6156900 6054342 6137003
7048F137003K0785j35146N6379R1237n1642M8459k97259j54985Q2600M7266J96800
$$ 6137003 6157788 6022642 6079021 6170258 6118616 6167075 5869816 5714831 5797431 5844697 6041497
7037F041497j57080J16715P1416j65402k01982l21309m00442n64998l71142l82472
$$ 6041497 5884417 6001132 6072548 5907146 5705164 5383855 4983413 4418415 4047273 3664801
7027C664801J58675K2426l90470k12831p8807K2180j51707n1574j7780n672o1108
$$ 3664801 3823476 3845902 3455432 3242601 3163794 3185974 3034267 2982693 2964913 2959241 2898133
7016B898133j09209m4750M6439j5434P3379K38182R7255K86166J49616O4846M11661
$$ 2898133 2788924 2744174 2790613 2775179 2848558 3086740 3183995 3470161 3619777 3684623 4096284
7005D096284K75075M43613O88011N55189L73032K88153m3749n50502n66416o23641
$$ 4096284 4371359 4814972 5502983 6058172 6431204 6719357 6675608 6125106 5558690 4935049
6995D935049n30929m99482l95994k80699k50042j57776j42777k8961k41098k2019
$$ 4935049 4404120 3904638 3508644 3227945 2977903 2820127 2677350 2648389 2407291 2385272
6985B385272J65322j02231l21856k0514J77489J67081j15636j01392K89519J86253
$$ 2385272 2550594 2448363 2126507 2105993 2283482 2450563 2334927 2233535 2523054 2709307
6975B709307l56564K29777K00276J69554P3078J16351M03739K89776K38767J32437
$$ 2709307 2352743 2582520 2782796 2952350 3025428 3141779 3545518 3835294 4074061 4206498
6965D206498L49726K26359K73893n1989j76232J14509l23911j72442k30777O414
$$ 4206498 4556224 4782583 5056476 5004487 4828255 4942764 4618853 4446411 4215634 4222048
6955D222048k04415o3272O5364m12281j6729J17644j1476K20507j540K04006J96764
$$ 4222048 4017633 3954361 4019725 3607444 3590715 3708359 3696883 3917390 3915850 4119856 4316620
6944D316620K80302o848j19182p0826J08265j22494l38370k10625j67391l74720
$$ 4316620 4596922 4590074 4470892 4400066 4508331 4385837 4047467 3836842 3669451 3294731
6934C294731m53433j06298j98040j02908k31931k06120l10983J49216j42043J1053
$$ 3294731 2841298 2735000 2536960 2434052 2202121 1996001 1685018 1834234 1692191 1703244
6924A703244k0825k39458j91863j8697J73347Q6703r0504P4080k48611k04193
$$ 1703244 1682419 1442961 1251098 1232401 1405748 1492451 1401947 1476027 1227416 1023223
6914A023223j10663O3401j21314R5099Q7124j14075K7351o5806q5436l24621N7980
$$ 1023223 912560 975961 854647 949746 1036870 922795 950146 884340 798904 474283 532263
6903E32263J15252k7206r5900j02153J64652j02210O490o0022k1081J2560m8736
$$ 532263 647515 620309 524409 422256 586908 484698 491188 431166 410085 422645 373909
6892C73909k25390J56285J15834k01781j39076J24776O2968j03890m2873O3365
$$ 373909 148519 304804 420638 218857 79781 204557 267525 163635 120762 184127
6882A84127O6386j07902P2641M9084l03054k7757Q7346l8316K60984k1843j72333
$$ 184127 250513 142611 215252 264336 -38718 -66475 20871 -17445 243539 221696 49363
6871D9363j01963Q3933J31501q4443J3335j0538j5530J09424j48316k7135J09777
$$ 49363 -52600 31333 162834 78391 91726 81188 65658 175082 26766 -369 109408
6860A09408J8233j76591J56394P6049j29418p8982K01325O9591n7213Q3116j77440
$$ 109408 127641 -48950 107444 183493 54075 -24907 176418 246009 188796 271912 94472
6849I4472j82166M9299N0894J08794K54758P1805k86507j49212j40226N5740L3525
$$ 94472 -87694 -38395 12499 121293 376051 447856 161349 12137 -128089 -72349 -38824
6838c8824P4621n9558P0148p4015J48048P2319k6905p6042N6463n5292n923J63252
$$ -38824 35797 -23761 46387 -27628 120420 192739 165834 89792 146255 90963 85040 248292
6826B48292J3251j65681k07869J2149J02317L8404p0503J66447k69468J10992
$$ 248292 261543 95862 -112007 -99858 2459 40863 -29640 136807 -132661 -21669
6816b1669L4514M5016J2370j06883J95J80278K62861k57490k06085K4216J63961
$$ -21669 12845 57861 70231 -36652 -36457 143821 406682 149192 -56893 -32677 131284
6805A31284n1940N0512J08888q7961m9395p458N9068j8625m6734j69459j6115
$$ 131284 79344 129856 238744 150783 101388 93930 152998 134373 87639 -81820 -97935
6794i7935Q4588L2966N2332J51110N2066k47102N7590P6698k58394J25433K01281
$$ -97935 -13347 19619 71951 223061 275127 28025 85615 162313 -96081 29352 230633
6783B30633J59586k78548j19185k5066Q6677L1961O9459O3510N3762q0537k55537
$$ 230633 390219 111671 -7514 -32580 54097 86058 155517 219027 272789 192252 -63285
6772f3285j07425K09516K42710P2339q384k11535k56709L37584j22584q4137N1257
$$ -63285 -170710 38806 281516 353855 345471 133936 -122773 214811 92227 8090 59347
6761E9347j33726J2761j16084j5200O720J27505J3245j6089K00497o8702j5652
$$ 59347 -74379 -61618 -177702 -192902 -186182 -58677 -45432 -61521 138976 70274 54622
6750E4622J07792j33724o6349o1012l8265K20624L9417J30431J1669m03464J34214
$$ 54622 162414 28690 -37659 -98671 -136936 83688 123105 253536 265205 -138259 -4045
6739d045L9557J25912J06004J0484k58067l6689M0663J00279J34736r8817R5602
$$ -4045 35512 161424 267428 277912 19845 -16844 23819 124098 258834 160017 255619
6728B55619j19672n6444l3450j77614L6076J04632M5250p9640j0380M9551J52500
$$ 255619 135947 79503 46053 -131561 -95485 9147 54397 -25243 -35623 13928 166428
6717A66428j64232J96838j48575M104p3436N066m4658J9072J046Q3796J83220
$$ 166428 2196 199034 50459 54563 -18873 -13807 -58465 -39393 -38347 45449 228669
6706B28669k45113J56216j56797k50706K87900O8868p566M1951K62826k34836
$$ 228669 -16444 139772 -17025 -267731 20169 89037 81471 123422 386248 151412
6696A51412j73197J93079J15246o4458k11179J44694K94126M4396j23981l8874
$$ 151412 -21785 171294 286540 222082 10903 155597 449723 494119 370138 331264
6686C31264K1919J0820J08448J09936j15443k2542k82047q3639J5303R8335K7839
$$ 331264 353183 364003 472451 582387 466944 444402 162355 78716 94019 192354 220193
6675B20193p5169j29005J00436K0339Q6805R6777q5687n064K3581j28495p4158
$$ 220193 145024 16019 116455 136794 223599 320376 234689 229625 253206 124711 50553
6664E0553J37759J1933J78844j06272j7863j8671K4811j7431j95663J10284o6055
$$ 50553 188312 200245 379089 272817 254954 236283 261094 243663 48000 158284 92229
6653I2229J35393N5687J19256K5466j66822p4978j48985k59372J60334K15798
$$ 92229 227622 283309 402565 428031 261209 186231 37246 -222126 -61792 154006
6643A54006M4533K1451J13486O2890o7670j33238k52475K8661J00281j4166N3273
$$ 154006 198539 219990 333476 396366 328696 195458 -57017 -28356 71925 57759 111032
6632A11032R1784j24998o4902J03566O698J48744N7247q9731j11509M0444j24054
$$ 111032 202816 77818 12916 116482 123180 271924 329171 239440 127931 168375 44321
6621D4321j79532J1968K21592Q0204K3007j18891j20304k2321j3537K95476q8195
$$ 44321 -135211 -123243 98349 178553 201560 82669 -37635 -59956 -73493 221983 133788
6610A33788j67643p7443L6687K5613k16374J76748R0741J41786j59331j67624
$$ 133788 -33855 -111298 -74611 -48998 -265372 -88624 2117 143903 -15428 -183052
6600a83052Q0465J51063R981O0229l3667L9586O2456K7384l6528j78470j52255
$$ -183052 -102587 48476 58457 118686 85019 124605 187061 214445 177917 -553 -152808
6589a52808P8986M9482R3154n8049J38358o4069r4304j449j4379p5995O8020K740
$$ -152808 -73822 -24340 68814 10765 149123 85054 -9250 -10699 -25078 -101073 -33053 -30313
6577c0313m3098J34475p8903R0546K3690M4787o0598n8018O6895p9110p1724J03433
$$ -30313 -73411 61064 -17839 72707 96397 141184 80586 22568 89463 10353 -61371 42062
6565D2062N6466q2280M8397J38335j00678j0106l38387J37347L8221l5688R8835
$$ 42062 98528 16248 64645 202980 102302 92196 -246191 -108844 -70623 -106311 -7476
6554g476Q7467J06693N47k06482J99027j06971q0714N4713j7444j82866Q9436
$$ -7476 79991 186684 187231 -19251 179776 72805 -7909 46804 29360 -153506 -64070
6543f4070p0941l6045K23795p2640j1354J69666j80903j02221j92185P0063R4589
$$ -64070 -135011 -171056 52739 -19901 -31255 138411 -42492 -144713 -336898 -266835 -172246
6532a72246J03419O1404N6562m3207j03320J89019J8396M6673j65791K15720p5846
$$ -172246 -68827 -7423 49139 5932 -97388 91631 110027 156700 -9091 206629 130783
6521A30783m1937R7043j49291M3557n5794J8576j1306m7425j09964J70702j09766
$$ 130783 88846 185889 36598 80155 24361 42937 31631 -15794 -125758 44944 -64822
6510f4822M7923J56394o6908j39251K0380J49678L8074k17547Q6500J80609r4361
$$ -64822 -16899 139495 72587 -66664 -46284 103394 141468 -76079 10421 191030 96669
6499I6669L3140m6007k05362J76718J84669l9114j5545m1981O1935n5064J38587
$$ 96669 129809 83802 -121560 55158 239827 200713 185168 143187 205122 150058 288645
6488B88645j17092r8189j07767K1706Q3776R4754L0914j76578j45427n3307p9695
$$ 288645 171553 73364 -34403 -12697 71079 165833 196747 20169 -125258 -178565 -258260
6477b58260J24825Q773K43568k66663K11599m5816K15931r9126k7916M0542k30664
$$ -258260 -133435 -124662 118906 -147757 63842 18026 233957 134831 106915 147457 -83207
6466h3207J04825J01808j14182o4559R3088j49341R7635K41845k256J72K45193
$$ -83207 21618 123426 9244 -55315 37773 -111568 -13933 227912 225656 225828 471021
6455D71021k23684n32k9825j76142L2227L62696j20169j0974n5282l954k1984
$$ 471021 247337 246805 216980 40838 73065 435761 315592 304618 249336 245382 223398
6444B23398j53155j2305O1337n384k7632k1271j5119K90216j76390j09426m5462
$$ 223398 70243 57938 119275 113891 86259 64988 49869 340085 163695 54269 8807
6433H807m1430K35628Q5776m7820l458L4825k11284L7528J366Q3636k21023o5119
$$ 8807 -32623 203005 288781 240961 237503 272328 61044 98572 99938 183574 -37449 -102568
6421a02568J21295K73995Q4512k62463N6259m4431J2154p4381k5432q3476K08656
$$ -102568 18727 292722 377234 114771 171030 126599 138753 64372 38940 -44536 164120
6410A64120q1029K07287p3247n5824J12400J02400k36557j20895M6077k5156J04154
$$ 164120 83091 290378 217131 161307 273707 376107 139550 18655 64732 39576 143730
6399A43730q6569j7557M6312m7422R200j90857J3791J05936N7623O1522K07473
$$ 143730 57161 39604 85916 38494 47694 -143163 -129372 -23436 34187 95709 303182
6388C03182J03914j67978k8817n4667J92261j11000l4894j8392n5098o8560J82864
$$ 303182 407096 239118 210301 155634 347895 236895 202001 183609 128511 59951 242815
6377B42815j38967r363J08877L670j19358M4153n2962l2691J68942K942J03169
$$ 242815 103848 94485 203362 207032 87674 131827 78865 46174 215116 218058 321227
6366C21227P9428K858J9960J95763j30470j36700N3890k90808j43266J09112M6773
$$ 321227 400655 403513 423473 619236 488766 352066 405956 115148 -28118 80994 127767
6355A27767q9554R6528N8088j5488L8187N5743O2580Q7102L7393O7525j74461
$$ 127767 38213 134741 192829 177341 215528 271271 333851 420953 458346 525871 351410
6344C51410k04719J1683j7333j9963o1770J13854l6294k3996M1606J72298j58692
$$ 351410 146691 158374 141041 121078 59308 173162 136868 112872 154478 326776 168084
6333A68084J1569R101o1541J55034j03662r0015j7867J56352l2549J95732M8474
$$ 168084 179653 188754 127213 282247 178585 88570 70703 227055 194506 390238 438712
6322D38712k0962j56105j8976M9575o5778J35043j4439k4311j3855l6319j13807
$$ 438712 417750 261645 242669 292244 226466 361509 347070 322759 308904 272585 158778
6311A58778n7300L4497M3242J43942Q9789o0586j83382J29601K1386j1561j11251
$$ 158778 101478 135975 179217 323159 412948 352362 168980 298581 319967 308406 197155
6300A97155k33404J18536O0709o8193J35098J9025j61175J26393M4868J23892
$$ 197155 -36249 82287 142996 74803 209901 228926 67751 194144 239012 362904
6290C62904M1931k66792j15012J42775r229P5357J73888O0728j24537j00442j59808
$$ 362904 404835 138043 23031 165806 156577 231934 405822 466550 342013 241571 81763
6279H1763j43571J29297P7728L0383M7712J36280L881N140l016J13203n7335k39898
$$ 81763 -61808 67489 145217 175600 223312 359592 363473 368613 365597 478800 421465 181567
6267A81567L9274q2614J5004j5736Q0895K20126j94008r2288R2464o1089O5459
$$ 181567 220841 138227 153231 137495 218390 438516 244508 152220 244684 183595 249054
6256B49054J10429K054k19503J38641P6458r0514O5050O7533q9336Q3767J3827
$$ 249054 359483 361537 142034 280675 357133 266619 331669 399202 309866 393633 407460
6245D07460n0280l6393j41073R8957K9281K01234j16691k1219j13637R696m927
$$ 407460 357180 320787 179714 278671 307952 509186 392495 371276 257639 267335 262408
6234B62408o9900j2124R1686J8649P7471R9541j07116M3059j38649K25572j35098
$$ 262408 192508 180384 272070 290719 368190 467731 360615 403674 265025 490597 355499
6223C55499k8533K33248o4913k14664o0754r18J59972J36160j14989j34587L4585
$$ 355499 326966 560214 495301 280637 219883 218965 378937 515097 400108 265521 300106
6212C00106N8720j2531j24159Q392K77994j50527j49414J09267L2780J23734p3412
$$ 300106 358826 346295 222136 230528 508522 357995 208581 317848 350628 474362 400950
6201D00950m9033J51413q5820k25771k1425J17818J99923j62396R5501J63763
$$ 400950 351917 503330 417510 191739 170314 288132 488055 325659 421160 584923
6191E84923K51143j34153j40004J63478q3577m4462Q6734k7524r8002J32579j0265
$$ 584923 836066 701913 561909 725387 641810 597348 684082 656558 558556 691135 680870
6180F80870o517j0963N073M8876o3503j59691J13279R3030J05718l9650o1496
$$ 680870 674353 663390 668463 717339 653836 494145 607424 700454 806172 766522 705026
6169G05026J34944n6199P69p1292P7130J15920j89663K9720P5965J34927k0871
$$ 705026 839970 783771 784540 713248 790378 906298 716635 746355 822320 957247 936376
6158I36376l6036p4810J24169J3887j57826P7475r3457L7024o3252j55486p5449
$$ 936376 900340 825530 949699 963586 805760 883235 789778 826802 763550 608064 532615
6147E32615L6170l5651L0472J20750J7795J91663k00817J30824k40790k014r583
$$ 532615 568785 533134 563606 684356 702151 893814 692997 823821 583031 581017 571434
6136E71434J70305o3454R0856J05588j35396n3442j8544J56212j030l3906j61810
$$ 571434 741739 678285 769141 874729 739333 685891 667347 823559 822529 788623 626813
6125F26813L76750j75065j40404J5497N1247N5329q9970R9067o7446m0951J57121
$$ 626813 1003563 828498 688094 703591 754838 810167 720197 819264 751818 710867 867988
6114H67988k0599k33964j38261N0260L36489J23740j12893J28888k84083p0886
$$ 867988 847389 613425 475164 525424 861913 985653 872760 1001648 717565 646679
6104F46679k4475J23350r1168Q3718j63258J7488k8996j86854P8532Q7739O0966
$$ 646679 622204 745554 654386 738104 574846 592334 563338 376484 455016 542755 603721
6093F03721P463N2720j8569j8973j3522M2466J04219k4393q0583q3158L393J41582
$$ 603721 611184 663904 645335 626362 612840 655306 759525 735132 654549 571391 574784 716366
6081G16366j14572R9818J4152J3874L7426j6979P1614J0328j90642o8557R7630
$$ 716366 601794 701612 715764 729638 767064 750085 821699 832027 641385 572828 670458
6070F70458m9199p7908j1752K55659k7537o1160M8459j33759J58790K994k0883
$$ 670458 621259 543351 531599 787258 759721 698561 747020 613261 772051 775045 754162
6059G54162m726L0049N213K0740J7821j22501J24851K31178k93045J09408m995
$$ 754162 749436 779485 784698 805438 823259 700758 825609 1056787 763742 873150 868155
6048H68155P0261p6040j20202n4846l1168P6621J51345R49j12946j00734J77533
$$ 868155 938416 862376 742174 687328 656160 732781 884126 885075 772129 671395 848928
6037H48928L7423R6278J9009j72703J0161J18258j16364J00517R9989j16129J18331
$$ 848928 886351 982629 1001638 828935 839096 957354 840990 941507 1041496 925367 1043698
6026A043698M0085j74724n8511J50017o3584J4351M1485R5963j18442O9525K3720
$$ 1043698 1083783 909059 850548 1000565 936981 951332 992817 1088780 970338 1039863 1063583
6015A063583R8062m3814l3648J81066m5191j03785j81862J02316J34188J26036
$$ 1063583 1161645 1117831 1084183 1265249 1220058 1116273 934411 1036727 1170915 1296951
6005A296951k6345J9514M7225O444M6370j59021K08654j00709j08643n9115j06576
$$ 1296951 1270606 1290120 1337345 1343789 1390159 1231138 1439792 1339083 1230440 1171325 1064749
5994A064749L3983J32608j97359M0424m56K13152Q829l4288q5367J70314j3928
$$ 1064749 1098732 1231340 1033981 1074405 1073949 1287101 1295930 1261642 1176275 1346589 1332661
5983A332661r5731K03758j4998j02029l4186J41027J79653K6305o9829k8191j36684
$$ 1332661 1236930 1440688 1425690 1323661 1289475 1430502 1610155 1636460 1566631 1538440 1401756
5972A401756R1564J25764n5566p9662O8508J8143J93402j3820J60190J72913j14963
$$ 1401756 1493320 1619084 1563518 1483856 1552364 1570507 1763909 1750089 1910279 2083192 1968229
5961A968229j585J15009J37571j12335k79965q8388J79951J47819J81388J12859
$$ 1968229 1966644 2081653 2219224 2106889 1826924 1738536 1918487 2066306 2247694 2360553
5951B360553R7272k80590J67578m3506r4664M403j38309M11498q3482J32667K34363
$$ 2360553 2457825 2177235 2344813 2301307 2206643 2211046 2072737 2484235 2400753 2533420 2767783
5940B767783M4642P915p2497L6605O7070o9274J86374M814j15845J31873P7136
$$ 2767783 2812425 2820340 2747843 2784448 2851518 2782244 2968618 2973432 2857587 2989460 3066596
5929C066596J34353j01627Q1112J17398M8341o5760J0849P670P4407J14322J10442
$$ 3066596 3200949 3099322 3180434 3297832 3346173 3280413 3291262 3298932 3373339 3487661 3598103
5918C598103K97464P8013K5634J01603p1486L2580K15032J60452L7505j34220
$$ 3598103 3895567 3973580 3999214 4100817 4029331 4061911 4276943 4437395 4474900 4340680
5908D340680J26027L3675K36557K78531N6317L9778j6148l2305K93556K51739
$$ 4340680 4466707 4500382 4736939 5015470 5071787 5111565 5095417 5063112 5356668 5608407
5898E608407L05529K86179K36048j87534N8459L57491P2432M03887J57608K40902
$$ 5608407 5913936 6200115 6436163 6248629 6307088 6664579 6737011 7140898 7298506 7539408
5888G539408K54062J52429K68424L20409K94505L75143N29164M00006N64941L15091
$$ 7539408 7793470 7945899 8214323 8534732 8829237 9204380 9733544 10133550 10698491 11013582
5878A1013582K80422J16012K65665L24824P55029M77889K69806P06469O60247
$$ 11013582 11294004 11410016 11675681 12000505 12755534 13233423 13503229 14209698 14869945
5869A4869945Q40703R07445J315267J498980J692378J875081K261247K639647
$$ 14869945 15710648 16618093 17933360 19432340 21124718 22999799 25261046 27900693
5861B7900693K908961L323062L842959M001538L626708K556261k29481k561888
$$ 27900693 30809654 34132716 37975675 41977213 45603921 48160182 47930701 45368813
5853D5368813l463089l230679k666922j952723j274996j160387p09900o81604
$$ 45368813 41905724 38675045 36008123 34055400 32780404 31620017 30910117 30228513
5845C0228513m87737q0371K34666L79681P37316J305909J755225K410955K694707
$$ 30228513 29740776 29660405 29895071 30274752 31012068 32317977 34073202 36484157 39178864
5836C9178864L202086L838151M613522N793161O749967P403139P926521P322451
$$ 39178864 42380950 46219101 50832623 56625784 63375751 70778890 78705411 86027862
5828H6027862M625751j110805p510366r928074r063198p175808n364591l848653
$$ 86027862 90653613 89542808 82032442 72104368 63041170 55865362 50500771 46652118
5820D6652118l077079k536833k020913k226923k063337j387480j415376j032635
$$ 46652118 43575039 41038206 39017293 36790370 34727033 33339553 31924177 30891542
5812C0891542m36119n3277L46538O44878J078576J369026J718702K230707K767666
$$ 30891542 30455423 30402146 30748684 31393562 32472138 33841164 35559866 37790573 40558239
5803D0558239L467448L796977L747238K951839J059698k307106m681588n645662
$$ 40558239 44025687 47822664 51569902 54521741 55581439 53274333 48592745 42947083
5795D2947083n067171m017840l205114k384653j900893j575019j528916j340743
$$ 42947083 37879912 33862072 30656958 28272305 26371412 24796393 23267477 21926734
5787B1926734r78023j163944j043246o05025o27876m57237n42533j88421j78913
$$ 21926734 20948711 19784767 18741521 18136496 17508620 17051383 16508850 16320429 16141516
5778A6141516k48556n09454j3935n1794p2118r0138p1716j12498j48662k31214
$$ 16141516 15892960 15383506 15369571 15317777 15245659 15155521 15083805 14971307 14822645 14591431
5768A4591431k02590m03051l67534o3008j61251k09001q9506K10191k29981m26385
$$ 14591431 14388841 13985790 13618256 13555248 13393997 13184996 13095490 13305681 13075700 12649315
5758A2649315l48457K7942L1303k34981m91510k68431k68344m12302n3690j26996
$$ 12649315 12300858 12328800 12360103 12125122 11633612 11365181 11096837 10684535 10630845 10503849
5748A0503849P0073L53598q414P521k17484L1173l1870j4933l98584l88755j09487
$$ 10503849 10573922 10927520 10919106 10926627 10709143 10740316 10708446 10693513 10294929 9906174 9796687
5737I796687j49949j24816p912o2953j74346M16617L72361J69466j43575j23069
$$ 9796687 9646738 9521922 9514010 9451057 9276711 9693328 10065689 10235155 10091580 9968511
5727I968511j85740j20303k60450m42170l83760l83829k22495j85638q8981j77742
$$ 9968511 9782771 9662468 9402018 8959848 8576088 8192259 7969764 7784126 7695145 7517403
5717G517403j72461j61766J3466q8339p2102J16063m7466j02776n0684j05566
$$ 7517403 7344942 7183176 7196642 7108303 7036201 7152264 7104798 7002022 6951338 6845772
5707F845772J3466k28850p822J60365K08331O381k1592L47996Q3411L24752J30323
$$ 6845772 6859238 6630388 6622566 6782931 6991262 6997643 6976051 7324047 7407458 7732210 7862533
5696G862533J09383L9443m37J56481J78540K43831K51873L6381J02687o2359j99794
$$ 7862533 7971916 8011359 8010922 8167403 8345943 8589774 8841647 8878028 8980715 8918356 8718562
5685H718562k4857j08898K2571o9570k45803k24261N8026j62583O8434N5577l8198
$$ 8718562 8693705 8584807 8607378 8537808 8292005 8067744 8125770 7963187 8031621 8087198 8049000
5674H049000L1293L7848K95783L70728K80995M62868L30289P00638P47232P01704
$$ 8049000 8080293 8118141 8413924 8784652 9065647 9528515 9858804 10559442 11306674 12008378
5664A2008378P65578M98003J32600K112l23518n37490m16611l44283j81045k92998
$$ 12008378 12773956 13271959 13404559 13406671 13083153 12545663 12129052 11784769 11603724 11310726
5654A1310726m63179m75539l20014m90511m03084k78424L0290o5464j16358o5673
$$ 11310726 10847547 10372008 10051994 9561483 9158399 8879975 8910265 8844801 8728443 8662770
5644H662770M3216K13100O17421L39397K80079K76229M85907J58722K38692J79382
$$ 8662770 8705986 8919086 9536507 9875904 10155983 10432212 10918119 11076841 11315533 11494915
5634A1494915p6283l16578l39475k72601k26863j84022l5979j44795L40j16350
$$ 11494915 11418632 11102054 10762579 10489978 10263115 10079093 10043114 9898319 9898659 9782309
5624I782309k05585j84889l95492j84217n369j6688l0465K63326J15213K15535
$$ 9782309 9576724 9391835 8996343 8812126 8806757 8790069 8759604 9022930 9138143 9353678
5614I353678J71659P6092p6407L3030j04299k95224k58212m44922j79295k57113
$$ 9353678 9525337 9601429 9525022 9558052 9453753 9158529 8900317 8455395 8276100 8018987
5604H018987k27556j88295k62108k39481k92776j76408N9746k72k65873k44737
$$ 8018987 7791431 7603136 7341028 7101547 6808771 6632363 6692109 6691837 6425964 6181227
5594F181227l1154L1305J5673N7986R2430J19029J166j87044P3363J48263n4980
$$ 6181227 6150073 6181378 6197051 6255037 6347467 6466496 6467662 6280618 6353981 6502244 6447264
5583F447264o7556j16072K7208J03664q0623j17308r796K35322L25534K83538
$$ 6447264 6379708 6263636 6290844 6394508 6313885 6196577 6186781 6422103 6747637 7031175
5573G031175K44105O12011P57235N56145N8602p01717r41412p06315o41237m57585
$$ 7031175 7275280 7887291 8644526 9200671 9259273 8557556 7616144 6909829 6268592 5811007
5563E811007l16153q3057j91261k63784q7431R7173J48576k94294q2623k42354
$$ 5811007 5494854 5411797 5220536 4956752 4869321 4966494 5115070 4820776 4738153 4495799
5553D495799Q6969J49396l1295L0358j7256l3555o1541n7477J34003j2326M14803
$$ 4495799 4582768 4732164 4700869 4731227 4713971 4680416 4618875 4561398 4695401 4683075 5097878
5542E097878J29095K63507k2874M3938j37266O5740j55021j47151K64289p1995
$$ 5097878 5226973 5490480 5467606 5511544 5374278 5440018 5284997 5137846 5402135 5330140
5532E330140j08912J65931M6988J27409k6822Q9402R4097l49q6586O1322J80988
$$ 5330140 5221228 5387159 5434147 5561556 5534734 5624136 5718233 5717884 5631298 5692620 5873608
5521E873608O3074k350j61426p8118O0528J33294q4596K54650k9216K12008K89914
$$ 5873608 5936682 5934332 5772906 5694788 5755316 5888610 5804014 6058664 6029448 6241456 6531370
5510F531370m3432K25463J50554L09711l9131P0809L43516L17925L52140m1366
$$ 6531370 6487938 6713401 6863955 7173666 7134535 7205344 7548860 7866785 8218925 8177559
5500H177559Q9341J66306L15798L84657L94833O9117L81619N23544M80013L75778
$$ 8177559 8266900 8433206 8749004 9133661 9528494 9597611 9979230 10502774 10982787 11358565
5490A1358565K05014M32144N67684L17807Q39487P35100R10574J058140J263206
$$ 11358565 11563579 11995723 12563407 12881214 13720701 14455801 15366375 16424515 17687721
5481A7687721J345728J563143J961485K196084K523205K826136L189031L167317
$$ 17687721 19033449 20596592 22558077 24754161 27277366 30103502 33292533 36459850
5473C6459850K980212K184976K78376j598433k773469l229171k776837k061018
$$ 36459850 39440062 41625038 41903414 40304981 37531512 34302341 31525504 29464486
5465B9464486j458398j010418q54526n43540k7460p6687J48239N31251Q70220
$$ 29464486 28006088 26995670 26141144 25597604 25570144 25493457 25641696 26172947 27043167
5456B7043167J113532J124578J652555J910935K396290L192893L208289L837198
$$ 27043167 28156699 29281277 30933832 32844767 35241057 38433950 41642239 45479437
5448D5479437M829864N377147N778575N642974M788814K335540j095133n110008
$$ 45479437 50309301 55686448 61465023 67107997 71896811 74232351 73137218 68027210
5440F8027210p024620o453051n646243m816219l807543k894690k262546j908742
$$ 68027210 61002590 54549539 48903296 44087077 40279534 37384844 35122298 33213556
5432C3213556j347549j381612r49826o36774l91364q8783K13265M05535O56759
$$ 33213556 31866007 30484395 29534569 28897795 28506431 28417648 28630913 29036448 29693207
5423B9693207Q47623J006275J527400J786082K043374K188220K258454J994903
$$ 29693207 30540830 31547105 33074505 34860587 36903961 39092181 41350635 43345538
5415D3345538R82563p62053k708065l605779l677764l028221k376802k135543
$$ 43345538 44328101 43566048 40857983 37252204 33574440 30546219 28169417 26033874
5407B6033874j553562j247392j337168j104794q46405r89946j090525r95447n33306
$$ 26033874 24480312 23232920 21895752 20790958 19944553 18954607 17864082 16868635 16335329
5398A6335329o27972p24936m19676n04065n87152l65320n03759j85003m02766
$$ 16335329 15707357 14982421 14562745 14058680 13471528 13106208 12602449 12417446 12014680
5389A2014680k85410k88444j25102j95210j25111k48575j83802P7659j42950j20351
$$ 12014680 11729270 11440826 11315724 11120514 10995403 10746828 10563026 10640685 10497735 10377384
5379A0377384M2057K014J66617Q0636j69186j91985J79084N9688O5699Q5703j60657
$$ 10377384 10419441 10421455 10588072 10668708 10499522 10307537 10486621 10546309 10612008 10697711 10537054
5368A0537054r7547j63896N8979J742j21741j33649N9311O3441j08526n1712K50593
$$ 10537054 10439507 10275611 10334590 10336332 10214591 10080942 10140253 10203694 10095168 10043456 10294049
5357A0294049R8622j53522j98048M9080o168l5495j37118O4249J3478J55954J01031
$$ 10294049 10392671 10239149 10041101 10090181 10084013 10048518 9911400 9975649 9989127 10145081 10246112
5346A0246112k23133N2222K44282M5298j40056K02678j51440L24169L79983M8623
$$ 10246112 10022979 10075201 10319483 10364781 10224725 10427403 10275963 10600132 10980115 11028738
5336A1028738N9969K97104K75345J76822J03545j5050M5922R4576l6535J10123
$$ 11028738 11088707 11385811 11661156 11837978 11941523 11926473 11972395 12066971 12030436 12140559
5326A2140559Q6225o5120J10006J08526j11136j40720k72363k01659J51473K1243
$$ 12140559 12226784 12161664 12271670 12380196 12269060 12128340 11855977 11654318 11805791 11827034
5316A1827034p4283k4973j23098m2374Q2561l2086k03826j78292l2213j56379
$$ 11827034 11752751 11727778 11604680 11562306 11644867 11612781 11408955 11230663 11198450 11042071
5306A1042071K67259J90496P0191q9206j2419r4837R3527K15013p6159L82153
$$ 11042071 11309330 11499826 11570017 11480811 11468392 11373555 11467082 11682095 11605936 11988089
5296A1988089K70946j92404l4480l82155k20204j17902l85442l42760r9585J34907
$$ 11988089 12259035 12066631 12032151 11649996 11429792 11311890 10926448 10583688 10484103 10619010
5286A0619010j99063j25443j44302J37161j1603l07498j3901j33151j11313q6651
$$ 10619010 10419947 10294504 10150202 10287363 10275760 9968262 9954361 9821210 9709897 9623246
5276I623246j95990J3819J34144K3680K62939K72861K91735K81531K01289r6009
$$ 9623246 9427256 9441075 9575219 9598899 9861838 10134699 10426434 10707965 10909254 10813245
5266A0813245j33509k55830l59794j39589n3247O0341j5101l1615k86968k0378
$$ 10813245 10679736 10423906 10064112 9924523 9871276 9931617 9916516 9884901 9597933 9577555
5256I577555r0246l10390J32373J40752j12752n5026k31213j42765J1455k68465
$$ 9577555 9487309 9176919 9309292 9450044 9337292 9282266 9051053 8908288 8919743 8651278
5246H651278k9666J15844J89733K53470J08763j2285J73386J73656j98137m5213
$$ 8651278 8621612 8737456 8927189 9180659 9289422 9277137 9450523 9624179 9426042 9380829
5236I380829j46854k5016m5089q8527r7150m97947n46496l28418l93242k16161
$$ 9380829 9233975 9208959 9163870 9075343 8978193 8480246 7933750 7605332 7212090 6995929
5226F995929l25032n10233k46576n9634M6408m9206k7998p9562n7031j57400l8190
$$ 6995929 6670897 6160664 5914088 5854454 5900862 5851656 5823658 5744096 5687065 5529665 5491475
5215E491475Q0189j2667K2080j26289J16959K32618j17957l0107j2224j43465
$$ 5491475 5571664 5558997 5581077 5454788 5571747 5804365 5686408 5656301 5644077 5500612
5205E500612k49947m46905j08779p1480k12079k37985J2565o3445r8905K00827
$$ 5500612 5250665 4803760 4694981 4623501 4411422 4173437 4186002 4122557 4023652 4224479
5195D224479n3447L4381M11J8490j21031L1701k48731n9926M5517j74942J1444
$$ 4224479 4171032 4205413 4205824 4224314 4103283 4134984 3886253 3826327 3871844 3696902 3708346
5184C708346J94570J53418j96437l4563r0260l3178j42j02877n6943l65757o861
$$ 3708346 3902916 4056334 3859897 3825334 3735074 3701896 3701754 3598877 3541934 3176177 3169316
5173C169316J68397j02663J1031j733l01470L05218J29602m5210J7844j63094
$$ 3169316 3337713 3235050 3246081 3244348 2942878 3248096 3377698 3332488 3350332 3187238
5163C187238j58936J39062J10619p8488k10537l5806L5133j7315j2087N154n6764
$$ 3187238 3028302 3167364 3277983 3199495 2988958 2953152 2988285 2970970 2958883 2964037 2907273
5152B907273P8809Q7061l01687J8848M8255O4507P3392P9878j87301j14808J3313
$$ 2907273 2986082 3073143 2771456 2790304 2838559 2903066 2976458 3056336 2869035 2754227 2767540
5141B767540K8414j66457R0424J81638q687m8879P0569n686p3422L1789q5231
$$ 2767540 2795954 2629497 2719921 2901559 2892872 2843993 2914562 2908876 2835454 2867243 2782012
5130B782012m343M5941o4675r009O4503N8726j14155j84263M4231j6444L129m8475
$$ 2782012 2777669 2823610 2758935 2749926 2814429 2873155 2759000 2574737 2618968 2602524 2605653 2557178
5118B557178p7626j36490q5068J13175N6619j22233J57755R9555m5168l2160k45266
$$ 2557178 2479552 2343062 2257994 2371169 2427788 2305555 2463310 2562865 2517697 2485537 2240271
5107B240271J5458J38726J69357j40397K60107j49589j62628o248J97503M4671
$$ 2240271 2255729 2394455 2563812 2423415 2683522 2533933 2371305 2365057 2562560 2607231
5097B607231K217m10186o2401Q1913o5077j29318j6303j96406J85638O1045k69395
$$ 2607231 2609448 2199262 2136861 2218774 2153697 2024379 2008076 1811670 1997308 2058353 1788958
5086A788958K0610o2302J44305M2848J9970j74582J29395o7958j08677m3405p7084
$$ 1788958 1809568 1747266 1891571 1934419 1954389 1779807 1909202 1841244 1732567 1689162 1612078
5075A612078J7002Q9507R1776m7822k45425K34841l6377N2490j50275l38724L66310
$$ 1612078 1629080 1718587 1810363 1762541 1517116 1751957 1715580 1768070 1617795 1279071 1645381
5064A645381M454o3862J35980O0092J62634k12139K3526j68093j36174Q6828k4532
$$ 1645381 1649835 1585973 1721953 1782045 1944679 1732540 1756066 1587973 1451799 1538627 1514095
5053A514095P3712j13044O1168Q414M6312q2859l7413J97241N8075q9075j5498
$$ 1514095 1587807 1474763 1535931 1544345 1590657 1507798 1470385 1667626 1725701 1636626 1621128
5042A621128R100q4363p4215Q2042N565M255n7409K04621q8965k0809J21467j38663
$$ 1621128 1630228 1545865 1471650 1553692 1559257 1563512 1506103 1710724 1621759 1600950 1722417 1583754
5030A583754j18850o0390O7165q7339j8712k37531J91693o5706p7092J9704q9612
$$ 1583754 1464904 1404514 1471679 1384340 1365628 1128097 1319790 1254084 1176992 1196696 1107084
5019A107084k9803J34552q9989J5299n3531N543j42822m2603J5550K7668Q1887
$$ 1107084 1077281 1211833 1121844 1137143 1083612 1089155 946333 903730 919280 946948 1028835
5008A028835j21543m6264r087r5683j73010p9382J90142o3467M9513L8252P8281
$$ 1028835 907292 861028 851941 756258 583248 503866 694008 630541 680054 718306 796587
4997G96587r2757J03588q875k82869r341K62971J32510Q3982j79232j15501L6703
$$ 796587 703830 807418 798543 515674 506333 769304 901814 985796 806564 691063 727766
4986G27766j17884R4329k1592m4274J05546J21040l3920o9042j12718K0406Q3692
$$ 727766 609882 704211 682619 638345 743891 864931 831011 761969 649251 669657 753349
4975G53349k5805j58741J14953m0788n4441j7009j12284O3531j19065J10421K30713
$$ 753349 727544 568803 683756 642968 588527 571518 459234 522765 403700 514121 744834
4964G44834l7903o484j56034L7248J33405J21634j43810P201j33835J18547j62260
$$ 744834 706931 700447 544413 581661 715066 836700 692890 700091 566256 684803 522543
4953E22543j53087p996J40729J3108j78905J30154j15764j27220L46656R2921
$$ 522543 369456 361460 502189 515297 336392 466546 350782 223562 570218 663139
4943F63139k03769j67076J87044K64116j11599k7014j01762J5939K5640L0439
$$ 663139 459370 292294 479338 743454 631855 604841 503079 519018 544658 575097
4933E75097K03458k82442Q0319n7025n2757j2235J15509k5005Q7512q2467j51565
$$ 575097 778555 496113 576432 519407 466650 454415 569924 544919 632431 549964 398399
4922C98399p9315P6926J43177o5547k7596R167P9368j32232l9765J45796J37723
$$ 398399 319084 396010 539187 473640 446044 455211 534579 402347 362582 508378 646101
4911F46101q3853n320k78061J34709K0089m1259J58434l316r0312J9302K8278
$$ 646101 562248 556928 278867 413576 433665 392406 550840 547524 457212 476514 504792
4900E04792l5418k8452J34123M9055q8397J1635J46817J9448M397j86280k71519
$$ 504792 469374 440922 575045 624100 535703 547338 694155 713603 718000 531720 260201
4889B60201J10860Q2943J56122K18732m1277l9371j39516P5358l4076r7901J63791
$$ 260201 371061 454004 610126 828858 787581 748210 608694 684052 649976 552075 715866
4878G15866m3355J77308q82j32020j70214J93420M4248m02703P5109K31587J99089
$$ 715866 672511 849819 848937 716917 546703 740123 784371 381668 456777 688364 887453
4867H87453j04422r6088N9362n8788n0681J35211L8915J15568L8860L3477m0869
$$ 887453 783031 686943 746305 687517 636836 772047 810962 926530 965390 998867 957998
4856I57998k47n5351j5771J11390o7734q5224J46558q2935L9918q1234l6079P5884
$$ 957998 957751 902400 886629 998019 930285 845061 991619 908684 948602 867368 831289 907173
4844I07173J16438J1050J09747l1592L410J37192j14802j37066P8288K26735k22651
$$ 907173 1023611 1034661 1144408 1112816 1116226 1253418 1138616 1001550 1079838 1306573 1083922
4833A083922O7297J48888K04748K5965k16591j61637K59862P8500k10270J55840
$$ 1083922 1151219 1300107 1504855 1530820 1314229 1152592 1412454 1490954 1280684 1436524
4823A436524K58051j0727M8593R2683q199P2062l1207J20175m7830J43109N8964
$$ 1436524 1694575 1683848 1732441 1825124 1816925 1888987 1857780 1977955 1930125 2073234 2132198
4812B132198J30074o1303J0614Q0615n2893L45911K50342J17745J26149J39582
$$ 2132198 2262272 2200969 2211583 2292198 2239305 2585216 2835558 2953303 3079452 3219034
4802C219034L09409K28761J13805M31094L57470O71489L15085O36108P60462R40894
$$ 3219034 3528443 3757204 3871009 4302103 4659573 5331062 5646147 6282255 7042717 7983611
4792G983611J195512J607099J979819K174599K289836K084291Q81615q47706k452796
$$ 7983611 9179123 10786222 12766041 14940640 17230476 19314767 20196382 19348676 16895880
4783A6895880l055159k851530j973732j517038q16486p67056n12000l42816o18180
$$ 16895880 13840721 10989191 9015459 7498421 6681935 5914879 5402879 5060063 4441883
4774D441883l17108j93820k25008k68983j48770j78214j14515m69565r0346K71711
$$ 4441883 4124775 3930955 3705947 3436964 3288194 3109980 2995465 2525900 2435554 2707265
4764B707265J91467j52214j71700j60871j32129K11826J35507r1980L2231o7577
$$ 2707265 2898732 2746518 2574818 2413947 2281818 2493644 2629151 2537171 2569402 2501825
4754B501825k961Q9304N2703m4852k38455J02826J90491p3438J48943k4515j4856
$$ 2501825 2498864 2588168 2640871 2596019 2357564 2460390 2650881 2577443 2726386 2701871 2687015
4743B687015j4342L45003R1985N9668P1769L36260J13947m8605J50119L70681
$$ 2687015 2672673 3017676 3109661 3169329 3241098 3577358 3691305 3642700 3792819 4163500
4733D163500M64987M79407K73444R26365Q12030R73806J128665J572025J766325
$$ 4163500 4628487 5107894 5381338 6307703 7119733 8093539 9222204 10794229 12560554
4724A2560554K100554K091018J853088O22345r28603j352156k472240k810970
$$ 12560554 14661108 16752126 18605214 19227559 18298956 16946800 14474560 11663590
4716A1663590k152764j543172j311656p58331n32515n17371o13076m79700l05716
$$ 11663590 9510826 7967654 6655998 5897667 5365152 4847781 4234705 3755005 3449289
4707C449289k24367m861p0871l81300k24986n3420j43479k16978J28799p7170
$$ 3449289 3224922 3220061 3149190 2767890 2542904 2489484 2346005 2129027 2257826 2180656
4697B180656n4338k92977j01596j08740J04733J17811m8121Q3039m7044N3951
$$ 2180656 2126318 1833341 1731745 1623005 1727738 1845549 1797428 1880467 1833423 1887374
4687A887374j02214j17098l8648m0092P804j4415o3243j98014O5193N460J25243
$$ 1887374 1785160 1668062 1629414 1589322 1597126 1582711 1519468 1321454 1386647 1392107 1517350
4676A517350k54401j44052o7879K22408r5709r7575q9919J17517K6590K2011k2806
$$ 1517350 1262949 1118897 1051018 1273426 1177717 1080142 990223 1107740 1134330 1156341 1133535
4665A133535j08693r816M9109L4576q2855K0527J06209r2349q6349O501J5484
$$ 1133535 1024842 1015026 1064135 1098711 1015856 1036383 1142592 1050243 963894 970395 985879
4654I85879M0494j89623r0383k6853J65343k9352K20278j10496n8432k2765j31700
$$ 985879 1026373 836750 746367 719514 884857 855505 1075783 965287 906855 884090 752390
4643G52390P3855R395j9567j29852J0430Q7004J16011K5377q3511p1218k9101
$$ 752390 826245 835640 816073 686221 696651 783655 899666 925043 841532 770314 741213
4632G41213n6628j04441K93908L5627j1382p8866q3127o2603J48638J65921o8711
$$ 741213 684585 580144 874052 909679 898297 819431 736304 673701 822339 988260 919549
4621I19549r1340K0040O1591j38715j13263N6010J47157j62694q1661J80597K62983
$$ 919549 828209 848249 909840 771125 657862 713872 861029 698335 616674 797271 1060254
4610A060254j29497m9035J42171j0124N9458N227O4341o0858j89086j10504l5367
$$ 1060254 930757 881722 1023893 1013769 1073227 1078454 1142795 1081937 892851 782347 746980
4599G46980j20223J49581j12683J44323J82511j48075m1177J29211j22432j09792
$$ 746980 626757 776338 663655 807978 990489 842414 801237 930448 808016 698224
4589F98224O8814P4331j85839n5039L2293j15377J30107J50506J92664N2658j02310
$$ 698224 767038 841369 655530 600491 632784 517407 647514 798020 990684 1043342 941032
4578I41032L4943R6147j44615j38848p987l7588J40064J72604n6991N436n0872
$$ 941032 975975 1072122 927507 788659 780672 743084 883148 1055752 998761 1004197 953325
4567I53325n0841l2764J69972k3462j76108J66431m2791n8715J30452k37815n952
$$ 953325 902484 869720 1039692 1016230 840122 1006553 963762 905047 1035499 797684 791732
4556G91732J57359k3806j04006M5925J79730k03151j6328M1677j46079J93872
$$ 791732 949091 925285 821279 867204 1046934 843783 827455 869132 723053 916925
4546I16925j4954L2470J72451r076L0600J08017p4274j659P9587j59817J99544
$$ 916925 901971 934441 1106892 1097816 1128416 1236433 1162159 1160500 1240087 1080270 1279814
4535A279814k23746j4325J82716M2289p6505j06978r4039L14338J60286k92383
$$ 1279814 1056068 1041743 1224459 1266748 1190243 1083265 989226 1303564 1463850 1171467
4525A171467k4498J72949R7481j17047j47075k19150J27038J93268k3545K1483
$$ 1171467 1146969 1319918 1417399 1300352 1153277 934127 1061165 1254433 1230888 1252371
4515A252371n4394q8371J95811R8471N3552j21118k31528k49380J66126K00426
$$ 1252371 1197977 1109606 1305417 1403888 1457440 1336322 1104794 855414 1021540 1221966
4505A221966P0013J8800J18181l6700p2302n2996r3862R1511O1205o1999j47388
$$ 1221966 1291979 1310779 1428960 1392260 1319958 1266962 1173100 1264611 1325816 1263817 1116429
4494A116429K47894K15208l3823p3669o4762J04152j172Q2930p7227j4495P1150
$$ 1116429 1364323 1579531 1545708 1472039 1407277 1511429 1510257 1593187 1515960 1501465 1572615
4483A572615J37879n3669j8436n3281k3501K53835m7770j0832p435j37752K6484
$$ 1572615 1710494 1656825 1638389 1585108 1561607 1815442 1767672 1756840 1749405 1611653 1638137
4472A638137J21781R5052J63942l6677P6518m613J64834J06591K6403K42652J91255
$$ 1638137 1759918 1854970 2018912 1982235 2058753 2054140 2218974 2325565 2351968 2594620 2785875
4461B785875J40132k9970k91703k83962j34891r3316n027Q9537j42196j18303
$$ 2785875 2926007 2896037 2604334 2320372 2185481 2092165 2087138 2176675 2034479 1916176
4451A916176J08037m8120j86670K99277R5713l14810j67236p133O3171L7788J07783
$$ 1916176 2024213 1976093 1789423 2088700 2184413 1869603 1702367 1695234 1758405 1796193 1903976
4440A903976j33047j47287j9332J04136R7123j16813O0346k42414J30419K99147
$$ 1903976 1770929 1623642 1604310 1708446 1805569 1688756 1749102 1506688 1637107 1936254
4430A936254j11066r340O5316J06192l2408p5533N3018J04289o0839P4893j43437
$$ 1936254 1825188 1815848 1881164 1987356 1954948 1879415 1932433 2036722 1975883 2050776 1907339
4419A907339L3840O6367k8209j25165J08434J37453K9794L592j86598m8914R2546
$$ 1907339 1941179 2007546 1979337 1854172 1962606 2100059 2129853 2133445 1946847 1897933 1990479
4408A990479l9495J61026o6514N4138j10108M9942N7582J41162K07142k99223
$$ 1990479 1950984 2112010 2045496 2099634 1989526 2039468 2097050 2238212 2445354 2146131
4398B146131Q5951O425K2895J51853J88994O094j84975M2346m3827j171J06711
$$ 2146131 2232082 2238507 2261402 2413255 2602249 2608343 2423368 2465714 2421887 2420716 2527427
4387B527427j10288J39868q225m013K55970j8628j88746R5683L4286M2712J22804
$$ 2527427 2417139 2557007 2548782 2544769 2800739 2782111 2593365 2689048 2723334 2766046 2888850
4376B888850M5019K31058J12214J1129N5275Q1067m0731J739L5888O6433j0945
$$ 2888850 2933869 3164927 3277141 3288270 3343545 3424612 3383881 3385620 3421508 3487941 3476996
4365C476996R6962j10763k23043K0368j13555M3017J51841L4429M780M0843K06280
$$ 3476996 3573958 3463195 3240152 3260520 3146965 3189982 3341823 3376252 3381032 3421875 3628155
4354C628155J51914p5274n0386J8771J02796K9306J00631M7621K39152J8191J90225
$$ 3628155 3780069 3704795 3654409 3673180 3775976 3805282 3905913 3953534 4192686 4210877 4401102
4343D401102r8060K72756J42524J24338O7238Q2550J22233J0949K16467P1489
$$ 4401102 4303042 4575798 4718322 4842660 4909898 4992448 5114681 5125630 5342097 5413586
4333E413586J59652K43900l6003J5426J67870k50827n9941J1074J80883J70658
$$ 5413586 5573238 5817138 5781135 5796561 5964431 5713604 5653663 5664737 5845620 6016278
4323F016278J73494J15402o8368J24926j25576j24252K93796J97710J12709j86618
$$ 6016278 6189772 6305174 6236806 6361732 6236156 6111904 6405700 6603410 6716119 6529501
4313F529501P5829O2189K28775L05946J79507P9310K56351K39946L59969L0039
$$ 6529501 6605330 6667519 6896294 7202240 7381747 7461057 7717408 7957354 8317323 8347362
4303H347362P895J18756K87189L4138K40117N7285k48938R1380j84780j00178
$$ 8347362 8355257 8474013 8761202 8795340 9035457 9092742 8843804 8935184 8750404 8650226
4293H650226j81798K92241J7375J41452j86669N185J49292J46931N8068Q0103
$$ 8650226 8468428 8760669 8778044 8919496 8732827 8738012 8887304 9034235 9092303 9172406
4283I172406j81381n0496J43427K2545k29J11386l1378K0781K36836R4212N583
$$ 9172406 8991025 8940529 9083956 9106501 9106272 9217658 9186280 9207061 9443897 9538109 9543692
4272I543692M0713K61358O1736q8160J84662K2638K05209l2085J08744R1284j57965
$$ 9543692 9584405 9845763 9907499 9819339 10004001 10026639 10231848 10199763 10308507 10399791 10241826
4261A0241826L32423j11797j73706P4302J88921k1573O7940J61977J44822j19281
$$ 10241826 10574249 10462452 10288746 10363048 10551969 10530396 10598336 10760313 10905135 10785854
4251A0785854J56491j43481J63204L15799M7840J33489L42204K38312K71655K70935
$$ 10785854 10942345 10798864 10962068 11277867 11325707 11459196 11801400 12039712 12311367 12582302
4241A2582302J57278Q5667J87172J51523J84487Q8568l6021K36770J99658J31303
$$ 12582302 12739580 12825247 13012419 13163942 13348429 13436997 13400976 13637746 13837404 13968707
4231A3968707K47619r8700J76580N25949K24838J98311K73619Q6009L4496M80386
$$ 13968707 14216326 14117626 14294206 14820155 15044993 15243304 15516923 15602932 15637428 16117814
4221A6117814K08639L50521M11788K68349L18385L40141L95882N08223M71002
$$ 16117814 16326453 16676974 17088762 17357111 17675496 18015637 18411519 18919742 19390744
4212A9390744O69205N67533O33496P26643M83006R68342R41216J029369Q18547
$$ 19390744 20059949 20627482 21260978 21987621 22470627 23438969 24380185 25409554 26228101
4203B6228101Q91175J043874J022381J360124J428100J112775J541165K016843
$$ 26228101 27119276 28163150 29185531 30545655 31973755 33086530 34627695 36644538
4195C6644538J807545J815686K190813K339877K380292K616348L174744L632923
$$ 36644538 38452083 40267769 42458582 44798459 47178751 49795099 52969843 56602766
4187E6602766M691738N471705O608876Q149898R471232J1603485J4242934J7397666
$$ 56602766 61294504 66766209 73375085 81524983 90996215 102599700 116842634 134240300
4179A34240300K2398463K7086043L1031933L2263838K6848008P398459j7937283
$$ 134240300 156638763 183724806 214756739 247020577 273868585 281267044 263329761
4172B63329761l6460052m0982396l1523729k2278452j5768192j1989534r012186
$$ 263329761 226869709 185887313 154363584 132085132 116316940 104327406 95315220
4165I5315220o553790m903187l377251k517958k465373k915958l968903m617866
$$ 95315220 88761430 83858243 80480992 77963034 75497661 72581703 68612800 63994934
4157F3994934m395848l622990k994568k449362j775263j483573j499602j724947
$$ 63994934 59599086 55976096 52981528 50532166 48756903 47273330 45773728 44048781
4149D4048781j753298j516043j091313k57687q3520K12995M09618J091525J455278
$$ 44048781 42295483 40779440 39688127 39430440 39346920 39559915 39969533 41061058 42516336
4140D2516336K012513K633776L181405K696248J369269l47861j554772j716126
$$ 42516336 44528849 47162625 50344030 53040278 54409547 54061686 52506914 50790788
4132E0790788k087888k525855k867612l570097l550927k727021k242282j947908
$$ 50790788 48702900 46177045 43309433 39739336 36188409 33461388 31219106 29271198
4124B9271198j420379j314201r54961r01273n30997k62777l44362m63648l61228
$$ 29271198 27850819 26536618 25581657 24680384 24149387 23886610 23542248 23078600 22717372
4115B2717372m22651n98598p15718m67172l16689j93107j54275j49402J34614
$$ 22717372 22294721 21696123 20980405 20513233 20196544 20003437 19849162 19699760 19834374
4106A9834374P9715K39515K37970J82573J66839L54064L84197N63120K43340M64857
$$ 19834374 19914089 20153604 20391574 20574147 20740986 21095050 21479247 22042367 22285707 22750564
4096B2750564J08609k13912p86807j184750q22222p51903o45521o28966m80537
$$ 22750564 22859173 22645261 21858454 20673704 19851482 19099579 18454058 17825092 17344555
4087A7344555k70668m08544j56956k17524J9223j91029m98978l30734l62638n39532
$$ 17344555 17073887 16665343 16508387 16290863 16310086 16119057 15620079 15289345 14926707 14387175
4077A4387175o9063k62709j80696k43638k35930J02411j56178j03905J13262l5672
$$ 14387175 14318112 14055403 13874707 13631069 13395139 13497550 13341372 13237467 13350729 13315057
4067A3315057j80405j47087r3560m8236k34538k0122K0590J8484P3461J62765
$$ 13315057 13134652 12987565 12894005 12845769 12611231 12591109 12611699 12630183 12703644 12866409
4057A2866409Q5941J02789J97778O6956J20711R8044K2672J74071L37727M15522
$$ 12866409 12952350 13055139 13252917 13319873 13440584 13538628 13561300 13735371 14073098 14488620
4047A4488620L28099L01678M74765N37987O72405R41101J203952J172086J168831
$$ 14488620 14816719 15118397 15593162 16131149 16803554 17744655 18948607 20120693 21289524
4038B1289524Q71560N73357j18705o53266q09025j326217j373476j137338q19473
$$ 21289524 22161084 22734441 22615736 21962470 21153445 19827228 18453752 17316414 16496941
4029A6496941n90306n95770k85145j20057k83041P6369N3680O742J03470K37912
$$ 16496941 15906635 15310865 15025720 14905663 14622622 14698991 14752671 14759413 14862883 15100795
4019A5100795Q1201J98044L02808K94685R9157K03608L71942M10723N67107M98339
$$ 15100795 15181996 15380040 15682848 15977533 16076690 16280298 16652240 17062963 17630070 18128409
4009A8128409Q49057Q70255J033942J110321J495740J561615J962138J825196
$$ 18128409 18977466 19847721 20881663 21991984 23487724 25049339 27011477 28836673
4001B8836673J339764P91916l82691j261743j483187r06019q10486p37340k97778
$$ 28836673 30176437 30968353 30585662 29323919 27840732 26934713 26124227 25386887 25089109
3992B5089109j07378J50900M56235Q06082J297075J379904J583952J064779Q3043
$$ 25089109 24981731 25132631 25588866 26394948 27692023 29071927 30655879 31720658 31803701
3983C1803701n92094n64620K8308L60056R3905k51526o06565Q4447L00789J45619
$$ 31803701 31211607 30646987 30675295 31035351 31129256 30877730 30271165 30355612 30656401 30802020
3973C0802020p5189k85288j71041j23994K49803J46485N93088J154889J544136
$$ 30802020 30726831 30441543 30270502 30146508 30396311 30542796 31135884 32290773 33834909
3964C3834909J759204K418702K470518J986051L78755j078632k513226l654307
$$ 33834909 35594113 38012815 40483333 42469384 42848139 41769507 39256281 35601974
3956C5601974l247356k416786j852917j445795p58770o31108l53824l50498k63829
$$ 35601974 32354618 29937832 28084915 26639120 25880350 25249242 24895418 24544920 24281091
3947B4281091r2555K68324N05429M54381M36186M07807M59729q3907j29878J06829
$$ 24281091 24188536 24456860 24962289 25416670 25852856 26260663 26720392 26636485 26506607 26613436
3937B6613436M44963P76562J054836J648793J807152K488961K502555K404429
$$ 26613436 27058399 27834961 28889797 30538590 32345742 34834703 37337258 39741687
3929C9741687J319286r35293j914202r67452L81634R31042J544860J382749m45312
$$ 39741687 41060973 40125680 38211478 37244026 37625660 38556702 40101562 41484311 41038999
3920D1038999k086520k449959j289819m00282M9389J46196p74036j974305k654485
$$ 41038999 38952479 36502520 35212701 34812419 34861808 35008004 34233968 32259663 29605178
3911B9605178j969992j270645q24775n91719m19444k74243o18843o04601l48879
$$ 29605178 27635186 26364541 25539766 24948047 24528603 24254360 23635517 23030916 22682037
3902B2682037m48454m3711J31229J68493L66042M85808O14534N44531L88615M7758
$$ 22682037 22233583 22189872 22321101 22489594 22855636 23341444 23955978 24500509 24889124 24936882
3892B4936882J27136j70017j52080K28399R3936j05942J52045j80509n04503l13120
$$ 24936882 25064018 24894001 24741921 24970320 25064256 24958314 25110359 24929850 24425347 24112227
3882B4112227n46686n07871k78309j78235J65035J83329K17064M57336L85654
$$ 24112227 23565541 23057670 22779361 22601126 22766161 22949490 23166554 23623890 24009544
3873B4009544L54769P81760J031518R43798J028459J453417J389293J851427J799582
$$ 24009544 24364313 25146073 26177591 27121389 28149848 29603265 30992558 32843985 34643567
3864C4643567J313817R40642P56104P98134L42378R2982j83962n21794q17208
$$ 34643567 35957384 36898026 37654130 38452264 38794642 38887624 38703662 38181868 37364660
3855C7364660j040227j227339q21854r99629m99684k29278K19238K38012N81486
$$ 37364660 36324433 35097094 34275240 33275611 32775927 32546649 32765887 33003899 33585385
3846C3585385Q80403O98679N71820M11625N57335M63059N38900J068618J628246
$$ 33585385 34465788 35164467 35736287 36147912 36705247 37168306 37707206 38775824 40404070
3837D0404070J687620K002788K020258J765455J395265N71490r2552j57510j59628
$$ 40404070 42091690 44094478 46114736 47880191 49275456 49846946 49754394 49596884 49437256
3828D9437256J25652L36047K3439m92885n58717l39991n66947m77199l03008l99206
$$ 49437256 49562908 49898955 49922394 49429509 48870792 48530801 47963854 47486655 47183647 46784441
3818D6784441m40851l10941j99762l52454j172820j338848j292641r73485o65860
$$ 46784441 46343590 46032649 45832887 45480433 44307613 42968765 41676124 40702639 40036779
3809D0036779j68019K24800L57289P18836N03019N87835N36567P33705Q57534
$$ 40036779 39868760 40093560 40450849 41169685 41672704 42260539 42797106 43530811 44388345
3800D4388345J261878J497403J700862K048388J533251Q75883p9601r96114j308967
$$ 44388345 45650223 47147626 48848488 50896876 52430127 53306010 53226409 52230295 50921328
3791E0921328j308222j725893j606168r40462m99853n48421q25300r57850p21059
$$ 50921328 49613106 47887213 46281045 45340583 44840730 44292309 43467009 42509159 41788100
3782D1788100n35306j83503K99175L52599P74456O12676L20870O2325n53198j198300
$$ 41788100 41252794 41069291 41368466 41721065 42495521 43108197 43429067 43491392 42938194 41739894
3772D1739894j058645o54866p05145n10653l62165o43272r15957j103690j246407
$$ 41739894 40681249 40026383 39321238 38810585 38448420 37805148 36889191 35785501 34539094
3763C4539094j279255j114020j048622p06408q97052j076110q20198j149144j016237
$$ 34539094 33259839 32145819 31097197 30390789 29493737 28417627 27597429 26448285 25432048
3754B5432048p52602n84131m75161m24613n56338l24505j69239k86045o3716J0415
$$ 25432048 24679446 24095315 23620154 23195541 22639203 22314698 22145459 21859414 21795698 21806113
3744B1806113j30238j88356j65393o8349j47510l2346n7727j0902k23759l04863
$$ 21806113 21675875 21487519 21322126 21253777 21106267 21073921 21016194 21005292 20781533 20476670
3734B0476670Q6363j52801k51293j03196k13941j67091n0557J53006M2558K1720
$$ 20476670 20563033 20410232 20158939 20055743 19841802 19674711 19624154 19777160 19819718 19841438
3724A9841438J44012L10176L63192K15054L97715K78882O03133O37818P95744
$$ 19841438 19985450 20295626 20658818 20873872 21271587 21550469 22153602 22791420 23587164
3715B3587164P64423P36741R33718R60685M66298K75975N47353N11250N00926
$$ 23587164 24351587 25088328 26022046 26982731 27449029 27725004 28272357 28783607 29284533
3706B9284533N25722M34833N00788Q6159q1180p94569j025045n69811o32506m19529
$$ 29284533 29810255 30245088 30745876 30832035 30750855 29956286 28931241 28361430 27728924 27309395
3696B7309395r3908O601L19060L59611O19415O18900R02972J314842J390107J672202
$$ 27309395 27215487 27222088 27541148 27900759 28520174 29139074 30042046 31356888 32746995 34419197
3686C4419197J855343J897123J460701J217845J038513J459051J719993J839311
$$ 34419197 36274540 38171663 39632364 40850209 41888722 43347773 45067766 46907077
3678D6907077J653492J242008M97588l90769r10632j388847j467375j020702p89528
$$ 46907077 48560569 49802577 50300165 49909396 48998764 47609917 46142542 45121840 44332312
3669D4332312n75036m61558k01318k13026m66933m63556k17634j97732K01183
$$ 44332312 43757276 43295718 43094400 42881374 42414441 41950885 41733251 41535519 41736702
3660D1736702M79551O28139J283195J438296J653968J205011Q56494N87793L94730
$$ 41736702 42216253 42844392 44127587 45565883 47219851 48424862 49281356 49869149 50263879
3651E0263879N36914N06292L00732M24412M81274M00281N58341O84749K95623
$$ 50263879 50800793 51307085 51607817 52032229 52513503 52913784 53472125 54156874 54452497
3642E4452497q7751l3161N4325K77491j82525p23654j596868k134030k038437
$$ 54452497 54364746 54331585 54385910 54663401 54480876 53757222 52160354 50026324 47987887
3633D7987887j728810j385979q74166n80826l64334k35663n8909j28391n30897
$$ 47987887 46259077 44873098 43998932 43418106 43053772 42818109 42759200 42630809 42099912
3624D2099912p69019o30571k62009j6900K14656J002868R91064J105898R96403
$$ 42099912 41330893 40700322 40438313 40421413 40636069 41638937 42630001 43735899 44732302
3615D4732302J082489J037558M05180J25007j78249k54978m15129p68068q17707
$$ 44732302 45814791 46852349 47257529 47382536 47204287 46949309 46534180 45766112 44948405
3606D4948405r33591j456373j430374j456363j284676j257181j059616q94577
$$ 44948405 44014814 42558441 41128067 39671704 38387028 37129847 36070231 35175654
3598C5175654q97126m29039m16636l73250l41590k55521K37669j05870j43819
$$ 35175654 34278528 33849489 33432853 33059603 32718013 32462492 32700161 32594291 32450472
3589C2450472K70796J1564J24479n868r3397q5270j74282k55112p9097m02456
$$ 32450472 32721268 32732832 32857311 32851443 32758046 32672776 32498494 32243382 32164285 31761829
3579C1761829l61503K1829l06482l59844n09794o82619p88917n01609l43264m64458
$$ 31761829 31400326 31422155 31115673 30755829 30246035 29563416 28774499 28272890 27929626 27465168
3569B7465168n03121k71556l98073n10107n17748k41216k07267k17273l45407
$$ 27465168 26962047 26690491 26292418 25782311 25264563 25023347 24816080 24598807 24253400
3560B4253400l72470k14380l46388j66262j8448k40951q2333j30795n77487m87781
$$ 24253400 23880930 23666550 23320162 23153900 23135452 22894501 22812168 22681373 22103886 21616105
3550B1616105q3297l68513k96249l44000k84625l23171j33474k44010l6417k77047
$$ 21616105 21532808 21164295 20868046 20524046 20239421 19916250 19782776 19538766 19502349 19225302
3540A9225302l57644r2107m9537l15693m58061k80157j86559k06200k78163j56387
$$ 19225302 18867658 18775551 18726014 18410321 17952260 17672103 17485544 17279344 17001181 16844794
3530A6844794l14936l99475r8931J10987j60343l24206k81746k01743k93240l39667
$$ 16844794 16529858 16130383 16031452 16142439 15982096 15657890 15376144 15174401 14881161 14541494
3520A4541494l79941r3935k76039k74673j54568k21711l95909J79926l0399k09082
$$ 14541494 14161553 14067618 13791579 13516906 13362338 13140627 12744718 12924644 12894245 12685163
3510A2685163k99600j38540j10088m9160l0369k31612l48467o1222k62030m22413
$$ 12685163 12385563 12247023 12136935 12087775 12057406 11825794 11477327 11416105 11154075 10731662
3500A0731662j63653J48423l10044k60921k8684j0994O7814k97922j63084j96427
$$ 10731662 10568009 10716432 10406388 10145467 10116783 10105789 10173603 9875681 9712597 9516170
3490I516170j95403l842o0334q2125q4860k16498K22095J93315j58557j05444
$$ 9516170 9320767 9316925 9256591 9174466 9089606 8873108 9095203 9288518 9129961 9024517
3480I024517P3964m1320k55923N2421K27159p0605r8964k84098j48520j68563
$$ 9024517 9098481 9057161 8801238 8853659 9080818 9010213 8911249 8627151 8478631 8310068
3470H310068p3942j95157M1101k2736k10040o3411J88309J0770j69386j559P8851
$$ 8310068 8236126 8040969 8082070 8059334 7849294 7785883 7974192 7984962 7815576 7814017 7892868
3459G892868o3393k7373P7311Q0810j33242j86681m2717N0610L20787J74540O4112
$$ 7892868 7829475 7802102 7879413 7960223 7826981 7640300 7597583 7648193 7968980 8143520 8207632
3448H207632j13410o2192J42278J61920j75932j05459J23818J97004m3250r2464
$$ 8207632 8094222 8032030 8174308 8336228 8160296 8054837 8178655 8375659 8332409 8239945
3438H239945M1678k38968j46231L2698l5612j43269q2795J71883j50867k44194
$$ 8239945 8281623 8042655 7896424 7929122 7893510 7750241 7667446 7839329 7688462 7444268
3428G444268J67039J8643j46303o5365o713P7476J9725J61383K7437K35804k3050
$$ 7444268 7611307 7629950 7483647 7418282 7411569 7489045 7508770 7670153 7697590 7933394 7910344
3417G910344J32452K36712J04132J5445J93054K78407J5800J02689m6311N9121
$$ 7910344 8042796 8279508 8383640 8399085 8592139 8870546 8886346 8989035 8942724 9001845
3407I001845o6259j45430l38752M6742J01032n9742K2026K07796J64274j81825
$$ 9001845 8935586 8790156 8451404 8498146 8599178 8539436 8561462 8769258 8933532 8751707
3397H751707k74779J10944J07160K24214j15857M724L12834K08422j66685R1585
$$ 8751707 8476928 8587872 8695032 8919246 8803389 8808113 9120947 9329369 9162684 9254269
3387I254269J59259r2369j19907K7520K39341Q1687m9758j34917L6784q3445m6948
$$ 9254269 9413528 9321159 9201252 9228772 9468113 9549800 9500042 9365125 9401909 9318464 9271516
3376I271516o9602J619k14865p5552J68966j80547j82556k1888j59438L3806k8639
$$ 9271516 9201914 9203533 8988668 8913116 9082082 8901535 8718979 8697091 8537653 8571459 8542820
3365H542820J54958j26090j44680n5459n0819N1093m7760p5098R7375l7785k55801
$$ 8542820 8697778 8571688 8427008 8371549 8320730 8371823 8324063 8248965 8346340 8308555 8052754
3354H052754K8259K4823r7264k81901q6597n4694l4550J99138j18280k4075K8180
$$ 8052754 8081013 8105836 8008572 7726671 7640074 7585380 7550830 7749968 7631688 7607613 7635793
3343G635793k75024K36430p7455J29149J44835k10340J01342K02426q3299o0689
$$ 7635793 7360769 7597199 7519744 7648893 7793728 7583388 7684730 7887156 7803857 7743168
3333G743168p585J2871n8874n203m1196k20308o4194j54044J65417r5453j50391
$$ 7743168 7735583 7748454 7689580 7684377 7643181 7422873 7358679 7204635 7370052 7274599 7124208
3322G124208n6441r930p9242P9840Q1308J34710M3108J65173J73988k30963k43797
$$ 7124208 7067767 7057837 6978595 7058435 7139743 7274453 7317561 7482734 7656722 7425759 7181962
3311G181962j46803K30373J82481q1489M8999K1493j35956J8492J535K42426N2956
$$ 7181962 7035159 7265532 7448013 7366524 7415523 7437016 7301060 7319552 7321087 7563513 7616469
3300G616469j49368J79637P7330j87269K2804K8242r2824J36494M3521r600j58683
$$ 7616469 7467101 7646738 7724068 7536799 7559603 7587845 7495021 7631515 7675036 7665436 7506753
3289G506753J52314O2015j23866m7004M1794N559K9756N769J15525K55881j0523
$$ 7506753 7659067 7721082 7597216 7550212 7592006 7597565 7627321 7633090 7748615 8004496 7993973
3278G993973q8269K12915K15512m5141J61523L37760J22493M8880L47531L78660
$$ 7993973 7905704 8118619 8334131 8288990 8450513 8788273 8910766 8959646 9307177 9685837
3268I685837K98126M90939L57143O07969L30526L06769M90708M25076J50875J21975
$$ 9685837 9983963 10474902 10832045 11440014 11770540 12077309 12568017 12993093 13143968 13265943
3258A3265943J08308l46402l26435m71453n99814q81693n12443m99353o25377
$$ 13265943 13374251 13027849 12701414 12229961 11630147 10748454 10236011 9736658 9111281
3249I111281o62727n07786m32588l11851l18548j76372r2872j66057l04975k93256
$$ 9111281 8448554 7940768 7508180 7196329 6877781 6701409 6608537 6442480 6137505 5844249
3239E844249L8733p254o9154q9723j0039L8624L4569J69596o2921M9166j7547
$$ 5844249 5882982 5875728 5806574 5716851 5706812 5745436 5780005 5949601 5886680 5935846 5918299
3228E918299l16624k02807k84805k50246j44734P999q6832r4869m7855k54060
$$ 5918299 5601675 5398868 5114063 4863817 4719083 4727082 4640250 4545381 4497526 4243466
3218D243466j36703m1511J20012m3228q966R584J25097k34784k5195j807k3859
$$ 4243466 4106763 4065252 4185264 4142036 4133070 4142654 4267751 4032967 4007772 4005965 3982106
3207C982106J45300r9857J3201J13252N5951j5983N2488o1321J44403K29527J3115
$$ 3982106 4127406 4027549 4040750 4154002 4209953 4193970 4246458 4185137 4329540 4559067 4572182
3196D572182l11931r1126o7770j99720k34079K39760O2201O0874O5304j22284
$$ 4572182 4260251 4169125 4101355 3901635 3667556 3907316 3969517 4030391 4095695 3973411
3186C973411m3452j08138P1745j49517p7326j25733K68063j3187j01845p7820
$$ 3973411 3929959 3821821 3893566 3744049 3666723 3540990 3809053 3795866 3694021 3616201
3176C616201o4290O1026o7764L57093n612k07901J57464K46240M6453l7941L18341
$$ 3616201 3551911 3612937 3545173 3902266 3896654 3688753 3846217 4092457 4138910 4100969 4419310
3165D419310k46992k11454K73156J00565p2430n9407o5880n0650m7327k2262j0760
$$ 4419310 4172318 3960864 4234020 4334585 4262155 4202748 4136868 4086218 4038891 4016629 4005869
3154D005869k05277N381K7389J8896k8308M3657j35736K1391k8699r6024P6282
$$ 4005869 3800592 3805973 3833362 3852258 3823950 3867607 3731871 3753262 3724563 3628539 3704821
3143C704821j34565O708J54387l8300J25348L4284N5689K3732l784L9282N6248
$$ 3704821 3570256 3576964 3731351 3693051 3818399 3852683 3908372 3932104 3928320 3967602 4023850
3132D023850O2154R1177j3264j18645j89797L5211K15095k21801j94772N6542
$$ 4023850 4086004 4177181 4163917 4045272 3855475 3890686 4105781 3883980 3689208 3745750
3122C745750L1547K9274k16564j58257n3619j68733j36794n1900j09401J89793
$$ 3745750 3777297 3806571 3590007 3431750 3378131 3209398 3072604 3020704 2911303 3101096
3112C101096J01580k71942j5069J23800O1345l9415J6326j51686J366K6085j83060
$$ 3101096 3202676 2930734 2915665 3039465 3100810 3061395 3077721 2926035 2927401 2953486 2770426
3101B770426L87577k84664k20908J07804k61905J05501J33995R8464J16151K5085
$$ 2770426 3158003 2873339 2652431 2760235 2498330 2603831 2737826 2836290 2952441 2977526
3091B977526j27577j25108j84440J08403J00935k44913k19317l5522j2232n8362
$$ 2977526 2849949 2724841 2540401 2648804 2749739 2504826 2285509 2249987 2237755 2179393
3081B179393J15240j25579n1735J83834K76j55602j73710j32674O2042J30665
$$ 2179393 2294633 2169054 2117319 2301153 2301429 2145827 1972117 1839443 1901485 2032150
3071B032150j70068o8201q5363L1694L5853r1658n9643J24896P3163j59014j27866
$$ 2032150 1862082 1793881 1708518 1740212 1776065 1684407 1624764 1749660 1822823 1663809 1535943
3060A535943J55583Q4080j82940j55697L9465m8849P183O6945l9352r1284l4355
$$ 1535943 1691526 1775606 1592666 1436969 1476434 1427585 1434768 1501713 1462361 1371077 1336722
3049A336722J60225q0519k56101j3891p687m0459j34931j27641k7212R4314R3257
$$ 1336722 1496947 1416428 1160327 1146436 1138749 1098290 963359 835718 808506 902820 996077
3038I96077j65072N62o4055m8826k9973j4950P2173L7179j59095R6796L7706L65
$$ 996077 831005 831567 767512 718686 688713 673763 745936 783115 624020 720816 758522 758887
3026G58887l000j50186m7110J7932Q3858J59599j2256j67781k6444O3324k4544
$$ 758887 755887 605701 558591 576523 660381 819980 807724 639943 613499 676823 652279
3015F52279l04091k7369l8301K37823n604m4279r0073J44223J17185k50243N6794
$$ 652279 348188 320819 282518 520341 514737 470458 380385 524608 641793 391550 448344
3004D48344R5656J3869j7424P694Q0062j09667M7366m4845r2920R474P7643l7324
$$ 448344 544000 557869 540445 548139 628201 518534 565900 521055 428135 437609 515252 477928
2992D77928K8246N705J01048j95700n6429L23733m4863P973j0853o8919k22663
$$ 477928 506174 511879 612927 417227 360798 684531 639668 647641 636788 567869 345206
2981C45206L3995n398O3935j4956J13043l1580Q6828J8045P1128j35657j07601
$$ 345206 379201 373803 437738 422782 535825 504245 591073 609118 680246 544589 436988
2970D36988o7175k6001M4577Q936M0596M539q2839J50712l1784j3326j26821j13017
$$ 436988 369813 343812 388389 397325 437921 442460 359621 510333 478549 465223 338402 225385
2958B25385J36149J57577R0400j46525K634m8140L1309n619K20306K1137P0218
$$ 225385 361534 519111 609511 462986 465620 417480 448789 443170 663476 684613 754831
2947G54831k1790r306p4330K7014j81030k126l7629J32271K0127j66518J83660
$$ 754831 733041 723735 649405 676419 495389 493263 455634 587905 608032 441514 625174
2936F25174J48032j47112J75649j82122K2660O780l8650r399m3056J16452l6685
$$ 625174 773206 626094 801743 619621 642281 649061 610411 601012 557956 674408 637723
2925F37723K47897p4490R5736n0810J79881k7353j05372R2178O8369l9972J16018
$$ 637723 885620 811130 906866 856056 1035937 1008584 903212 995390 1063759 1023787 1139805
2914A139805n2488k26361j07412P1463n7080q6383k48176m9963J5760L24333p9980
$$ 1139805 1087317 860956 753544 825007 767927 681544 433368 383405 399165 723498 643518
2903F43518m33836J6004K69349O2522q1548M1799J01064j01522j46397P8161J5967
$$ 643518 209682 225686 495035 557557 476009 517808 618872 517350 370953 449114 465081
2892D65081J2667j67739P6339J6372K80381P4386l32069r0541P1630R6960K73011
$$ 465081 477748 310009 386348 402720 683101 757487 425418 334877 406507 503467 776478
2881G76478k37179j16815J9107M7111O4517L4020J84392l54224j7299r5575l3495
$$ 776478 539299 422484 441591 488702 553219 587239 771631 417407 400108 304533 271038
2870B71038o1780N6295j9928MJ04886j16986L5254k1774J21253J18295M0675l18039
$$ 271038 209258 265553 245625 245629 350515 233529 268783 247009 368262 486557 527232 209193
2858B09193j40693M3388P5856N9674L6986J13454j39067j9016P6521o9045j50586
$$ 209193 68500 111888 187744 247418 284404 397858 258791 239775 316296 247251 96665
2847I6665j76321K25205P1310o3927K9808L9997k73885J39183j6018Q305M058
$$ 96665 -79656 145549 216859 152932 182740 222737 -51148 88035 72017 80322 84380
2836H4380j53749o7546o676J67679N1582J18075M2883j59297q8146J02610N0879
$$ 84380 -69369 -136915 -143591 24088 75670 193745 236628 77331 -10815 91795 142674
2825A42674K05639j62218M0758L2337J00010l56549J4589J83271r4864P2632R326
$$ 142674 348313 186095 226853 259190 359200 2651 17240 200511 105647 178279 187605
2814A87605M1336k39198j2379j73778J70647R3196n6272M2553N362J30719j87542
$$ 187605 228941 -10257 -22636 -196414 -25767 67429 11157 53710 59072 189791 2249
2803B249J17785j43488O2725J77001o6155o0410J963n3987r5011j760J00995n781
$$ 2249 120034 -23454 39271 216272 150117 89707 91670 37683 -57328 -59088 41907 36126
2791C6126J62450K7170M9075p7628O2703j16298j46506Q4968j20038r0955O7192
$$ 36126 198576 225746 274821 197193 259896 143598 -2908 82060 -37978 -128933 -61741
2780f1741L34490l82800m7636K61508J27026k9898l6847j93587J98888M3668J10711
$$ -61741 272749 -110051 -157687 103821 230847 200949 164102 -29485 169403 213071 323782
2769C23782o5052l33386M7960q4109L0082L5654j62633p2736K04856J01104k20642
$$ 323782 258730 -74656 -26696 -110805 -80723 -45069 -207702 -280438 -75582 25522 -195120
2758a95120P9512N0947P8833o1855j98341J37353K44442j96266j41171J11139
$$ -195120 -115608 -64661 14172 -47683 -246024 -108671 135771 -60495 -201666 -90527
2748i0527N8827j2297O4767p6010j39854J02048o2761l1385K61492k549j53012
$$ -90527 -31700 -43997 20770 -55240 -195094 -93046 -155807 -187192 74300 71751 -81261
2737h1261J54322j34716J79060l9292j62217j74781r1540M9672J32841Q4517R819
$$ -81261 73061 -61655 117405 78113 -84104 -258885 -350425 -300753 -167912 -83395 -73576
2726g3576m3896P3708j14312j41253J19282o0579J26048K3594L4017j398j79273
$$ -73576 -117472 -43764 -158076 -299329 -180047 -240626 -114578 -90984 -56967 -58365 -237638
2715b37638K12778J4451o4830M02383k19033j66059j33323k1164K51J13826P1826
$$ -237638 -24860 -10409 -75239 327144 108111 -57948 -191271 -212435 -212184 -98358 -26532
2704b6532J65706J3539n7346j1227m2903k2334k67212Q7249l7649L4247j1781
$$ -26532 139174 152713 95367 84140 41237 18903 -248309 -161060 -198709 -164462 -176243
2693a76243L5996J01078j81954K04920m7724k66921P0043r1994R0145K66183J8386
$$ -176243 -140247 -39169 -221123 -16203 -63927 -330848 -260805 -352799 -262654 3529 21915
2682B1915j83597k1730J9546j33323K7337J95054r8838N1218J76709Q2953Q9956
$$ 21915 -161682 -183412 -163866 -297189 -269852 -74798 -173636 -122418 54291 137244 227200
2671B27200k74654j04333L5053J8128J30855m3168Q8526K43877k45414k49625
$$ 227200 -47454 -151787 -116734 -98606 32249 -10919 77607 321484 76070 -173555
2661a73555r684J70180K26557M571J0144j90123n1005n581J18177j08219j07646
$$ -173555 -183239 -13059 213498 218069 228213 38090 -12915 -18496 99681 -8538 -116184
2650a16184r1456K52652J12435J40452j80176j94618K01Q3948J7307q972O7479
$$ -116184 -207640 45012 157447 297899 117723 -76895 -76694 7254 24561 15589 83068
2639H3068M0094o433j59669P5637K9915o7675j47073J91376M1244J35539o9508
$$ 83068 123162 116729 -42940 32697 62612 -5063 -152136 39240 80484 216023 146515
2628A46515K2193m6460k39455j30997K4032J34247N7058J82560J16478j53324
$$ 146515 168708 122248 -117207 -248204 -224172 -89925 -32867 149693 266171 112847
2618A12847j42885N0212j11209k24571j863O7147J78437O4428p6671Q3076r295
$$ 112847 -30038 20174 -91035 -315606 -317469 -250322 -71885 -7457 -84128 -1052 -10347
2607a0347P6395l08388O6850K9444J00993L6522j01938J12042Q9901Q966r9874
$$ -10347 66048 -242340 -175490 -146046 -45053 -8531 -110469 1573 91474 100440 566
2596E66R5894l4790k06758Q5948J87167j2706L6634j6391j82219q188J86840j0807
$$ 566 96460 61670 -145088 -59140 128027 115321 151955 135564 -46655 -54843 131997 121190
2584A21190k12421J26623K31152o4481j97728j84753q491R402L2324K7140K3655
$$ 121190 -91231 35392 266544 202063 4335 -180418 -188909 -179507 -147183 -120043 -96388
2573i6388L9907P5359J09082R7907j13102m0290j12982j24087j08740O4104M8152
$$ -96388 -56481 18878 127960 225867 112765 72475 -40507 -164594 -273334 -209230 -161078
2562a61078Q4922n9447O0220L79611k15697k90525Q8228K8350p7833K0440J58350
$$ -161078 -76156 -135603 -75383 304228 88531 -201994 -113766 -85416 -163249 -142809 15541
2551A5541J4999p3703m6309N3004o6939N0578n6041J78191M5601K3719k45786
$$ 15541 30540 -43163 -89472 -36468 -103407 -52829 -108870 69321 114922 138641 -107145
2540a07145p2426L5774M5390J37632J25711q8336r9129J0881j8895o5092N72O4372
$$ -107145 -179571 -143797 -98407 39225 164936 76600 -22529 -11648 -30543 -95635 -95063 -30691
2528c0691j87233Q8401q4984N8009J012J09549L7270Q773L5030M5546p9661j25795
$$ -30691 -217924 -129523 -214507 -156498 -155486 -45937 -8667 106 35136 80682 1021 -124774
2516a24774J19555j11933R7442J68464J56951j55086j75580M9000j12528Q8128
$$ -124774 -5219 -117152 -19710 148754 305705 150619 -24961 24039 -88489 -361
2506c61L4744N3468j75059k22885K90964n8157o5225J80642R0855j61377j13058
$$ -361 34383 87851 -87208 -310093 -19129 -77286 -142511 38131 128986 -32391 -145449
2495a45449L8224M4326j03843j65808K12688k5757P6910J9763K9902K564O8442
$$ -145449 -107225 -62899 -166742 -332550 -119862 -145619 -68709 -48946 -19044 -16480 51962
2484E1962p56l803r3051k88641R9641J38490j68941q9311P7095N8971K979l0485
$$ 51962 51206 47403 -45648 -334289 -234648 -96158 -265099 -354410 -277315 -218344 -215365 -245850
2472b45850J92623k3641J15508J57805j76474j07369L11046J51378j51818j03749
$$ -245850 -53227 -76868 38640 196445 19971 -87398 223648 375026 223208 119459
2462A19459n1545l4960o2792m8517N2637R8474o1699N0029l8941j17428j01893
$$ 119459 67914 32954 -29838 -78355 -25718 72756 11057 61086 22145 -95283 -197176
2451a97176J86926N3050j57837K18295J2810M0172m3603J758J01604l481j34171
$$ -197176 -10250 42800 -115037 103258 116068 156240 112637 114395 215999 212518 78347
2440G8347j5196p6792j87831J15956n849O8627J22993j813j6877j32199j2519
$$ 78347 63151 -13641 -201472 -85516 -91365 -22738 100255 98442 81565 -50634 -63153
2429f3153K44039j5395r819j44389N845K96082L8103k80895m822N6751j07495
$$ -63153 180886 165491 155672 11283 17128 313210 351313 70418 65596 122347 14852
2418A4852j0603N3061j2435j03048K07382R4203k08662K64709n3189J09546j6464
$$ 14852 4249 57310 44875 -58173 149209 243412 34750 299459 246270 355816 339352
2407C39352j70584Q8530N8939j43072n1336K64410J23801j70069r0148m2836n7387
$$ 339352 168768 257298 316237 173165 121829 386239 510040 339971 249823 206987 149600
2396A49600j94023K9138K84036O325N7159K19528m0316q6614O9744J39756K91
$$ 149600 -44423 -15285 268751 275076 332235 551763 511447 424833 494577 634333 634624
2385F34624k3127l47689J9028j9293L7512q0730k15795P4526J31500J81221o7193
$$ 634624 611497 263808 282836 263543 301055 220325 4530 79056 210556 391777 324584
2374C24584j54141n453k3321J629Q0607L9226J3238m8500J38080m9913p9791j66250
$$ 324584 170443 164990 141669 143298 223905 263131 276369 227869 365949 316036 236245 69995
2362F9995L6627P8354J43282L5625j43580o3673P7374l8504O9129J60980j65122
$$ 69995 106622 184976 328258 363883 220303 156630 234004 195500 264629 425609 260487
2351B60487n7668n9911j39092N402O3711J36090k5704q9362M0713K06751j12644
$$ 260487 202819 142908 3816 9218 72929 209019 183315 93953 134666 341417 228773
2340B28773J3854N6855J12808j57548K2494R3909K0630r9863k6540l1077O6798
$$ 228773 242627 299482 412290 254742 277236 371145 391775 291912 265372 234295 301093
2329C01093r6555Q5109J25162J07938j74648j00481o8600J17679N9783j880p1277
$$ 301093 204538 289647 414809 522747 348099 247618 179018 296697 356480 354600 283323
2318B83323P4853Q0126k05648p160L3117Q5155J14815j17877J61384N6137j51000
$$ 283323 358176 438302 232654 225494 258611 343766 458581 340704 502088 558225 407225
2307D07225k8353k19043K02372l4304J16978j19298N757k9108j86813N7911K39727
$$ 407225 378872 159829 362201 327897 444875 325577 331334 302226 115413 173324 413051
2296D13051k2939j01771J49697J60978J5080k95525J29432J35649j27751N7186
$$ 413051 390112 288341 438038 599016 614096 318571 448003 583652 455901 513087
2286E13087l5604j51954J67609O4829K3277R2126q4884k50267K4210n9575P7723
$$ 513087 477483 325529 493138 557967 581244 673370 588486 338219 362429 302854 380577
2275C80577K6101L10926L3783n6429j1354j66265J25469J36310k0863p3898j32013
$$ 380577 406678 717604 751387 694958 683604 517339 642808 779118 758255 684357 552344
2264E52344O2903J50192k24891m2326J68830J02267p7069k432J17489j4242k02933
$$ 552344 615247 765439 540548 498222 667052 769319 692250 689818 807307 793065 590132
2253E90132J33241j07565q7709j25192j6067J2426Q0497J23257n2073j7614J26911
$$ 590132 723373 615808 528099 402907 386840 399266 479763 603020 550947 533333 660244
2242F60244J3039J27141R8411N6646l631N4676K8803K2581N108p8133p3784k7101
$$ 660244 673283 800424 898835 955481 951850 1006526 1035329 1057910 1063018 984885 911101 884000
2230H84000J70451K48709k06781o7293q2838P2307r1745j7817n7849K11245K02172
$$ 884000 1054451 1303160 1096379 1029086 946248 1018555 926810 908993 851144 1062389 1264561
2219A264561K2045j52173j28661M499K00239J56411J54000r5711j68183J53628
$$ 1264561 1286606 1134433 1005772 1010271 1210510 1366921 1520921 1425210 1257027 1410655
2209A410655K81063M6686J0737O4729o4642J13542R2264K66786O9118n0311n2091
$$ 1410655 1691718 1738404 1749141 1813870 1749228 1862770 1955034 2221820 2290938 2240627 2188536
2198B188536P7304R2808P3747L409m1735O516j48347L10936O1991M4703j6931
$$ 2188536 2265840 2358648 2432395 2435804 2394069 2400585 2252238 2563174 2625165 2669868 2652937
2187B652937K70243j12999L5348K58731K17808k83022l6887K21378o4270l985
$$ 2652937 2923180 2810181 2845529 3104260 3322068 3039046 3002159 3223537 3159267 3155282
2177C155282J6010J02736M0672n826n7031M31838k3735M0320J47139J25862L8442
$$ 3155282 3171292 3274028 3314700 3308874 3251843 3683681 3659946 3700266 3847405 3973267 4011709
2166D011709M4167j10061M3602K81506J99057K34581K66500Q0191K77247N3514
$$ 4011709 4055876 3945815 3989417 4270923 4469980 4704561 4971061 5051252 5328499 5382013
2156E382013L22177L05632M44387J67560J52550K97386N77785M51910K55151N20435
$$ 5382013 5704190 6009822 6454209 6621769 6774319 7071705 7649490 8101400 8356551 8876986
2146H876986O04795N73350Q43431N27042P83655R96946Q37837J078365J188812
$$ 8876986 9481781 10055131 10898562 11425604 12209259 13206205 14044042 15122407 16311219
2137A6311219J019179J335715J318915J227912J250428J822549K655417L145807
$$ 16311219 17330398 18666113 19985028 21212940 22463368 24285917 26941334 30087141
2129C0087141L854514M793698O010694P821313R650497J3454985J5067820J6249133
$$ 30087141 33941655 38735353 44746047 52567360 62217857 75672842 90740662 106989795
2121A06989795J6675990R302138j7237766l0591536k0342071j3195933q520276
$$ 106989795 123665785 132967923 115730157 85138621 64796550 51600617 43080341
2114D3080341o626092n034456l873572k435052k154957j723731j418134j087599
$$ 43080341 36454249 31419793 27546221 25111169 22956212 21232481 19814347 18726748
2106A8726748j148224j151289j680171j736233j287192p47695m60165n11477p38961
$$ 18726748 17578524 16427235 14747064 13010831 11723639 10975944 10515779 10004302 9265341
2097I265341m82076j33293l39074k65891l18774l84763k79440l23386l20039j42063
$$ 9265341 8783265 8649972 8310898 8045007 7726233 7341470 7062030 6738644 6418605 6276542
2087F276542l59740o9487J9127k71910k80749l08072j65904k30267l31477k28502
$$ 6276542 5916802 5847315 5866442 5594532 5313783 5005711 4839807 4609540 4278063 4049561
2077D049561j3255j49359l75060R407L1515l39630k02887j0500k3104j30587j35966
$$ 4049561 4036306 3886947 3511887 3521294 3552809 3213179 3010292 2999792 2976688 2846101 2710135
2066B710135N5853L5423k83253r4639j14216m4333l9711m0827p1786n202o9058
$$ 2710135 2765988 2801411 2518158 2423519 2309303 2264970 2225259 2184432 2112646 2107444 2038386
2055B038386o751k07837j9346r9700q4966J55990N1339j06443j2098j12486J61656
$$ 2038386 2031635 1823798 1804452 1704752 1619786 1775776 1827115 1720672 1708574 1596088 1757744
2044A757744M1463j87417j92006R4254j23898j73040O1527j70124J23572K5015
$$ 1757744 1799207 1611790 1419784 1514038 1390140 1217100 1278627 1108503 1232075 1257090
2034A257090M157L0466l08736L8229R3807L0360j61043L6225r2170k10265J68209
$$ 1257090 1261247 1291713 982977 1021206 1115013 1145373 984330 1020555 928385 718120 886329
2023H86329l125j10740j2445J51593n1712n3668P6311J06918l98564J569L5990
$$ 886329 883204 772464 760019 911612 859900 806232 882543 989461 590897 592466 628456
2012F28456j71288n1732p6863K24712J9866J26169j29110q6655K91109r9709n4261
$$ 628456 457168 405436 328573 553285 573151 699320 570210 483555 774664 674955 620694
2001F20694m6435r3441j31076J96391m0087k49941J60422O6905k9317k7322r559
$$ 620694 574259 480818 349742 546133 506046 256105 416527 483432 454115 426793 417234
1990D17234j0783R177k1823j19997r0163J88951O6111j4432j65148L129M7547
$$ 417234 406451 415628 393805 273808 183645 372596 438707 424275 259127 262256 309803
1979C09803l6242j51737n0433J46148j06598K0758j11353K22337K75748j28536
$$ 309803 273561 121824 71391 217539 110941 131699 20346 242683 518431 389895
1969C89895r6069k15918J54704q4045k7662J20768j56315N0834J29320k8151j40
$$ 389895 293826 77908 232612 148567 120905 241673 85358 136192 265512 237361 237221
1958B37221j8964n2415P7282j8874Q698j19440R2442k4200k45096J04827J34224
$$ 237221 218257 165842 243124 224250 232948 113508 205950 181750 -63346 41481 175705
1947A75705j07582J37139K8626o4856o4868J02055o393k02771M1019J52550j02727
$$ 175705 68123 205262 233888 169032 104164 206219 199826 -2945 38074 190624 87897
1936H7897M0498j70972R474K71275j41012j4706J99573L2819l14419j53727K62500
$$ 87897 128395 -42577 -33103 238172 97160 82454 282027 314846 427 -153300 109200
1925A09200m4238K7319j61510m4967j50814J90819m9670J24099J39273J06061
$$ 109200 64962 92281 -69229 -114196 -265010 -74191 -123861 238 139511 245572
1915B45572j84711n8537K40139l8764k24022j3539k53681K14337K51826k32309
$$ 245572 60861 2324 242463 203699 -20323 -33862 -287543 -73206 178620 -53689
1905e3689K9272N9989K03735p8497K2512j38086j39304k9061J15349R9894j25590
$$ -53689 -24417 35572 239307 160810 183322 45236 -94068 -123129 -7780 92114 -33476
1894c3476j60122O6809J57717J71700j3583P6124k35176p2086P8052O1720j8669
$$ -33476 -193598 -126789 30928 202628 189045 265169 29993 -42093 35959 97679 79010
1883G9010J80537j18513k8020q3843j14512J3758J2632n1927n7592L0991l0322
$$ 79010 259547 141034 113014 29171 -85341 -71583 -58951 -110878 -168470 -137479 -167801
1872a67801P1558P5458J2288N0138o9402o9566K52187M9877K01479R973j19004
$$ -167801 -96243 -20785 -8497 41641 -27761 -97327 154860 204737 406216 416189 297185
1861B97185N4225l599m2878J98052q4945k56767J69208N7839r644K11148l802
$$ 297185 351410 347811 304933 502985 418040 161273 330481 388320 378676 589824 586022
1850E86022j81604n0143O6101m3416j53854j23556l742L6835J36223P2625l19387
$$ 586022 404418 354275 420376 376960 223106 99550 95808 132643 268866 341491 22104
1839B2104m7482n0194J7062J31452j7340k95004K40062l6204k24149m0304r7038
$$ 22104 -25378 -75572 -58510 72942 55602 -239402 660 -35544 -259693 -299997 -397035
1828c97035J38006J0212J69253L90559j79681n0665M8988j88892k45064J90033
$$ -397035 -259029 -248817 -79564 310995 131314 80649 129637 -59255 -304319 -114286
1818a14286N4135P5743L3880J06940r2212j07042O8566j03586l0617M3478P0177
$$ -114286 -60151 15592 49472 156412 64200 -42842 25724 -77862 -108479 -65001 5176
1807E176j05024J18081J8376j42283O5892M1509r2540r63J42212n3782q0306N8463
$$ 5176 -99848 18233 36609 -105674 -39782 1727 -90813 -91776 50436 -3346 -83652 -25189
1795b5189N8621j9956o2415O3998Q0014R9693j65121R8358N7767j24762j63473
$$ -25189 33432 13476 -48939 15059 95073 194766 29645 128003 185770 61008 -102465
1784a02465J15035j5770j01489l325n7451p3167K54559K00936Q2356l948q7703
$$ -102465 12570 -3200 -104689 -108014 -165465 -238632 15927 216863 299219 295271 207568
1773B07568r2788k58412j25990Q4023K9124K6927j4082L7201L5166r121J6103
$$ 207568 114780 -143632 -269622 -185599 -156475 -129548 -143630 -106429 -71263 -80384 -64281
1762f4281j83206L3156Q6604K6310l4816L7102O1039n5089k26576J20215J50465
$$ -64281 -247487 -214331 -127727 -101417 -136233 -99131 -38092 -93181 -319757 -199542 -49077
1751d9077L70145J0218j73865l1698m9290Q2538m1571j51706N822q094k55600
$$ -49077 321068 331286 157421 125723 76433 158971 117400 -34306 -28484 -36578 -292178
1740b92178J02969K28651J20053j11788O5291N562k11088M62K41801P802j03926
$$ -292178 -189209 39442 159495 47707 112998 118560 -92528 -92066 149735 157537 53611
1729E3611k67518J69433m9637j27622j02849J10419j1122j02834m159J5783M5409
$$ 53611 -213907 -44474 -94111 -221733 -324582 -214163 -225285 -328119 -332278 -316495 -271086
1718b71086K65789R7745j81304o6329Q2207j21779K04029n4071k44328J64541
$$ -271086 -5297 92448 -88856 -155185 -72978 -194757 9272 -44799 -289127 -124586
1708a24586K38539n4029j39191J77629J18189l86409K14463K19343k81344o7968
$$ -124586 113953 59924 -79267 98362 216551 -169858 44605 263948 -17396 -85364
1698h5364O2494J26657j18110K2048j296K3524j49117J34469j23777Q6313K2218
$$ -85364 -22870 103787 -14323 7725 6429 29953 -119164 15305 -108472 -22159 59
1687E9p3585o3891j01818J50107n413j5890j6580R554k2673J23208L2621r5156
$$ 59 -73526 -137417 -239235 -89128 -94541 -110431 -127011 -117457 -140130 -16922 15699 -79457
1675g9457O1342m8894j2871J30521j27325j38054L9338J3165J76436N3299O7442
$$ -79457 -18115 -67009 -79880 50641 -76684 -214738 -175400 -162235 14201 67500 134942
1664A34942r8796j17420k04002R9787Q6133p8622q4778L3936L7117k8235j78743
$$ 134942 36146 -81274 -285276 -185489 -99356 -177978 -262756 -228820 -191703 -219938 -398681
1653c98681J43038M69828J28858j40665j57961K1702J2976P2514m2900j51045
$$ -398681 -255643 214185 343043 202378 44417 66119 79095 151609 108709 -42336
1643d2336m0434P4595J5116k53633m1810K39947J17285Q1984j0696r8170O7953
$$ -42336 -82770 -8175 6941 -246692 -288502 -48555 68730 150714 140018 41848 109801
1632A09801j04773M1239N0566j11143q8422m934J19121j50903J06146q6373p8452
$$ 109801 5028 46267 96833 -14310 -102732 -107666 11455 -139448 -33302 -119675 -198127
1621a98127J92671j14157q4612N7053m2921J31989N7197j10305o7642M1199R8173
$$ -198127 -5456 -119613 -204225 -147172 -190093 -58104 -907 -111212 -178854 -137655 -39482
1610c9482J66487j72057j9725J02958j44734J23575o4785J36061k1559J01572
$$ -39482 127005 -45052 -64777 38181 -106553 17022 -47763 88298 66739 168311
1600A68311j51615k45250j14508R2837L0457j59247q3299K65330J05822n1337
$$ 168311 16696 -228554 -343062 -250225 -219768 -379015 -462314 -196984 -91162 -142499
1590a42499K2257m7149j79854J44030J63475J26732M0158k69165O4079n5652l462
$$ -142499 -120242 -167391 -347245 -203215 -39740 86992 127150 -142015 -77936 -133588 -137050
1579a37050J10932r5244m8772j52419K31200N0518m4054R4650q8347P6237M8075
$$ -137050 -26118 -121362 -170134 -322553 -91353 -40835 -84889 9761 -78586 -2349 45726
1568D5726j6217M354J22862j86785N2073Q279J14851k70933R0384J07186J7184
$$ 45726 29509 33863 156725 -30060 22013 30292 145143 -125790 -35406 71780 88964
1557H8964j08947m7950K3172O0621O3256J04352j1357j66820r0226K8439j0446
$$ 88964 -19983 -67933 -44761 15860 79116 183468 172111 5291 -84935 -56496 -66942
1546f6942j65672l6667J04074j3455J46671O0629r3994m4570J05718j40781q018
$$ -66942 -232614 -269281 -165207 -178662 -31991 28638 -65356 -109926 -4208 -144989 -153007
1535a53007K14789O1466k06039m8036J48563k15986j12871K18307K23918j64524
$$ -153007 61782 123248 -82791 -130827 17736 -198250 -311121 -92814 131104 -33420
1525c3420j36438L8563K65251J23780q8836j85718M6142l6657j66637j32055p5460
$$ -33420 -169858 -131295 133956 257736 168900 -16818 29324 -7333 -173970 -306025 -381485
1514c81485J34462K00914L5653L6892M1245l0998j70902J45806J73606j43720
$$ -381485 -247023 -46109 -10456 26436 67681 36683 -134219 11587 185193 41473
1504D1473j36158M8069N6454j29509K79002n0234j05450n7135P6300J69023j48041
$$ 41473 -94685 -46616 9838 -119671 159331 109097 3647 -53488 22812 191835 43794
1493D3794M8636l2659o0639j12694J65009p2752j88117J09226K15508q8304J24682
$$ 43794 92430 59771 -868 -113562 51447 -21305 -209422 -100196 115312 27008 151690
1482A51690k1279K8665j29901j32490J18567Q0694J39193k93776o6048J73572
$$ 151690 130411 159076 29175 -103315 15252 95946 235139 -58637 -124685 48887
1472D8887j01046j08313L4673l3006J50051J32730q0428j94883j62936n701K16024
$$ 48887 -52159 -160472 -125799 -158805 -8754 123976 43548 -151335 -314271 -319972 -103948
1461a03948J7891j86260m7028J0142L20268J60836j0174j78379k8708J88688j07120
$$ -103948 -86057 -272317 -319345 -309203 11065 171901 161727 -16652 -45360 143328 36208
1450C6208J4649r2103k8645n6144Q035m8735Q1646K57727k22916P256N6496r3872
$$ 36208 50857 -41246 -69891 -126035 -118000 -166735 -85089 172638 -50278 -43022 13474 -80398
1438h0398n607Q3665j5237N0952P0809p2291J34694n3136L893k3535J2548k39985
$$ -80398 -86005 -2340 -17577 33375 104184 31893 166587 113451 117344 93809 106357 -133628
1426a33628L4930O8417O4744Q9868o0357J67559j09781j86275P4909K0226L4163
$$ -133628 -98698 -30281 34463 124331 63974 231533 121752 -64523 10386 30612 64775
1415F4775R4677j42739J43413k60035l4009J20354o6783m3402K91359K11873m75066
$$ 64775 159452 16713 160126 -99909 -133918 -13564 -80347 -123749 167610 379483 -95583
1404i5583k13514K04498Q4679J6643k3089K3311K1306J25089P6481j99503N5132
$$ -95583 -309097 -104599 -19920 -3277 -26366 -3055 18251 143340 219821 20318 75450
1393G5450L1038m4916j14675o4846j86825J45152l8130l7504J11329J89068J0312
$$ 75450 106488 61572 -53103 -117949 -304774 -159622 -197752 -235256 -123927 65141 75453
1382G5453j5020L7993q3207p8233K8265j1372J21093R1920k47220j72242J8681
$$ 75453 60433 98426 15219 -63014 -34749 -46121 74972 166892 -80328 -252570 -233889
1371b33889J60689j5960R6754J1100O9065j47414j06630P967J15049j7910P1548
$$ -233889 -73200 -89160 7594 18694 87759 -59655 -166285 -158318 -43269 -61179 10369
1360A0369J04861j4765j49490j61869J49097K06695r9323r1451q1114L28687j08588
$$ 10369 115230 100465 -49025 -210894 -61797 144898 45575 -45876 -126990 201697 93109
1349I3109k19646N6425k7254j22727p1895J80298k3103J52971l4590j4762P9709
$$ 93109 -126537 -70112 -97366 -220093 -291988 -111690 -134793 18178 -16412 -31174 48535
1338D8535m3264j89537p3377n222O0243L1018O2515P5345O3323R2100p683m370
$$ 48535 5271 -184266 -257643 -262865 -202622 -171604 -109089 -33744 29579 121679 113996 109626
1326A09626j17860r6211q7766L0550R2376Q5822r4319M0098k141k82302K15257
$$ 109626 -8234 -104445 -192211 -161661 -69285 16537 -77782 -37684 -39825 -322127 -106870
1315a06870J38978r7567L4066K5987n3986K322J47332K04837k85212j33388R6682
$$ -106870 32108 -65459 -31393 -5406 -59392 -57070 90262 295099 9887 -123501 -26819
1304b6819L1712J05760O2386k01387j64764J59115K6565o0424N7532J7347m9874
$$ -26819 4893 110653 173039 -28348 -193112 -33997 -7432 -67856 -10324 7023 -42851
1293d2851p1547o4832J9108J80833p2292Q6605J13804N4035j78220k5414J28088
$$ -42851 -114398 -179230 -160122 20711 -51581 35024 148828 202863 24643 -771 127317
1282A27317o812K3689N3625J10062j85496k57143J7457J22932K1355L8957P4336
$$ 127317 120505 144194 197819 307881 122385 -134758 -117301 5631 26986 65943 140279
1271A40279R3101J19029R6382l62885j06808n5371k5514J26166l4278j05760q3813
$$ 140279 233380 352409 448791 85906 -20902 -76273 -101787 24379 -9899 -115659 -199472
1260a99472K31604Q1842r8937J3529J767m4907j32015q1354J25101L41652k1316
$$ -199472 32132 113974 15037 28566 30333 -14574 -146589 -227943 -102842 238810 217494
1249B17494n8030j48728J23291o5496n9385J30891M302p2443j85243P351N1863
$$ 217494 159464 10736 134027 68531 9146 140037 144339 71896 -113347 -105996 -54133
1238e4133R3708P1049L020n6181p3859n6078o4109j07187R5184L22895J73119
$$ -54133 39575 110624 113644 57463 -16396 -72474 -136583 -243770 -148586 174309 347428
1227C47428k07954q5728o7573m180j14357O0214j57311K3654L5420J80008J35200
$$ 347428 139474 53746 -13827 -18007 -132364 -72150 -229461 -205807 -170387 9621 144821
1216A44821J13897j92125k83136J00138K6913o3298M6642K28824Q5176j18911
$$ 144821 258718 66593 -216543 -116405 -89492 -152790 -106148 122676 207852 88941
1206H8941k37617K75613Q711j29369l28587P5167L12762R2689k04273m6164M4447
$$ 88941 -148676 126937 135648 6279 -322308 -247141 65621 158310 -45963 -92127 -47680
1195d7680P9417q6886K4370O7687K3413K12673j29562l09243j2285J34088j11268
$$ -47680 31737 -55149 -30779 36908 60321 272994 143432 -165811 -178096 -44008 -155276
1184a55276p8599J41965R4202L3661O499p612K48757j39058j71953k00457j5326
$$ -155276 -233875 -91910 2292 35953 42452 34840 283597 144539 -27414 -227871 -243197
1173b43197J24744K07204Q3840j60599j02589l0917N9006K08m0432J5726M491
$$ -243197 -118453 88751 172591 11992 -90597 -121514 -62508 -62300 -102732 -87006 -82515
1162h2515k2991J55165j35473L0362J57693j57762j26139R2621K7889J0878L2038
$$ -82515 -105506 49659 -85814 -55452 102241 -55521 -181660 -89039 -61150 -50272 -18234
$$ [...]
##END NTUPLES=NMR SPECTRUM
##END=
