##TITLE=1H_EC-3264(8-2)
 CDCl3
 8 sc, 
 13.1.2022
##JCAMPDX= 6.0         $$ Bruker NMR JCAMP-DX V2.0
##DATA TYPE= NMR SPECTRUM
##DATA CLASS= NTUPLES
##ORIGIN= UXNMR, Bruker Analytische Messtechnik GmbH
##OWNER= root
$$ XWIN-NMR		Version 3.5
$$ Thu Jan 13 11:33:50 2022 Russian Standard Time (UT+4h)  she@DPX200
##.OBSERVE FREQUENCY= 200.131346
##.OBSERVE NUCLEUS= ^1H
##.ACQUISITION MODE= SIMULTANEOUS
##.ACQUISITION SCHEME= undefined
##.AVERAGES= 8
##.DIGITISER RES= 18
##SPECTROMETER/DATA SYSTEM= spect
##.PULSE SEQUENCE= zg30
##.SOLVENT NAME= D2O
##.SHIFT REFERENCE= (INTERNAL, D2O, 0, 15.7171)
##AUDIT TRAIL= $$ (NUMBER, WHEN, WHO, WHERE, WHAT)
$$ ##TITLE= Audit trail, XWIN-NMR		Version 3.5
$$ ##JCAMPDX= 5.01
$$ ##ORIGIN= Bruker BioSpin GmbH
$$ ##OWNER= she
$$ F:/spectra/data/she/nmr/H-F/1/pdata/1/auditp.txt
$$ ##AUDIT TRAIL=  $$ (NUMBER, WHEN, WHO, WHERE, WHAT)
(   1,<2022-01-13 11:31:43.21 +0400>,<she>,<DPX200>,
      <created by zg, POWCHK disabled, PULCHK disabled
       configuration hash MD5:
       00 E9 B6 7A A2 85 ED C7 34 08 36 98 17 FE 4E 26
       data hash MD5: 16K
       5D 32 1F EC BA DB AA C0 4A 70 73 8C 61 69 43 41>)
(   2,<2022-01-13 11:31:45.56 +0400>,<she>,<DPX200>,
      <Start of raw data processing
       efp BC_mod = 2 LB = 0.24 FT_mod = 6 PKNL = 1 PHC0 = -15863.8 PHC1 = 5.40079 SI = 16K 
       data hash MD5: 16K
       A0 66 C1 DA 72 55 3F 16 BE D4 E2 23 AB AA 4F BD>)
(   3,<2022-01-13 11:32:00.07 +0400>,<she>,<DPX200>,
      <pk PHC0 = -2.740736 PHC1 = 7 
       data hash MD5: 16K
       88 E3 4B D5 61 C0 92 40 75 41 6A FE 82 4A 34 0F>)
(   4,<2022-01-13 11:32:03.25 +0400>,<she>,<DPX200>,
      <abs ABSG = 5 
       data hash MD5: 16K
       7C DF E1 7A C1 9D B4 58 23 C9 48 5A C3 7B B4 52>)
(   5,<2022-01-13 11:32:30.56 +0400>,<she>,<DPX200>,
      <abs ABSG = 5 
       data hash MD5: 16K
       54 68 C3 D7 50 9A 1A 02 46 14 4B 8C 70 86 8D D5>)
$$ ##END=
$$ 
$$ hash MD5
$$ 66 84 BF C2 5D 17 0E E1 9C 62 E4 3B 56 B5 59 81
##$RELAX= 
##$RELAX= 
##$RELAX= 
##$RELAX= 
##$RELAX= 
##$RELAX= 
$$ Bruker specific parameters
$$ --------------------------
##$DU= <F:/spectra>
##$EXPNO= 1
##$NAME= <H-F>
##$PROCNO= 1
##$TYPE= <nmr>
##$USER= <she>
##$AMP= (0..31)
100 100 100 100 100 100 100 100 100 100 100 100 100 100 100 100 100 100 
100 100 100 100 100 100 100 100 100 100 100 100 100 100 
##$AQSEQ= 0
##$AQ_mod= 1
##$AUNM= <au_zg>
##$AUTOPOS= <>
##$BF1= 200.13
##$BF2= 200.13
##$BF3= 200.13
##$BF4= 200.13
##$BF5= 200.13
##$BF6= 200.13
##$BF7= 200.13
##$BF8= 200.13
##$BYTORDA= 1
##$CFDGTYP= 0
##$CFRGTYP= 5
##$CHEMSTR= <none>
##$CNST= (0..31)
1 1 145 1 1 1 1 1 1 1 1 1 1 1 1 1 1 1 1 1 1 1 1 1 1 1 1 1 1 1 1 1 
##$CPDPRG= <>
##$CPDPRG1= <>
##$CPDPRG2= <>
##$CPDPRG3= <>
##$CPDPRG4= <mlev>
##$CPDPRG5= <mlev>
##$CPDPRG6= <mlev>
##$CPDPRG7= <mlev>
##$CPDPRG8= <mlev>
##$CPDPRGB= <>
##$CPDPRGT= <>
##$D= (0..31)
0 1.2 0 0 0 0 0 0 0 0.06 0 0.03 0 0 0 0 0.0002 0 0 0 0 0 0 0 0 0 0 0 0 
0 0 0 
##$DATE= 1642059102
##$DBL= (0..7)
$$ [...]
##$SUBNAM2= <"">
##$SUBNAM3= <"">
##$SUBNAM4= <"">
##$SUBNAM5= <"">
##$SUBNAM6= <"">
##$SUBNAM7= <"">
##$SUBNAM8= <"">
##$SUBNAM9= <"">
##$SW= 18.0517287032376
##$SWIBOX= (0..15)
0 0 2 0 0 0 0 0 0 0 0 0 0 0 0 0 
##$SW_h= 3612.71676300578
##$TD= 16384
##$TD0= 1
##$TE= 0
##$TE2= 300
##$TE3= 300
##$TEG= 300
##$TL= (0..7)
0 120 120 120 120 120 120 120 
##$TP= (0..7)
150 150 150 150 150 150 150 150 
##$TP07= 0
##$TPNAME0= <>
##$TPNAME1= <>
##$TPNAME2= <>
##$TPNAME3= <>
##$TPNAME4= <>
##$TPNAME5= <>
##$TPNAME6= <>
##$TPNAME7= <>
##$TPOAL= (0..7)
0.5 0.5 0.5 0.5 0.5 0.5 0.5 0.5 
##$TPOFFS= (0..7)
0 0 0 0 0 0 0 0 
##$TUNHIN= 0
##$TUNHOUT= 0
##$TUNXOUT= 0
##$USERA1= <user>
##$USERA2= <user>
##$USERA3= <user>
##$USERA4= <user>
##$USERA5= <user>
##$V9= 5
##$VALIST= <valist>
##$VCLIST= <CCCCCCCCCCCCCCC>
##$VD= 0
##$VDLIST= <DDDDDDDDDDDDDDD>
##$VPLIST= <PPPPPPPPPPPPPPP>
##$VTLIST= <TTTTTTTTTTTTTTT>
##$WBST= 1024
##$WBSW= 4
##$XGAIN= (0..3)
0 0 0 0 
##$XL= 0
##$YL= 0
##$YMAX_a= 125209
##$YMIN_a= -177533
##$ZGOPTNS= <>
##$ZL1= 120
##$ZL2= 120
##$ZL3= 120
##$ZL4= 120
##$ABSF1= 15.71714
##$ABSF2= -2.334709
##$ABSG= 5
##$ABSL= 3
##$ALPHA= 0
##$AQORDER= 0
##$ASSFAC= 0
##$ASSFACI= 0
##$ASSFACX= 0
##$ASSWID= 0
##$AUNMP= <proc_1d>
##$AZFE= 0.1
##$AZFW= 0.1
##$BCFW= 0
##$BC_mod= 2
##$BYTORDP= 0
##$COROFFS= 0
##$CY= -3
##$DATMOD= 1
##$DC= 0
##$DFILT= <>
##$DTYPP= 0
##$F1P= 0
##$F2P= 0
##$FCOR= 1
##$FTSIZE= 16384
##$FT_mod= 6
##$GAMMA= 0
##$GB= 0
##$INTBC= 1
##$INTSCL= 0
##$ISEN= 128
##$LB= 0.24
##$LEV0= 0
##$LPBIN= 0
##$MAXI= 10000
##$MC2= 0
##$MEAN= 0
##$ME_mod= 0
##$MI= 1.114404
##$NCOEF= 0
##$NC_proc= -7
##$NLEV= 6
##$NOISF1= 3.799351
##$NOISF2= 2.8
##$NSP= 0
##$NTH_PI= 0
##$NZP= 0
##$OFFSET= 15.71714
##$PC= 1
##$PHC0= -15866.54
##$PHC1= 12.40079
##$PH_mod= 1
##$PKNL= yes
##$PPARMOD= 0
##$PSCAL= 0
##$PSIGN= 0
##$REVERSE= no
##$SF= 200.130006887804
##$SI= 16384
##$SIGF1= 3
##$SIGF2= 2
##$SINO= 5.538805
##$SIOLD= 16384
##$SREGLST= <1H.CDCl3>
##$SSB= 0
##$STSI= 16384
##$STSR= 0
##$SW_p= 3612.71676300578
##$SYMM= 0
##$S_DEV= 0
##$TDeff= 16384
##$TDoff= 0
##$TI= <>
##$TILT= no
##$TM1= 0
##$TM2= 0
##$TOPLEV= 0
##$USERP1= <user>
##$USERP2= <user>
##$USERP3= <user>
##$USERP4= <user>
##$USERP5= <user>
##$WDW= 1
##$XDIM= 16384
##$YMAX_p= 345529778
##$YMIN_p= -1836319
$$ End of Bruker specific parameters
$$ ---------------------------------
##NTUPLES= NMR SPECTRUM
##VAR_NAME=  FREQUENCY,     SPECTRUM/REAL,   SPECTRUM/IMAG
##SYMBOL=    X,             R,               I
##VAR_TYPE=  INDEPENDENT,   DEPENDENT,       DEPENDENT
##VAR_FORM=  AFFN,          ASDF,            ASDF
##VAR_DIM=   16384,         16384,           16384
##UNITS=     HZ,            ARBITRARY UNITS, ARBITRARY UNITS
##FACTOR=    0.220516191357247, 1,           1
##FIRST=     3145.47137603307, 0,            0
##LAST=      -467.24538697271, 0,            0
##MIN=       -467.24538697271, -1836319,     0
##MAX=       3145.47137603307, 345529778,    0
$$ Real data points
##PAGE= N=1
##DATA TABLE= (X++(R..R)), XYDATA
$$ [...]
7168H93145o5781J55939n7887L5044q540N1327q3073J18914K1502K05864M1981
7157A308435L6022M5658L7510J3994l4054J29695J97669n2201j98810K67398K3002
7146A774318O8720L6738k3600K41815J12124k41074M749J02480J82264O449K16881
7135B481864l499j06215J62698Q0841o4571J5887J82301R3845R9588O9858K15299
7124C227896J03030k2496P8886m8287R8295K22172K71953J89242J96824P9589
7114D397104K05157L40626K20902L99455L86623M42773M45822L25546J74072L63384
7104G701464O42516N34358L29425M09792N36494N51644R45654J031005J050931
7095A3733283J180655R92053J282140J749818K327937L115203L698705N106263
$$ y = [893145, 827364, 983303, 925416, 960460, 951920, 1003247, 920174, 1039088, 1060590, 1266454, 1308435, 1344457, 1390115, 1427625, 1441619, 1407565, 1537260, 1734929, 1682728, 1483918, 1751316, 1774318, 1843038, 1879776, 1856176, 2097991, 2210115, 1969041, 1973790, 2076270, 2258534, 2264983, 2481864, 2478365, 2372150, 2534848, 2615689, 2551118, 2567005, 2749306, 2843151, 2942739, 3012597, 3227896, 3330926, 3308430, 3387316, 3339029, 3437324, 3659496, 3931449, 4120691, 4317515, 4397104, 4602261, 4942887, 5163789, 5563244, 5949867, 6392640, 6838462, 7164008, 7338080, 7701464, 8343980, 8878338, 9207763, 9617555, 10154049, 10705693, 11651347, 12682352, 13733283, 14913938, 15905991, 17188131, 18937949, 21265886, 24381089, 28079794, 33186057]
7087C3186057O424176Q139198J0057555J1407995J2430245J0757761O129082j366647
7079I7165422q297827j3104392j4398147j2393139q986912o311179m728237l335756
7071B5609833k574519k147426j646400j403233j092419j092437r83915p13795
7063A3955689q89470j050383q16631o39030o44554o12637l65097n54409n15848
7054G867630n44424l95614m7352j76792J71181j57007j32271K5784J3181R7195
7044F721511L69683J63449J8141J78762J99796j04353k03300L0577L93702M80026
7034H247994R06717O47151L57449j19833l23225q05845j210155j062258p33931
7025E904064n74601m74818m21975j05662k94442l68864j19258P8850L7444k62014
$$ y = [33186057, 39610233, 47749431, 57806986, 69214981, 81645226, 92402987, 98532069, 97165422, 88867595, 75763203, 61365056, 48971917, 39985005, 33673826, 28945589, 25609833, 23035314, 20887888, 19241488, 17838255, 16745836, 15653399, 14669484, 13955689, 13066219, 12015836, 11199205, 10560175, 9915621, 9302984, 8937887, 8383478, 7867630, 7323206, 6927592, 6880240, 6703448, 6874629, 6717622, 6585351, 6611135, 6624316, 6721511, 7091194, 7254643, 7272784, 7451546, 7651342, 7546989, 7343689, 7374266, 7767968, 8247994, 9154711, 9801862, 10159311, 10039478, 9716253, 8910408, 7700253, 6637995, 5904064, 5329463, 4854645, 4432670, 4327008, 4032566, 3663702, 3544444, 3623294, 3660738, 3398724]
7015C398724K7898j04685j03622p7933j40642k02640k5723J21515L40120K30412
7005C463424N4200J32808R1583N02750M92879K95433L05637L23638j98554k18050
6995E245748k45144j86227m81235m55343M3762o1459j84737k9507P2389p2464
6985C645783R5982p6418m16291k19436J6846R787j98999j35051j62446n8799L2346
6974B533304K87158J16924p9785J86628J86038o0563o6887J03735j21600j36964
6964B947988k7863j73676k93575j55960j58042j83410j9365K8968j70439k12397
6954A582229l50192p1276R3295M5276n8118K1384q1276O8999j93799P5261J40204
6943A271987k02947p3231l3377l5754n6608j29594O3290j6838R677m5946k64790
$$ y = [3398724, 3426622, 3321937, 3218315, 3140382, 2999740, 2797100, 2771377, 2892892, 3233012, 3463424, 3517624, 3650432, 3742015, 4244765, 4737644, 5033077, 5338714, 5662352, 5463798, 5245748, 5000604, 4814377, 4333142, 3877799, 3921561, 3860102, 3675365, 3645858, 3718247, 3645783, 3741765, 3665347, 3249056, 3029620, 3046466, 3056253, 2857254, 2722203, 2559757, 2500958, 2533304, 2820462, 2937386, 2857601, 3044229, 3230267, 3169704, 3102817, 3206552, 3084952, 2947988, 2920125, 2746449, 2452874, 2296914, 2138872, 1955462, 1936097, 1965065, 1794626, 1582229, 1232037, 1160761, 1254056, 1299332, 1241214, 1262598, 1181322, 1250321, 1056522, 1131783, 1271987, 1069040, 995809, 962432, 926678, 870070, 740476, 803766, 786928, 796605, 750659, 485869]
6932D85869k0185K24724j72921P5905L5354K0492n9671J4442K8217j20990k33511
6921B77725P3803l077L4620p8055K34929m0623o4841J18312m0340l01740p4695
6910A36018Q0938J27646J0458k49009J16758M3584J14805k21316k7606J07748
6900B40024j13690Q2242J51785N401J82253o9644k54213l9349M3128o3926j5703
6889A48308n1989J24818P3706l2844j22528L216J12243J13980j90968L81N4376
6878B32699j4228O5921j112r1082j02388m3355Q2271j64136R9208J2880O2163
6867A38841j14017j97871R0448J47148K25317j03151O8456L0955p3021j9003q1464
6856A12638l2576o4919j76999L23540L6463j77308k0339o2472m8540N0737j37678
$$ y = [485869, 465684, 690408, 517487, 593392, 628746, 649238, 589567, 604009, 632226, 511236, 277725, 351528, 348451, 383071, 305016, 539945, 499322, 434481, 552793, 512453, 210713, 136018, 216956, 344602, 355060, 106051, 222809, 266393, 381198, 159882, 132276, 240024, 126334, 208576, 360361, 365762, 548015, 478371, 224158, 184809, 227937, 164011, 148308, 96319, 221137, 294843, 261999, 139471, 142687, 254930, 368910, 177942, 178323, 232699, 218471, 284392, 283280, 192198, 89810, 46455, 128726, -35410, 63798, 76678, 138841, 24824, -173047, -82599, 64549, 289866, 186715, 255171, 286126, 213105, 194102, 112638, 80062, 15143, -161856, 161684, 198147, 20839, 500, -61972, -110512, -59775, -197453]
6845a97453P563J42109J5120K06027n749r0182J65274j03384N1032j90832j93537
6834a94012r779J02050J71215L9333L4525p7104P1099j50645l9644J74493q5387
6823C6144m4166J76893J23638M1j54354J41288K02338k30459r2779K02549j46657
6812B14476j14703j35861J03571j08493K54321R1382j79542j16547J86181l8769
6802A56016r2992j3884j09006J82765R0224j3023J14060J22237q4338l17435N2431
6791H7055k238j34252N0549N3343q5339R4497q6174r2334j49474J80157P1858
6780a2352J59900Q7979m1999j75866J6011m540K8170j29864l2123L56303r6783
6769A54836j50278j8697K0545j08409K00413p5327j14070J01229n4826J08394
$$ y = [-197453, -189890, -47781, -32661, 173366, 167617, 77435, 242709, 139325, 190357, -475, -194012, -203791, -101741, 69474, 108807, 143332, 66228, 137327, -13318, -52962, 121531, 36144, -8022, 168871, 292509, 292550, 138196, 279484, 481822, 251363, 158584, 361133, 214476, 99773, -36088, 67483, -41010, 213311, 304693, 125151, 8604, 194785, 156016, 63024, 49140, -59866, 122899, 213123, 200100, 314160, 436397, 352059, 34624, 87055, 84817, -49435, 1114, 54457, -30882, 63615, -22559, -114893, -264367, -84210, -12352, 147548, 235527, 193528, 17662, 33673, 29133, 57303, -72561, -104684, 251619, 154836, 4558, -14139, 6406, -102003, 98410, 23083, -90987, 10242, -44584, 63810]
6759F3810l6813j89967Q289R310J10721J17809j425j9913P6990j27988m3884k6087
6747e9148Q7318k8555r613m9359P5022O5988L8649L3237Q9403j58353o8331K2500
6735C8758o8115j82537J39920J60822J94769k34547P4329j63925K1594l7116L1597
6724b4451J4182J15427L3389j13931K58217n4571o2469j08308Q481J07508k6921
6713A46553j95899j5053P7175P498J02781j23966O7200K03947j71476k5415L0707
6702A04052K7773R5414l97320r2902J65580J07172J29789j55604J12059J88485
6692B84498p152J34564j45945O4910J21525J21111k50618j6204K56128J45475
6682G08292q2880J9680j05178p8213K7719j71699J72506l9557k03941j83032J20233
$$ y = [63810, 26997, -162970, -154681, -145371, -34650, 83159, 81734, 61821, 138811, 10823, -33061, -59148, 28170, -385, -9998, -59357, 15665, 81653, 120302, 153539, 242942, 84589, 16258, 38758, -29357, -211894, -71974, 88848, 283617, 49070, 123399, -40526, -18932, -56048, -24451, -10269, 105158, 138547, 24616, 282833, 228262, 165793, 57485, 65966, 173474, 146553, -49346, -64399, 12776, 20274, 123055, -911, 66289, 270236, 98760, 73345, 104052, 131825, 227239, -170081, -262983, -97403, 9769, 139558, -16046, 96013, 284498, 277346, 411910, 265965, 330875, 452400, 573511, 322893, 306689, 562817, 708292, 625412, 645092, 539914, 461701, 489420, 317721, 490227, 450670, 246729, 63697, 183930]
6671A83930Q8568Q0194j10202j22299J26901p3800k74639l2096O8612J43540J55724
6660B34433n3415N4675J76332k9392j72820n8359J77114r4029j6803J5754k5753
6649B07737j03961l9139j47801O7161J59709K02136q7627k23943R415J84984L4666
6638B63337L1458q6894j91021j04590K90203l4616o887k1793J81100J49559n2688
6627D17168m8609k02285j54921K3847J16870K44913o7645k10154j45616J89347
6617A62915m9174n1041J60200O5180k34196L1215J55734l13563J69729N3418J06352
6606B56769k27430J45838K71478m6244j37397j11657j11919n3846J26780J3948
6596A26320J02375N2563M3814J88117J14782k87766l7463j13986o9013J66576
$$ y = [183930, 272498, 352692, 242490, 120191, 247092, 173292, -101347, -133443, -64831, 78709, 234433, 181018, 235693, 412025, 382633, 209813, 151454, 328568, 234539, 217736, 233490, 207737, 103776, 64637, -83164, -16003, 143706, 345842, 258215, 34272, 43687, 228671, 263337, 294795, 207901, 16880, -87710, 202493, 167877, 160990, 139197, 320297, 469856, 417168, 368559, 166274, 11353, 35200, 152070, 396983, 329338, 119184, -26432, 162915, 113741, 62700, 222900, 288080, 53884, 85099, 240833, -72730, 96999, 150417, 256769, 29339, 175177, 446655, 400411, 263014, 151357, 39438, -14408, 112372, 126320, 228695, 281258, 325072, 513189, 627971, 340205, 302742, 188756, 119743, 286319]
6586B86319J3606k01927M0939r0935J87595l6596J67560J59734M87l2883k49215
6575B44684J5943J24034K6185j0956J29648L8207L130k13915K03774j92264j64265
6564B04205j24558J06897K09606r6419k4107O9078P5306L7196o8450j6860j77391
6553A94503m7481K9656l0605R9951j4125j60761J93158Q6393J4254p9307o4387
6542B21249J43592o5853J35958J14619j04632j21416j09593J07789l6734N4569
6532C39548L4668j56704Q0749M6145o345j20021j35545J85970q7016M0314M9996
6521B71759J02159q7601J8649M0100N1464L1584j46556q181o0330K05336R1995
6510E10378j56360j93488m1327L1093J56549J30633j43586j86476O1608q2301
$$ y = [286319, 299925, 97998, 138937, 48002, 235597, 199001, 366561, 526295, 526782, 493899, 244684, 260627, 384661, 410846, 399890, 529538, 567745, 570875, 356960, 560734, 368470, 204205, 79647, 186544, 396150, 299731, 275624, 344702, 420008, 457204, 388754, 371894, 194503, 147022, 176678, 146073, 246024, 231899, 71138, 264296, 350689, 364943, 285636, 221249, 364841, 298988, 434946, 549565, 444933, 323517, 213924, 321713, 284979, 339548, 374216, 217512, 298261, 344406, 338061, 218040, 82495, 268465, 181449, 221763, 271759, 373918, 286317, 304966, 345066, 396530, 428114, 281558, 273377, 213047, 418383, 510378, 354018, 160530, 119203, 150296, 306845, 437478, 293892, 107416, 169024, 86723]
6500H6723o405K03063q4618q9320o4656K71856j23281K239R9859o8648N5427J03764
6488C86003J751j14775j21309K52751O846m3868J7799k28143k4731J97161R0514
6477D19999l36995R0463n5575j76412J11063J3502k0660q4895P4038J46485K7229
6466B08242j96815o8171J91239l3312j5032j01528J14954J20474p4042k17693
6456g1684J90694k8872K930m6722o5225J84925Q3938j0654j94017j24903j2325
6445i1915J51055J21773n4377J05003j89676j95606O6998J23048n0713Q7555N1835
6434A24980J0365J4548j32010J02367J18834n2586j17756n2977o7495J22128R7896
6423A68294Q139k02879J00824J03628J13999j42292q4623J01906N5264P8089j56074
$$ y = [86723, 80318, 283381, 198763, 109443, 44787, 316643, 193362, 195601, 295460, 226812, 282239, 386003, 387754, 272979, 151670, 404421, 411267, 367399, 385198, 157055, 132324, 329485, 419999, 83004, 173467, 117892, -58520, 52543, 66045, 45385, -39510, 34528, 181013, 208242, 11427, -56744, 134495, 101183, 86151, -15377, 99577, 220051, 146009, -71684, 119010, 90138, 93068, 46346, -18879, 166046, 249984, 239330, 45313, -79590, -91915, 59140, 180913, 126536, 231539, 41863, -153743, -86745, 36303, -14410, 73145, 124980, 135345, 149893, 17883, 120250, 239084, 186498, 68742, 15765, -51730, 70398, 168294, 176433, -26446, 74378, 178006, 292005, 149713, 65090, 166996, 222260, 300349, 144275]
6412A44275j67746J27477J60980j56018j60972J72387J09404p9946l1928J35292
6402B53205j6850j47888L76335k87165r4284J37228j35631j5411J27327q8694
6392A08172Q293O4285q8547r9376M4523q6138R2466J739P6678j22425r170P6158
6380F6658j72266J42326R2226j20441J89510k58950N5626K35934r9153P1657r4916
6369A08211M9788O3753j7086j03119l5651K8227K56229q4972j83242p2146L3364
6358D3356r2787J61888K6857p6647J9989n9952J15983J69381q3476o7373j45242
6347A1977j63110J65892N1248o5956L6655k31199J3771M2800K0713J02465R9456
6336H4712k26653N6269J05433P1914J00757j33965J16844l6394k71236m7117j04207
$$ y = [144275, -23471, 104006, 264986, 108968, -52004, 120383, 229787, 149841, 117913, 253205, 236355, 88467, 464802, 177637, 83353, 220581, 84950, 69539, 196866, 108172, 116465, 180750, 92203, -7173, 37350, -48788, 43678, 45417, 122095, -330, -9500, 66658, -105608, 36718, 128944, 8503, 198013, -60937, -5311, 230623, 131470, 203127, 108211, 157999, 221752, 204666, 101547, 65896, 94123, 350352, 265380, 82138, 9992, 43356, -49431, 112457, 139314, 62667, 82656, 22704, 138687, 308068, 224592, 157219, 11977, -151133, 14759, 66007, 51, 36706, -194493, -180722, -137922, -117209, -14744, 84712, -141941, -85672, 19761, 91675, 192432, 58467, 175311, 138917, -132319, -179436, -283643]
6325b83643Q1072K27710J19243K4486j9833P6076n1331j62361j01584n1781J48279
6314F333O4427j57644J13844j68300N7276K47657k45845m0057J43909l104K665
6303B1161o9745M5465K0625l4931J58147J35675j61116L1707J31163j12142q7145
6292G8864n2553m0955J2446K15492M7210k59582N1357j8807J36576j34330l9607
6281c889J63051Q9325j11234Q0662m207R8477J47156n6145j78965r3109k7115
6270A04007k31465L6236J98891J60692j35873J70303j40928n3612n1842k5423
6260C0986j84908j54680J89158K41546J25553N7829k66622m8622P8485K0676m6457
6249D2944j10989M0778K33274l00530k6632R9485J57951K57994j10355l04478
$$ y = [-283643, -202571, 25139, 144382, 168868, 149035, 225111, 173780, 11419, -90165, -141946, 6333, 70760, -86884, 26960, -141340, -84064, 163593, -82252, -122309, 21600, 18496, 21161, -48584, -3119, 17506, -17425, 140722, 276397, 115281, 146988, 278151, 166009, 78864, 26311, -14644, -2198, 213294, 260504, 922, 52279, 33472, 170048, 35718, -3889, 159162, 248487, 137253, 217915, 213708, 312185, 459341, 403196, 224231, 131122, 104007, -127458, -91222, 107669, 268361, 132488, 302791, 161863, 108251, 56409, 30986, -153922, -308602, -119444, 122102, 247655, 305484, 38862, -9760, 68725, 89401, 42944, -68045, -27267, 206007, -94523, -121155, -21670, 136281, 394275, 283920, -20558]
6239b0558J76159R9920k04956j38295O3897N3046j7834K44850j38272p4613J13728
6228A57072O9526k10744N0272m929J06247K62095k11987L4245l4089j66226L01102
6217C52584k37662q4879K5004J71817P8273m8771l8108L288j7397J37430l11994
6206B9585J17242j5442j08041J17840K39804q3127q0215n6278r9262J58717n0984
6195A69839j18398j8794p669J11643J14423j49257O3717J65584p7443j8076P8375
6184C13944P7916J76327j41756J4761j64888o2617k911J52567J60537k0042l5676
6173D68162P0994J51336o4859l7419P0961j44810l395r1385o6503J41211L103
6162D97396n7267J03102j8775j1783m9258M8207j31284M1993K08455j26987p71
$$ y = [-20558, 155601, 255521, 50565, -87730, -23833, 29213, 11379, 256229, 117957, 43344, 157072, 226598, 15854, 66126, 61197, 167444, 429539, 217552, 251797, 217708, 51482, 352584, 114922, 30043, 55047, 226864, 305137, 256366, 218258, 221546, 204149, 341579, 29585, 146827, 131385, 23344, 141184, 380988, 297861, 217646, 161368, 62106, 220823, 169839, 51441, 32647, 24978, 136621, 251044, 101787, 165504, 331088, 253645, 235569, 313944, 391860, 568187, 426431, 441192, 276304, 213687, 210776, 363343, 523880, 503838, 468162, 539156, 690492, 625633, 588214, 659175, 514365, 510970, 419585, 353082, 494293, 497396, 440129, 543231, 524456, 512673, 463415, 511622, 380338, 422331, 630786, 503799, 503028]
6151E03028K48761k0413J628M6236q7261R1097J17331N1026m9479r0064r826P235
6139H09299P0854j53732j87802j24347Q0654O9606J21817j66684j04613K08442
6129F23494j64442J13524j67416P6654L3020r8017k23111J35757K80772j02R5176
6118G05309j63171q5522K32195n356m0124J43751j5338l25474j36394l8510l4969
6107B36397J35932J15102k1338o8830k2667q6636q5451K33459O6093o0651O188
6096D47598j5712j3499K4669J784R7838o4698R8586N4644j79339J15254j25836
6085D41289r1655J49854m3608q1883Q4886r2279J63843N5582J7674q6286k29487
6074B87930K9861j36978J40776Q0104j4992m0700O8761J86928O918k5872j64036
$$ y = [503028, 751789, 731376, 733004, 779240, 691979, 783076, 900407, 951433, 901954, 811890, 802064, 809299, 880153, 726421, 538619, 414272, 494926, 564532, 686349, 519665, 415052, 623494, 459052, 572576, 405160, 481814, 514834, 416817, 193706, 329463, 610235, 610133, 705309, 542138, 456616, 688811, 683455, 643331, 787082, 771744, 446270, 309876, 271366, 236397, 372329, 487431, 466093, 397263, 374596, 287960, 202509, 435968, 502061, 441410, 447598, 431886, 418387, 443056, 444840, 542678, 477980, 576566, 631210, 451871, 567125, 441289, 349634, 499488, 455880, 373997, 458883, 366604, 530447, 586029, 603703, 517417, 287930, 317791, 180813, 321589, 401693, 386701, 346001, 414762, 601690, 608608, 582736, 418700]
6063D18700Q8608Q7414L11963j39445j86575Q8384j24861l4020k87616N3434M65191
6052G41177k64793j2526q8371Q6758J05240O3947n2014j77955O8568O3378k07182
6041C26227R2369J81878p6008j87549J56101N8949L2308J22185l672o3587l7609
6030F01592J51125J8165j57261o0465M1405k4803O4016Q358J48032j4326J30344
6019I06182Q561k12831j76231Q2265J31219K7195l6577j35805J05813J51199p0373
6008G80617o0976N3409j42765p1573Q1270m4013J78391j92349M8908K16306J03103
5997I50328k70248J30976K46179k14767n216J96528j3505j33375j4850J2328P2581
5986I56959R7148j30693Q3102N9971j04916J42562j1450L4681j93028q0704P6959
$$ y = [418700, 507308, 594722, 906685, 767240, 580665, 669049, 544188, 510168, 222552, 275986, 741177, 476384, 463858, 375487, 462245, 567485, 631432, 579418, 401463, 470031, 533409, 326227, 418596, 600474, 524466, 336917, 493018, 551967, 584275, 706460, 702788, 639201, 601592, 752717, 770882, 613621, 553156, 594561, 569758, 633774, 642132, 790164, 775838, 906182, 914743, 701912, 525681, 607946, 739165, 766360, 729783, 593978, 699791, 850990, 780617, 719641, 773050, 630285, 558712, 639982, 595969, 774360, 582011, 630919, 847225, 950328, 680080, 811056, 1057235, 842468, 837252, 1033780, 1020275, 886900, 872050, 884378, 956959, 1054107, 923414, 1006516, 1066487, 961571, 1104133, 1092683, 1127364, 934336, 853632, 930591]
5975I30591j26414K07685N8502k1032p4570K5386M046J02678j24509R7932k4435
5964A055860J40476K78780R9j69662p4154K07485j20997M3434Q1679j48833O6146
5953A360313j3135N4021J05761q1400K09952M4391q9481j24342L2370J27970J18838
5942A745258j55005J76P9613J1757j30849J82718J55685M6876q7487m0571Q1069
5931A889240J01245m1748q2252J66524Q4087j17793R6387J55210J0109j5383J78254
5920B423880J26448J88553m5342j97114O899L323O3004J95796p644N3037L12779
5909C123619j59308j78710J09874Q1856J67855K96370J33876j40123J22487J94866
5899C752662P0591M6653J92681j9191K74660L64538j14510K66499J05509K42637
$$ y = [930591, 804177, 1011862, 1070364, 1049332, 974762, 1000148, 1004194, 1106872, 982363, 1080295, 1055860, 1196336, 1475116, 1475215, 1305553, 1231399, 1438884, 1317887, 1361321, 1443000, 1294167, 1360313, 1347178, 1401199, 1506960, 1425560, 1635512, 1679903, 1590422, 1466080, 1498450, 1626420, 1745258, 1590253, 1590429, 1670042, 1681799, 1550950, 1733668, 1889353, 1936229, 1848742, 1808171, 1889240, 1990485, 1948737, 1866485, 2033009, 2117096, 1999303, 2095690, 2250900, 2261009, 2245626, 2423880, 2550328, 2738881, 2693539, 2496425, 2503324, 2506647, 2569651, 2765447, 2757803, 2810840, 3123619, 2964311, 2785601, 2895475, 2977331, 3145186, 3441556, 3575432, 3435309, 3557796, 3752662, 3823253, 3869906, 4062587, 4043396, 4318056, 4682594, 4568084, 4834583, 4940092, 5182729]
5889E182729L78263J34969J75584J77317J75841K77398K11125M15737L66770M60331
5879G956064M12543L68967N07320L16405L15362L51344J47911K62523L14487J88362
5869A1141288R8351K06910J30326L38410M88916N54395O35907N05030Q26870J185143
5859A6111546R83478J015149J415695J659015J707101K190672K608611L205606
5851C0896873L256641L711022M389148M704692M952813M247304K198257p07882
5843E7648868l560220m843447m758029l445306k282302j752698j333390q89925
5835C4783551o47067m30846M26480M08383O43108R68105J557537J845525K020783
5826D1575559K854890L996588N005416N783905O833896Q259832R172038J0417421
$$ y = [5182729, 5560992, 5695961, 5871545, 6048862, 6224703, 6502101, 6713226, 7128963, 7495733, 7956064, 8368607, 8737574, 9244894, 9561299, 9876661, 10228005, 10375916, 10638439, 10952926, 11141288, 11239639, 11446549, 11576875, 11915285, 12404201, 12958596, 13594503, 14099533, 14926403, 16111546, 17095024, 18110173, 19525868, 21184883, 22891984, 25082656, 27691267, 30896873, 34153514, 37864536, 42253684, 46958376, 51911189, 56158493, 58356750, 57648868, 54088648, 49245201, 44487172, 41041866, 38759564, 37006866, 35673476, 34783551, 34136484, 33705638, 34132118, 34540501, 35183609, 36151714, 37709251, 39554776, 41575559, 44430449, 48427037, 53432453, 59216358, 66050254, 74310086, 83482124, 93899545]
5818I3899545R831143O484217l16782p953779j2686665j2935160j0802963p947202
5810E7572354o063863m431208l499271k798881k083005k041503j497597q52227
5802C4304799q11934l22623j29678l3091O12545Q78848J565769J985706K633390
5793D0683731L252879L762297M415418M866259M044551J778752j873586n551824
5785E5378477p364977o470983n368363l862916l119361k191066j703146j567928
5777B3729737j273252j104241q33007p79859n03419p76201m85007j13101j74090
5768A7687560j76434r9341P7650R3000j39933l92829n09268k43226j93042l47192
5758A5756945k91657l69177n84448k50663j44451n0039k90507m08711l28476k90956
$$ y = [93899545, 103730688, 110214905, 109898123, 101944344, 89257679, 76322519, 65519556, 57572354, 51508491, 47077283, 43578012, 40779131, 38696126, 36654623, 35157026, 34304799, 33492865, 33170242, 33040564, 33007473, 33620018, 34498866, 36064635, 38050341, 40683731, 43936610, 47698907, 52114325, 56980584, 61025135, 62803887, 60930301, 55378477, 48013500, 41542517, 36174154, 32311238, 29191877, 27000811, 25297665, 23729737, 22456485, 21352244, 20519237, 19739378, 19235959, 18459758, 17974751, 17861650, 17687560, 17511126, 17411785, 17489435, 17582435, 17442502, 17049673, 16540405, 16297179, 16104137, 15756945, 15465288, 15096111, 14511663, 14261000, 14116549, 14066510, 13776003, 13367292, 13038816, 12747860]
5748A2747860o5477j08149k14200j22587Q0824j57568J48703p8796K58122M1443
5738A2530175M5041L16855J6826n9345J31179J46052j00517k87267l64357j27116
5728A2247526K38081N6572k91521r6044j08929l83335l93442l35899p58428m77613
5718I696968n39295n0306j31890m52856j26988m7008l4885j71718j72152K6580
5708G996450j01197J86305J9530R7038J70312j2328k37913l30900J50864p1348
5698G866813J01955m5287n8687p4551j35043n8055j3473k5105j96719p722N4276
5687G408402J92838J69590j45306j2791K51699j09493k25817j90677k73671j29004
5677F935770k91743k01588K3095j89419k2778Q4975k5873j8624J65600L54229
$$ y = [12747860, 12682383, 12574234, 12360034, 12237447, 12318271, 12160703, 12309406, 12230610, 12488732, 12530175, 12575216, 12892071, 12908897, 12849552, 12980731, 13126783, 13026266, 12738999, 12374642, 12247526, 12485607, 12542179, 12250658, 12154614, 12045685, 11662350, 11268908, 10933009, 10174581, 9696968, 9157673, 9107367, 8975477, 8522621, 8395633, 8348625, 8313740, 8142022, 7969870, 7996450, 7895253, 8081558, 8101088, 8198126, 8368438, 8356110, 8118197, 7787297, 7938161, 7866813, 7968768, 7923481, 7864794, 7790243, 7655200, 7597145, 7583672, 7558567, 7361848, 7354126, 7408402, 7601240, 7770830, 7625524, 7612733, 7864432, 7754939, 7529122, 7338445, 7064774, 6935770, 6644027, 6442439, 6465534, 6276115, 6253337, 6338312, 6312439, 6293815, 6459415, 6813644]
5667F813644J52348K91161L26390L56192M38796M07546K90688N05734J28431K7905
5657I738835M36400l75428j12900J16617l79559o5895m42703k51676k22983k78427
5647H162281k46985j96292j33792j46690j70475J10278K18461L52280L10819J95588
5637H455473L18952N22584O17132J38868M96300K27681J30125Q5371l35918n3521
5627A0603047q1511o1108K3269k32081j33679k49969k73763J3894j11776k45976
5617I250347j16254j25651Q4717n5882J25632K94071N57133L72008K51026L65465
5607A1002612J37606n8783M47540J59990k00827j89810n84195p72678o65940m35178
5597H840337m24784j72865j35621k89253k38194n0324k14274j57790o0481m4749
$$ y = [6813644, 6965992, 7257153, 7583543, 7939735, 8378531, 8786077, 9076765, 9582499, 9710930, 9738835, 10175235, 9799807, 9686907, 9803524, 9423965, 9358070, 8915367, 8663691, 8440708, 8162281, 7915296, 7719004, 7585212, 7438522, 7268047, 7378325, 7596786, 7949066, 8259885, 8455473, 8774425, 9297009, 9914141, 10053009, 10549309, 10776990, 10907115, 10992486, 10656568, 10603047, 10521536, 10460428, 10483697, 10251616, 10117937, 9867968, 9594205, 9608099, 9496323, 9250347, 9134093, 9008442, 9093159, 9037277, 9162909, 9456980, 10014113, 10386121, 10637147, 11002612, 11140218, 11081435, 11528975, 11688965, 11488138, 11298328, 10714133, 9941455, 9275515, 8840337, 8415553, 8242688, 8107067, 7817814, 7579620, 7529296, 7315022, 7157232, 7096751, 7052002]
5587G052002j55874k5776J83597J9530q1457L732M9794K44702L76912P8390J97948
5576G943500M0541o3903j27610m28255j9301J05587J03594N43846O74542Q43459
5566I616000J181790J200902Q79848n45443j395300j617782j253234o35237n90518
5557F841026m11125m63687k22716k26333l83025k01440r0953K8285j06495l05481
5547D458056J36355J63559k95639q2829J32025k44802o4833J89119J20106K20866
5537D731983K77200J36081j62625j63312j63816k17282J82958j03658k8363K25190
5527D714356j13428k16780n7659j28880j59881Q0334N4817k6028n4725o724J1524
5516D096926M5719J83442J54836p3402J55338j08125J67426K21928m8184l5964
$$ y = [7052002, 6896128, 6870352, 7053949, 7073479, 6992022, 6995754, 7045548, 7290250, 7667162, 7745552, 7943500, 7984041, 7920138, 7792528, 7364273, 7344972, 7450559, 7554153, 8097999, 8772541, 9616000, 10797790, 11998692, 12878540, 12333097, 10937797, 9320015, 8066781, 7431544, 6841026, 6429901, 5966214, 5743498, 5517165, 5134140, 4932700, 4841747, 4870032, 4763537, 4458056, 4594411, 4757970, 4462331, 4379502, 4511527, 4266725, 4201892, 4391011, 4511117, 4731983, 5009183, 5145264, 4982639, 4819327, 4655511, 4438229, 4621187, 4517529, 4489166, 4714356, 4600928, 4384148, 4326489, 4197609, 4037728, 4118062, 4172879, 4146851, 4092126, 4085402, 4096926, 4142645, 4326087, 4480923, 4407521, 4562859, 4454734, 4622160, 4844088, 4795904, 4759940]
5506D759940M0609k1229M1339R2551l7897N1338K97330o943N1838J65572K6037
5495E460485R9200J2310R2132N6118k0103K24179N02613K00299L53767L51322
5485G332322K43341K93404L84048L57183J38493K54924P7215L16308L46819K38986
5475I983043J90160K90205L30820O16448O86245M89508P80685Q49734J061448
5466A5278296J190540J285157J943485K220415K766135L588253M248995M765935
5458C7287211N157503M849740L182464M60620k924708n119976n195237l891296
5450C3806321k879898k024181j481457j127750o42617m19965l26625J69533N38100
5441B5611461R69874J014584J119338J528251J811432K389763L448081M444676
$$ y = [4759940, 4800549, 4779320, 4820659, 4913210, 4875313, 4926651, 5223981, 5217038, 5268876, 5434448, 5460485, 5559685, 5571995, 5664127, 5720245, 5700142, 5924321, 6426934, 6627233, 6981000, 7332322, 7575663, 7869067, 8253115, 8610298, 8748791, 9003715, 9080930, 9397238, 9744057, 9983043, 10173203, 10463408, 10794228, 11410676, 12096921, 12586429, 13367114, 14216848, 15278296, 16468836, 17753993, 19697478, 21917893, 24684028, 28272281, 32521276, 37287211, 42444714, 47294454, 50476918, 50937538, 48012830, 42892854, 37697617, 33806321, 30926423, 28902242, 27420785, 26293035, 25650418, 25230453, 24903828, 25073361, 25611461, 26581335, 27595919, 28715257, 30243508, 32054940, 34444703, 37892784, 42337460]
5433D2337460N381825O605012P964665R084004R558519Q113991L812526k368144
5425I0489858q275015j0835415j0312183q103393n959195m599644l758747k895156
5417C5751110k409831k013646j501412j289372o70875l90930k22185n4010O85991
5408B7884840J073029J371014J828568K390576K907685L242980L854386L608716
5400D8161794L128292J428067j272396l999630n512463n130333m183437l312814
5392B9307080k616826k260087j451231j290205j445025j178635j115624r37640
5384A7011807j077275j045693p36276m89567m99525m69328n49365j43247k84323
5375A1717208k97494m43832n1608j78375k50527o6952L3548j44515j6060K81564
$$ y = [42337460, 47719285, 54324297, 62288962, 71372966, 80931485, 89045476, 92858002, 90489858, 82214843, 71379428, 61067245, 52963852, 47004657, 42405013, 38646266, 35751110, 33341279, 31327633, 29826221, 28536849, 27865974, 27475044, 27252859, 27198849, 27884840, 28957869, 30328883, 32157451, 34548027, 37455712, 40698692, 44553078, 48161794, 51290086, 52718153, 51445757, 47446127, 41933664, 36803331, 32619894, 29307080, 26690254, 24430167, 22978936, 21688731, 20243706, 19065071, 17949447, 17011807, 15934532, 14888839, 14152563, 13662996, 13163471, 12694143, 12144778, 12001531, 11717208, 11419714, 10975882, 10924274, 10745899, 10495372, 10428420, 10461968, 10317453, 10301393, 10582957]
5365A0582957J71847o5397L47803N37751J77087L75175j07102k47441k29299l40683
5355A1202698l65465l54448j08195n2829l12928k80467j33542j68259j30829n03
5345I295233r9595q8083j79647l38506M4440k46447J85113M18423Q9063J0100
5335I090094n2852L10866K21379J43221k2576J91879p0577J03924K60115L32987
5325A0508460J88926L87013L33443J89659m6227l1981O8750m6958l31464j17093
5315A1102528k47355m66675k55011l22759r8776l06379m82543j75472r1948r968
5305H645642k08722l8375j0844L4656M3138R1867K43929L58704N97180J62140
5295I919315L82413L48111K35302L69384J38489r6447k42838l42800m26886k72045
$$ y = [10582957, 10754804, 10689407, 11037210, 11574961, 11752048, 12127223, 12020121, 11772680, 11543381, 11202698, 10837233, 10482785, 10374590, 10321761, 10008833, 9728366, 9594824, 9426565, 9295736, 9295233, 9195638, 9107555, 8927908, 8589402, 8633842, 8387395, 8572508, 8990931, 9079994, 9090094, 9037242, 9348108, 9569487, 9712708, 9690132, 9882011, 9811434, 9915358, 10175473, 10508460, 10697386, 11084399, 11417842, 11607501, 11561274, 11529293, 11598043, 11551085, 11219621, 11102528, 10855173, 10388498, 10133487, 9810728, 9711952, 9405573, 8923030, 8747558, 8655610, 8645642, 8436920, 8398545, 8387701, 8422357, 8465495, 8557362, 8801291, 9159995, 9757175, 9919315, 10301728, 10649839, 10885141, 11254525, 11393014, 11296567, 11053729, 10710929, 10284043, 10011998]
5285A0011998q8281k50352k76529j09384j49582m30475j61386k06588j05871J69817
5275H403367l10748j07106J5654J83814M2779R3153K41487J71304J25101K23848
5265I082653L42381L55457K56561j3087O2014k23943k16498k14435J0928o2286
5255I379745k64472j54932k64946J15267o6960J29157J09272o8598j11108j75147
5245H627278M7690j43969q8578L5843J30324j36644K27483N6121J27730K47919
5235I131197N6790J64728P2200j8542M5514K58532j97830j27608o2875l13280
5225I008826l03730m74298n44095n08998k18442k84841k30659k40260n8479j44739
5215F000285J27972j64199j63555K2428O8163l9123j44197K37996M5184k9004
$$ y = [10011998, 9923717, 9673365, 9396836, 9287452, 9137870, 8707395, 8546009, 8339421, 8233550, 8403367, 8092619, 7985513, 8001167, 8184981, 8227760, 8320913, 8562400, 8733704, 8858805, 9082653, 9425034, 9780491, 10037052, 10023965, 10085979, 9862036, 9645538, 9431103, 9442031, 9379745, 9115273, 8960341, 8695395, 8810662, 8743702, 8872859, 8982131, 8913533, 8802425, 8627278, 8674968, 8530999, 8442421, 8478264, 8608588, 8471944, 8699427, 8755548, 8883278, 9131197, 9187987, 9352715, 9424915, 9406373, 9451887, 9710419, 9512589, 9384981, 9322106, 9008826, 8705096, 8230798, 7686703, 7177705, 6959263, 6674422, 6443763, 6203503, 6145024, 6000285, 6128257, 5964058, 5800503, 5822931, 5891094, 5851971, 5707774, 5945770, 5990954, 5961950]
5205E961950O27m8207L1053J44613j49990j52191p3982j99455l00122k43416k14421
5194D756459j83644J93504j63174k22572r852j97220j48444N4691N4975Q8667
5184D223390j04737j31650L22653n984j72406J12280r4900N4613k7909O9549j30110
5173D114789k46024j7541j32181m2524j27778r077l3392J5636j08451j12560J47866
5162C448763M8215q495j3441k34671k9914Q2600L7022o0773k2940o3404j36776
5151C046186M0971J8060q3054L5070j8118J60112r0331J5120l08476j56866K31081
5140B889755p6532L5535J14940J10380k17284M8159J70726m7381j56240K1374
5130B893432o5633j49683j9676j88074K72722R981l09502n8757K74968O9952q6793
$$ y = [5961950, 5962577, 5914370, 5945423, 6090036, 5940046, 5787855, 5713873, 5514418, 5214296, 4970880, 4756459, 4572815, 4766319, 4603145, 4380573, 4370721, 4173501, 4025057, 4079748, 4134723, 4223390, 4118653, 3987003, 4309656, 4303672, 4131266, 4243546, 4148646, 4203259, 4175350, 4244899, 4114789, 3868765, 3851224, 3719043, 3676519, 3548741, 3539664, 3506272, 3521908, 3413457, 3300897, 3448763, 3496978, 3488483, 3475042, 3240371, 3210457, 3293057, 3330079, 3269306, 3246366, 3182962, 3046186, 3087157, 3105217, 3022163, 3057233, 3039115, 3199227, 3108896, 3124016, 2815540, 2658674, 2889755, 2813223, 2848758, 2963698, 3074078, 2856794, 2904953, 3075679, 3028298, 2872058, 2893432, 2827799, 2678116, 2658440, 2470366, 2743088, 2753069, 2443567, 2384810, 2659778, 2729730, 2642937]
5119B642937K2924j43770j36043J65109j1001r5174k4189O0020k86504o1857q5205
5108B047247J03186K88249Q6689p4004m6238l082j08322r0234L5034P0037j1988
5097B296574j1059k77220J4953l7551j5704J5706J14444k11731K04429L8362k09746
5086A921457j17605J13337K0233j73981m398R8060J08153k11522m8977J28349
5076A833106j79851k7654M8368k43885L928M2520l2883m6673j39601N8677n9949
5065A256103K1314J48784p2869j87392j7328J10609R308J752J36321n946k56561
5054A144095m376K34859L7083j33189k0762K3913P4265p4412p5796j54289l9255
5043A012136Q9715J59863N1364j97208m6336N4670R8020J6754q4169j62140K18331
$$ y = [2642937, 2665861, 2522091, 2386048, 2551157, 2540156, 2444982, 2420793, 2480813, 2194309, 2132452, 2047247, 2150433, 2438682, 2525371, 2451367, 2405129, 2402047, 2293725, 2203491, 2238525, 2308562, 2296574, 2285515, 2008295, 2023248, 1985697, 1969993, 1985699, 2100143, 1888412, 2092841, 2131203, 1921457, 1803852, 1917189, 1937422, 1763441, 1759043, 1857103, 1965256, 1753734, 1704757, 1833106, 1653255, 1625601, 1673969, 1430084, 1434012, 1476532, 1443649, 1396976, 1257375, 1316052, 1256103, 1277417, 1426201, 1353332, 1165940, 1148612, 1259221, 1268529, 1270281, 1406602, 1400656, 1144095, 1139719, 1374578, 1411661, 1278472, 1257710, 1281623, 1355888, 1281476, 1205680, 1051391, 1012136, 1101851, 1261714, 1313078, 1115870, 1069534, 1124204, 1222224, 1238978, 1154809, 992669, 1211000]
5032A211000J73852P1527j26008k78187J59582o4952j23979j36988j2774Q0327
5022I53400o2559M7128J23115N4084k77751O0093L6790k05905p5213J43q8815
5011E64510M1161K97864p1236k34030j35946J34624J20879k8732J37467q9839
5001G36722m8721j76917O8974M0086k20555L6938N2512N8406k20499K50540p9697
4990D97789o4717O1479O0142L7993j9618j67155j21302J00625N2420N7185N6985
4979E51826J5890M9369J4986j01897j10775p7156J06914j5552p7001K219n2100
4968C06723M9128R0663j44338L5452K60087J11112j59627N9152k2613L2958j91585
4957D27112N335R4569n1920P0574j3700m6459J458r948L4985j26348l9569K20701
$$ y = [1211000, 1384852, 1456379, 1330371, 1052184, 1211766, 1146814, 1022835, 885847, 873073, 953400, 890841, 937969, 1061084, 1115168, 837417, 897510, 934300, 728395, 653182, 653325, 564510, 605671, 903535, 832299, 598269, 462323, 596947, 717826, 689094, 826561, 736722, 688001, 511084, 580058, 620144, 399589, 436527, 489039, 547445, 326946, 577486, 497789, 433072, 494551, 554693, 592686, 573068, 405913, 284611, 385236, 437656, 494841, 551826, 567716, 617085, 632071, 530174, 419399, 342243, 449157, 433605, 356604, 358823, 306723, 355851, 446514, 302176, 337628, 597715, 708827, 549200, 608352, 585739, 618697, 427112, 432447, 527016, 475096, 545670, 531970, 485511, 486969, 477021, 512006, 385658, 346089, 566790]
4945E66790J49777r3621r0490j10289o9293N0548M3934M0825O773J8272P2607
4934E85833n0220j18281P5416Q6533N5861k28652P8308R7910r1863r2193M411
4923D03063L7922j13077J65340j10143k10091j88044L20112R8300J36522J19988
4913F59892p2348l29138j10009M14354k72779N7122R1705o2844k09466O2546J41633
4902C70668R215n3234K52031o6160j36973K02951o6696m6144O9897K23075p8365
4891F80265n1923n4570m6468R9733j09879j81216L2985J41049n6924p7824o4993
4880C10235K39868K8027O4144k2406j41296p6373Q8655P1243m9366L040J2795
4869E28566j48250Q1185N6333r0762r9349M8760J62068J46156j96785k2574N1156
$$ y = [566790, 716567, 622946, 532456, 422167, 352874, 403422, 447356, 488181, 494954, 513226, 585833, 535613, 417332, 492748, 579281, 635142, 406490, 484798, 582708, 490845, 398652, 403063, 440985, 327908, 493248, 383105, 173014, -15030, 305082, 403382, 539904, 659892, 587544, 258406, 148397, 562751, 289972, 347094, 438799, 375955, 166489, 229035, 370668, 379883, 326649, 578680, 512520, 375547, 578498, 511802, 465658, 535555, 758630, 680265, 628342, 573772, 527304, 627037, 517158, 335942, 368927, 509976, 453052, 375228, 310235, 550103, 578130, 642274, 619868, 478572, 402199, 490854, 562097, 512731, 515771, 528566, 380316, 461501, 517834, 427072, 327723, 376483, 538551, 684707, 487922, 465348, 516504]
4858E16504j26694J27114J36426J95879j62181j10744l9113M3998j0856N8682
4848F29015p0443J68158N8022R2307M5592j83624j08387J41373j92979p8445J47828
4837F48417j47058J19731P2477N0708P8904R9702K90910r1741j16549J23335l16000
4826H12836J28789J74181j36761l4188j6173j58047M9138J44680P1041J31022
4816A166518j01768j81902R768J31512Q3743K65584J34230J08260p9922Q651m2449
4805A502225Q014J48284n3165L45488J75294o0924K12508j36979P879J25554J84874
4794B459052L88268J95969K28805K18479M26586N55569P91300P49511J358412
4785G371951J712069J953846K613047K640499K617568J326855m49146k099162
$$ y = [516504, 389810, 516924, 653350, 849229, 687048, 576304, 537191, 581189, 570333, 629015, 558572, 726730, 784752, 877059, 922651, 739027, 630640, 772013, 579034, 500589, 648417, 501359, 621090, 693567, 744275, 823179, 922881, 1213791, 1122050, 1005501, 1128836, 812836, 941625, 1115806, 979045, 944857, 928684, 770637, 819775, 964455, 1035496, 1166518, 1064750, 882848, 892616, 1024128, 1107871, 1373455, 1507685, 1615945, 1536023, 1544674, 1502225, 1510239, 1658523, 1605358, 1950846, 2126140, 2065216, 2277724, 2140745, 2148624, 2274178, 2459052, 2847320, 3043289, 3272094, 3490573, 3917159, 4472728, 5264028, 6013539, 7371951, 9084020, 11037866, 13650913, 16291412, 18908980, 20235835, 19786689, 17687527]
4777A7687527l270394l352518k338106j450124j084688n85236p25993o11928m20179
4768C848361l08456k14396p6900k39595k54625o4167j92092M4229k53565r6469
4758B192325p9296P5425n6207n1246j92849k15751L39836j5177M4276P9500q3900
4747B036936k8208m5077J05185K23381n3868J28699K9286k05990R2792k0265J25004
4736B387875O9771r5646J47150M713q9100J46299N30901M79218J64909N20713
4726D266803O83099O28248J183492J554687J653503K153967K416861K518297J824918
4717A8883875K49464j089135j890094k739600k958993k026375j355127j075674
4709E998341q19294o46511n70593n17824k35256j10743k81632j45805l70219m7091
$$ y = [17687527, 14417133, 11064615, 8726509, 7276385, 6191697, 5606461, 4880468, 4268540, 3848361, 3539905, 3325509, 3248609, 3009014, 2754389, 2690222, 2498130, 2542359, 2288794, 2192325, 2113029, 2188454, 2132247, 2081001, 1888152, 1672401, 2012237, 1997060, 2041336, 2120836, 2036936, 2008728, 1963651, 2068836, 2292217, 2238349, 2367048, 2396334, 2190344, 2283136, 2262871, 2387875, 2457646, 2362000, 2509150, 2513863, 2424763, 2571062, 3101963, 3581181, 3746090, 4266803, 4949902, 5578150, 6761642, 8316329, 9969832, 12123799, 14540660, 17058957, 18883875, 19133339, 18044204, 16154110, 13414510, 10455517, 8429142, 7074015, 5998341, 5179047, 4532536, 3961943, 3444119, 3208863, 3098120, 2816488, 2670683, 2300464, 2253373]
4699B253373J60480l9132l01171j68188o6365L3041k2795k73306j1840n1404l2568
4688A480125m0651n3883l58j85299L1266J09759O3794k35719M7261j36025L6960
4677A117230j04328j26255P1872r1284J00006k08961j41070L9684N7868k4897
4667F89865K937K43180j56922j13593J48616j5734p9031q3399O9916J95090j12736
4656G88189R8833Q8082j31864P7656l68864K25706j22601j5822J13983J05589
4646H58887J39079q5612k36287n7506M1730j66393q270j04212J30923O4574k0141
4635E56772J24894R8057J6332L7208K6182j63791q7143J54685n2874k38741M424
4624D76005J6585n7647K2932J45579J23181P071k62510Q6257K13511o2426N7504
$$ y = [2253373, 2413853, 2374721, 2073550, 1905362, 1838997, 1872038, 1849243, 1575937, 1564097, 1512693, 1480125, 1439474, 1385591, 1385233, 1199934, 1231200, 1340959, 1404753, 1169034, 1216295, 1080270, 1117230, 1012902, 886647, 958519, 867235, 967241, 758280, 617210, 656894, 714762, 689865, 692802, 935982, 779060, 665467, 814083, 798349, 719318, 635919, 705835, 900925, 788189, 887022, 975104, 843240, 920896, 552032, 777738, 655137, 639315, 753298, 858887, 997966, 912354, 676067, 618561, 660291, 493898, 485628, 381416, 512339, 576913, 556772, 681666, 779723, 796055, 833263, 859445, 695654, 608511, 763196, 710322, 471581, 476005, 492590, 434943, 457875, 603454, 726635, 733706, 471196, 557453, 770964, 708538, 766042]
4613G66042j68012j40578J30162J68917J66861l10722q4766K31835j9676k8177
4603G11886m7672Q7732n5407j36492k9221L6742J25241j43969j17843N1059J32538
4592F14594M5850k6554q1655J4769J21370J6321K41840j17940j18589P0249l6464
4581G43791n1845k07180j2905J41149n1712K92131j1231l32141o7060p4208J33453
4570E02242K72456J12612m2840J48340m23925j39706R5549J02061J90736o0777
4560G56748N9515m190O542P5358n7874p128j79324j63870K17061J98755n3690
4549H47903j45841j13137p8282K29962k0947q1850N5981K86620p7775L9056r2371
4538H49319n0190n1064j73578n3034M2363J22160J05397n7988J155p0577o6980
$$ y = [766042, 598030, 457452, 587614, 756531, 923392, 612670, 527904, 759739, 740063, 711886, 664214, 751946, 696539, 560047, 530826, 567568, 692809, 548840, 430997, 482056, 614594, 660444, 633890, 552235, 567004, 688374, 704695, 946535, 828595, 710006, 780255, 743791, 691946, 484766, 471861, 613010, 561298, 853429, 842198, 510057, 442997, 368789, 502242, 774698, 887310, 844470, 992810, 568885, 429179, 524728, 626789, 817525, 756748, 816263, 812073, 818615, 893973, 836099, 828971, 649647, 485777, 702838, 901593, 847903, 702062, 588925, 510643, 740605, 719658, 637808, 693789, 980409, 902634, 941690, 849319, 799129, 748065, 574487, 521453, 563816, 685976, 791373, 733385, 734540, 663963, 596983]
4527E96983L925L03009K61275J07295l8561k39363q9648j78156j5262j5554P4972
4516G70915R9640J11772R683p853R1657o9057J18218j25148l26620J42244L2001
4505H47452P9064L0123O826J3930J86705j07665k06563R8355j21836Q0544K35442
4494A142377J72348k29223q6503K42550P3903m9794L5231l2368j47773M1116K6856
4483A188720p207j10103q7549j4507J75669M0931k086k781J25063m2024J79365
4472A443491M7370N9010K643K01476K506q6637J65694K06079L16971K37355L15918
4461B911876q1961O2086k31150j98307o2979l24974j48479k01892M5677j2590
4451A757307k55883P4497J39964O8835J1592j44696L0652j77768J60320q2128
$$ y = [596983, 600908, 903917, 1165192, 1272487, 1233926, 994563, 904915, 726759, 711497, 695943, 770915, 870555, 982327, 992010, 984157, 1075814, 1006757, 1124975, 999827, 673207, 815451, 847452, 926516, 956639, 963465, 977395, 1164100, 1056435, 849872, 948227, 826391, 906935, 1142377, 1314725, 1085502, 998999, 1241549, 1315452, 1265658, 1300889, 1268521, 1120748, 1161864, 1188720, 1181513, 1071410, 983861, 969354, 1145023, 1185954, 1183868, 1181087, 1306150, 1264126, 1443491, 1490861, 1549871, 1552514, 1753990, 1756496, 1669859, 1835553, 2041632, 2358603, 2595958, 2911876, 2829915, 2892001, 2660851, 2462544, 2399565, 2074591, 1926112, 1724220, 1769897, 1757307, 1501424, 1575921, 1715885, 1784720, 1796312, 1651616, 1682268, 1504500, 1664820, 1582692]
4441A582692m7762K9473o781j55338k2484J4459j16973L82335J5458r7588L9474
4430A616965p4418J98947J24674J5421j3154j10956P6612j11003j4055M2825j8843
4419A733015j24972J47713L2841q7805J26325K58883j88548K2425P1547J487Q8796
4408B081707J86563m6343P6064k7155k99564j95632J44362p051R6169l0677j02797
4397A875646r24Q4841k29051R1995L31258M5777L1748j00174Q6679r7477k0442
4386B099876L1301K18270j12585o6395O4844L304k3034o7600N3708J21320O4687
4375B387696j2642M0616q2236J79720Q9939J38126Q705J2775K7549J35701J65342
4364C091291k16497J30428J40690L60288n4275k20941K46210n0013p750R0236
$$ y = [1582692, 1534930, 1564403, 1557622, 1402284, 1379800, 1394259, 1277286, 1659621, 1675079, 1577491, 1616965, 1542547, 1741494, 1866168, 1881589, 1868435, 1757479, 1834091, 1723088, 1709033, 1751858, 1733015, 1608043, 1755756, 1788597, 1700792, 1827117, 2086000, 1897452, 1919877, 1991424, 1992911, 2081707, 2268270, 2221927, 2297991, 2270836, 1971272, 1775640, 1920002, 1912951, 2009120, 1978443, 1875646, 1874722, 1959563, 1730512, 1822507, 2153765, 2199542, 2231290, 2131116, 2217795, 2120318, 2099876, 2131177, 2349447, 2236862, 2170467, 2235311, 2238615, 2215581, 2147981, 2201689, 2323009, 2387696, 2375054, 2415670, 2333434, 2513154, 2603093, 2741219, 2749924, 2762699, 2790248, 2925949, 3091291, 2874794, 3005222, 3145912, 3506200, 3451925, 3230984, 3477194, 3427181, 3419431, 3509667]
4354C509667m5830K09204n1039k4491L23747O8851j32648m4096K8459R7668K79076
4343D218568q245L20852J58349J84975J37562O5919K78591J48353M42635k9046
4333E918513K13156P0041J75530J57052N3667j23140q0293Q6979j42129J1101
4323F340477K24847R5561L5338P7370K14719K41042n0060J62149J7306j9385K22779
4312G562143O7454N4857L16669N7849K47742L63510R252K64397L26043L62661
4302I632577L05555L77693J35005J41566J94986Q8218l008L01203O4183p7132
4292A1160846j26790m4900m938k18246j2764j04480Q6364n8577r4046K02935Q8600
4281A0874004j42148q817J04112J29545J15379J4791m28J7369J98249K68036k2383
$$ y = [3509667, 3463837, 3673041, 3622002, 3597511, 3921258, 3990109, 3857461, 3813365, 3841824, 3939492, 4218568, 4210323, 4531175, 4689524, 4874499, 5012061, 5077980, 5356571, 5504924, 5947559, 5918513, 6131669, 6201710, 6377240, 6534292, 6587959, 6464819, 6384526, 6471505, 6329376, 6340477, 6565324, 6660885, 6696223, 6773593, 6988312, 7229354, 7179294, 7341443, 7358749, 7339364, 7562143, 7629597, 7684454, 8001123, 8058972, 8306714, 8670224, 8679476, 8943873, 9269916, 9632577, 9938132, 10315825, 10450830, 10592396, 10787382, 10875600, 10872592, 11173795, 11237978, 11160846, 11034056, 10989156, 10984218, 10765972, 10753208, 10648728, 10735092, 10676515, 10582469, 10785404, 10874004, 10731856, 10723039, 10827151, 10956696, 11072075, 11086866, 11086438, 11103807, 11302056, 11570092, 11547709]
4270A1547709o4215j4348J06940K49505Q490J90543p3504q6053J41060N7964k74484
4259A1789607j67223j12573k74548q6842L0600P5669K15849J4193J45485J73726
4249A1803943R9608J55556K66603K67654M976J57717K610K79661J90042J13075
4239A3341445J0503J27349J5288J86991J37105K60914K02967P0831J43240J15126
4229A4611759J88715K72850K73954K5683L50777K62861L85696L00570M43550M94613
4219A7611028O40356P30745L86918K98579M13142L40107m0195K06985K96380N44397
4209B1428442N21118L99208P16446R33840P73646J252741Q67304J258202J032278
4200B9183225R78618R42070R56543J212698J505188J334149J590065J609224J852066
$$ y = [11547709, 11483494, 11469146, 11576086, 11825591, 11834081, 12024624, 11951120, 11865067, 12006127, 12064091, 11789607, 11622384, 11509811, 11235263, 11148421, 11179021, 11254690, 11470539, 11484732, 11630217, 11803943, 11903551, 12059107, 12325710, 12593364, 12598340, 12756057, 12758667, 13038328, 13228370, 13341445, 13351948, 13479297, 13494585, 13681576, 13818681, 14079595, 14282562, 14353393, 14496633, 14611759, 14800474, 15073324, 15347278, 15372961, 15723738, 15986599, 16372295, 16672865, 17116415, 17611028, 18251384, 18982129, 19369047, 19667626, 20080768, 20420875, 20380680, 20587665, 20884045, 21428442, 21949560, 22348768, 23065214, 23999054, 24772700, 26025441, 26892745, 28150947, 29183225, 30161843, 31103913, 32060456, 33273154, 34778342, 36112491, 37702556, 39311780, 41163846]
4191D1163846K277246K353072K743662L367447L259010L648753M562087N893035
4183F9268158P802636J0600856J3809488J7784896K2387006K8658423L5746182
4176B06057645M2534805M5315215L7481930J4140183j9264561m3623645n1026974
4169B31614598m0536179k8126834k0155909j5438295j2595221j0128269p941283
4162I6692608o370674m841919m364722l802012l725016m001694l833058l367301
4154F2386212k293840j941215j612980j234068j311318k167681k656293k470667
4146D6698150j675901p88469p3720N42062J190557J891706K736569L414719L647985
4137E7583658L562121K006937k19202k079630l447326l931389l774598l083318
$$ y = [41163846, 43441092, 45794164, 48537826, 51905273, 55164283, 58813036, 63375123, 69268158, 77070794, 87671650, 101481138, 119266034, 141653040, 170311463, 206057645, 248592450, 293907665, 331389595, 345529778, 326265217, 282641572, 231614598, 191078419, 162951585, 142795676, 127357381, 114762160, 104633891, 96692608, 90321934, 85480015, 81115293, 77313281, 73588265, 69586571, 65753513, 62386212, 60092372, 58151157, 56538177, 55304109, 53992791, 51825110, 49168817, 46698150, 45022249, 44233780, 44160060, 44702122, 45892679, 47784385, 50520954, 53935673, 57583658, 61145779, 63152716, 62933514, 60853884, 57406558, 53475169, 49700571, 46617253]
4129D6617253l024960l181727l015591k245544j976163j753446r96822q77191
4121B9545809o24450k79008o4843l06747k35729O4444k90698l22469p16469q72135
4111B5897705l85092m84085m06757k16848j94441k56876j01145j22825k4350J06072
4101B3811358J40812M15562N46662Q95402Q75913O98250K71661o44638j376051
4092B5634931j449465j436599r59905m28654m80676m77068l67402k85022m75784
4083A9274356k65424P2531N3352P5482J50469P9855l04277k56078j68449m30611
4073A8281206o15559k11003l70792j07014o8734k95351k38090k31443j11103k18678
4063A5813439M54J62211k10993K6765R8401j11978O0K58436q7705m2681J06421
$$ y = [46617253, 43592293, 40410566, 37394975, 35149431, 33173268, 31419822, 30423000, 29545809, 28921359, 28642351, 28577508, 28270761, 28035032, 28099476, 27808778, 27486309, 26769840, 25897705, 25512613, 25028528, 24621771, 24404923, 24210482, 23953606, 23852461, 23729636, 23705286, 23811358, 23952170, 24367732, 24914394, 25809796, 26685709, 27383959, 27655620, 27010982, 25634931, 24185466, 22748867, 21788962, 21360308, 20879632, 20402564, 20035162, 19750140, 19274356, 19008932, 19081463, 19134815, 19210297, 19360766, 19440621, 19136344, 18880266, 18711817, 18281206, 17665647, 17454644, 17083852, 16976838, 16908104, 16612753, 16374663, 16143220, 16032117, 15813439, 15813893, 15976104, 15765111, 15791876, 15890277, 15778299, 15778359, 16036795, 15949090, 15906409, 16012830]
4052A6012830L1804M4758L53540J25067L81622M65992M22150L48861K91415J048506
4042A9526545J155520Q02046P48414Q07313L79462K38464k60785m93501r60847
4033B1942631j207880p96306m73345n50110m45972l52888k28613m95456o02546
4024A6789515m00449k96325j29527j04336r5973p4448m5684K8321j85332o3537
4014A5422225J88383L70764j02134L70701J92372K99235L28144O4451M87183Q20013
4004A8441337P26303Q87311J323473J447873J647241J436199J633305J395451
3996B8938493R12361o1281j326806k208571j551814j398203j91841J96120O23315
3987B3931773J195944J429962K201553K320368K786898K107194M32334k284156
$$ y = [16012830, 16044634, 16089392, 16442932, 16567999, 16949621, 17415613, 17837763, 18186624, 18478039, 19526545, 20682065, 21484111, 22232525, 23039838, 23419300, 23657764, 23396979, 22903478, 21942631, 20734751, 19938445, 19465100, 18914990, 18469018, 18116130, 17887517, 17392061, 16789515, 16389066, 16092741, 15963214, 15858878, 15762905, 15688457, 15642773, 15671094, 15485762, 15422225, 15610608, 15981372, 15879238, 16249939, 16442311, 16741546, 17069690, 17134141, 17621324, 18441337, 19167640, 20054951, 21378424, 22826297, 24473538, 25909737, 27543042, 28938493, 29850854, 29789573, 28462767, 26254196, 24702382, 23304179, 23112338, 23308458, 23931773, 25127717, 26557679, 28759232, 31079600, 33866498, 35973692, 36406026, 34121870]
3979C4121870l247656k360443j333028p33408r9743O10508O82085P41360L41915
3970B8723460J4542p459m6492J89854M16329J183531J576033J830460K234782
3961C6115040K262234J987478J354444K97992N6249J20277j417277k618669k818503
3952C5339265j691732o43662O5624K45027m02781j447226j941567j375157o23992
3943B7523799Q0691K21081k28542j12329m28120q95003r24727l11954j37997l0353
3933B4756546O37276J239558J647335K254575K967551L406988K938043J785863
3925D1633735M33590j133508j797926k085781j841282j131276j028563j383340
3917C1665649n91171j28942O46272J065523M97340o14857j907126k245586j825269
$$ y = [34121870, 30874214, 28513771, 27180743, 26447335, 26347592, 26958100, 27640185, 28381545, 28723460, 28738002, 28730543, 28684051, 28873905, 29290234, 30473765, 32049798, 33880258, 36115040, 38377274, 40364752, 41719196, 42017188, 42073437, 42193714, 40776437, 38157768, 35339265, 33647533, 33003871, 33069495, 33314522, 32911741, 31464515, 29522948, 28147791, 27523799, 27604490, 27825571, 27597029, 27484700, 27056580, 26161577, 25236850, 24924896, 24786899, 24756546, 25393822, 26633380, 28280715, 30535290, 33502841, 36909829, 39847872, 41633735, 42067325, 40933817, 39135891, 37050110, 35208828, 34077552, 33048989, 31665649, 31074478, 30945536, 31591808, 32657331, 33154671, 32539814, 30632688, 28387102, 26561833]
3908B6561833j712640j433878j359079r55439n55922n67988m82054m79114j28474
3899A8887245R3798K06143q1302j1732K16323K53259K19210n400n09338k59233
3889A9008973K06418J41923L41773L87410O39684O62772Q44022Q02789L92098
3880B3427862J68073J75675K55467Q4946Q83k51449r02629j132841j080407r91411
3870A9754169p30341m04167k92319k80768J96870M7478K37883M13592N58761M66445
3860A9967603M64564R67398J372409J282356J613904K150147J930883K023329
3852C1772593J738526J108224J115487Q53293L27826k54271m17448p92060j155845
3843C4296325j613670j824706j407259j243191o07162j78640K04377K41091Q06548
$$ y = [26561833, 24849193, 23415315, 22056236, 21100797, 20544875, 19976887, 19494833, 19015719, 18887245, 18981043, 19187186, 19105884, 19094152, 19310475, 19563734, 19782944, 19777544, 19268206, 19008973, 19215391, 19357314, 19699087, 20086497, 20726181, 21388953, 22232975, 23035764, 23427862, 23595935, 23771610, 24027077, 24112023, 24112906, 23861457, 22958828, 21825987, 20745580, 19754169, 19023828, 18619661, 18327342, 18046574, 18243444, 18290922, 18528805, 18942397, 19501158, 19967603, 20432167, 21399565, 22771974, 24054330, 25668234, 27818381, 29749264, 31772593, 33511119, 34619343, 35734830, 36588123, 36915949, 36661678, 36244230, 35452170, 34296325, 32682655, 30857949, 29450690, 28207499, 27600337, 27421697, 27626074, 27867165, 28673713]
3834B8673713O55771Q82084O50717M72625L21336L58461J232162J533212J819229
3825C6599310K445654K622206K460043K141612J608461J88795m73404k40401k14798
3816D7137478J88448k6859k06212o48223o49753p54614o33982l77877l51923k17875
3806D3458608k96505l18340n13571q47917j426800j722711j603568j066428n62082
3797C5100686L9155N40606N37424O16492P17263O44660P95527Q51128J033208
3788D0876149J421760K012416K197505K268989J621716O67814n80739j372655
3780D9112955j835100k168591j889044j603804r28115o72317l11839j102362j335962
3771C7265821j557921j316541j397424r58553j105383j119041q90029n67559m57827
$$ y = [28673713, 29329484, 30211568, 30862285, 31334910, 31656246, 32014707, 33246869, 34780081, 36599310, 39044964, 41667170, 44127213, 46268825, 47877286, 48066081, 47592677, 47352276, 47137478, 47325926, 47299067, 47092855, 46444632, 45794879, 45040265, 44406283, 44028406, 43676483, 43458608, 43162103, 42843763, 42330192, 41482275, 40055475, 38332764, 36729196, 35662768, 35100686, 35139841, 35680447, 36217871, 36834363, 37551626, 38196286, 38991813, 39842941, 40876149, 42297909, 44310325, 46507830, 48776819, 50398535, 51066349, 50485610, 49112955, 47277855, 45109264, 43220220, 41616416, 40688301, 40015984, 39704145, 38601783, 37265821, 35707900, 34391359, 32993935, 32035382, 30929999, 29810958, 28920929, 28353370, 27895543]
3762B7895543j10094j5074K96286M73592M99735N91690K42168J84705o73859o37013
3752B8747679r69344j023327q77958p57172o10325p28417q38675q39981m46287
3743B1656193r19130q03091n44488l54572j53668k12841m115j43306k09620m09047
3733A7902315j00723j61864j16361M328l36962j9480j98186j41809J12510L3515
3723A6977283j64664o7771j06517q7787j43548N0327K30774J2764L58654J18233
3713A7177748L71926J42136L83555L14346M02977O00537M91744N41316O70552
3704B1096837P22420Q34918O77811Q75406R02803P23389N38777O61009P26626
3695B7759996Q73512P68197P03865J053430M55171L73387j77474p75482p58993
$$ y = [27895543, 27785449, 27770375, 28066661, 28540253, 29039988, 29631678, 29873846, 30058551, 29384692, 28747679, 27778335, 26755008, 25877050, 25119878, 24509553, 23781136, 22942461, 22102480, 21656193, 20737063, 19933972, 19389484, 19034912, 18881244, 18668403, 18664288, 18520982, 18311362, 17902315, 17801592, 17639728, 17523367, 17527695, 17190733, 17171253, 16973067, 16831258, 16943768, 16977283, 16812619, 16744848, 16638331, 16550544, 16406996, 16457323, 16688097, 16700861, 17059515, 17177748, 17549674, 17691810, 18075365, 18389711, 18792688, 19393225, 19884969, 20426285, 21096837, 21819257, 22654175, 23331986, 24207392, 25110195, 25833584, 26372361, 27033370, 27759996, 28633508, 29401705, 30105570, 31159000, 31614171, 31987558, 31810084, 31034602, 30275609]
3686C0275609q57191o27720n07414l06067J50130J33375N36648O64736J021223
3677C0483329J202076J343951J800567K000496K242024K123694J849326J641244
3669D4686707J479853J890265K167595K389323K168403J666567R11142r6331j047776
3660E6215748k112939j822848j793416j262068q36523m70679m7920j51110l37532
3651D7380713k15376l03442r0350L79223M88522N40697J068229J553792J408426
3642E2210434J338394Q95974N46832N00539Q07341R79878Q43598Q37345O95192
3633E9655527N80088L24421L19805L01883K26279L7099k2070N98982J14388m87980
3623F1648422j661163k432134k256075k192884j733727j589672j123778o77751
$$ y = [30275609, 29418418, 28790698, 28283284, 27977217, 28127347, 28260722, 28797370, 29462106, 30483329, 31685405, 33029356, 34829923, 36830419, 39072443, 41196137, 43045463, 44686707, 46166560, 48056825, 50224420, 52613743, 54782146, 56448713, 57359855, 57263524, 56215748, 54102809, 52279961, 50486545, 49224477, 48387954, 47917275, 47869355, 47718245, 47380713, 47165337, 46861895, 46771545, 47150768, 47639290, 48179987, 49248216, 50802008, 52210434, 53548828, 54444802, 54991634, 55492173, 56299514, 57279392, 58122990, 58960335, 59655527, 60235615, 60560036, 60879841, 61181724, 61408003, 61445102, 61423032, 62022014, 62136402, 61648422, 59987259, 57555125, 55299050, 53106166, 51372439, 49782767, 48658989, 47981238]
3615D7981238k47738j14079k37174l61423q67978o99051l32728m2520K81014N30057
3605D5889618R55469J169823J406746J471924J518600J273388R64463N20928N4377
3596E5225336o709o95964j368256j565970k057903k249060k294836k360930j592015
3587D1033693j196473j153218o45508l64868n06859l09737m47203l77869n66765
3578C5465193j70297n28043q7295Q6201o9059M74010N93229J81821O8904k90381
3568C5724283j69216N60k43696k02911m21088o70821j300816j071265r24008j042937
3558B9678085r06291o30599o43637o05308m23428k32212o76604m01280l37975
3549B4820751k64912m75920n05249l20496l84703n1778m25767p05050l98865m56656
$$ y = [47981238, 47733500, 47619421, 47382247, 47020824, 46152846, 45453795, 45121067, 45078547, 45359561, 45889618, 46845087, 48014910, 49421656, 50893580, 52412180, 53685568, 54650031, 55170959, 55225336, 55218627, 54522663, 53154407, 51588437, 49530534, 47281474, 44986638, 42625708, 41033693, 39837220, 38684002, 38038494, 37673626, 37166767, 36857030, 36409827, 36031958, 35465193, 35294896, 34766853, 34679558, 34765759, 34696700, 35170710, 35763939, 35945760, 36014664, 35724283, 35555067, 35555627, 35311931, 35109020, 34687932, 34017111, 32716295, 31645030, 30721022, 29678085, 28771794, 28141195, 27497558, 26892250, 26468822, 26236610, 25560006, 25158726, 24820751, 24555839, 24079919, 23574670, 23254174, 22869471, 22817693, 22391926, 21686876, 21288011, 20831355]
3539B0831355j16261l59440l91324l19496m87799j16453m8627j77386j85965l97724
3529A8230880j62239k3010k37861k55972m74471m26235l84898o9141l23588j81201
3519A5692264k75274k76504l31384n09825l86350m09776j38349l82433m70612
3510A2511757j14980k26254j65004K5394j78236p3672j13139P624j89561j92683
3500A1291246l6627j71077l01704j71740Q300j74832k85751k53759j32103q9312
3490I682641k25847k598j50259m35690J73004j66849k69000k0234j62716m8611
3480H373841r8399j59576K0292j81126k0129o032j59105J29554L6868j57063P4404
3469G853529j64452j96005Q6992l9930m7002L4474j23829n4057P7131K7947j23681
$$ y = [20831355, 20715094, 20355654, 19964330, 19644834, 19157035, 19040582, 18991955, 18814569, 18628604, 18230880, 18068641, 18045631, 17807770, 17551798, 17077327, 16651092, 16266194, 16197053, 15873465, 15692264, 15416990, 15140486, 14809102, 14299277, 13912927, 13503151, 13364802, 12982369, 12511757, 12396777, 12170523, 12005519, 12030913, 11852677, 11779005, 11665866, 11673490, 11483929, 11291246, 11254619, 11083542, 10781838, 10610098, 10618398, 10443566, 10157815, 9904056, 9771953, 9682641, 9456794, 9454196, 9303937, 8868247, 9041251, 8874402, 8605402, 8585168, 8422452, 8373841, 8275442, 8115866, 8136158, 7955032, 7934903, 7928871, 7769766, 7899320, 7936188, 7779125, 7853529, 7689077, 7493072, 7580064, 7540134, 7493132, 7527606, 7403777, 7349720, 7426851, 7454798, 7331117]
3458G331117j29382K4787J16164q657k38724j00767j8303j14088q7464m3532K02166
3447F933317j75501R4971R8507m0297L21625r6693l47976l3724K00191j43506
3437F810914n5955l8155R7272j66722Q5112k4971K7353J40192R1056N7343J9389
3426G042828l2117J098P7486r0016k34081P315p26O3838j51831K72864J54977
3415G111635k44461J28677Q6728J0178m7430k7799M6174j27169K76052R1800k72505
3404G031880M5977j45031N2716R8457p8711j771j26787n6027P8580j7502J05039
3393F986820J5734L5747L7328p3528l8617k1206J4819L6440m8070J17982J23259
3382G186708M5858j87662J17918L02414J2658j49492l80087J4290J7228k78073
$$ y = [7331117, 7201735, 7226522, 7342686, 7334029, 7095305, 6994538, 6976235, 6862147, 6774683, 6731151, 6933317, 6757816, 6852787, 6951294, 6910997, 7232622, 7135929, 6787953, 6754229, 6954420, 6810914, 6754959, 6716804, 6814076, 6647354, 6732466, 6707495, 6734848, 6875040, 6966096, 7023439, 7042828, 7010711, 7011809, 7089295, 6999279, 6765198, 6772513, 6771787, 6835625, 6683794, 6956658, 7111635, 6867174, 6995851, 7082579, 7092757, 7045327, 7017528, 7063702, 6936533, 7212585, 7304385, 7031880, 7077857, 6932826, 6985542, 7083999, 7005288, 7003517, 6876730, 6820703, 6899283, 6881781, 6986820, 7002554, 7038301, 7075629, 7002101, 6963484, 6942278, 6957097, 6993537, 6945467, 7063449, 7186708, 7232566, 7044904, 7162822, 7465236, 7477894, 7328402, 6948315, 6962605, 6979833, 6701760]
3372F701760n6218q8062Q4704O6853q6156j38115O6317r266k17271J58846l7103
3361F446289k02550J00579q482K4214N5228n674l03035j79258K0953K80455M3234
3350F271953J45711J29859M3841j01643J47258q1965j03869Q4221o718q3949l1224
3339F413475J00158J21547O0422k9439N8484k23175J09867k04359o4130M8252
3329F391102N1339K4878J00541j34047l83K68110K40510J21082j66589L82O2303
3318F959228L5349m9206R6142K32424J30798o7371R7761J84094K9122m8142Q5919
3307G686118j24687j89925J46960J64447K12028l9689j97831M15538J20764K1347
3297H215070N1310L8807R5244j86860p6355K84253Q5065L42243M53116J69717
$$ y = [6701760, 6645542, 6557480, 6642184, 6709037, 6622881, 6484766, 6551083, 6541817, 6324546, 6483392, 6446289, 6243739, 6344318, 6335836, 6360050, 6415278, 6409604, 6106569, 5927311, 5948264, 6228719, 6271953, 6417664, 6547523, 6591364, 6489721, 6636979, 6555014, 6451145, 6535366, 6528648, 6444699, 6413475, 6513633, 6635180, 6695602, 6666163, 6724647, 6501472, 6611339, 6406980, 6342850, 6391102, 6442441, 6467319, 6567860, 6433813, 6433430, 6701540, 6942050, 7063132, 6896543, 6896925, 6959228, 6994577, 6945371, 7041513, 7273937, 7404735, 7337364, 7435125, 7619219, 7648341, 7600199, 7686118, 7561431, 7371506, 7518466, 7682913, 7894941, 7855252, 7657421, 8072959, 8193723, 8215070, 8266380, 8305187, 8400431, 8213571, 8137216, 8421469, 8506534, 8848777, 9301893, 9471610]
3287I471610J71035J03512M57505L5135O4682L16053L10648n8694O9875M08882
3277A1350243L01286L17496K83451K49938K77990M61351N00439K98406N93876
3268A4634476O93600O04511R36476J149469J334032J331037J427403J282564J501155
3259B4894723J575479J292053J086424L78037n1096m80463j064190j484052j773597
3250B4373318j910634j891165j882948j673411j382102j003006r02064j031648
3242A2696340r03723o22065n13998m67559n93603n55629l06561k34692l47944
3233H150566k38780p6031r0254m80504k57086j74242j2181l62267k24762J64423
3223F398882J00640L14030K43772J07631k23023k42135l2272k65653m02217l9973
$$ y = [9471610, 9642645, 9746157, 10203662, 10238797, 10303479, 10619532, 10930180, 10871486, 10941361, 11350243, 11651529, 11969025, 12252476, 12502414, 12780404, 13241755, 13742194, 14040600, 14634476, 15328076, 15932587, 16869063, 18018532, 19352564, 20683601, 22111004, 23393568, 24894723, 26470202, 27762255, 28848679, 29226716, 29175620, 28695157, 27630967, 26146915, 24373318, 22462684, 20571519, 18688571, 17015160, 15633058, 14630052, 13727988, 12696340, 11792617, 11170552, 10656554, 10188995, 9595392, 9039763, 8733202, 8498510, 8150566, 7911786, 7835755, 7745501, 7264997, 7007911, 6833669, 6821488, 6459221, 6234459, 6398882, 6499522, 6813552, 7057324, 7164955, 6941932, 6699797, 6667525, 6401872, 5999655, 5959682]
3213E959682J04115j34280j01560Q6829k63850Q8760m0314j95688k86072J03217
3203E320839J224j42596m7410j48011l3977o9993J14422m3901l0956K1839l0349
3192D911131n961l5312n6690N3519J70846J19236l4975l3594q4932j90752q4611
3181D727905O1532n1365j95060k0648J95915l8663O3625j22173j44610k1942J15019
3170D569535r9035K6258J08982j16825J26965J4595j00658j1571N2653Q3326K41067
3159D895292q9449L2213k318r0847j01825O0845J11615j55719m0907n9877M5426
3148D604449Q2994k30453R7235j59316l6626o9783n5249K2541l8136L5267j43278
3137D109645j29842m6989J73162L1688l6082J38280K2874J65717m414R38J6576
$$ y = [5959682, 6063797, 5929517, 5827957, 5914786, 5650936, 5739696, 5699382, 5503694, 5217622, 5320839, 5322063, 5179467, 5132057, 4984046, 4950069, 4880076, 4994498, 4950597, 4919641, 4941480, 4911131, 4905170, 4869858, 4813168, 4866687, 5037533, 5156769, 5121794, 5088200, 5003268, 4812516, 4727905, 4789437, 4738072, 4543012, 4522364, 4718279, 4679616, 4743241, 4621068, 4476458, 4454516, 4569535, 4470500, 4496758, 4605740, 4488915, 4615880, 4630475, 4529817, 4518246, 4570899, 4654225, 4895292, 4805843, 4838056, 4835738, 4744891, 4643066, 4703911, 4815526, 4659807, 4618900, 4559023, 4604449, 4687443, 4456990, 4554225, 4394909, 4358283, 4288500, 4233251, 4255792, 4217656, 4252923, 4109645, 3979803, 3932814, 4105976, 4137664, 4101582, 4239862, 4262736, 4428453, 4424039, 4424977, 4441553]
3126D441553o8815r2300j41619R5276j77374J49104O7170N8740K707l9974k67668
3115D026800J32687O7423N7646j17201j34433n4371j64649J958j64227l42998
3105C308635l3472J00088j02875l0767j79223J38738J44029r4891m9348r3019
3095C107895M3163m0357j27866J55720n1911N7826j85867K2436p5160J8459Q6683
3084C011021m1230q7731P233P3319Q9135k54376o7587j54572J06369M5025J0483
3073B737089k1712o9539j14877j68963j74936j7187J53278r7232M0925l20507
3063A946339j82947J6790J81079n8423K8280j21236r3395O1885j3830j45542j19887
3052A499113k05450n0366K09204O2030R4555J9049k29970l7384l8498M5377m5028
$$ y = [4441553, 4372738, 4280438, 4138819, 4234095, 4056721, 4205825, 4272995, 4331735, 4334442, 4294468, 4026800, 4159487, 4226910, 4284556, 4167355, 4032922, 3978551, 3813902, 3815860, 3651633, 3308635, 3275163, 3375251, 3272376, 3241609, 3062386, 3201124, 3345153, 3250262, 3200914, 3107895, 3151058, 3110701, 2982835, 3138555, 3086644, 3144470, 2958603, 2981039, 2905879, 2924338, 3011021, 2969791, 2882060, 2889293, 2962612, 3051747, 2797371, 2729784, 2575212, 2681581, 2726606, 2737089, 2715377, 2645838, 2530961, 2361998, 2187062, 2169875, 2323153, 2225921, 2266846, 1946339, 1763392, 1780182, 1961261, 1902838, 1931118, 1809882, 1716487, 1778372, 1764542, 1619000, 1499113, 1293663, 1243297, 1452501, 1514531, 1609086, 1628135, 1398165, 1360781, 1322283, 1367660, 1322632]
3041A322632p7632P5941J6143M2455R4656l14818k11880L56884M841p1104J42283
3030A380401j8353k46778k3869r1044p7206J47396j90099J67910N0489j55940
3020I42907q9153O1781O3170j6735l5749q5204j80142J69038M9843P8403L382
3009I61541o8347K07710q6544q9964j71582j53272k2863J31686L6280j1764K02415
2998I35296N6715k41401j71233j10789J90640l5936J08933J0627n8582K63712
2988I47982j35679J2098k5569O6234K115n3539j99179J18119r0463P3384K12413
2977I27916k28066J16198J0870O6235K6424K2864J5318l116k09519K08827j11136
2966H42815r1760M7816l0779J86184p5937J6970q8888o8467j4558K37890J57851
$$ y = [1322632, 1245000, 1320941, 1337084, 1379539, 1474195, 1159377, 947497, 1304381, 1309222, 1238118, 1380401, 1362048, 1115270, 1091401, 1000357, 923151, 1070547, 880448, 1048358, 1098847, 942907, 853754, 915535, 978705, 961970, 926221, 841017, 660875, 829913, 879756, 958159, 961541, 893194, 1100904, 1014360, 924396, 752814, 599542, 576679, 708365, 744645, 732881, 935296, 992011, 750610, 579377, 468588, 659228, 623292, 732225, 742852, 684270, 947982, 812303, 824401, 798832, 865066, 867181, 813642, 614463, 732582, 642119, 715503, 927916, 699850, 816048, 826918, 893153, 919577, 942441, 957759, 954643, 745124, 953951, 842815, 751055, 798871, 768092, 954276, 878339, 895309, 806421, 737954, 723396, 961286, 1119137]
2955A119137q4172Q5104P6106j04323o7516l1327j71446K69828L9597j40677K19817
2944A210128J71295J66223R5826P2481k60451N7477J4268L8155o9299j24943j25849
2933A245311l699K24806M1633j24873j56675J83602j09932R0128P8136Q946l2913
2922A444470O3557L01450J85515O5885K56444J54470N2658l9659k70197j93060
2912B021533j22083l90391M2838j60777P879J2118p4447q4915m3507j11077j74800
2901I22371J96149J88461J53227k19468k08398J15565J33693o7324q2583J39307
2891A271000m3974l123p267J42633j25740j70747J61089J00204j02357j37514
2881A084204k23039k4795K12696j01648k2759m0994j01783J4949L9455k10265
$$ y = [1119137, 1034965, 1120069, 1196175, 1091852, 1024336, 993009, 821563, 1091391, 1130988, 990311, 1210128, 1381423, 1547646, 1643472, 1715953, 1455502, 1512979, 1527247, 1565402, 1496103, 1371160, 1245311, 1241612, 1466418, 1508051, 1383178, 1226503, 1410105, 1300173, 1390301, 1468437, 1477383, 1444470, 1508027, 1809477, 1994992, 2060877, 2317321, 2471791, 2524449, 2484790, 2214593, 2021533, 1899450, 1509059, 1551897, 1391120, 1398999, 1411117, 1336670, 1251755, 1208248, 1097171, 922371, 1118520, 1306981, 1460208, 1240740, 1032342, 1147907, 1281600, 1214276, 1131693, 1271000, 1227026, 1223903, 1216636, 1359269, 1233529, 1062782, 1223871, 1324075, 1221718, 1084204, 861165, 836370, 1049066, 947418, 924659, 883665, 781882, 796831, 836286, 626021]
2871F26021l8757J353J6725r2370l9276n5910L1077J41946K03097k57249p0457
2860D66200r9515q5671P747j30476J45631K4247q0134J36278q1540K119J3991
2849C18877J23686j05786N6128N2460j08415M2015j32748o7967J34295J87092
2839D99637o1950q8114O1062j24538J39395p7013q2433L8100j27533J17028J31300
2828D24941j29897m5866J18250j22354q6453O3073Q689l0474o3821J24731J08176
2817C68995r7810J86483j35422j1480J38533k6383J4268j28001j46965j3856J7470
2806A65832O8820j11601j70516Q0595J32167J2757J03772j79828M8599L3868l4276
2795A50189L1422j31516L4206J11637N8346j74595k17100J43833J2390q0121R0240
$$ y = [626021, 587264, 588617, 605342, 512972, 473696, 417786, 448863, 590809, 793906, 536657, 466200, 366685, 281014, 288761, 158285, 303916, 328163, 248029, 384307, 302767, 304886, 318877, 442563, 336777, 392905, 445365, 336950, 378965, 246217, 178250, 312545, 499637, 437687, 349573, 410635, 286097, 425492, 348479, 266046, 304146, 176613, 293641, 424941, 295044, 249178, 367428, 245074, 158621, 221694, 230383, 199909, 136088, 260819, 368995, 271185, 457668, 322246, 310766, 449299, 422916, 437184, 309183, 162218, 148362, 165832, 234652, 123051, -47465, 33130, 165297, 178054, 281826, 101998, 150597, 184465, 150189, 181611, 50095, 84301, 195938, 254284, 79689, -137411, 6422, 18812, -61309, 28931]
2784B8931J33267p6342j85127m2547K26756K39072k75145l4497p1534O0117N5019
2773E7970j2838o6467j25098J67922P3091o9684k3364K6842M701O8645j17071
2762a5351L2428K00281R0170r9398R9979k30091O3791L8183l8075j52245l1062
2751d1390L932J04705j97934n7713J66170P729m5480L5866L5790r7109K18302
2740A32868K4643j2794M3424n8417j75793N4536J35073J12136j70542q5183p41
2729g90j0907m6198J21349K635j16219k42679J05229m5894q6798K66834Q6502
2718C3064j40977N225P5563p5921J47238J12918k39162K8931P319j18785K59300
2707I4713j43960n0365R7929K45968o190j68877o7894k8759J76750j73121K10856
$$ y = [28931, 162198, 85856, -99271, -141818, 84938, 324010, 48865, 14368, -57166, 2951, 57970, 45132, -21335, -146433, 21489, 94580, 24896, 1532, 28374, 33075, 101720, -15351, 17077, 217358, 307528, 208130, 308109, 78018, 141809, 179992, 141917, -10328, -41390, -37458, 67247, -130687, -188400, -22230, -14501, -59981, -24115, 11675, -85434, 132868, 157511, 144717, 188141, 129724, -46069, 8467, 143540, 255676, 85134, -49, -790, -11697, -57895, 63454, 66089, -50130, -292809, -187580, -233474, -320272, -53438, 33064, -107913, -102688, -27125, -103046, 44192, 157110, -82052, -53121, -45802, -164587, 94713, -49247, -99612, -1683, 244285, 238095, 69218, 1324, -27435, 149315, -23806, 187050]
2696A87050j00935j62090P569k5451N6545L9712J70053R1030n7504j07806L6851
2685A35024l3159j97013L6154o8576J01781j11707J49230P8066j15601J60924
2675A35123K4143j46730j18008n2633K86521N4742j67541l8934Q1009J76343o8787
2664A65248j19990j45497J15790J488M997R913q0444Q917N8263n1237L1353J06632
2652A05433j32665j04294q9972L4154J73804o2607K10726j15671L360J37886P5805
2641B35959m105j63800P4473P4580q1256J87563N4504j39390o3840P1846K8715
2630B75249k43317o4242J07575j09093L7255L0413l1875k5701p915j5319K4862
2619b2108k8858p948k0896J51422J12549K7625j17263Q820p4137j3813n8626j46723
$$ y = [187050, 86115, -75975, -68406, -93857, -37312, 2400, 172453, 263483, 205979, 98173, 135024, 101865, -95148, -58994, -127570, -25789, -137496, 11734, 89800, -25801, 135123, 159266, 12536, -105472, -158105, 128416, 183158, 15617, -23317, 57692, 234035, 165248, 45258, -100239, 15551, 17039, 22036, 31949, -48495, -39578, 18685, -32552, -1199, 105433, -27232, -131526, -221498, -187344, -13540, -76147, 134579, 18908, 22268, 160154, 235959, 231854, 68054, 142527, 217107, 135851, 323414, 377918, 238528, 174688, 246534, 275249, 31932, -32310, 75265, -33828, 3427, 33840, 1965, -23736, -31651, -46970, -22108, -50966, -58914, -79810, 71612, 184161, 211786, 94523, 103343, 29206, 15393, -43233, -189956]
2607a89956m3029J7815J52609k8702j43076K7829J4207N3660J04253P1212N8742
2596I5564l2213j73284L30661J27901j99989r5327r1239k06543q280J08841j174
2585a45082J29025L4846J10823j72777J56910l8725M8036j26403n828k1674O9073
2574C8224l9694q6566o7972K36172J35350J93037j01539R192k34449n9409J57424
2563A79770o5378j93288j29159L5873o4195M3246n1851K57594J23825J57560m5634
2552B48363j4648l09188L2315J67209j53809o1411J7563J14604R1363O4171K7522
2541B24054N0161k18807O1580k5959j12129J79752j1157p8276M2201j92334p3440
2530a54354L306K21509J87699j42951M7134p5009q3846q8930q3873K72380J21524
$$ y = [-189956, -232985, -215170, -62561, -91263, -234339, -206510, -192303, -138643, -34390, 36822, 95564, 63351, -109933, 220728, 348629, 148640, 53313, -37926, -244469, -252749, -143908, -145082, -16057, 18789, 129612, -43165, 113745, 75020, 123056, -3347, -9175, -30849, 38224, -1470, -88036, -156008, 80164, 215514, 408551, 307012, 316204, 81755, 22346, 179770, 114392, -78896, -208055, -172182, -236377, -193131, -244982, 12612, 136437, 293997, 248363, 233715, -75473, -43158, 124051, -29758, -91169, -73606, 40998, 132361, 196532, 224054, 274215, 55408, 116988, 91029, -21100, 158652, 147495, 69219, 111420, -80914, -154354, -151048, 70461, 258160, 115209, 162343, 87334, 3488, -85442, -169315, 103065, 224589]
2519B24589j72833j18608p5064k3923O7450J3547k56926N8178J30156j13926j39784
2508d07144L97808J55k00488K01764o3147J4717l9798p0084N0981o022j47558
2497b68816J18174J49886o2377l7668j53465Q1586J22423R7038r0980R9148j78601
2486a23652J00918M9137j2877q5800q2272k0693J34021m2487j77029J5445J17714
2475a27575J93755J39643j58698p4159J11677k6402o8046L05371j83452k21899
2465a09785J49816j97058N1538l2806J27135N1984J52038o8967p9420j1787J1148
2454D3836n4059K3152j29753J3653o906J53429r4906j48797l219L3503K31106
2443F1039o4459j398o1402J09197M9003M800j10685m5302J42427j80846J42036
$$ y = [224589, 51756, -66852, -141916, -165839, -98389, -84842, -341768, -283590, -153434, -267360, -407144, -9336, -9181, -209669, -7905, -71052, -56335, -96133, -166217, -115236, -121258, -268816, -150642, -756, -63133, -100801, -254266, -172680, -50257, 46781, -44199, 54949, -123652, -22734, 26403, 13526, -72274, -154546, -175239, -41218, -83705, -260734, -245289, -127575, 66180, 205823, 47125, -27034, 84643, 58241, -9805, 295566, 112114, -109785, 40031, -157027, -105489, -138295, -11160, 40824, 192862, 123895, 44475, 32688, 43836, -10223, 12929, -116824, -103171, -110077, 43352, -51554, -200351, -203570, -170067, 61039, -3420, -4818, -66220, 42977, 91980, 96780, -13905, -59207, 83220, -97626, 44410]
2432D4410M7758n8612J45886k43789K11367p0553k05459L45349J87761k31051
2422A73067Q7229L629p4424J073o3214N5351j15461J76260l65283J29077K36064
2411B43368J12218j86482j37709q9268o7366J81256j09367R3067J95382L7039
2401B72138q6301J66951q4617j54951r041N7488q2942r3516N8017l9640O6332
2390F9918L8146o7843M4554K78127j13867n31l7036J26406j35756r3307J8340
2379A27151j06815l3281L8710K5133l8404m6721J14781K69961j24873j18901K5635
2368A32376J51754j21127q2678M8701q0631r1400J14014m5057k40966P6795L04704
2357A66485q8125k0543J17191p2490j09510L5482j53941o2871L6887l0736N572
$$ y = [44410, 92168, 33556, 179442, -64347, 147020, 76467, -128992, 216357, 404118, 173067, 260296, 263925, 189501, 190574, 127360, 182711, 67250, 243510, -121773, 7304, 243368, 355586, 169104, 31395, -57873, -125239, 56017, -53350, 39717, 235099, 272138, 185837, 352788, 268171, 113220, 104179, 161667, 78725, -14791, 43226, 3586, 69918, 108064, 40221, 84775, 362902, 249035, 248504, 211468, 337874, 202118, 108811, 127151, 20336, -12945, 25765, 50898, 12494, -34227, 80554, 350515, 225642, 106741, 132376, 284130, 163003, 80325, 129026, 48395, -43005, 71009, 25952, -215014, -138219, 166485, 78360, 57817, 175008, 102518, -6992, 28490, -125451, -188322, -151435, -182171, -176599]
2346a76599R1449k3573J77330O0027j35167p248k11697J99009P2083n5958j23793
2335a34137K15685j26678k11073K04205P116J17448O6023j63517L4178P2068j39382
2324e8064l6553r9493K44787J24253O675n9831P3851k79703j57707p5028J05462
2313b11351J75512J1568n4059R6259M6857J26433j40868R7587j35986j45975M5121
2302h8902J01593J26563n5159J7522Q6765M2139m7174J12311j91172Q5498j1959
2291A78025q3460r6273j15361J79529J3981Q3692J66044L4203j32635n517J35148
2280C57376j77051J25420j3435j90330m8271P8719n9970q7455M0157K1024J48801
2269A94985j8430j48256j0091O1341J20798j76953K32774L8938N2531j27690j72670
$$ y = [-176599, -85150, -108723, 68607, 128634, -6533, -13781, -225478, -26469, 45614, -10344, -134137, 81548, -45130, -256203, -51998, -44882, 72566, 138589, -24928, 9250, 81318, -58064, -94617, -194110, 50677, 174930, 181605, 121774, 195625, -84078, -241785, -316813, -211351, -35839, -24271, -78330, 17929, 64786, 191219, 50351, 147938, 11952, -134023, -88902, 12691, 139254, 84095, 101617, 188382, 230521, 183347, 295658, 104486, 189984, 178025, 94565, -1708, -117069, 62460, 76441, 160133, 326177, 360380, 227745, 222228, 357376, 180325, 305745, 292310, 101980, 53709, 132428, 72458, -14997, 25160, 46184, 194985, 176555, 28299, 18208, 79549, 200347, 23394, 256168, 295106, 347637, 219947, 47277]
2258D7277J08806j02790K4000N220p3508K66866P7615k5381o6316j24510J14574
2247B51853n403R4349J30046j62555N159J03397j24157J0069J51822j44032q9059
2236B21489m5525r1034K9376K8146O7585J8158K74061m8591J5026O998k39564
2225B36125j07384J22364O0739K33460N674k5306K8521k24659j37806Q1357L8958
2214C12043n4583m4889Q7001L04125j42500J991R6667M7756R2193J7949j5911
2203G01842n6888K8744j6822J79247P5927j70491K46192m0777p2893J58362J45116
2192A177559J65023J467O5279j77329N4220L57858o9947K4314j00535p5005K4987
2181A447891l5957O7142n9902J47632J81190o5829M3365J859J25572O6068l5225
$$ y = [47277, 156083, 53293, 77293, 82513, 9005, 275871, 353486, 328105, 261789, 137279, 251853, 246450, 340799, 470845, 308290, 313449, 416846, 292689, 302758, 454580, 310548, 221489, 175964, 84930, 114306, 142452, 210037, 228195, 502256, 453665, 468691, 475689, 236125, 128741, 251105, 311844, 545304, 550978, 525672, 554193, 329534, 191728, 273085, 312043, 257460, 212571, 299572, 603697, 461197, 463188, 559855, 607611, 699804, 717753, 701842, 644954, 673698, 656876, 836123, 912050, 741559, 987751, 946974, 874081, 1032443, 1177559, 1342582, 1344049, 1409328, 1231999, 1286219, 1644077, 1574130, 1598444, 1497909, 1422904, 1447891, 1411934, 1479076, 1419174, 1566806, 1747996, 1682167, 1725532, 1727391, 1852963, 1919031, 1883806]
2170A883806j08552K05446K21832J55608k72610k4383K88379J79852R9106L36546
2160B965030j087L049j57555M8304O9929K42529K09576m6451K50976M26395K64155
2149D274850K06409K42714K47927L21765P5654N4742K64269O45137N94332L94256
2139G322055L42091M43994O82264R03829J021764Q83650P99730L86790N80407
2130A3366574R04981J405323K279290K911739M088497N380157P263107R344776
2122D6944444J2267177J3940535J6235788J1666063m38593k0143453k2899938
2115E7572023j4246358r300539n719627m172677k997238k597672k083341j693586
2107A4760985r08019r55197l04514n93335o94227j092210j149565p52666q05608
$$ y = [1883806, 1775254, 1980700, 2202532, 2358140, 2085530, 2061147, 2349526, 2529378, 2628484, 2965030, 2963943, 2966992, 2809437, 2857741, 2927670, 3170199, 3379775, 3333324, 3584300, 4010695, 4274850, 4481259, 4723973, 4971900, 5293665, 5369319, 5424061, 5688330, 6333467, 6927799, 7322055, 7664146, 8108140, 8790404, 9694233, 10715997, 11599647, 12399377, 12786167, 13366574, 14271555, 15676878, 17956168, 20867907, 24956404, 30336561, 37599668, 46944444, 59211621, 73152156, 89387944, 101054007, 100615414, 80471961, 57572023, 43325665, 34025126, 28305499, 24132822, 21135584, 18537912, 16454571, 14760985, 13852966, 12897769, 12593255, 11999920, 11305693, 10213483, 9063918, 8311252, 7505644]
2098G505644n24186l63156n16618k53032l80819j29438m58507j24145j61414k54292
2088D340037k49414m4460l18242j98612p5071o5981k77357j31286j40527o6588
2078B772499k11180l3953k5311j23753n0967l0873j69326j54260l0025P5207j43205
2067A874853O5817o525j20003l2492M9908q9991k22021m5995J46193R1644j42442
2056A568946q7252k56903J53610j4537p7219n6558r4913R0550K3647J0152j4846
2045A244677j18764j04413J80493l3968j50968k7989r4418k54988J45737k2539
2035G62860k7104k7997K1289j21373J46887o0750l800o482k6100J40513r162j94370
2023E94411J59449J2328l09070J41415o0875n0037J53380r4964k2870n1681n8327
$$ y = [7505644, 6981458, 6618302, 6101684, 5848652, 5467833, 5338395, 4879888, 4755743, 4594329, 4340037, 4090623, 4046163, 3727921, 3529309, 3454238, 3388257, 3110900, 2979614, 2839087, 2772499, 2561319, 2527366, 2502055, 2378302, 2327335, 2296462, 2127136, 1972876, 1942851, 2018058, 1874853, 1940670, 1934145, 1814142, 1781650, 1831558, 1741567, 1519546, 1473551, 1619744, 1711388, 1568946, 1481694, 1224791, 1378401, 1363864, 1286645, 1230087, 1135174, 1225724, 1249371, 1259523, 1244677, 1125913, 1021500, 1201993, 1168025, 1017057, 989068, 894650, 639662, 785399, 762860, 735756, 707759, 729048, 607675, 754562, 693812, 690012, 683530, 657430, 797943, 788781, 594411, 753860, 766188, 457118, 598533, 537658, 487621, 641001, 546037, 523167, 471486, 413159]
2012D13159O8692j57027J50745p2634j2085J33190j61440o9066J77700k8342j00316
2001C42576j15011K21024N2356k55611O559K48830K3123j24098j7407k9244j50596
1990B02501J42422Q4851m7729J42051j36486l4153r104n3088J15203j52726L7320
1979B91062l10739m0309N5188K30878P2814K8143J19372m7300j16357r317q2130
1968A91305J02812k3784K7926J71483n5911n2577j52163j30093j34585J88367
1958A32780N2742j62082K6911N6546K0213J87032j0936M3237J4508j23495N4325
1947B91781m5422J3665m8988k35047K01280J54229L1019k69111j45937p1400J2003
1936a11928L4015Q2717N042P2245j0115j15030R1656J89977n935m54010K02717
$$ y = [413159, 481851, 324824, 475569, 402935, 390850, 524040, 362600, 293534, 471234, 442892, 342576, 227565, 448589, 500945, 245334, 251893, 500723, 523846, 399748, 382341, 353097, 202501, 344923, 429774, 382045, 524096, 387610, 353457, 344353, 291265, 406468, 253742, 291062, -19677, -59986, -4798, 226080, 298894, 327037, 446409, 399109, 282752, 273435, 191305, 294117, 270333, 298259, 469742, 413831, 361254, 209091, 78998, -55587, 132780, 185522, 23440, 50351, 106897, 127110, 314142, 303206, 346443, 360951, 237456, 291781, 246359, 260024, 211036, -24011, 177269, 331498, 362517, 93406, -52531, -123931, -111928, -77913, 4804, 9846, 82091, 71976, -43054, 48602, 238579, 232644, -221366, -18649]
1925a8649J77924k2466N1431j23446j18037J53690j39922l3265J13589p8958n8866
1914i6975j5192J29417J75352m3030j24916J31070o0496j76011K33185P3038r9633
1903A25809j1277j26300K78611j62477J12846n9377j8687N4208j69121p7533m0647
1892i3945J06637r6805J00193l4464J8829M9889k9882K55142k12589J3637o7477
1881I165J11697q9406p7941o4143l12730L12475m6327l6975o5585P7020O6963
1870a15787J08005j10357J77968q3948J04652Q3432m7693n5745P4078Q529j29514
1859A3620q1531J28433K67226p4500L5135M9072q7613r78K8394J16566l3067l9001
1847C21756n0888m9981p9134m7251J47565O3063p8838k23286L7852J04489J79928
$$ y = [-18649, 159275, 136809, 188240, 64794, -53243, 100447, -39475, -72740, 40849, -38109, -96975, -112167, 17250, 192602, 149572, 24656, 155726, 95230, -80781, 152404, 225442, 125809, 114532, -11768, 266843, 104366, 217212, 157835, 139148, 193356, 24235, -53298, -93945, 12692, -84113, 16080, -18384, 445, 50334, 20452, 275594, 63005, 76642, 9165, 120862, 31456, -46485, -110628, -423358, -110883, -157210, -194185, -259770, -182750, -115787, -7782, -118139, 59829, -24119, 80533, 163965, 116272, 60527, 134605, 143134, 13620, -67911, 60522, 327748, 253248, 288383, 337455, 249842, 248864, 277258, 393824, 360757, 321756, 270868, 220887, 141753, 94502, 242067, 305130, 226292, 3006, 40858, 145347, 325275]
1836C25275j91590p5665J60748j27385j46217L8156K57987p8794j96827O3614
1826B9302l7848j08413J42500J39047j56043J16218r702j2381k18181O7108J41661
1815I3268k2864K4550Q6491J64915j82278r4795M8672J57051n5574l27423J8269
1804h9718m806J74045J92543j29517j78774O9372Q858O7624O3467j99016r6326
1793a22248R3061N8150Q2674q9892N8021j19544j48836O3208K3838J13460l8307
1782b6415M346L5314j20306K7254k9301j52830k2058m5688J44301J49010n0508
1771h6881j02788M2358J61954j50317l3742P751K89549K4558r0861K9546m5172
1760D5955L7740j50087K9419k4616q08J34345j60522k2398N8459r300k31823l5067
$$ y = [325275, 133685, 58020, 218768, 91383, -54834, -16678, 241309, 162515, -34312, 29302, -8546, -116959, 25541, 164588, 8545, 124763, 115061, 102680, -115501, -48393, 93268, 70404, 94954, 181445, 346360, 164082, 69287, 117959, 275010, 219436, -107987, -89718, -94524, 79521, 272064, 142547, -36227, 33145, 42003, 109627, 173094, -25922, -122248, -29187, 28963, 111637, 21745, 79766, -39778, -188614, -125406, -101568, 11892, -26415, -22069, 13245, -107061, -79807, -109108, -261938, -283996, -329684, -185383, -36373, -86881, -189669, -147311, 14643, -135674, -169416, -161665, 127884, 152442, 61581, 91127, 45955, 83695, -66392, -36973, -61589, -62397, 71948, -88574, -110972, -52513, -61813, -293636, -328703]
1748c28703J67414j30971J65818K04847k10479k008K35397k44012j37729P7745
1738b02681R1095j26170L74767J23382j60810j10744m6826n1296m9380o4772J6086
1727b07349J28064n4217j39973K2913P8276O9916p7954O6289M4526P8270p0258
1716f1497P8809J16636j89792J54835K1611j01967j97548R4243J01845r0008j1814
1705h4647m2696J45006O5595p0910o8072j4796N2374K08917J2523j23654N5771
1694A35411j91903k21326K22694j89968q608J54943J25586j29438n3295J35225
1684b0679J26038J4364k41285l0263M4982J95285p1738m9511N7954O6288j38905
1673d7470n1731k8968J9465J98245J22060j94506J25339J31011k08424j31835
$$ y = [-328703, -161289, -292260, -126442, 78405, -132074, -134082, 101315, -142697, -280426, -202681, -111586, -237756, 137011, 260393, 99583, -11161, -57987, -109283, -158663, -223435, -207349, -79285, -133502, -273475, -250562, -172286, -102370, -180324, -114035, -69509, 8761, -61497, 17312, 133948, -55844, 98991, 120602, 18635, -178913, -84670, 17175, -72833, -84647, -127343, 17663, 83258, 12348, -55724, -70520, -18146, 190771, 203294, 79640, 135411, -56492, -277818, -55124, -245092, -253700, -98757, 26829, -102609, -155904, -20679, 105359, 119723, -121562, -151825, -106843, 88442, 16704, -32807, 25147, 91435, -47470, -99201, -128169, -108704, 89541, 211601, 17095, 142434, 273445, 65021, -66814]
1663f6814K0819k9634O875j80848L938K60924j26704J20061M0785j49263M972
1652i4889J54939L1963N6801p3822J02055j629L9707m0753j45426K6981n0830
1641E097j99710Q5084K8715J20169m039k29356J89160K46427r0076j58403J07395
1630A00463k67140R102J28779K44391k7640L7227j45606q1012K50174l1268j61824
1619E5646n3360r5158K23090J81694p0248j63953M2681J8926q1298k6404k0833
1608A0783J7008o7739P2487J44666j66168j42250K59419k7264j48925o6283L1158
1597h3108K05046O3050k01515N4180l6881R3066J14727m4570j00671m7677M6183
1586F1830m8608j69869K92543J18364k84403J6985m3947K06669n5664r1949K2919
$$ y = [-66814, -45995, -75629, -68754, -249602, -245664, 15260, -111444, 8617, 49402, -99861, -94889, 60050, 92013, 148814, 74992, 177047, 175418, 215125, 174372, 28946, 55927, 5097, -194613, -109529, -80814, 39355, 35316, -194040, -4880, 241547, 151471, -6932, 100463, -166677, -157575, -28796, 215595, 187955, 225182, 79576, -1436, 248738, 217470, 55646, 2286, -92872, 130218, 311912, 241664, 77711, 120392, 139318, 58020, 31616, 10783, 27791, -39948, 32539, 177205, 11037, -131213, 128206, 100942, -47983, -114266, -83108, 121938, 184988, -16527, 37653, 772, 93838, 208565, 163995, 63324, 15647, 61830, 13222, -156647, 135896, 254260, -30143, -13158, -57105, 149564, 93900, 1951, 24870]
1575B4870J2232k55877n067J95529K5053p7818J61731r3583O7453N4048q7018
1564B1553M8165l87937J19719J37270j78050J19927J50264k23871m5045J09226
1554a28779K33943k19282k28050K74599j34028N8334K03251j57795J84612K2946
1544A09751j31032l6545J32612J07712Q4205k57204o5199Q7088j97107R297M0631
1533a15791J33467j65202P6178O4011j42393N1793n536R3375o2663j48233J2638
1522b08356k2096J31114q4303Q367r7985K21675P7044o5559J21215r8253N9541
1511D2404R9294o6950N3368j01217j58281J68913n4327k2783K31298r7173j17297
1500b2751j04920k8293O7822J67413N0283k06230K84058o2849k09203N1845L6792
$$ y = [24870, 37102, -218775, -223842, -28313, -3260, -81078, 80653, -12930, 54523, 108571, 21553, 69718, -318219, -198500, -61230, -239280, -119353, 30911, -192960, -238005, -128779, 105164, -114118, -342168, -67569, -201597, -143263, 59988, -97807, 86805, 109751, -21281, -57826, 74786, 182498, 266703, 9499, -55700, 31388, -165719, -156422, -115791, 17676, -147526, -71348, -7337, -149730, -97937, -103473, -10098, -72761, -220994, -208356, -230452, -99338, -183641, -175274, -273259, -51584, 25460, -40099, 81116, -17137, 42404, 141698, 74748, 128116, 26899, -131382, 37531, -16796, -39579, 191719, 94546, -22751, -127671, -155964, -88142, 79271, 129554, -76676, 207382, 144533, -64670, -12825, 23967]
1489B3967n7531j35638q3844M7069M840o2112K15346K66536j22417j2122M0660
1478A24754p9889r3958R7782O621J8438k01051K37761n2785j79661J07101M5088
1467C0201j20598k3356M7953r8177J2181n9271K2864N5471r027L8973J56344n0167
1455C391p4331r302p2932J20421M3731J34183j35864P107n9735r5125J31619M7327
1443D0490k27j86822n0242J78384J7245n693o9030m0730P64O9990J19473j00836
1431b7234O9004n5103o5412O747j50750K4952J31446J249J50124l9777o4533l03687
1419c22974R287J62497J31863j3731k22424p109K23504k0850j19973P7270j11456
1408b14096O4312J6126k9059K66657j44498o2335m1290K9902J58379O7749r5032
$$ y = [23967, -33564, -169202, -253046, -205977, -201137, -263249, -47903, 218633, 96216, 84094, 124754, 44865, -49093, 48689, 55310, 73748, -127303, 110458, 57673, -121988, -14887, 30201, -90397, -113753, -65800, -163977, -151796, -211067, -188203, -132732, -141759, -102786, 53558, 3391, -70940, -80242, -153174, -32753, 10978, 145161, 9297, 16404, -43331, -138456, -6837, 40490, 40263, -146559, -196801, -18417, -1172, -6865, -75895, -116625, -115861, -45871, 73602, -27234, 41770, -13333, -78745, -71998, -222748, -197796, -66350, -65101, 85023, 45246, -19287, -322974, -313687, -151190, -19327, -33058, -255482, -262591, -39087, -59937, -179910, -102640, -214096, -149784, -133658, -162717, 103940, -40558, -102893, -144183, -114281, 44098, 111847, 16815]
1397A6815m0528p596l537j8077K66160j55482k48971J30406J58347r1429P343
1386A3451J38518p4763J54529j32974k192l5863K8612j73048j72595J84846R2258
1375B0779J17705q7818k83281J41838l8367r9759J80108J16582o4142M9131R1510
1364A44286j17928Q1568k24139k7110k7771J04103r2876j10868R9670J37319O0910
1353B7164m5758k24800J07075q3002n4326O9212J27244j9999j31790K78441j34970
1342h5509j33190O3897K77549p3174j15987J53357J94869n9711j59808j31752
1332f9459O4642m5046J94387p4814K7380q7002P6651o1951j31094K3880p8405
1321a60831K16459j24615k80777r407K66891P3472L4004L3250k58991M9341J57914
$$ y = [16815, -23713, -31309, -34846, -52923, 213237, 57755, -191216, -60810, 97537, 6108, 13451, 151969, 77206, 231735, 98761, 96569, 60706, 89318, -83730, -256325, -71479, 20779, 138484, 50666, -232615, -90777, -129144, -228903, -48795, 67787, 3645, 52776, 144286, 26358, 107926, -116213, -143323, -171094, -66991, -159867, -270735, -171065, -33746, 27164, -18594, -243394, -136319, -219321, -273647, -204435, -77191, -97190, -228980, 49461, -85509, -218699, -154802, 122747, 49573, -66414, 86943, 281812, 222101, 62293, -69459, -4817, -49863, 144524, 69710, 97090, 10088, 86739, 24788, -106306, -82426, -160831, 55628, -68987, -349764, -359171, -92280, -18808, 15196, 48446, -210545, -161204, -3290]
1310c290r5493J41259j98980o4107n7974J31736J52374j07059L5830K31669P6592
1299B42557k504n8095l3869O5969k01863k9109o1496q603R0482l9367q5263N5217
1287f5944j9318J42029M3364j00822J9085J25140r3456j58550N3465K5902K61698
1276B32593k54486K2482P3236J12910J27987m9497j68484p8959r558r1582j79364
1265b62722k9973R1859J58149Q4140k87129J17068M1075K15815j96429j02255
1255a70402K12297K9902L1426R0401k03935j9596N0091K4563j23741j43099K15692
1244f401K100m4007k40332M6696J75882j78896J44162p4670m3917O8172J20749
1233c0462J13653P4361o3375R5972K2474q14j48366K06148O7960k33718k92254
$$ y = [-3290, -98783, 42476, -156504, -220611, -278585, -146849, 5525, -101534, -65704, 165965, 242557, 240053, 181958, 148089, 214058, 12195, -16914, -78410, -87013, 3469, -35898, -121161, -65944, -85262, 56767, 100131, -691, 18394, 143534, 50078, -108472, -55007, -29105, 232593, -21893, 589, 73825, 186735, 314722, 265225, 96741, 17782, 8224, -83358, -262722, -292695, -200836, -42687, 41453, -245676, -128608, -87533, 128282, -68147, -170402, 41895, 71797, 103223, 193624, -10311, -29907, 20184, 44747, -78994, -222093, -6401, -4301, -48308, -288640, -241944, -66062, -244958, -100796, -175466, -219383, -151211, -30462, 83191, 157552, 94177, 190149, 212623, 211809, 63443, 269591, 337551, 103833, -188421]
1222a88421n9185K12422N5850K9340O1206r5567j76734p7840J8237K79089j32616
1211g4219o4700m0371j6896N441K9130P8104P4196K26854o7251k09954j333l975
1199f4974K93633j59235j11637M117K00769M6851q9283L1669m6475K01919j46828
1188A60526j14446n3503n7039M8937J58334l9725j12317m7719o6346L16391j62500
1177C0593J58130q0643K6950k55j11376q9648j38889P9678M1633J33429O8104
1166A17706j37955j48860K03337M988j52040j54001K40262J10405j15471j19934
1156a51563M4545J14915r106J00660p3572j17077K72128r9883j51258K4443O4206
$$ y = [-188421, -247606, -35184, 20666, 50006, 111212, 15645, -161089, -238929, -220692, 58397, -74219, -138919, -179290, -196186, -190745, -161615, -83511, -9315, 217539, 150288, -59666, -60999, -64974, 228659, 69424, -42213, -38096, 162673, 209524, 120241, 151910, 105435, 307354, 160526, 46080, -7423, -64462, -15525, 142809, 103084, -9233, -56952, -123298, 193093, 30593, 188723, 108080, 135030, 134775, 23399, -66249, -205138, -125460, -83827, 49602, 117706, -20249, -169109, 34228, 39216, -112824, -266825, -26563, 83842, -31629, -151563, -107018, 7897, -1209, 99451, 25879, -91198, 180930, 81047, -70211, -45768, 18438]
$$ [...]
##END NTUPLES=NMR SPECTRUM
##END=
