##TITLE=1H_EC-3264(7-3)
 CDCl3
 8 sc, 
 11.1.2022
##JCAMPDX= 6.0         $$ Bruker NMR JCAMP-DX V2.0
##DATA TYPE= NMR SPECTRUM
##DATA CLASS= NTUPLES
##ORIGIN= UXNMR, Bruker Analytische Messtechnik GmbH
##OWNER= root
$$ XWIN-NMR		Version 3.5
$$ Tue Jan 11 11:29:06 2022 Russian Standard Time (UT+4h)  she@DPX200
##.OBSERVE FREQUENCY= 200.131346
##.OBSERVE NUCLEUS= ^1H
##.ACQUISITION MODE= SIMULTANEOUS
##.ACQUISITION SCHEME= undefined
##.AVERAGES= 8
##.DIGITISER RES= 18
##SPECTROMETER/DATA SYSTEM= spect
##.PULSE SEQUENCE= zg30
##.SOLVENT NAME= CDCl3
##.SHIFT REFERENCE= (INTERNAL, CDCl3, 0, 15.726)
##AUDIT TRAIL= $$ (NUMBER, WHEN, WHO, WHERE, WHAT)
$$ ##TITLE= Audit trail, XWIN-NMR		Version 3.5
$$ ##JCAMPDX= 5.01
$$ ##ORIGIN= Bruker BioSpin GmbH
$$ ##OWNER= she
$$ F:/spectra/data/she/nmr/H-F/1/pdata/1/auditp.txt
$$ ##AUDIT TRAIL=  $$ (NUMBER, WHEN, WHO, WHERE, WHAT)
(   1,<2022-01-11 11:27:48.92 +0400>,<she>,<DPX200>,
      <created by zg, POWCHK disabled, PULCHK disabled
       configuration hash MD5:
       00 E9 B6 7A A2 85 ED C7 34 08 36 98 17 FE 4E 26
       data hash MD5: 16K
       4D 6E CD F7 9D 11 E5 BE 81 58 6A ED D2 09 82 9F>)
(   2,<2022-01-11 11:27:51.57 +0400>,<she>,<DPX200>,
      <Start of raw data processing
       efp BC_mod = 2 LB = 0.24 FT_mod = 6 PKNL = 1 PHC0 = -15865.86 PHC1 = 11.00079 SI = 16K 
       data hash MD5: 16K
       6E 98 BA 76 E5 E9 DE 1E 6F 5A 00 B7 E9 2F 88 62>)
(   3,<2022-01-11 11:28:07.07 +0400>,<she>,<DPX200>,
      <pk PHC0 = 0.6095055 PHC1 = -0.8 
       data hash MD5: 16K
       C2 B8 03 31 3C 53 00 FD C9 9D 4F 44 C8 C6 2A E0>)
(   4,<2022-01-11 11:28:10.31 +0400>,<she>,<DPX200>,
      <abs ABSG = 5 
       data hash MD5: 16K
       58 E7 C5 20 B2 88 8B 84 73 18 1B 59 C9 8F A2 C1>)
$$ ##END=
$$ 
$$ hash MD5
$$ 70 CD 7F CF 27 DB 8C EB 32 A8 9E AB 6A 63 E7 F1
##$RELAX= 
##$RELAX= 
##$RELAX= 
##$RELAX= 
##$RELAX= 
##$RELAX= 
$$ Bruker specific parameters
$$ --------------------------
##$DU= <F:/spectra>
##$EXPNO= 1
##$NAME= <H-F>
##$PROCNO= 1
##$TYPE= <nmr>
##$USER= <she>
##$AMP= (0..31)
100 100 100 100 100 100 100 100 100 100 100 100 100 100 100 100 100 100 
100 100 100 100 100 100 100 100 100 100 100 100 100 100 
##$AQSEQ= 0
##$AQ_mod= 1
##$AUNM= <au_zg>
##$AUTOPOS= <>
##$BF1= 200.13
##$BF2= 200.13
##$BF3= 200.13
##$BF4= 200.13
##$BF5= 200.13
##$BF6= 200.13
##$BF7= 200.13
##$BF8= 200.13
##$BYTORDA= 1
##$CFDGTYP= 0
##$CFRGTYP= 5
##$CHEMSTR= <none>
##$CNST= (0..31)
1 1 145 1 1 1 1 1 1 1 1 1 1 1 1 1 1 1 1 1 1 1 1 1 1 1 1 1 1 1 1 1 
##$CPDPRG= <>
##$CPDPRG1= <>
##$CPDPRG2= <>
##$CPDPRG3= <>
##$CPDPRG4= <mlev>
##$CPDPRG5= <mlev>
##$CPDPRG6= <mlev>
##$CPDPRG7= <mlev>
##$CPDPRG8= <mlev>
##$CPDPRGB= <>
##$CPDPRGT= <>
##$D= (0..31)
0 1.2 0 0 0 0 0 0 0 0.06 0 0.03 0 0 0 0 0.0002 0 0 0 0 0 0 0 0 0 0 0 0 
0 0 0 
##$DATE= 1641886068
##$DBL= (0..7)
120 120 120 120 120 120 120 120 
##$DBP= (0..7)
150 150 150 150 150 150 150 150 
##$DBP07= 0
##$DBPNAM0= <>
##$DBPNAM1= <>
##$DBPNAM2= <>
##$DBPNAM3= <>
##$DBPNAM4= <>
$$ [...]
##$SUBNAM2= <"">
##$SUBNAM3= <"">
##$SUBNAM4= <"">
##$SUBNAM5= <"">
##$SUBNAM6= <"">
##$SUBNAM7= <"">
##$SUBNAM8= <"">
##$SUBNAM9= <"">
##$SW= 18.0517287032376
##$SWIBOX= (0..15)
0 0 2 0 0 0 0 0 0 0 0 0 0 0 0 0 
##$SW_h= 3612.71676300578
##$TD= 16384
##$TD0= 1
##$TE= 0
##$TE2= 300
##$TE3= 300
##$TEG= 300
##$TL= (0..7)
0 120 120 120 120 120 120 120 
##$TP= (0..7)
150 150 150 150 150 150 150 150 
##$TP07= 0
##$TPNAME0= <>
##$TPNAME1= <>
##$TPNAME2= <>
##$TPNAME3= <>
##$TPNAME4= <>
##$TPNAME5= <>
##$TPNAME6= <>
##$TPNAME7= <>
##$TPOAL= (0..7)
0.5 0.5 0.5 0.5 0.5 0.5 0.5 0.5 
##$TPOFFS= (0..7)
0 0 0 0 0 0 0 0 
##$TUNHIN= 0
##$TUNHOUT= 0
##$TUNXOUT= 0
##$USERA1= <user>
##$USERA2= <user>
##$USERA3= <user>
##$USERA4= <user>
##$USERA5= <user>
##$V9= 5
##$VALIST= <valist>
##$VCLIST= <CCCCCCCCCCCCCCC>
##$VD= 0
##$VDLIST= <DDDDDDDDDDDDDDD>
##$VPLIST= <PPPPPPPPPPPPPPP>
##$VTLIST= <TTTTTTTTTTTTTTT>
##$WBST= 1024
##$WBSW= 4
##$XGAIN= (0..3)
0 0 0 0 
##$XL= 0
##$YL= 0
##$YMAX_a= 358391
##$YMIN_a= -510299
##$ZGOPTNS= <>
##$ZL1= 120
##$ZL2= 120
##$ZL3= 120
##$ZL4= 120
##$ABSF1= 15.71494
##$ABSF2= -2.336909
##$ABSG= 5
##$ABSL= 3
##$ALPHA= 0
##$AQORDER= 0
##$ASSFAC= 0
##$ASSFACI= 0
##$ASSFACX= 0
##$ASSWID= 0
##$AUNMP= <proc_1d>
##$AZFE= 0.1
##$AZFW= 0.1
##$BCFW= 0
##$BC_mod= 2
##$BYTORDP= 0
##$COROFFS= 0
##$CY= -3
##$DATMOD= 1
##$DC= 0
##$DFILT= <>
##$DTYPP= 0
##$F1P= 0
##$F2P= 0
##$FCOR= 1
##$FTSIZE= 16384
##$FT_mod= 6
##$GAMMA= 0
##$GB= 0
##$INTBC= 1
##$INTSCL= 0
##$ISEN= 128
##$LB= 0.24
##$LEV0= 0
##$LPBIN= 0
##$MAXI= 10000
##$MC2= 0
##$MEAN= 0
##$ME_mod= 0
##$MI= 1.114404
##$NCOEF= 0
##$NC_proc= -6
##$NLEV= 6
##$NOISF1= 3.799351
##$NOISF2= 2.8
##$NSP= 0
##$NTH_PI= 0
##$NZP= 0
##$OFFSET= 15.72596
##$PC= 1
##$PHC0= -15865.25
##$PHC1= 10.20079
##$PH_mod= 1
##$PKNL= yes
##$PPARMOD= 0
##$PSCAL= 0
##$PSIGN= 0
##$REVERSE= no
##$SF= 200.130005123195
##$SI= 16384
##$SIGF1= 3
##$SIGF2= 2
##$SINO= 5.538805
##$SIOLD= 16384
##$SREGLST= <1H.CDCl3>
##$SSB= 0
##$STSI= 16384
##$STSR= 0
##$SW_p= 3612.71676300578
##$SYMM= 0
##$S_DEV= 0
##$TDeff= 16384
##$TDoff= 0
##$TI= <>
##$TILT= no
##$TM1= 0
##$TM2= 0
##$TOPLEV= 0
##$USERP1= <user>
##$USERP2= <user>
##$USERP3= <user>
##$USERP4= <user>
##$USERP5= <user>
##$WDW= 1
##$XDIM= 16384
##$YMAX_p= 394067620
##$YMIN_p= -885604
$$ End of Bruker specific parameters
$$ ---------------------------------
##NTUPLES= NMR SPECTRUM
##VAR_NAME=  FREQUENCY,     SPECTRUM/REAL,   SPECTRUM/IMAG
##SYMBOL=    X,             R,               I
##VAR_TYPE=  INDEPENDENT,   DEPENDENT,       DEPENDENT
##VAR_FORM=  AFFN,          ASDF,            ASDF
##VAR_DIM=   16384,         16384,           16384
##UNITS=     HZ,            ARBITRARY UNITS, ARBITRARY UNITS
##FACTOR=    0.220516191357247, 1,           1
##FIRST=     3147.23641090468, 0,            0
##LAST=      -465.480352101097, 0,           0
##MIN=       -465.480352101097, -885604,     0
##MAX=       3147.23641090468, 394067620,    0
$$ Real data points
##PAGE= N=1
##DATA TABLE= (X++(R..R)), XYDATA
$$ [...]
$$ plain form
7166 1063725 1064778 1155375 1269544 1205528 1213383 1216553 1188872 1237120 1309449 1415785 1501972 1578159
7154 1578159 1572177 1661173 1775876 1757278 1832251 1912868 1904149 2081951 2145155 2225798 2206716
7143 2206716 2195354 2314555 2352945 2337628 2387730 2511706 2590386 2567113 2536750 2673585 2738091
7132 2738091 2758967 2827713 2844256 2940717 3062967 3220419 3265303 3231906 3190965 3342487 3403965
7121 3403965 3520344 3533937 3620716 3732837 3846546 3820238 3829286 4011091 4187522 4310753
7111 4310753 4518412 4525065 4579687 4797347 5034593 5289025 5494436 5788743 6122102 6395034
7101 6395034 6684636 6883959 7059798 7274519 7550951 7853086 8168081 8492613 8810002 9346289
7091 9346289 9813230 10338553 10787255 11369602 11965667 12642086 13504247 14439780 15439001 16543640
$$ packed form
7166A063725J053R0597J14169o4016P855L170k7681M8248P2329J06336Q6187P6187
7154A578159n982Q8996J14703j8598P4973Q0617q719J77802O3204Q0643j9082
7143B206716j1362J19201L8390j5317N0102J23976P8680k3273l0363J36835O4506
7132B738091K0876O8746J6543R6461J22250J57452M4884l3397m0941J51522O1478
7121C403965J16379J3593Q6779J12121J13709k6308R048J81805J76431J23231
7111D310753K07659O653N4622K17660K37246K54432K05411K94307L33359K72932
7101F395034K89602J99323J75839K14721K76432L02135L14995L24532L17389N36287
7091I346289M66941N25323M48702N82347N96065O76419Q62161R35533R99221J104639
$$ plain form
7081 16543640 17643553 18865144 20411675 22185427 24283916 26816083 29824986 33039407
7073 33039407 36155633 39341437 42806052 46911648 51914472 58560864 67236837 77959391
7065 77959391 90337517 102633674 111595062 113975347 108177448 96085083 80994432 66604196
7057 66604196 54959013 46204561 39598487 34660271 30854123 27856156 25284348 23273934
7049 23273934 21513702 19727606 18267598 16930231 15500554 14437421 13647564 12887771
7041 12887771 12466192 12018309 11669249 11449274 11231718 10956579 10851881 10727285 10750340 10809135
7031 10809135 10899456 11088359 11088219 11099253 10768963 10333684 9917661 9639603 9465964 9323194
7021 9323194 9136584 9143517 8965312 8514831 8077864 7586463 7203129 6939881 6748994 6395095
$$ packed form
7081A6543640J099913J221591J546531J773752K098489K532167L008903L214421
7073C3039407L116226L185804L464615M105596N002824O646392Q675973J0722554
7065G7959391J2378126J2296157Q961388K380285n797899j2092365j5090651j4390236
7057F6604196j1645183q754452o606074m938216l806148k997967k571808k010414
7049B3273934j760232j786096j460008j337367j429677j063133p89857p59793
7041A2887771m21579m47883l49060k19975k17556k75139j04698j24596K3055N8795
7031A0809135R0321J88903j40J1034l30290m35279m16023k78058j73639j42770
7021I323194j86610O933j78205m50481m36967m91401l83334k63248j90887l53899
$$ plain form
7011 6395095 6257818 6044116 5812839 5881676 5775531 5695742 5571969 5596434 5724608 5629968
7001 5629968 5621054 5644062 5689240 5748089 5901907 6180563 6419808 6636480 6971647 7321564
6991 7321564 7884711 8552482 9525123 10696949 11798055 12984900 14043658 14395365 14020386
6982 14020386 12878216 11634787 10381717 9254562 8388879 7772526 7458163 7157339 6927741
6973 6927741 6781589 6907842 7022371 7133062 7349430 7665767 8113865 8456484 9107823 9744410
6963 9744410 10349099 10950405 11576785 12058270 12289779 12301484 12112842 11888746 11431100 11068169
6953 11068169 10631177 10087985 9792720 9509802 9350101 9309493 9283728 9446605 9733508 10073844
6943 10073844 10543256 10896157 11151696 11236758 11259598 11230864 10990799 10487909 9831052 9164635
$$ packed form
7011F395095j37277k13702k31277O8837j06145p9789j23773K4465J28174r4640
7001E629968q914K3008M5178N8849J53818K78656K39245K16672L35167L49917
6991G321564N63147O67771R72641J171826J101106J186845J058758L51707l74979
6982A4020386j142170j243429j253070j127155q65683o16353l14363l00824k29598
6973F927741j46152J26253J14529J10691K16368L16337M48098L42619O51339O36587
6963I744410O04689O01306O26380M81485K31509J1705j88642k24096m57646l62931
6953A1068169m36992n43192k95265k82918j59701m0608k5765J62877K86903L40336
6943A0073844M69412L52901K55539Q5062K2840k8734k40065n02890o56857o66417
$$ plain form
6933 9164635 8562509 7873795 7186031 6595716 6101379 5568117 5175022 4848225 4552011 4318797
6923 4318797 4011012 3779439 3505986 3413646 3235888 3040387 2930298 2821287 2743477 2778893
6913 2778893 2671631 2521335 2442896 2350143 2239397 2130512 1986263 1974653 1871734 1774537
6903 1774537 1626430 1503656 1536232 1566523 1441244 1326803 1361001 1336707 1217266 1220348 1176341
6892 1176341 1075930 1032317 993109 1103724 1110655 1042033 991233 948260 931086 928236 867935
6881 867935 792310 833515 854203 788465 760802 734873 767190 654814 610686 716787 640007
6870 640007 537662 487244 527465 497411 547836 431118 436393 533727 562886 540155 427780
6859 427780 393724 448426 436437 399865 375108 368844 356847 286259 260607 241484 381331 409545
$$ packed form
6933I164635o02126o88714o87764n90315m94337n33262l93095l26797k96214k33214
6923D318797l07785k31573k73453r2340j77758j95501j10089j09011p7810L5416
6913B778893j07262j50296p8439r2753j10746j08885j44249j1610j02919r7197
6903A774537j48107j22774L2576L0291j25279j14441L4198k4294j19441L082m4007
6892A176341j00411m3613l9208J10615O931o8622n0800m2973j7174k850o0301
6881H67935p5625M1205K0688o5738k7663k5929L2317j12376m4128J06101p6780
6870F40007j02345n0418M0221l0054N0425j16718N275R7334K9159k2731j12375
6859D27780l4056N4702j1989l6572k4757o264j1997p0588k5652j9123J39847K8214
$$ plain form
6847 409545 405935 409484 370463 352105 393079 401797 377574 296684 365632 411831 362866 371110
6835 371110 301238 213867 358775 338095 273144 398959 399131 361278 292361 296320 312620 280931
6823 280931 214707 374076 349309 302985 261230 186556 160208 138037 224850 306052 189244
6812 189244 84946 219774 200202 203070 123092 193913 134252 236127 259562 188292 217826
6801 217826 97448 146320 134808 59865 115742 202917 215205 203451 110354 102398 150304 192652
6789 192652 150757 188489 138811 162271 175349 123581 235655 275963 247246 231966 298712
6778 298712 367504 252559 186218 187816 226483 230703 201322 162784 199111 259320 211266 210864
6766 210864 236714 151252 114195 89928 104823 158793 105241 124604 146303 244982 208745 199513
$$ packed form
6847D09545l610L549l9021j8358M0974Q718k4223q0890O8948M6199m8965Q244
6835C71110o9872q7371J44908k0680o4951J25815J72l7853o8917L959J6300l1689
6823B80931o6224J59369k4767m6324m1755p4674k6348k2171Q6813Q1202j16808
6812A89244j04298J34828j9572K868p9978P0821n9661J01875K3435p1270K9534
6801B17826j20378M8872j1512p4943N5877Q7175J2288j1754r3097p956M7906M2348
6789A92652m1895L7732m9678K3460J3078n1768J12074M0308k8717j5280O6746
6778B98712O8792j14945o6341J598L8667M220k9381l8538L6327O0209m8054m02
6766B10864K5850q5462l7057k4267J4895N3970n3552J9363K1699R8679l6237r232
$$ plain form
6754 199513 217898 203723 155317 89070 34434 66752 135825 63170 -22661 79735 73870 -4013
6742 -4013 41302 85370 57054 117638 69009 115611 160130 78418 81160 57454 50265 54014 -8595
6729 -8595 79731 10419 -8767 50571 31371 100508 156311 37914 19693 27292 39848 51957
6717 51957 17004 87027 138161 30305 -4727 53557 -53215 -10807 79759 183906 130069
6706 130069 155978 152214 109861 47810 188320 216418 273527 223126 212249 189320 138740 185684
6694 185684 226348 61817 13562 57842 21578 80920 51401 39872 86599 118741 101182
6683 101182 178226 170460 230700 190726 108224 86547 36377 63747 180893 237368 184749 229764
6671 229764 277209 260900 205365 242859 371630 420458 357660 444475 550150 607965 531398
$$ packed form
6754A99513J8385j4175m8406o6247n4636L2318O9073p2655q5831J02396n865p7883
6742d013M5315M4068k8316O0584m8629M6602M4519q1712K742k3706p189L749o2609
6729h595Q8326o9312j9186N9338j9200O9137N5803j18397j8221P599J2556J2109
6717E1957l4953P0023N1134j07856l5032N8284j06772M2408R0566J04147n3837
6706A30069K5909l764m2353o2051J40510K8098N7109n0401j0877k2929n0580M6944
6694A85684M0664j64531m8255M4280l6264N9342k9519j1529M6727L2142j7559
6683A01182P7044p766O0240l9974q2502k1677n0170K7370J17146N6475n2619M5015
6671B29764M7445j6309n5535L7494J28771M8828o2798Q6815J05675N7815p6567
$$ plain form
6660 531398 479298 553345 468971 275303 282421 262932 253432 218275 170554 146769 116568 139229
6648 139229 219302 200046 68706 160765 151212 147349 74223 53253 136557 115770 72568 25457
6636 25457 46517 -29446 -9345 23663 12660 72203 44872 53524 133457 185482 77174 55373
6624 55373 16230 51443 52614 114414 49612 -43860 -112627 -20778 51239 83693 -82639 -67812
6612 -67812 -24967 -27403 81702 82681 55080 58915 13488 12197 29490 -20173 9699 9038 133193
6599 133193 224110 56931 -65447 -53786 -103853 -15704 75065 108556 76365 10706 -73187
6588 -73187 -24814 48107 100337 40693 17374 40823 39378 154057 161028 101170 90939 86082
6576 86082 11163 -41107 -87131 32998 138680 117001 99263 59341 140762 147110 107655 118449
$$ packed form
6660E31398n2100P4047q4374j93668P118j9489r500l5157m7721k3785l0201K2661
6648A39229Q0073j9256j31340R2059r553l863p3126k0970Q3304k0787m3202m7111
6636B5457K1060p5963K0101L3008j1003N9543k7331Q652P9933N2025j08308k1801
6624E5373l9143L5213J171O1800o4802r3472o8767R1849P2017L2454j66332J4827
6612f7812M2845k436J09105R79k7601L835m5427j291J7293m9663K9872o61J24155
6599A33193R0917j67179j22378J1661n0067Q8149R0769L3491l2191o5659q3893
6588g3187M8373P2921N2230n9644k3319K3449j445J14679O971n9858j0231m857
6576H6082p4919n2270m6024J20129J05682k1679j7738l9922Q1421O348l9455J0794
$$ plain form
6564 118449 138070 30139 52447 24717 -29790 14038 61291 66928 -35382 -14398 4992
6553 4992 39876 -29189 -20299 32044 51953 63050 64136 43340 -40426 104868 103587 78014
6541 78014 52164 60134 109434 117533 219841 139019 50592 36228 46551 65417 84842 101429
6529 101429 -11697 72920 14386 29253 33091 -37529 8911 -37319 -4504 -27620 -16908 33427
6517 33427 -50032 13600 73785 64936 -33321 -69210 52649 -11816 -121005 -96360 -130709 -52264
6505 -52264 -44693 35090 32307 44219 -418 -92142 -143569 -145372 -12781 -9530 -101514 -49376
6493 -49376 -14786 -31508 43004 -33181 -27409 23289 78417 29253 24470 -17633 -4283 -31597
6481 -31597 -36987 -37666 -31849 -100776 -118448 -26962 11465 -39011 -118065 -106264 -103940 -119765 -98896
$$ packed form
6564A18449J9621j07931K2308k7730n4507M3828M7253N637j02310K0984J9390
6553D992L4884o9065Q890N2343J9909J1097J086k0796q3766J45294j281k5573
6541G8014k5850P970M9300Q099J02308q0822q8427j4364J0323J8866J9425J6587
6529A01429j13126Q4617n8534J4867L838p0620M6440m6230L2815k3116J0712N0335
6517C3427q3459O3632O0185q849r8257l5889J21859o4465j09189K4645l4349P8445
6505e2264P571P9783k783J1912m4637r1724n1427j803J32591L251r1984N2138
6493d9376L4590j6722P4512p6185N772N0698N5128m9164m783m2103J3350k7314
6481c1597n390o79N817o8927j7672R1486L8427n0476p9054J1801K324j5825K0869
$$ plain form
6468 -98896 9376 33386 95198 128388 17007 8544 23369 -26053 -56480 -60092 -103504 -24136
6456 -24136 116884 107435 -8116 -2256 -102189 -72483 -111712 -108047 -59352 -3691 -70680 -52369
6444 -52369 38474 -56326 11982 7126 27180 49936 66435 34988 29099 80574 65541 56237
6432 56237 38240 -63498 -39706 -29217 -17354 -9565 -2285 1855 -78405 -105919 -89448 -72974
6420 -72974 -40181 -116313 -231144 -174118 -79726 206 4547 -25553 -17206 51191 172916 103278
6408 103278 14469 48396 -31379 -65291 -47512 -101421 -69227 -63847 25586 63146 -96656 -36486
6396 -36486 -17313 67610 62757 27350 48093 84863 73859 -1185 64042 10858 -1457 35331
6384 35331 54703 117098 79153 26792 -14728 26403 22680 53747 38766 125784 156309 47844
$$ packed form
6468i8896J08272K4010O1812L3190j11381q463J4825m9422l0427l612m3412P9368
6456b4136J41020r449j15551N860r9933K9706l9229L665M8695N5661o6989J8311
6444e2369R0843r4800O8308m856K0054K2756J6499l1447n889N1475j5033r304
6432E6237j7997j01738K3792J0489J1863P789P280M140q0260k7514J6471J6474
6420g2974L2793p6132j14831N7026R4392P9932M341l0100Q347O8397J21725o9638
6408A03278q8809L3927p9775l3912J7779n3909L2194N380Q9433L7560j59802O0170
6396c6486J9173Q4923m853l5407K0743L6770j1004p5044O5227n3184j2315L6788
6384C5331J9372O2395l7945n2361m1520M1131l723L1067j4981Q7018L0525j08465
$$ plain form
6372 47844 118212 107063 15397 -65891 8177 20969 3896 -23819 -35870 -35110 5139 -59192
6360 -59192 -53885 -45327 39790 11249 39003 120663 74863 7613 19500 -63756 -1435 106656
6348 106656 7956 -90692 -74429 -33818 -60651 -3941 -40672 -45560 -90262 -23439 36566 29765
6336 29765 15495 -71270 -122973 -56062 72201 -54714 -47383 72010 68035 31209 34990 71945
6324 71945 69788 50516 37342 59062 41427 -67366 -101622 -116185 -89390 15168 -55403 50369
6312 50369 81098 -74454 -75012 38631 13255 8512 77675 95433 103017 86328 47839 81462
6300 81462 99738 59116 77098 156940 149710 92289 -9360 -68874 -30353 37725 119489 48967
6288 48967 33560 78805 -32119 58626 69486 56245 39879 21664 22040 -64524 -9796 9497
$$ packed form
6372D7844P0368j1149r1666q1288P4068J2792j7073k7715j2051P60M0249o4331
6360e9192N307Q558Q5117k8541K7754Q1660m5800o7250J1887q3256O2321J08091
6348A06656r8700r8648J6263M0611k6833N6710l6731m888m4702O6823O0005o801
6336B9765j4270q6765n1703O6911J28263j26915P331J19393l975l6826L781L6955
6324G1945k157j9272j3174K1720j7635j08793l4256j4563K6795J04558p0571J05772
6312E0369L0729j55552n58J13643k5376m743O9163J7758P584j6689l8489L3623
6300H1462J8276m0622J7982P9842p230n7421j01649n9514L8521O8078Q1764p0522
6288D8967j5407M5245j10924R0745J0860j3241j6366j8215L76q6564N4728J9293
$$ plain form
6276 9497 110878 79997 64987 99531 79304 -5089 991 109599 83375 28632 128432 101319
6264 101319 -10276 73994 165027 145401 114996 103555 29473 4007 88880 67956 46642
6253 46642 75600 102996 124428 126580 167186 186405 135855 129113 213788 237770 253566 117316
6241 117316 87106 61692 -3028 94551 203032 138990 186193 161211 58160 78939 97473
6230 97473 180220 4756 -49225 62574 114752 81509 33747 122123 60405 62552 111799 145305
6218 145305 121945 4307 -19473 -49848 88145 220167 101676 129443 207596 159330 175309
6207 175309 172276 118959 67953 130993 85417 -38312 21768 92331 128522 106825 202659 174062
6195 174062 143463 222405 131259 108765 48225 18975 98639 170314 133478 108847 16153 19661
$$ packed form
6276I497J01381l0881j5010L4544k0227q4393O080J08608k6224n4743R9800k7113
6264A01319j11595Q4270R1033j9626l0405j1441p4082k5466Q4873k0924k1314
6253D6642K8958K7396K1432K152M0606J9219n0550o742Q4675K3982J5796j36250
6241A17316l0210k5414o4720R7579J08481o4042M7203k4982j03051K0779J8534
6230I7473Q2747j75464n3981J11799N2178l3243m7762Q8376o1718K147M9247L3506
6218A45305k3360j17638k3780l0375J37993J32022j18491K7767P8153m8266J5979
6207A75309l033n3317n1006O3040m5576j23729O0080P0563L6191k1697R5834k8597
6195A74062l0599P8942r1146k2494o0540k9250P9664P1675l6836k4631r2694L508
$$ plain form
6183 19661 67274 36596 154576 81852 125101 164308 114762 76327 99120 82918 227378
6172 227378 386050 358637 299597 229106 163290 126476 198010 283621 211473 261979 337873
6161 337873 206707 226604 172042 138021 181958 254443 269866 331485 344738 253451 277897
6150 277897 416890 366082 310144 278287 330392 425292 506938 503543 509016 471768 493173 483258
6138 483258 534388 594240 452658 507034 516397 521502 382799 406184 489095 491072 454527 473948
6126 473948 470947 369682 441973 393593 402765 448298 611449 567880 519415 568607 762165
6115 762165 721175 631924 827378 844888 911130 849514 813477 699548 646460 601542 557263
6104 557263 526190 484754 476329 433997 469819 558727 563335 466137 486343 510485 572101 597952
$$ packed form
6183A9661M7613l0678J17980p2724M3249L9207m9546l8435K2793j6202J44460
6172B27378J58672k7413n9040p0491o5816l6814P1534Q5611p2148N0506P5894
6161C37873j31166J9897n4562l4021M3937P2485J5423O1619J3253r1287K4446
6150B77897J38993n0808n5938l1857N2105R4900Q1646l395N473l7248K1405r915
6138D83258N1130N9852j41582N4376R363N105j38703K3385Q2911J977l6545J9421
6126D73948l001j01265P2291m8380R172M5533J63151m3569m8465M9192J93558
6115G62165m0990q9251J95454J7510O6242o1616l6037j13929n3088m4918m4279
6104E57263l1073m1436q425m2332L5822Q8908M608r7198K0206K4142O1616K5851
$$ plain form
6092 597952 630370 674213 589548 669130 728829 704736 631243 655728 667431 571696 560361 637046
6080 637046 640414 649350 602785 570173 568542 496864 476606 589695 639073 575327 598895 508978
6068 508978 525734 510044 550389 493293 513695 641156 556041 646473 688112 639648 608459
6057 608459 686774 691609 642711 617785 639557 638662 603158 759046 717694 568126 614755 684228
6045 684228 661751 554128 542959 588364 550585 559928 581945 627521 547559 595063 654675 626650
6033 626650 702451 722544 639229 686442 696096 665665 743682 780931 825162 755607 787326 742094
6021 742094 774316 672068 613170 640082 661269 685725 733789 809588 778136 755420 766838
6010 766838 887908 876447 951017 960907 897736 966011 940545 1016430 976684 936312 1003111 1008842
$$ packed form
6092E97952L2418M3843q4665P9582N9699k4093p3493K4485J1703r5735j1335P6685
6080F37046L368Q936m6565l2612j631p1678k0258J13089M9378o3746K3568q9917
6068E08978J6756j5690M0345n7096K0402J27461q5115R0432M1639m8464l1189
6057F08459P8315M835m8898k4926K1772q95l5504J55888m1352j49568M6629O9473
6045F84228k2477j07623j1169M5405l7779R343K2017M5576p9962M7504N9612k8025
6033F26650P5801K0093q3315M7213R654l0431P8017L7249M4231o9555L1719m5232
6021G42094L2222j02248n8898K6912K1187K4456M8064P5799l1452k2716J1418
6010G66838J21070j1461P4570R890o3171O8275k5466P5885l9746m0372O6799N731
$$ plain form
5998 1008842 877472 777030 958850 913424 768640 828218 961752 1008753 1012364 1006901 1003155
5987 1003155 981368 1038853 1038365 1052132 1145961 1226017 1227732 1244771 1223418 1204456 1100659 1205366
5975 1205366 1290835 1267570 1290192 1271147 1311875 1285313 1282095 1362410 1344918 1302012 1333116 1325195
5963 1325195 1298415 1412673 1451245 1500733 1574111 1468992 1479977 1545900 1550723 1540550 1474247
5952 1474247 1375190 1451894 1462937 1539268 1708624 1621943 1566172 1575908 1633885 1673720 1619903
5941 1619903 1712491 1891328 1886196 1834953 1841746 1762671 1820021 1862951 1894616 1879063 1889186 1861820
5929 1861820 1913746 1916503 1901807 1949395 1941051 1907415 1972397 2103617 2077224 2084041 2144339 2179432
5917 2179432 2212765 2239099 2307512 2290940 2292212 2310094 2407071 2532837 2520615 2555289 2564915 2680851
$$ packed form
5998A008842j31370j00442J81820m5426j44784N9578J33534M7001L611n463l746
5987A003155k1787N7485m88J3767R3829Q0056J715J7039k1353j8962j03797J04707
5975A205366Q5469k3265K2622j9045M0728k6562l218Q0315j7492m2906L1104p921
5963A325195k6780J14258L8572M9488P3378j05119J0985O5923M823j0173o6303
5952A474247r9057P6704J1043P6331J69356q6681n5771R736N7977L9835n3817
5941A619903R2588J78837n132n1243O793p9075N7350M2930L1665j5553J0123k7366
5929A861820N1926K757j4696M7588q344l3636O4982J31220k6393O817O0298L5093
5917B179432L3333K6334O8413j6572J272J7882R6977J25766j2222L4674R626J15936
$$ plain form
5905 2680851 2785582 2831362 2751321 2739235 2929648 2971691 3045963 3095447 3153831 3115575 3194780
5894 3194780 3344964 3480029 3447701 3625080 3742774 3624750 3699638 3858551 3903025 4015467
5884 4015467 4125902 4221831 4354804 4518173 4647409 4700742 4862079 5041048 5125702 5230887
5874 5230887 5404954 5521787 5676183 5751408 5825771 6021253 6259689 6343864 6550933 6808838
5864 6808838 7063049 7334620 7517660 7706026 7897289 8065468 8372635 8537638 8805710 9052752
5854 9052752 9326020 9532032 9793505 10113223 10381095 10655450 11089126 11467078 11774659 12140584
5844 12140584 12658734 13362623 14007222 14568534 15110311 15833899 16710807 17659186 18490051
5835 18490051 19309444 20109393 20826677 21267765 21747956 22549901 23330200 24245713 25473141
$$ packed form
5905B680851J04731M5780q0041j2086J90413M2043P4272M9484N8384l8256P9205
5894C194780J50184J35065l2328J77379J17694j18024P4888J58913M4474J12442
5884D015467J10435R5929J32973J63369J29236N3333J61337J78969Q4654J05185
5874E230887J74067J16833J54396P5225P4363J95482K38436Q4175K07069K57905
5864F808838K54211K71571J83040J88366J91263J68179L07167J65003K68072K47042
5854I052752K73268K06012K61473L19718K67872K74355M33676L77952L07581L65925
5844A2140584N18150P03889O44599N61312N41777P23588Q76908R48379Q30865
5835A8490051Q19393P99949P17284M41088M80191Q01945P80299R15513J227428
$$ plain form
5826 25473141 26910074 28630441 30761030 32972142 35296536 38108214 41326749 45025621
5818 45025621 49357424 54283252 59529955 64147674 67055867 67364215 65388290 61989056
5810 61989056 58685528 56211338 54356239 52801559 51469366 50380088 49458876 48943135
5802 48943135 48866307 49505116 50708053 52495533 54725939 56931601 59115341 61326759 64159194
5793 64159194 68158501 73426104 79836443 87357494 96287983 105989473 114907915 120584673
5785 120584673 120416955 113830641 102780088 91136887 81146248 73167406 67300502 62822196
5777 62822196 59122456 56112158 53554002 51333412 49484771 47730860 46331273 45179173
5769 45179173 44419869 44020367 44130579 44754842 45899614 47518037 49880259 52880928 56356748
$$ packed form
5826B5473141J436933J720367K130589K211112K324394K811678L218535L698872
5818D5025621M331803M925828N246703M617719K908193L08348j975925l399234
5810F1989056l303528k474190j855099j554680j332193j089278r21212n15741
5802D8943135p6828O38809J202937J787480K230406K205662K183740K211418K832435
5793F4159194L999307N267603O410339P521051Q930489R701490Q918442N676758
5785A20584673j67718o586314j1050553j1643201r990639p978842n866904m478306
5777F2822196l699740l010298k558156k220590j848641j753911j399587j152100
5769D5179173p59304l99502J10212O24263J144772J618423K362222L000669L475820
$$ plain form
5760 56356748 60646841 65116913 69047009 71350048 70498042 66563726 60604002 54257455
5752 54257455 48729857 44294486 40966244 38376292 36321897 34677039 33291712 32120694
5744 32120694 30972937 29682019 28501441 27375638 26143116 24864662 23736645 22821612
5736 22821612 22010186 21310068 20743075 20159545 19740937 19351752 19052874 18811766 18610073
5727 18610073 18447589 18304896 18280737 18213897 18221908 18216567 18168075 18048332 17855565 17701007 17882695
5716 17882695 17963242 18183048 18399813 18610624 18607762 18146866 17528914 16781697 15942815 15269123
5706 15269123 14614615 14191710 13837932 13568509 13334122 13043800 12904093 12837629 12843604 12710186
5696 12710186 12551302 12501553 12340285 12049324 11986168 11840300 11737386 11891991 12029070 12164450
$$ packed form
5760E6356748M290093M470072L930096K303039q52006l934316n959724o346547
5752E4257455n527598m435371l328242k589952k054395j644858j385327j171018
5744C2120694j147757j290918j180578j125803j232522j278454j128017r15033
5736B2821612q11426p00118n66993n83530m18608l89185k98878k41108k01693
5727A8610073j62484j42693k4159o6840Q011n341m8492j19743j92767j54558J81688
5716A7882695Q0547K19806K16765K10811k862m60896o17952p47217q38882o73692
5706A5269123o54508m22905l53778k69423k34387k90322j39707o6464N975j33418
5696A2710186j58884m9749j61268k90961o3156j45868j02914J54605J37079J35380
$$ plain form
5686 12164450 12371978 12591255 12890568 13078946 13172162 13078026 12954615 12810964 12726969 12655012
5676 12655012 12849685 13006367 13283254 13701198 14126081 14497707 14887870 15225252 15471041
5667 15471041 15625149 15641492 15675928 15679779 15441433 14997772 14642975 14397296 14200524 14067026
5657 14067026 14131206 14223923 14352498 14484512 14754287 14927181 15396002 16051113 16712350 17514905
5647 17514905 18419171 19475996 20477260 21437941 22288190 22955598 23232782 23175755 23006001
5638 23006001 22604838 21909340 20950701 19889367 18737276 17789939 17030902 16335444 15771593
5629 15771593 15330387 15048412 14817579 14734381 14707829 14862036 15092714 15327900 15715900 16071464
5619 16071464 16429879 16921735 17307116 17664371 17987564 18222979 18183820 18176899 17905060 17588450
$$ packed form
5686A2164450K07528K19277K99313J88378R3216r4136j23411j43651q3995p1957
5676A2655012J94673J56682K76887M17944M24883L71626L90163L37382K45789
5667A5471041J54108J6343L4436L851k38346m43661l54797k45679j96772j33498
5657A4067026O4180R2717J28575J32014K69775J72894M68821O55111O61237Q02555
5647A7514905R04266J056825J001264R60681Q50249O67408K77184n7027j69754
5638B3006001m01163o95498r58639j061334j152091r47337p59037o95458n63851
5629A5771593m41206k81975k30833q3198k6552J54207K30678K35186L88000L55564
5619A6071464L58415M91856L85381L57255L23193K35415l9159o921k71839l16610
$$ plain form
5609 17588450 17205084 16585189 16034049 15547924 15098736 14482708 13930138 13528769 13182228
5600 13182228 12966061 12786041 12657480 12462073 12268442 12082910 11751004 11393989 11237073
5591 11237073 11054905 10822092 10659484 10461276 10358812 10372722 10315866 10350505 10275658 10150786
5581 10150786 9910655 9582729 9387960 9145810 8827942 8559957 8424723 8224379 7993544
5572 7993544 7866327 7787497 7659493 7547001 7306746 7226300 7054342 6913520 6905186 6822462
5562 6822462 6710344 6599646 6607420 6607253 6602876 6778643 6794872 6867972 6973181 7096118 7274825
5551 7274825 7444141 7613489 7998329 8528449 9184214 10003654 11039451 12318006 13378828
5542 13378828 13651502 12732300 11015365 9435673 8320523 7582835 6966543 6564502 6296873
$$ packed form
5609A7588450l83366o19895n51140m86125m49188o16028n52570m01369l46541
5600A3182228k16167j80020j28561j95407j93631j85532l31906l57015j56916
5591A1237073j82168k32813j62608j98208j02464J3910n6856L4639p4847j24872
5581A0150786k40131l27926j94769k42150l17868k67985j35234k00344k30835
5572G993544j27217p8830j28004j12492k40255q0446j71958j40822q334q2724
5562F822462j12118j10698P774j67m377J75767J6229P3100J05209J22937J78707
5551G274825J69316J69348L84840N30120O55765Q19440J035797J278555J060822
5542A3378828K72674r19202j716935j579692j115150p37688o16292m02041k67629
$$ plain form
5533 6296873 5994910 5780941 5679038 5527062 5331586 5264269 5201849 5232653 5224887 5228514 5244536
5522 5244536 5241059 5315570 5520406 5702279 5768359 5783562 5798736 5597339 5353070 5223442 5158972
5511 5158972 5028489 4960606 4900362 4750264 4802070 4783119 4786608 4791459 4817817 4702631 4598469
5500 4598469 4662281 4773045 4824629 4820567 4849353 4888310 4883283 4896897 4844008 5011084 5033716
5489 5033716 5008654 5082584 5162635 5185405 5375377 5383822 5442472 5493274 5550828 5643748 5708726
5478 5708726 5945306 6028444 6192800 6262656 6426497 6625186 6697231 6770310 6845582 6946855
5468 6946855 7025863 6932982 6992016 7091788 7218351 7292344 7452031 7605323 7760894 7988578
5458 7988578 8151976 8340173 8559256 8805324 8938709 9140453 9407101 9645453 9956735 10226155
$$ packed form
5533F296873l01963k13969j01903j51976j95476o7317o2420L0804p766L627J6022
5522E244536l477P4511K04836J81873O6080J5203J5174k01397k44269j29628o4470
5511E158972j30483o7883o0244j50098N1806j8951L489M851K6358j15186j04162
5500D598469O3812J10764N1584m062K8786L8957n027J3614n2889J67076K2632
5489E033716k5062P3930Q0051K2770J89972Q445N8650N0802N7554R2920O4978
5478E708726K36580Q3138J64356O9856J63841J98689P2045P3079P5272J01273
5468F946855P9008r2881N9034R9772J26563P3993J59687J53292J55571K27684
5458G988578J63398J88197K19083K46068J33385K01744K66648K38352L11282K69420
$$ plain form
5448 10226155 10435516 10598396 10918893 11250284 11652118 12092317 12493444 12887929 13380927
5439 13380927 13823793 14194071 14463113 14669451 14819094 15175611 15667080 16149904 16605052
5430 16605052 17110522 17683094 18402806 19172551 19959282 20758457 21819879 23077275 24336917
5421 24336917 25827401 27755854 29753542 31893035 34563924 37480924 40908419 44833503
5413 44833503 49412960 54380961 59109664 62751274 64518005 63825080 60876343 56845554
5405 56845554 52806253 49429522 46695896 44714745 43197588 42176337 41570113 41361524
5397 41361524 41675764 42283001 43224546 44627607 46296714 48418155 51016452 54014828 57607448
5388 57607448 61875464 66958562 73090419 80332515 88575389 97307420 105258076 110452083
$$ packed form
5448A0226155K09361J62880L20497L31391M01834M40199M01127L94485M92998
5439A3380927M42866L70278K69042K06338J49643L56517M91469M82824M55148
5430A6605052N05470N72572P19712P69745P86731P99175J061422J257396J259642
5421B4336917J490484J928453J997688K139493K670889K917000L427495L925084
5413D4833503M579457M968001M728703L641610J766731o92925k948737m030789
5405E6845554m039301l376731k733626j981151j517157j021251o06224k08589
5397D1361524L14240O07237R41545J403061J669107K121441K598297K998376L592620
5388E7607448M268016N083098O131857P242096Q242874Q732031P950656N194007
$$ plain form
5380 110452083 111328466 107024101 98932447 89469905 80438303 72857135 66714290 61766827
5372 61766827 57673805 54372258 51838858 49916426 48404539 47281538 46405129 45692972
5364 45692972 45357151 45427184 45890179 46789612 48204467 50084295 52640226 55535925 58858078
5355 58858078 62268599 64982860 66759198 66479517 63899342 59450126 54426647 49693792
5347 49693792 45639973 42249029 39637241 37628784 35750074 34155744 32842955 31662044
5339 31662044 30635374 29549439 28611214 27704519 27004740 26314727 25660100 25098678 24822264
5330 24822264 24602906 24268801 24098832 23758296 23430026 23076068 22788794 22659450 22422597
5321 22422597 22213604 22087545 22124367 22130068 22072550 22072033 22372137 22701962 23057038 23517550 23977970
$$ packed form
5380A10452083Q76383m304365q091654r462542r031602p581168o142845m947463
5372F1766827m093022l301547k533400j922432j511887j123001q76409p12157
5364D5692972l35821P0033M62995Q99433J414855J879828K555931K895699L322153
5355E8858078L410521K714261J776338k79681k580175m449216n023479m732855
5347D9693792m053819l390944k611788k008457j878710j594330j312789j180911
5339C1662044j026670j085935r38225r06695o99779o90013o54627n61422k76414
5330B4822264k19358l34105j69969l40536l28270l53958k87274j29344k36853
5321B2422597k08993j26059L6822N701n7518n17L00104L29825L55076M60512M60420
$$ plain form
5310 23977970 24439375 24921653 25358600 25739670 25977182 26048040 26076776 26113496 26081245 25958859
5300 25958859 25710610 25404891 25222979 24977707 24673088 24480625 24190284 23737368 23490628
5291 23490628 23140233 22809182 22508662 22327472 22167467 22204610 22439368 22626582 22997825 23381346
5281 23381346 23773104 24296854 24879079 25232322 25641576 25897116 25943303 25859147 25735984 25497377
5271 25497377 25174515 24844789 24421966 23715800 22957856 22273628 21699565 21167183 20653546
5262 20653546 20241523 19786340 19325906 18867343 18496730 18206166 17956005 17893708 17895236 17907378
5252 17907378 17963997 18242142 18434999 18661312 19077568 19394642 19784854 20177673 20637273 20918859
5242 20918859 21055058 20969243 20468334 19709147 19081667 18408785 17915523 17531019 17489392 17324091
$$ packed form
5310B3977970M61405M82278M36947L81070K37512P0858K8736L6720l2251j22386
5300B5958859k48249l05719j81912k45272l04619j92463k90341m52916k46740
5291B3490628l50395l31051l00520j81190j60005L7143K34758J87214L71243L83521
5281B3381346L91758N23750N82225L53243M09254K55540M6187q4156j23163k38607
5271B5497377l22862l29726m22823p06166p57944o84228n74063n32382n13637
5262B0653546m12023m55183m60434m58563l70613k90564k50161o2297J528J2142
5252A7907378N6619K78145J92857K26313M16256L17074L90212L92819M59600K81586
5242B0918859J36199q5815n00909p59187o27480o72882m93262l84504m1627j65301
$$ plain form
5232 17324091 17191441 16937490 16675126 16448540 16009840 15670724 15490308 15310662 15212336 15179073
5222 15179073 15176727 15158886 15246860 15439547 15666005 16019504 16382506 16386279 16397371 16326035 16134318
5211 16134318 15841205 15636165 15590279 15588910 15627288 15678634 15721147 15528500 15082189 14367492
5201 14367492 13756174 13256545 12977365 12687877 12342959 12206477 12018186 11912677 11770701
5192 11770701 11502606 11248466 11133309 11083181 10963370 10830029 10692432 10639522 10473291 10384893
5182 10384893 10371690 10280867 10313899 10178302 10063968 9816988 9591744 9312355 8997680 8793822
5172 8793822 8494655 8361652 8158089 8094215 7978609 7884852 7822912 7746910 7719224 7782047 7577603
5161 7577603 7468998 7258425 7116292 7038577 6977066 6907698 6760642 6762280 6699113 6627054 6490487
$$ packed form
5232A7324091j32650k53951k62364k26586m38700l39116j80416j79646r8326l3263
5222A5179073k346j7841Q7974J92687K26458L53499L63002L773J1092p1336j91717
5211A6134318k93113k05040m5886j369L8378N1346M2513j92647m46311p14697
5201A4367492o11318m99629k79180k89488l44918j36482j88291j05509j41976
5192A1770701k68095k54140j15157n0128j19811j33341j37597n2910j66231q8398
5182A0384893j3203r0823L3032j35597j14334k46980k25244k79389l14675k03858
5172H793822k99167j33003k03563o3874j15606r3757o1940p6002k7686O2823k04444
5161G577603j08605k10573j42133p7715o1511o9368j47056J638o3167p2059j36567
$$ plain form
5150 6490487 6403904 6460464 6494376 6427745 6327909 6226797 6245217 6212294 6162513 6224674 6208895
5139 6208895 6106052 6070493 6123679 6198768 6211223 6072397 6083700 6018203 5842741 5767343 5854266
5128 5854266 5783177 5820640 5822919 5755319 5812793 5739635 5648659 5594691 5617541 5635543 5713885 5782141
5116 5782141 5763716 5757990 5823524 5761047 5758898 5787388 5847813 5935076 5994190 6125503 6079851 6061331
5104 6061331 6026126 5880981 5783889 5623637 5460730 5409966 5368472 5307619 5249772 5253236 5360976
5093 5360976 5357357 5231631 5156629 5167203 5243839 5184161 5197557 5240569 5315589 5277087 5236420
5082 5236420 5285021 5283882 5407299 5513630 5472523 5416559 5329889 5292447 5270010 5151581 4948139
5071 4948139 4912510 4855857 4887820 5059359 5134433 5224243 5162678 5171010 5060436 5020352 5077500
$$ packed form
5150F490487q6583N6560L3912o6631r9836j01112J8420l2923m9781O2161j5779
5139F208895j02843l5559N3186P5089J2455j38826J1303o5497j75462p5398Q6923
5128E854266p1089L7463K279o7600N7474p3158r0976n3968K2850J8002P8342O8256
5116E782141j8425n726O5534o2477k149K8490O0425Q7263N9114J31313m5652j8520
5104F061331l5205j45145r7092j60252j62907n0764m1494o0853n7847L464J07740
5093E360976l619j25726p5002J0574P6636n9678J3396M3012P5020l8502m0667
5082E236420M8601j139J23417J06331m1107n5964q6670l7442k2437j18429k03442
5071D948139l5629n6653L1963J71539P5074Q9810o1565Q332j10574m0084N7148
$$ plain form
5060 5077500 4985024 4986410 4897049 4902059 4899960 4695252 4616462 4656016 4716984 4709930 4591049 4582905
5048 4582905 4548129 4432217 4456736 4547405 4610955 4622557 4737317 4774192 4819267 5013402 5038358
5037 5038358 5007862 4895951 4818651 4788737 4664036 4458482 4321699 4284237 4263830 4289334 4153203
5026 4153203 4135675 4023876 3879786 3864430 3884679 3900531 3845404 3773076 3671638 3592349 3621484
5015 3621484 3565641 3561255 3623863 3687033 3651871 3718591 3771039 3793946 3708732 3588882 3423370
5004 3423370 3236136 3140155 3118352 2930101 2860591 2773071 2767485 2721859 2724235 2757543 2731067
4993 2731067 2627883 2418200 2384150 2471342 2431740 2410206 2383605 2323646 2323536 2280225 2227678
4982 2227678 2283148 2303455 2225627 2199353 2269855 2185218 2190616 2217367 2138538 2122182 2049229 2110187
$$ packed form
5060E077500r2476J386q9361N010k099k04708p8790L9554O0968p054j18881q144
5048D582905l4776j15912K4519R0669O3550J1602J14760L6875M5075J94135K4956
5037E038358l0496j11911p7300k9914j24701k05554j36783l7462k0407K5504j36131
5026D153203j7528j11799j44090j5356K0249J5852n5127p2328j01438p9289K9135
5015C621484n5843m386O2608O3170l5162O6720N2448K2907q5214j19850j65512
5004C423370j87234r5981k1803j88251o9510q7520n586m5626K376L3308k6476
4993B731067j03184k09683l4050Q7192l9602k1534k6601n9959j10m3311n2547
4982B227678N5470K0307p7828k6274P0502q4637N398K6751p8829j6356p2953O0958
$$ plain form
4970 2110187 2132119 2131520 2101752 2083025 2052326 2128839 2066509 2040567 2085751 2027342 1992174 1979565
4958 1979565 1929544 1892954 1845783 1967725 1973433 1902167 1874216 1952619 1964113 1967834 1981545 1994679
4946 1994679 1984230 1941212 1970550 1946892 1903544 1930081 1895298 1946964 1922718 1852002 1910327
4935 1910327 1923705 1836698 1814246 1864013 1950433 1924990 1952201 1780757 1743593 1912091 1946684
4924 1946684 1991970 1981054 2042385 2018879 2013528 1986676 1927341 1916167 1915099 2024960 2065246 2013005
4912 2013005 2057368 2013531 2005771 1987127 1961173 2038249 2020437 1892793 1973978 2067770 2087916
4901 2087916 2065597 2019994 2161453 2124051 1997396 2050298 2087887 2153877 2097851 1980869 2037598
4890 2037598 2135944 2225489 2196537 2199199 2164648 2102995 2044671 2046794 2016815 2141215 2072724 2101766
$$ packed form
4970B110187K1932n99k9768j8727l0699P6513o2330k5942M5184n8409l5168j2609
4958A979565n0021l6590m7171J21942N708p1266k7951P8403J1494L721J3711J3134
4946A994679j0449m3018K9338k3658m3348K6537l4783N1666k4246p0716N8325
4935A910327J3378q7007k2452M9767Q6420k5443K7211j71444l7164J68498L4593
4924A946684M5286j0916O1331k3506n351k6852n9335j1174j068J09861M0286n2241
4912B013005M4363m3837p760j8644k5954P7076j7812j27644Q1185R3792K0146
4901B087916k2319m5603J41459l7402j26655N2902L7589O5990n6026j16982N6729
4890B037598R8346Q9545k8952K662l4551o1653n8324K123k9979J24400o8491K9042
$$ plain form
4878 2101766 2073137 2136802 2191710 2256372 2246782 2156034 2277694 2278983 2213344 2223493 2261628 2164288
4866 2164288 2184051 2231122 2274075 2270145 2418863 2534410 2399842 2342808 2452179 2412903 2330790
4855 2330790 2338273 2381556 2490204 2575785 2537343 2633664 2643625 2650407 2698751 2783772 2846241 2771897
4843 2771897 2807544 2852262 2825419 2874243 2985898 3036447 3087708 3089349 3115544 3200315 3177648
4832 3177648 3231879 3224949 3184005 3159843 3280409 3278126 3267584 3251784 3298786 3289136 3319950 3381857
4820 3381857 3419383 3455114 3587601 3642557 3615925 3686662 3739965 3759760 3760047 3851734 3913203 3976440
4808 3976440 4081675 4109743 4041793 3960219 4087556 4235350 4180488 4300900 4392646 4387388 4621474
4797 4621474 4815536 4887641 4904967 5000522 5135679 5276958 5409866 5521995 5579966 5602428
$$ packed form
4878B101766k8629O3665N4908O4662r590r0748J21660J289o5639J0149L8135r7340
4866B164288J9763M7071M2953l930J48718J15547j34568n7034J09371l9276q2113
4855B330790P483M3283J08648Q5581l8442R6321R961O782M8344Q5021O2469p4344
4843B771897L5647M4718k6843M8824J11655N0549N1261J641K6195Q4771k2667
4832C177648N4231o930m0944k4162J20566k283j0542j5800M7002r650L0814O1907
4820C381857L7526L5731J32487N4956k6632P0737N3303J9795K87R1687O1469O3237
4808C976440J05235K8068o7950q1574J27337J47794n4862J20412R1746n258K34086
4797D621474J94062P2105J7326R5555J35157J41279J32908J12129N7971K2462
$$ plain form
4787 5602428 5799463 5948436 6081097 6270181 6317408 6457549 6737810 6949187 7301704 7476104
4777 7476104 7665842 7835488 8104843 8599517 8910811 9365974 9756485 10139415 10657550 11392093
4767 11392093 12329198 13343798 14514127 15863940 17431250 19432800 21867787 24921747
4759 24921747 28847124 33672374 39166097 44434411 47631930 47124271 42973096 36814598
4751 36814598 30397043 25138919 21447494 18773026 16837587 15413760 14206276 13244516
4743 13244516 12525725 11780954 11269125 10803511 10458442 10106382 9802903 9600724 9492984
4734 9492984 9398652 9422764 9441501 9386824 9307019 9264357 9274086 9335475 9251498 9275641 9408624
4723 9408624 9378546 9430334 9601918 9643862 9741860 9863324 9898765 10174976 10479189 10844629
$$ packed form
4787E602428J97035J48973J32661J89084M7227J40141K80261K11377L52517J74400
4777G476104J89738J69646K69355M94674L11294M55163L90511L82930N18135P34543
4767A1392093R37105J014600J170329J349813J567310K001550K434987L053960
4759B4921747L925377M825250N493723N268314L197519n07659m151175o158498
4751C6814598o417555n258124l691425k674468j935439j423827j207484r61760
4743A3244516p18791p44771n11829m65614l45069l52060l03479k02179j07740
4734I492984r4332K4112J8737n4677p9805m2662R729O1389q3977K4143J32983
4723I408624l0078N1788J71584M1944R7998J21464L5441K76211L04213L65440
$$ plain form
4713 10844629 11077122 11455573 12032732 12528459 13177656 13935711 14828613 15845621 17008984
4704 17008984 18580059 20630091 22935657 25891995 29686521 34283819 39264608 43814890
4696 43814890 46531805 46418475 43786204 39221293 33419233 27810689 23643042 20755960
4688 20755960 18502227 16789183 15450591 14298258 13409656 12796542 12174039 11609313 11084125
4679 11084125 10635994 10327284 10001332 9685558 9462166 9325950 9232869 9127537 8917203 8846282
4669 8846282 8853486 8726527 8719494 8666319 8522629 8406908 8361353 8247752 8127211 8049301 7866035
4658 7866035 7759330 7771880 7689992 7809828 7778252 7740612 7850127 7783668 7807777 7767171 7842657
4647 7842657 7770422 7722580 7640470 7634146 7638245 7600575 7580638 7563123 7711421 7750210 7705772 7720414
$$ packed form
4713A0844629K32493L78451N77159M95727O49197P58055Q92902J017008J163363
4704A7008984J571075K050032K305566K956338L794526M597298M980789M550282
4696D3814890K716915j13330k632271m564911n802060n608544m167647k887082
4688B0755960k253733j713044j338592j152333q88602o13114o22503n64726n25188
4679A1084125m48131l08710l25952l15774k23392j36216r3081j05332k10334p0921
4669H846282P204j26959p033n3175j43690j15721m5555j13601j20541p7910j83266
4658G866035j06705J2550q1888J19836l1576l7640J09515o6459K4109m0606P5486
4647G842657p2235m7842q2110o324M099l7670j9937j7515J48298L8789m4438J4642
$$ plain form
4635 7720414 7705289 7728762 7671152 7723410 7727482 7742143 7712264 7798666 7905215 7896345 7794556
4624 7794556 7891637 7826545 7804432 7789080 7752159 7802699 7819036 7772160 7729431 7772444 7784978
4613 7784978 7757982 7751853 7778292 7831655 7870941 7879127 7830649 7907858 7962142 7904313 7923665 8000124
4601 8000124 7948568 7899315 7882034 7895550 8022492 8016778 8004524 8095080 8051856 8078710 8068332
4590 8068332 8068694 8084520 8112059 8177525 8064419 8047884 8060324 8099282 8054969 8049675 7998747 8072393
4578 8072393 7982881 8123677 8109228 8032507 7984856 8059247 8017444 7995972 7989408 7984536 8004222 8006935
4566 8006935 8102470 8062695 8083920 8142279 8117641 8085952 8066576 8030908 7983404 7980446 7957526 7959583
4554 7959583 7997377 8008308 7932650 7858336 7800191 7749489 7739978 7740866 7777715 7831211 7816792 7675698
$$ packed form
4635G720414j5125K3473n7610N2258M072J4661k9879Q6402J06549q870j01789
4624G794556R7081o5092k2113j5352l6921N0540J6337m6876m2729M3013J2534
4613G784978k6996o129K6439N3363L9286Q186m8478P7209N4284n7829J9352P6459
4601H000124n1556m9253j7281J3516J26942n714j2254R0556m3224K6854j0378
4590H068332L62J5826K7539O5466j13106j6535J2440L8958m4313n294n0928P3646
4578H072393q9512J40796j4449p6721m7651P4391m1803k1472o564m872J9686K713
4566H006935R5535l9775K1225N8359k4638l1689j9376l5668m7504k958k2920K057
4554G959583L7794J0931p5658p4314n8145n0702r511Q88L6849N3496j4419j41094
$$ plain form
4542 7675698 7743312 7715733 7713618 7600296 7565062 7595271 7637807 7509804 7379484 7441435 7451899
4531 7451899 7433962 7374967 7304156 7275845 7318525 7243931 7248014 7221169 7160509 7091911 7164502 7133399
4519 7133399 7138174 7147348 7010368 6990303 7000893 6941665 6912952 6946059 6898080 6862648 6822465 6862458
4507 6862458 6880935 6874795 6861673 6875223 6866470 6879342 6753584 6638520 6631425 6546915 6432366
4496 6432366 6528452 6628907 6509908 6457501 6444424 6415842 6288998 6218962 6191568 6185548 6216766
4485 6216766 6228346 6256174 6285243 6194550 6101173 6010270 5994177 6025542 6044093 5922246 5859434
4474 5859434 5924085 5998366 6111151 6063590 5993541 6045263 5936191 5911442 5962892 5987586 5889968
4463 5889968 5796148 5828592 5897877 5967997 5921825 5842923 5912214 5998888 6008950 6122390 6135751
$$ packed form
4542G675698O7614k7579k115j13322l5234L0209M2536j28003j30320O1951J0464
4531G451899j7937n8995p0811k8311M2680p4594M083k6845o0660o8598P2591l1103
4519G133399M775R174j36980k0065J0590n9228k8713L3107m7979l5432m0183L9993
4507F862458J8477o140j3122J3550q753J2872j25758j15064p095q4510j14549
4496F432366R6086J00455j18999n2407j3077k8582j26844p0036k7394o020L1218
4485F216766J1580K7828K9069r0693r3377r0903j6093L1365J8551j21847o2812
4474E859434O4651P4281J12785m7561p0049N1722j09072k4749N1450K4694r7618
4463E889968r3820L2444O9285P0120m6172p8902O9291Q6674J0062J13440J3361
$$ plain form
4452 6135751 6130395 6163076 6332017 6481798 6728843 6855415 7032479 7290642 7240720 7091281
4442 7091281 6863621 6608675 6486055 6347858 6236608 6064168 5854586 5795919 5769184 5722737
4432 5722737 5647472 5617649 5563603 5464050 5348368 5268356 5284779 5264406 5294335 5193393 5123573
4421 5123573 5059252 5012960 5087989 5129807 5039687 5097897 5039481 5012242 5102489 5034362 5029176 5038583
4409 5038583 5078359 5248329 5244037 5224691 5232898 5173616 5060581 4993349 4941579 4958856 4973972
4398 4973972 4890893 4926088 4900600 4833685 4756184 4754409 4730632 4804866 4755192 4789932 4830573 4757720
4386 4757720 4842905 4864183 4911894 4997111 4916485 4859649 4988350 5017704 4960718 4879087 4811028
4375 4811028 4742195 4827532 4859148 4795591 4797156 4872865 4833837 4728900 4719291 4773606 4812087 4823340
$$ packed form
4452F135751n356L2681J68941J49781K47045J26572J77064K58163m9922j49439
4442G091281k27660k54946j22620j38197j11250j72440k09582n8667k6735m6447
4432E722737p5265k9823n4046r9553j15682q0012J6423k0373K9929j00942o9820
4421E123573o4321m6292P5029M1818r0120N8210n8416k7239R0247o8127n186R407
4409E038583L9776J69970m292j9346Q207n9282j13035o7232n1770J7277J5116
4398D973972q3079L5195k5488o6915p7501j775k3777P4234m9674L4740M0641p2853
4386D757720Q5185K1278M7711Q5217q0626n6836J28701K9354n6986q1631o8059
4375D811028o8833Q5337L1616o3557J565P5709l9028j04937r609N4315L8481J1253
$$ plain form
4363 4823340 4891159 4805979 4744787 4816826 4860691 4898933 4917169 4943960 4959012 4949394 5002859 4989449
4351 4989449 5036535 4999476 5053466 5096598 5133441 5220736 5377442 5245523 5355848 5425265 5394459
4340 5394459 5371087 5360140 5359288 5409544 5503407 5430196 5477435 5500299 5641494 5724922 5761073 5826839
4328 5826839 5776561 5919396 5844554 6009280 6143487 6215934 6346353 6418156 6546649 6521441
4318 6521441 6637430 6697369 6860119 6944347 7076964 7161565 7286317 7404522 7461150 7577187
4308 7577187 7704061 7812483 8005405 8149980 8284335 8448061 8496724 8652260 8764558 8812844
4298 8812844 8905198 9010179 9078073 9131374 9136582 9298252 9442962 9673309 9912990 9802410
4288 9802410 9864083 10073900 10306715 10463504 10683039 10833039 11038353 11110924 11222481 11421635
$$ packed form
4363D823340O7819q5180o1192P2039M3865L8242J8236K6791J5052r618N3465j3410
4351D989449M7086l7059N3990M3132L6843Q7295J56706j31919J10325O9417l0806
4340E394459k3372j0947q52N0256R3863p3211M7239K2864J41195Q3428L6151O5766
4328E826839n0278J42835p4842J64726J34207P2447J30419P1803J28493k5208
4318F521441J15989N9939J62750Q4228J32617Q4601J24752J18205N6628J16037
4308G577187J26874J08422J92922J44575J34355J63726M8663J55536J12298M8286
4298H812844R2354J04981O7894N3301N208J61670J44710K30347K39681j10580
4288I802410O1673K09817K32815J56789K19535J50000K05314P2571J11557J99154
$$ plain form
4278 11421635 11507961 11615029 11823458 12027277 12203094 12412470 12526374 12536767 12491467 12391724
4268 12391724 12493280 12576233 12692225 12900656 12896235 12927928 13085871 13360010 13446575 13546266
4258 13546266 13913871 14206665 14478545 14718130 14934027 15131031 15116359 15118082 15164067 15230340
4248 15230340 15355454 15499336 15468709 15533300 15533585 15536471 15629385 15867169 15964589 16030672 15998396
4237 15998396 16009860 16064609 16146558 16393359 16467440 16507454 16589843 16748338 16835827 16960361 17129899
4226 17129899 17289740 17421704 17679358 17818155 18039068 18228282 18402240 18577010 18706661
4217 18706661 18862417 19192298 19411594 19707528 20016869 20387160 20605837 20855577 21189223
4208 21189223 21646232 22201626 22794187 23305711 23767986 24249595 24841575 25696227 26561968
$$ packed form
4278A1421635Q6326J07068K08429K03819J75817K09376J13904J0393m5300r9743
4268A2391724J01556Q2953J15992K08431m421L1693J57943K74139Q6565R9691
4258A3546266L67605K92794K71880K39585K15897J97004j4672J723M5985O6273
4248A5230340J25114J43882l0627O4591K85K886R2914K37784R7420O6083l2276
4237A5998396J1464N4749Q1949K46801P4081M0014Q2389J58495Q7489J24534J69538
4226A7129899J59841J31964K57654J38797K20913J89214J73958J74770J29651
4217A8706661J55756L29881K19296K95934L09341L70291K18677K49740L33646
4208B1189223M57009N55394N92561N11524M62275M81609N91980Q54652Q65741
$$ plain form
4199 26561968 27554298 28495219 29514819 30352752 31113903 31698743 32475876 33191538 34033032
4190 34033032 34908799 35809998 37006082 38366514 39861413 41343815 42889972 44498213
4182 44498213 46265090 48320902 50645582 53035197 55851996 58824795 62019743 65425641
4174 65425641 69290868 73571482 78647534 84649267 91670822 99741739 109251498 120549725
4166 120549725 134027563 150509557 170763301 195235984 225803851 263548346 307953790
4159 307953790 353361574 386939713 394067620 368296624 320081913 267270605 223994195
4152 223994195 192718182 170265299 154025313 142592347 134531759 128909949 124681927
4145 124681927 120799435 115690270 108737472 100666588 92777256 85890972 80444660 76485581
$$ packed form
4199B6561968R92330R40921J019600Q37933P61151N84840P77133P15662Q41494
4190C4033032Q75767R01199J196084J360432J494899J482402J546157J608241
4182D4498213J766877K055812K324680K389615K816799K972799L194948L405898
4174F5425641L865227M280614N076052O001733P021555Q070917R509759J1298227
4166A20549725J3477838J6481994K0253744K4472683L0567867L7744495M4405444
4159C07953790M5407784L3578139P127907k5770996m8214711n2811308m3276410
4152B23994195l1276013k2452883j6239986j1432966q060588n621810m228022
4145A24681927l882492n109165o952798q070884p889332o886284n446312l959079
$$ plain form
4137 76485581 73632170 71361177 69247517 66971714 64840270 62852367 61352408 60302034
4129 60302034 59723153 59722515 60139143 60981492 62296121 63685840 64939983 66301015 68072747
4120 68072747 70753832 74287920 78239397 81474901 83046586 82366391 80059262 76630811
4112 76630811 71705253 65601216 59451862 54051813 49848980 46488532 43643161 41116658
4104 41116658 39070315 37371611 35927862 34730285 33697043 32660317 31652706 30664004
4096 30664004 29861854 29212361 28710711 28350985 28225111 28115680 28248956 28242466 28240764 28357845
4086 28357845 28238268 28238229 28495621 28870318 29016463 28754494 28217342 27255398 26098131 25050348
4076 25050348 24191706 23563706 23050917 22626314 22318204 21957768 21754360 21709970 21750880 21870338
$$ packed form
4137G6485581k853411k270993k113660k275803k131444j987903j499959j050374
4129F0302034n78881o38M16628Q42349J314629J389719J254143J361032J771732
4120F8072747K681085L534088L951477L235504J571685o80195k307129l428451
4112G6630811m925558o104037o149354n400049m202833l360448k845371k526503
4104D1116658k046343j698704j443749j197577j033242j036726j007611r88702
4096C0664004q02150o49493n01650l59726j25874j09431J33276o490j702J17081
4086B8357845j19577l9K57392L74697J46145k61969n37152r61944j157267j047783
4076B5050348q58642o28000n12789m24603l08110l60436k03408m4390M0910J19458
$$ plain form
4066 21870338 22112380 22397873 22708464 23110104 23575176 24046253 24546146 24875279 24631208
4057 24631208 24225040 23645204 22594777 21468874 20575011 19920693 19324030 18965359 18834319
4048 18834319 18592277 18490935 18419707 18441949 18487822 18620853 18620453 18641884 18860797 18961133 19030103
4037 19030103 19287778 19588073 19881359 20203058 20596362 21086277 21557525 22229052 23085939
4028 23085939 24079644 25368282 26775124 28663458 30812002 33116218 35503374 37090812
4020 37090812 37913241 37614947 36437156 34627405 32105375 29311935 26774175 24779774
4012 24779774 23397237 22351459 21535488 20948508 20574824 20234320 19824997 19405668 19169741
4003 19169741 19168595 19081772 19162659 19318412 19452074 19703689 19993478 20297485 20827699 21379307
$$ packed form
4066B1870338K42042K85493L10591M01640M65072M71077M99893L29133k44071
4057B4631208m06168n79836j050427j125903q93863o54318n96663l58671j31040
4048A8834319k42042j01342p1228K2242M5873J33031m00K1431K18913J00336O8970
4037A9030103K57675L00295K93286L21699L93304M89915M71248O71527Q56887
4028B3085939R93705J288638J406842J888334K148544K304216K387156J587438
4020C7090812Q22429k98294j177791j809751k522030k793440k537760j994401
4012B4779774j382537j045778q15971n86980l73684l40504m09323m19329k35927
4003A9169741j146q6823Q0887J55753J33662K51615K89789L04007N30214N51608
$$ plain form
3993 21379307 21959807 22645687 23326038 24096175 25007802 25869274 26729220 27794636 28991045
3984 28991045 30407192 31929142 33439460 35130483 37054588 39305938 41736817 43856993
3976 43856993 44872097 43937572 41476614 38701548 36572742 35008181 34107395 33592824 33422012
3967 33422012 33572083 33523475 33165336 32303696 31525489 31060534 30874069 31090607 31446867 31825789
3957 31825789 32203006 32303094 31986488 31857260 32038743 32370658 33031611 34126620 35762085
3948 35762085 37795939 40216929 42670446 44973470 46967108 49259133 52235839 55096013
3940 55096013 56475376 55158638 51043171 45960514 41772105 38603549 36383528 34894234
3932 34894234 33771019 33046459 32467192 32108691 31851053 31769440 31935688 31953972 31652503 31079728
$$ packed form
3993B1379307N80500O85880O80351P70137R11627Q61472Q59946J065416J196409
3984B8991045J416147J521950J510318J691023J924105K251350K430879K120176
3976D3856993J015104r34525k460958k775066k128806j564561r00786n14571j70812
3967C3422012J50071m8608l58139q61640p78207m64955j86465K16538L56260L78922
3957C1825789L77217J00088l16606j29228J81483L31915O60953J095009J635465
3948C5762085K033854K420990K453517K303024J993638K292025K976706K860174
3940E5096013J379363j316738m115467n082657m188409l168556k220021j489294
3932C4894234j123215p24560n79267l58501k57638q1613J66248J8284l01469n72775
$$ plain form
3922 31079728 30590803 30580558 31016283 31816247 33145743 35124453 37749695 41115298 45128704
3913 45128704 49351869 52675080 53921935 52895231 51434929 51263475 53054560 56254700
3905 56254700 59862492 61824284 60048002 54705100 48668087 44455275 41765975 39730985
3897 39730985 37580426 35176886 32834761 31241682 30239038 29494750 28994038 28289916 26918396
3888 26918396 25270307 23715532 22455940 21495053 20659713 20038238 19588050 19135142 18773873
3879 18773873 18565678 18300204 18007468 17705801 17436524 17302473 17231222 17179540 17092489 17249667
3869 17249667 17421844 17585755 17570227 17554746 17367273 17103859 16978244 17022397 17092077 17231465
3859 17231465 17417751 17635650 17999587 18441734 18885151 19349212 19986120 20694538 21433372
$$ packed form
3922C1079728m88925j0245M35725P99964J329496J978710K625242L365603M013406
3913D5128704M223165L323211J246855j026704j460302j71454J791085L200140
3905E6254700L607792J961792j776282n342902o037013m212812k689300k034990
3897C9730985k150559k403540k342125j593079j002644p44288n00712p04122j371520
3888B6918396j648089j554775j259592r60887q35340o21475m50188m52908l61269
3879A8773873k08195k65474k92736l01667k69277j34051p1251n1682q7051J57178
3869A7249667J72177J63911j5528j5481j87473k63414j25615M4153O9680J39388
3859A7231465J86286K17899L63937M42147M43417M64061O36908P08418P38834
$$ plain form
3850 21433372 22125691 22867962 23482539 23869174 24102084 24324404 24505252 24582517 24459274 24210399
3840 24210399 23931903 23581447 23368712 23278363 23299837 23377076 23571369 23962680 24322221 24856195
3830 24856195 25616906 26306384 27212636 28276567 29507514 31042573 32629239 34613920 36835289
3821 36835289 39137608 41399423 43465421 45073143 46134442 46985235 47592589 47799298 47655975
3812 47655975 47004678 45749586 44403262 43022742 41827361 40822032 40260871 40125957 40295554
3803 40295554 40928105 41701125 42622724 43602593 44450582 45121682 45942992 46883090 48192702
3794 48192702 49900245 51997363 54671914 57589536 60386638 63128237 65195890 66275795
3786 66275795 66611563 66640876 66865700 67481031 68229524 68909130 69396753 69751837 70295158 70938246
$$ packed form
3850B1433372O92319P42271O14577L86635K32910K22320J80848P7265j23243k48875
3840B4210399k78496l50456k12735r0349K1474P7239J94293L91311L59541N33974
3830B4856195P60711O89478R06252J063931J230947J535059J586666J984681K221369
3821C6835289K302319K261815K065998J607722J061299Q50793O07354K06709j43323
3812D7655975o51297j255092j346324j380520j195381j005329n61161j34914J69597
3803D0295554O32551P73020R21599R79869Q47989O71100Q21310R40098J309612
3794D8192702J707543K097118K674551K917622K797102K741599K067653J079905
3786F6275795L35768K9313K24824O15331P48493O79606M87623L55084N43321O43088
$$ plain form
3776 70938246 71848582 72552466 72774644 72462905 71261281 69243252 66823974 63847765 60717255
3767 60717255 57738794 55395129 53733137 52720147 52141595 52001260 52173652 52282026 52402603
3758 52402603 52618364 52853717 53341111 54376095 55834707 57752425 59733042 61381468 62288499
3749 62288499 62144214 60785010 58568135 56068107 53429145 50967935 48906917 47006086
3741 47006086 45370726 43694953 41875386 40025963 38199004 36599551 35113878 33912729
3733 33912729 32925015 32158567 31883194 31755501 31848996 32172743 32771649 33371813 34180849 35158738
3723 35158738 35939541 36347632 36317593 35707586 34881048 34159109 33269465 32520645 31834634 31093887
3713 31093887 30216299 29191132 28204531 27284223 26340149 25266426 24394653 23598507 22947141
$$ packed form
3776G0938246R10336P03884K22178l11739j201624k018029k419278k976209l130510
3767F0717255k978461k343665j661992j012990n78552j40335J72392J08374J20577
3758E2402603K15761K35353M87394J034984J458612J917718J980617J648426R07031
3749F2288499j44285j359204k216875k500028k638962k461210k061018j900831
3741D7006086j635360j675773j819567j849423j826959j599453j485673j201149
3733C3912729r87714p66448k75373j27693R3495L23747N98906O00164Q09036R77889
3723C5158738P80803M08091l0039o10007q26538p21939q89644p48820o86011p40747
3713C1093887q77588j025167r86601r20308r44074j073723q71773p96146o51366
$$ plain form
3704 22947141 22532786 22099115 21692597 21455078 21315402 21227048 21173666 21166115 21384348 21651916
3694 21651916 21696059 21868168 22123569 22280176 22501851 22650431 22788932 22810601 22774059 22867638
3684 22867638 22803732 22811984 22789815 22683178 22708069 22773815 22852981 23070254 23296532 23612017 24043697
3673 24043697 24598280 25041217 25617707 26329151 27111356 28054142 28935968 29993428 31038294
3664 31038294 32156181 33164562 34156762 35255154 36531510 37701321 38690427 39796073
3656 39796073 40857975 42076605 43361514 44254821 44856040 44767760 44235676 43562947 43056237
3647 43056237 42777374 42515232 42503290 42774327 43216141 43860547 44726611 45889880 47141949
3638 47141949 48743473 50674141 52763694 54945597 57318313 59577094 61730724 63986072
$$ packed form
3704B2947141m14355m33671m06518k37519j39676q8354n3382p551K18233K67568
3694B1651916M4143J72109K55401J56607K21675J48580J38501K1669l6542R3579
3684B2867638o3906Q252k2169j06637K4891O5746P9166K17273K26278L15485M31680
3673B4043697N54583M42937N76490P11444P82205R42786Q81826J057460J044866
3664C1038294J117887J008381R92200J098392J276356J169811R89106J105646
3656C9796073J061902J218630J284909Q93307O01219q8280n32084o72729n06710
3647D3056237k78863k62142j1942K71037M41814O44406Q66064J163269J252069
3638D7141949J601524J930668K089553K181903K372716K258781K153630K255348
$$ plain form
3630 63986072 66027845 68097280 70272799 72250919 73659236 74408865 74190960 72959789
3622 72959789 71262106 69471125 67784626 66438930 65587353 65146601 64649908 64161752 63650570
3613 63650570 63046576 62553074 62373792 62607353 63454223 64775172 66547214 68560128 70454253
3604 70454253 72188935 73373024 74034256 74675298 75510367 76586875 77652772 78723754 79680466
3595 79680466 80417155 81130088 81448587 81508479 81484091 81478615 81565678 81607381 81485660 80582201
3585 80582201 78778741 76471673 74023972 71899611 70103562 68693458 67638833 66858874
3577 66858874 66324746 65982369 65829486 65471809 65018949 64667730 64429767 64697181 65200492
3568 65200492 65914346 66777788 67738496 68816151 69760753 70682960 71396342 71742595 71640237
$$ packed form
3630F3986072K041773K069435K175519J978120J408317P49629k17905j231171
3622G2959789j697683j790981j686499j345696q51577m40752m96693m88156n11182
3613F3650570o03994m93502j79282K33561Q46870J320949J772042K012914J894125
3604G0454253J734682J184089O61232O41042Q35069J076508J065897J070982R56712
3595G9680466P36689P12933L18499N9892k4388n476Q7063M1703j21721r03459
3585H0582201j803460k307068k447701k124361j796049j410104j054625p79959
3577F6858874n34128l42377j52883l57677m52860l51219k37963K67414N03311
3568F5200492P13854Q63442R60708J077655R44602R22207P13382L46253j02358
$$ plain form
3559 71640237 71143241 70554462 69568145 68071039 66221288 64026332 61397344 58726433 56218924
3550 56218924 54004018 52256632 50939657 49861094 49067066 48340517 47860818 47503633 47183142
3541 47183142 46906458 46635063 46448216 46169350 45998615 45849056 45796712 45804917 45813704 45579801
3531 45579801 45283143 44859419 44446397 43925175 43375759 42578345 41418238 40225420 38852873
3522 38852873 37619984 36543410 35460222 34619681 33806705 33085805 32434056 31871707 31441780
3513 31441780 30919385 30363051 29847297 29455059 29056021 28609373 28259258 27943981 27637036
3504 27637036 27438502 27269713 27027720 26772306 26452502 26148156 25809522 25429120 24917353
3495 24917353 24334923 23822545 23218767 22549349 21958811 21421936 20920443 20316908 19809335
$$ packed form
3559G1640237m96996n88779r86317j497106j849751k194956k628988k670911k507509
3550E6218924k214906j747386j316975j078563p94028p26549m79699l57185l20491
3541D7183142k76684k71395j86847k78866j70735j49559n2344Q205Q787k33903
3531D5579801k96658m23724m13022n21222n49416p97414j160107j192818j372547
3522C8852873j232889j076574j083188q40541q12976p20900o51749n62349m29927
3513C1441780n22395n56334n15754l92238l99038m46648l50115l15277l06945
3504B7637036j98534j68789k41993k55414l19804l04346l38634l80402n11767
3495B4917353n82430n12378o03778o69418n90538n36875n01493o03535n07573
$$ plain form
3486 19809335 19315819 18980637 18735042 18333265 18123481 17965765 17697779 17636175 17515759 17531031
3476 17531031 17483171 17476022 17529476 17364047 17310788 17259545 17292910 17223280 17186091 17085356 17006134
3465 17006134 16967534 16893989 16783531 16542533 16365356 16189549 16037213 15907010 15723216 15571963
3455 15571963 15476737 15277547 15047551 14926673 14881004 14720320 14497373 14546164 14479482 14452379
3445 14452379 14540898 14632220 14790414 14937259 15134434 15292928 15505751 15748115 15893527 16158076
3435 16158076 16335216 16451218 16530224 16630874 16767411 16857342 16809748 16728017 16721899 16769090 16769096
3424 16769096 16726465 16698603 16667788 16545693 16433919 16310142 16179311 15935862 15753479 15670896
3414 15670896 15690038 15746658 15812723 15798830 15944731 16115426 16272726 16398549 16555947 16789463
$$ packed form
3486A9809335m93516l35182k45595m01777k09784j57716k67986o1604j20416J5272
3476A7531031m7860p149N3454j65429n3259n1243L3365o9630l7189j00735p9222
3465A7006134l8600p3545j10458k40998j77177j75807j52336j30203j83794j51253
3455A5571963r5226j99190k29996j20878m5669j60684k22947M8791o6682k7103
3445A4452379Q8519R1322J58194J46845J97175J58494K12823K42364J45412K64549
3435A6158076J77140J16002P9006J00650J36537Q9931m7594q1731o118M7191O
3424A6769096m2631k7862l0815j22095j11774j23777j30831k43449j82383q2583
3414A5670896J9142N6620O6065j3893J45901J70695J57300J25823J57398K33516
$$ plain form
3404 16789463 17029505 17181467 17358275 17612766 17815749 17929402 18029000 18335975 18479106 18564410
3394 18564410 18670640 18739749 18687290 18611122 18474434 18483218 18366256 18120150 17860474 17830290
3384 17830290 17927313 18030297 18053859 18129420 18103778 18242973 18466687 18652850 18821510 18988025
3374 18988025 19228438 19430659 19551050 19720943 19871301 19886108 19889798 19958243 19897809 19695950
3364 19695950 19672950 19701695 19563140 19518357 19420625 19212988 18874386 18634378 18414914 18253522
3354 18253522 18175584 18082609 18075695 17920686 17994917 18056544 18005722 18012550 17921398 17817301 17692954
3343 17692954 17500141 17249028 16960819 16770427 16448656 16232104 16060381 15909191 15788142
3334 15788142 15638167 15609044 15607253 15450338 15424555 15372789 15348749 15222498 15086447 15152139 15152096
$$ packed form
3404A6789463K40042J51962J76808K54491K02983J13653R9598L06975J43131Q5304
3394A8564410J06230O9109n2459p6168j36688Q784j16962k46106k59676l0184
3384A7830290R7023J02984K3562P5561k5642J39195K23714J86163J68660J66515
3374A8988025K40413K02221J20391J69893J50358J4807L690O8445o0434k01859
3364A9695950k3000K8745j38555m4783r7732k07637l38602k40008k19464j61392
3354A8253522p7938r2975o914j55009P4231O1627n0822O828r1152j04097j24347
3343A7692954j92813k51113k88209j90392l21771k16552j71723j51190j21049
3334A5788142j49975k9123j791j56915k5783n1766k4040j26251j36051O5692m3
$$ plain form
3323 15152096 15069175 15010161 14924069 14942644 14869148 14845202 14703585 14670132 14392260 14243820 14029929
3312 14029929 13786205 13592819 13347512 13170320 12987839 12815531 12614665 12692197 12788116 12662510
3302 12662510 12502596 12550361 12542126 12536249 12468333 12444049 12392350 12241541 12098766 12017499 12028132
3291 12028132 12072622 11920740 11782640 11735303 11769226 11733069 11685895 11658967 11626343 11571405 11546981
3280 11546981 11502714 11534405 11624901 11572424 11635714 11667729 11587213 11749080 11917024 11973048 12022340
3269 12022340 12082078 12102579 12207673 12281689 12518105 12659897 12950865 13251526 13507325 13912267
3259 13912267 14330687 14766538 15252646 15621055 16210574 16814831 17347868 17995924 18754924
3250 18754924 19247182 19625847 19935445 19934146 19859338 19343283 18582338 17964207 17088632 16055011
$$ packed form
3323A5152096q2921n9014q6092J8575p3496k3946j41617l3453k77872j48440k13891
3312A4029929k43724j93386k45307j77192j82481j72308k00866P7532R5919j25606
3302A2662510j59914M7765q235n877o7916k4284n1699j50809j42775q1267J0633
3291A2028132M4490j51882j38100m7337L3923l6157m7174k6928l2624n4938k4424
3280A1546981m4267L1691R0496n2477O3290L2015q0516J61867J67944N6024M9292
3269A2022340N9738K0501J05094P4016K36416J41792K90968L00661K55799M04942
3259A3912267M18420M35851M86108L68409N89519O04257N33037O48056P59000
3250A8754924M92258L78665L09598j299p4808n16055p60945o18131q75575j033621
$$ plain form
3240 16055011 15110454 14325384 13517241 12702093 12191509 11680906 11224177 10752822 10361749
3231 10361749 10047256 9831791 9574249 9408421 9226569 9084244 8970061 8900136 9006476 9072190
3221 9072190 9148259 9063542 9064334 9116389 8832694 8411795 8000601 7640351 7350795 7180437 7069496
3210 7069496 6888633 6720851 6585397 6532937 6496017 6374359 6350506 6392010 6407793 6445654 6576420
3199 6576420 6607933 6688091 6801870 6860471 6844912 7153263 7276544 7476007 7825096 8089045
3189 8089045 8393343 8774665 9095382 9041007 8708125 8118303 7520441 7042975 6801138 6631183
3179 6631183 6546510 6354071 6360880 6375711 6502040 6468648 6477482 6605293 6585633 6681107 6775394
3168 6775394 6856783 6914278 6923264 6979002 6975983 6977346 6988895 6952843 7062882 7173913 7364966
$$ packed form
3240A6055011r44557p85070q08143q15148n10584n10603m56729m71355l91073
3231A0361749l14493k15465k57542j65828j81852j42325j14183o9925J06340O5714
3221I072190P6069q4717P92N2055k83695m20899m11194l60250k89556j70358j10941
3210G069496j80863j67782j35454n2460l6920j21658k3853M1504J5783L7861J30766
3199F576420L1513Q0158J13779N8601j5559L08351J23281J99463L49089K63949
3189H089045L04298L81322L20717n4375l32882n89822n97862m77466k41837j69955
3179F631183q4673j92439O809J4831J26329l3392Q834J27811j9660R5474R4287
3168F775394Q1389N7495Q986N5738l019J363J1549l6052J10039J11031J91053
$$ plain form
3157 7364966 7552293 7684547 7771793 7595156 7330442 7157568 6921759 6874434 6911720 6940169
3147 6940169 6905481 6984276 7100846 7103110 7005414 7077096 7151763 7239715 7316052 7365077 7528658
3136 7528658 7598210 7642648 7698628 7759579 7808071 7890164 7925822 7910082 7846417 7769893 7751953
3125 7751953 7599365 7469257 7391493 7352557 7177219 7074782 7066741 7193882 7191590 7154636 7042376
3114 7042376 7095432 7171784 7108177 7135424 7216926 7063542 7121278 7231316 7264605 7327703 7344576
3103 7344576 7399093 7324452 7382913 7373109 7366312 7284424 7237607 7197534 7209381 7274193 7348803 7293441
3091 7293441 7265143 7231032 7227492 7227579 7125697 6979278 6665582 6401352 6420970 6343129 6249328
3080 6249328 6131433 6087894 6020705 5883696 5825503 5774464 5710267 5695306 5570578 5508852 5472138
$$ packed form
3157G364966J87327J32254Q7246j76637k64714j72874k35809m7325L7286K8449
3147F940169l4688P8795J16570K264r7696P1682P4667Q7952P6337M9025J63581
3136G528658O9552M4438N5980O0951M8492Q2093L5658j5740o3665p6524j7940
3125G751953j52588j30108p7764l8936j75338j02437q041J27141k292l6954j12260
3114G042376N3056P6352o3607K7247Q1502j53384N7736J10038L3289O3098J6873
3103G344576N4517p4641N8461r804o797q1888m6817m0073J1847O4812P4610n5362
3091G293441k8298l4111l540Q7j01882j46419l13696k64230J9618p7841r3801
3080F249328j17895m3539o7189j37009n8193n1039o4197j4961j24728o1726l6714
$$ plain form
3069 5472138 5450331 5407101 5321553 5256515 5175359 5142834 5063471 4922653 4963296 4896101 4944808
3058 4944808 4895337 4887506 5045509 4970765 4796060 4713271 4581952 4478864 4351541 4170405
3048 4170405 4113600 4041173 3907545 3773682 3637481 3476469 3460895 3331167 3193570 3111297
3038 3111297 2997671 3043566 2923095 2884248 2856322 2853085 2850622 2761275 2793979 2763013 2669021
3027 2669021 2650894 2699170 2662092 2661337 2661104 2607031 2505361 2354010 2334839 2306359 2100923 2044859
3015 2044859 2040211 2010764 1954767 1943019 1863156 1801189 1779245 1684508 1709806 1704839 1708487 1601385
3003 1601385 1481557 1448980 1469619 1501773 1411446 1281601 1315896 1290856 1308015 1358767 1407908
2992 1407908 1525223 1423844 1370373 1343083 1307765 1223502 1309748 1226367 1213440 1218765 1208792
$$ packed form
3069E472138k1807m3230q5548o5038q1156l2525p9363j40818M0643o7195M8707
3058D944808m9471p831J58003p4744j74705q2789j31319j03088j27323j81136
3048D170405n6805p2427j33628j33863j36201j61012j5574j29728j37597q2273
3038C111297j13626M5895j20471l8847k7926l237k463q9347L2704l0966r3992
3027B669021j8127M8276l7078p55k33n4073j01670j51351j9171k8480k05436n6064
3015B044859m648k9447n5997j1748p9863o1967k1944r4737K5298m967L648j07102
3003A601385j19828l2577K0639L2154r0327j29845L4295k5040J7159N0752M9141
2992A407908J17315j01379n3471k7290l5318q4263Q6246q3381j2927N325r973
$$ plain form
2981 1208792 1224073 1136307 1083873 1107520 997314 1055953 1046056 992276 963050 1046759 1143900
2970 1143900 1029220 1037277 1000612 931040 1082151 1058380 1015995 1051437 956820 939027 856005
2959 856005 866422 909530 863406 950595 1081186 1045610 1020078 979115 960264 893081 958977
2948 958977 928951 931419 942363 1044269 1039204 1088015 1204837 1133905 1138828 1156221 1181970 1244679
2936 1244679 1322983 1258478 1238186 1279461 1355930 1343605 1385109 1396896 1264555 1189990 1217016
2925 1217016 1169100 1130693 1190658 1257018 1238876 1261849 1197082 1221350 1285963 1326571 1309475
2914 1309475 1356622 1402004 1435302 1669682 1784712 1709927 1682491 1756600 1785847 1788559 1688174
2903 1688174 1716710 1530075 1419572 1419463 1326489 1277285 1139001 1204023 1113586 1160058 1159986 1081691
$$ packed form
2981A208792J5281q7766n2434K3647j10206N8639r897n3780k9226Q3709R7141
2970A143900j14680Q057l6665o9572J51111k3771m2385L5442r4617j7793q3022
2959H56005J0417M3108m6124Q7189J30591l5576k5532m0963j8851o7183O5896
2948I58977l0026K468J0944J01906n065M8811J16822p0932M923J7393K5749O2709
2936A244679P8304o4505k0292M1275P6469j2325M1504J1787j32341p4565K7026
2925A217016m7916l8407N9965O6360j8142K2973o4767K4268O4613M0608j7096
2914A309475M7147M5382L3298K34380J15030p4785k7436P4109K9247K712j00385
2903A688174K8536j86635j10503j09r2974m9204j38284O5022r0437M6472p2p8295
$$ plain form
2891 1081691 1038486 953838 924880 922546 905932 1008676 1048241 992202 1083532 1128538 1084896
2880 1084896 1071389 1047884 1032403 1118859 1017079 987241 1019509 1013494 967065 945729 937337 871496
2868 871496 826817 793091 779638 792968 727061 755507 724981 773512 834833 736863 688716 688387
2856 688387 640793 649775 619032 641703 605585 488815 512151 537560 474187 529279 610269 589553
2844 589553 554970 546148 511480 501766 432960 464545 450088 423239 485402 510596 433436 372350
2832 372350 398515 444004 416757 486730 429391 364974 419956 364341 372650 399555 334486 360825
2820 360825 339495 391111 427838 497010 549015 435597 319838 368504 308108 224176 217249
2809 217249 300743 290832 261870 230056 218351 258815 185952 233074 313458 365596 211625 131020
$$ packed form
2891A081691m3205q4648k8958k334j6614J02744L9565n6039R1330M5006m3642
2880A084896j3507k3505j5481Q6456j01780k9838L2268o015m6429k1336q392o5841
2868H71496m4679l3726j3453J3330o5907K8446l0526M8531O1321r7970m8147l29
2856F88387m7594Q982l0743K2671l6118j16770K3336K5409o3373N5092Q0990k0716
2844E89553l4583q822l4668r714o8806L1585j4457k6849O2163K5194p7160o1086
2832C72350K6165M5489k7247O9973n7339o4417N4982n5615Q309K6905o5069K6339
2820C60825k1330N1616L6727O9172N2005j13418j15759M8666o0396q3932o927
2809B17249Q3494r911k8962l1814j1705M0464p2863M7122Q0384N2138j53971q0605
$$ plain form
2797 131020 59345 222717 271919 178340 84681 57147 9608 125547 134784 100126 140747
2786 140747 245947 237068 284812 222419 126863 132268 263238 201404 73803 181785 244221
2775 244221 182770 94268 170688 196773 114551 58509 122344 157072 162175 181926 251206 157393
2763 157393 89926 48867 22501 -1858 25564 106915 147695 100739 37015 59137 21281 75534
2751 75534 27895 34750 132020 120381 151699 79552 -3273 4308 -26245 36695 28132 56012
2739 56012 18473 9710 40608 24761 19528 7462 -34516 -23544 1938 -68484 -160618 -59652
2727 -59652 126817 174754 142114 49777 72154 22698 -5256 90856 21730 25619 55635 22818
2715 22818 -20292 -75277 -2504 -53119 -87480 -89255 -19661 -3084 -10425 46237 72345 6924
$$ packed form
2797A31020p1675J63372M9202r3579r3659k7534m7539J15939R237l4658M0621
2786A40747J05200q879M7744o2393r5556N405J30970o1834j27601J07982O2436
2775B44221o1451q8502P6420K6085q2222n6042O3835L4728N103J9751O9280r3813
2763A57393o7467m1059k6366k4359K7422Q1351M0780m6956o3724K2122l7856N4253
2751G5534m7639O855R7270j1639L1318p2147q2825P581l0553O2940q563K7880
2739E6012l7539q763L0898j5847n233j2066m1978J0972K5482p0422r2134J00966
2727e9652J86469M7937l2640r2337K2377m9456k7954R6112o9126L889L0016l2817
2715B2818m3110n4985P2773n0615l4361j775O9594J6577p341N6662K6108o5421
$$ plain form
2703 6924 319 -10533 -8262 -75732 -65175 -65780 -86022 -19139 32313 42366 -12084 34096 17671
2690 17671 9912 -8988 -33968 -21599 -5988 -4263 31357 126558 200573 144533 65787 76816
2678 76816 58334 55235 -43654 -71601 -46756 -73517 -26059 3903 -2011 36071 2353 81564
2666 81564 92502 -45140 -70367 -12232 29915 50374 -38050 -14146 43800 -14137 -62288 20076
2654 20076 6673 21952 -66801 -66232 98080 18985 57329 -5710 16693 -8139 41984 19143
2642 19143 47453 10101 -84451 -81777 -76668 16867 -10224 28393 75735 19532 59153 168678
2630 168678 127350 105537 85908 73165 -16937 -26706 -7514 -44820 -4991 4666 -60831 -26264
2618 -26264 28029 -479 24581 29086 -1623 -10009 39866 26155 -79300 66198 -732 -7276
$$ packed form
2703F924o605j0852K271o7470J0557o05k0242O6883N1452J0053n4450M6180j6425
2690A7671p759j8900k4980J2369J5611J725L5620R5201P4015n6040p8746J1029
2678G6816j8482l099r8889k7947K4845k6761M7458K9962n914L8082l3718P9211
2666H1564J0938j37642k5227N8135M2147K0459q8424K3904N7946n7937m8151Q2364
2654B0076j3403J5279q8753N69J64312p9095L8344o3039K2403k4832N0123k2841
2642A9143K8310l7352r4552K674N109R3535k7091L8617M7342n6203L9621J09525
2630A68678m1328k1813j9629j2743r0102r769J9192l7306L9829R657o5497L4567
2618b6264N4293k8508K5060M505l0709q386M9875j3711j05455J45498o6930o544
$$ plain form
2606 -7276 34398 -5930 7576 134554 75696 28023 -17933 -137361 -120497 -28310 -14919 -100423
2594 -100423 -60149 28092 42477 -17713 -105013 -67437 -33937 -137077 -15850 -51443 -77652
2583 -77652 -82675 29792 35832 -19748 20785 98171 91224 162384 16868 -12700 12664 20713
2571 20713 10055 -28142 10949 1328 12596 -44857 -112809 94827 60318 71665 111781 93436
2559 93436 -18872 -40735 60644 28410 -29985 -26312 -59302 -137084 -74063 -25802 25253 -71847
2547 -71847 -33210 -33289 -36454 -50810 -99199 -90128 -45099 -103902 -12198 -44804 -116748 -140304 -77848
2534 -77848 85546 -44065 -92949 -58102 -124025 -46680 -33550 38065 44853 10473 83091 173034
2522 173034 122105 30203 -14580 -1771 29440 34479 -23550 -21421 2476 48347 -88253 -37054
$$ packed form
2606g276M1674m0328J3506J26978n8858m7673m5956j19428J6864R2187J3391q5504
2594a00423M0274Q8241J4385o0190q7300L7576L3500j03140J21227l5593k6209
2583g7652n023J12467O040n5580M0533P7386o947P1160j45516k9568K5364Q049
2571B0713j0658l8197L9091r621J1268n7453o7952K07636l4509J1347M0116j8345
2559I3436j12308k1863J01379l2234n8395L673l2990p7782O3021M8261N1055r7100
2547g1847L8637p9l165j4356m8389R071M5029n8803R1704l2606p1944k3556O2456
2534g7848J63394j29611m8884L4847o5923P7345J3130P1615O788l4380P2618Q9943
2522A73034n0929r1902m4783J2809L1211N039n8029K129K3897M5871j36600N1199
$$ plain form
2510 -37054 -73245 -184936 18437 67190 71438 70338 9423 32537 92469 25268 20078 -30893
2498 -30893 -28480 90328 -38953 -182895 -31791 2282 14637 -71194 -105618 -158547 -94296
2487 -94296 -77755 -47133 -4586 -52273 -13558 -82319 -18533 -18992 -57493 -22625 -4607 3072
2475 3072 34613 61275 -5268 -111833 -49049 28296 3433 -2570 -76855 -229887 -249363 -218953
2463 -218953 -208741 -159008 -112087 -145427 -174507 -162734 -143943 -113173 -43513 -47761 -59995 -9578
2451 -9578 60802 -21321 -31279 -77078 -96601 -81445 -41915 -23862 -76490 -72082 -26417 -14281
2439 -14281 -54500 -48727 -28326 -45341 -83909 28842 57988 53340 -102085 -159099 -75751 -32490
2427 -32490 -22020 -29608 -30338 -7896 -103917 -117189 -95952 -33030 4806 14753 102871 4117 -32437
$$ packed form
2510c7054l6191j11691K03373M8753M248j100o0915K3114N9932o7201n190n0971
2498c0893K413J18808j29281j43942J51104L4073J2355q5831l4424n2929O4251
2487i4296J6541L0622M2547m7687L8715o8761O3786m59l8501L4868J8018P679
2475C072L1541K6662o6543j06565O2784P7345k4863o003p4285j53032j9476L0410
2463b18953J0212M9733M6921l3340k9080J1773J8791L0770O9660m248j2234N0417
2451i578P0380q2123r958m5799j9523J5156L9530J8053n2628M408M5665J2136
2439a4281m0219N773K0401j7015l8568J12751K9146m648j55425n7014Q3348M3261
2427c2490J0470p588p30K2442r6021j3272K1237O2922L7836R947Q8118r8754l6554
$$ plain form
2414 -32437 -39318 -54280 -26090 -55190 -105186 -118920 -59836 18895 11912 -62198 -18297 -37753
2402 -37753 -78564 62188 18620 -30127 -11693 -86056 -76485 -86851 -83998 -65372 -90183 -58334
2390 -58334 82254 72867 96704 -64032 65259 181026 171689 131082 97518 234476 209971
2379 209971 269089 234796 301797 258239 245522 227776 215798 163109 25021 32871 28546 -9148
2367 -9148 -30508 -19293 67913 140392 127382 73959 69582 76109 35229 43887 25523 -10693 11089
2354 11089 59980 60582 193652 181406 110855 71465 -39485 -53411 -7547 86302 110348 87543
2342 87543 47391 -31144 -21108 24205 40107 20656 75665 29690 3541 4741 42955 17064
2330 17064 25986 162590 103599 87131 128165 250769 257002 161776 130937 85277 59432 83894
$$ packed form
2414c2437o881j4962K8190k9100m9996j3734N9084P8731o983p4110M3901j9456
2402c7753m0811J40752m3568m8747J8434p4363R571j0366K853J8626k4811L1849
2390e8334J40588r387K3837j60736J29291J15767r337m0607l3564J36958k4505
2379B09971N9118l4293O7001m3558j2717j7746j1978n2689j38088P850m325l7694
2367i148k1360J1215Q7206P2479j3010n3423m377O527m0880Q658j8364l6216K1782
2354A1089M8891O02J33070j2246p0551l9390j10950j3926M5864R3849K4046k2805
2342H7543m0152p8535J0036M5313J5902j9451N5009m5975k6149J200L8214k5891
2330A7064Q922J36604n8991j6468M1034J22604O233r5226l0839m5660k5845K4462
$$ plain form
2318 83894 18363 139589 148184 119244 34527 126651 16806 27945 108347 117690 161755 70049
2306 70049 20408 -67461 48666 144685 86956 94120 86138 10620 -70206 29214 42340 86542
2294 86542 63836 61746 56052 40468 159243 60733 21350 96 29378 -11748 83112 144812
2282 144812 170566 113870 52232 97192 117379 78563 43777 62148 99868 100520 62303 9893
2270 9893 30345 17208 -63841 69504 234953 178553 131549 136235 233998 208527 152556 142032
2258 142032 129073 273428 375405 223818 274995 137799 60378 162891 161490 113453 76972
2247 76972 170350 287685 300884 217174 227984 245963 236234 193404 201944 128021 257498 270658
2235 270658 200071 286454 282484 310695 318647 252468 290926 320211 344405 275082 251385 273807
$$ packed form
2318H3894o5531J21226Q595k8940q4717R2124j09845J1139Q0402R343M4065r1706
2306G0049m9641q7869J16127R6019n7729P164p982p5518q0826R9420J3126M4202
2294H6542k2706k090n694j5584J18775r8510l9383k1254K9282m1126R4860O1700
2282A44812K5754n6696o1638M4960K0187l8816l4786J8371L7720O52l8217n2410
2270I893K0452j3137q1049J33345J65449n6400m7004M686R7763k5471n5971j0524
2258A42032j2959J44355J01977j51587N1177j37196p7421J02513j401m8037l6481
2247G6972R3378J17335J3199q3710J0810J7979r729m2830Q540p3923J29477J3160
2235B70658p0587Q6383l970K8211P952o6179L8458K9285K4194o9323k3697K2422
$$ plain form
2223 273807 335047 199380 156905 170546 196838 227597 251204 283895 183882 201767 270836
2212 270836 307431 343786 434391 401748 317245 366285 507164 537231 563082 646575 654083 652045
2200 652045 686108 683048 753847 760431 739567 766489 758377 825069 860386 851193 861767 795399
2188 795399 842557 959181 1052504 1033403 1085560 957343 981754 1049341 1143938 1147238 1122636
2177 1122636 1101559 1074410 1120349 1158280 1239708 1253145 1214647 1070280 1133424 1277879 1275199
2166 1275199 1347006 1464498 1402930 1421522 1555299 1595051 1611920 1656838 1647694 1694067 1839143
2155 1839143 1882974 1968815 2171115 2239546 2338300 2468476 2711663 2795729 2794113 2811588 2827763
2144 2827763 3059617 3244022 3424981 3466308 3631402 3803287 3913035 4233528 4391270 4604481
$$ packed form
2223B73807O1240j35667m2475J3641K6292L0759K3607L2691j00013J7885O9069
2212B70836L6595L6355R0605l2643q4503M9040J40879L0067K5851Q3493P508k038
2200F52045L4063l060P0799O584k0864K6922q112O6692L5317r193J0574o6368
2188G95399M7158J16624R3323j9101N2157j28217K4411O7587R4597L300k4602
2177A122636k1077k7149M5939L7931Q1428J3437l8498j44367O3144J44455k680
2166A275199P1807J17492o1568J8592J33777L9752J6869M4918r144M6373J45076
2155A839143M3831Q5841K02300O8431R8754J30176K43187Q4066j616J7475J6175
2144B827763K31854J84405J80959M1327J65094J71885J09748L20493J57742K13211
$$ plain form
2134 4604481 4923375 5171589 5548234 5959408 6480925 6926380 7369760 7958481 8603937 9288784
2124 9288784 9901094 10573269 11463994 12515284 13815504 15312654 17283194 19930201 23217535
2115 23217535 27056891 32154025 39029069 47121280 55919008 61428075 58622513 47235554
2107 47235554 35616806 28160120 23128759 19481265 16707803 14441877 12822269 11495882
2099 11495882 10367709 9690608 9148726 8719037 8246952 7610479 6796476 6073567 5542443
2090 5542443 5187487 4928716 4798941 4542481 4158490 3984803 3917041 3810626 3634468 3417182
2080 3417182 3263388 3061152 2896744 2715332 2601856 2455612 2338360 2160780 2040889 1900078
2070 1900078 1816125 1812041 1817142 1837379 1799254 1733472 1650640 1578854 1639176 1601164 1541798 1439523
$$ packed form
2134D604481L18894K48214L76645M11174N21517M45455M43380N88721O45456O84847
2124I288784O12310O72175Q90725J051290J300220J497150J970540K647007L287334
2115B3217535L839356N097134O875044Q092211Q797728N509067k805562j1386959
2107D7235554j1618748p456686n031361l647494k773462k265926j619608j326387
2099A1495882j128173o77101n41882m29689m72085o36473q14003p22909n31124
2090E542443l54956k58771j29775k56460l83991j73687o7762j06415j76158k17286
2080C417182j53794k02236j64408j81412j13476j46244j17252j77580j19891j40811
2070A900078q3953m084N101K0237l8125o5782q2832p1786O0322l8012n9366j02275
$$ plain form
2058 1439523 1421168 1328857 1241506 1264753 1196240 1218654 1214302 1223167 1278201 1200906 1027619 939119
2046 939119 917706 972415 932855 958886 890379 882127 981538 892343 820120 785278 741838 773340
2034 773340 689921 681693 638299 626573 711695 694409 690912 618936 582999 577154 594872 526209
2022 526209 522972 427169 267924 231114 268520 411450 500619 416597 442855 446199 500808 518745
2010 518745 504883 597578 521424 434289 328501 378735 374096 375084 364157 376225 375034 333852
1998 333852 321742 256240 340170 264171 301841 397838 365455 344480 281208 200776 227321 236113
1986 236113 310568 193955 241260 266280 337176 328045 344497 327466 180807 163756 218437
1975 218437 271029 226836 154920 151477 129220 192811 218922 272832 291805 240884 262054 194611
$$ packed form
2058A439523j8355r2311q7351K3247o8513K2414m352Q865N5034p7295j73287q8500
2046I39119k1413N4709l9560K6031o8507q252R9411q9195p2223l4842m3440L1502
2034G73340q3419q228m3394j1726Q5122j7286l497p1976l5937n845J7718o8663
2022E26209l237r5803j59245l6810L7406J42930Q9169q4022K6258L344N4609J7937
2010E18745j3862R2695p6154q7135j05788N0234m639R88j0927J2068j191m1182
1998C33852j2110o5502Q3930p5999L7670R5997l2383k0975o3272q0432K6545Q792
1986B36113P4455j16613M7305K5020P0896r131J6452j7031j46659j7051N4681
1975B18437N2592m4193p1916l443k2257O3591K6111N3910J8973n0921K1170o7443
$$ plain form
1963 194611 185968 255099 283038 184776 143321 84772 124110 146265 49224 36941 210749 233766
1951 233766 159933 66916 97653 137961 159794 173212 175282 171609 43299 78939 185977 14847
1939 14847 53711 45207 89483 142148 148727 166050 190620 112031 28271 11306 37411 116268
1927 116268 99478 72829 175676 119902 10556 -62889 -38768 57491 124192 161406 80379
1916 80379 98200 12208 8855 127588 72400 -30767 36477 -13016 -17143 6602 24118 133885
1904 133885 21156 -79993 515 53769 45881 61365 10085 47505 93132 66304 88648
1893 88648 43981 2880 -62018 800 57681 23771 16766 2768 10270 67867 -23224 -113487
1881 -113487 -1284 -34871 32112 -76052 -50177 -40851 7925 114658 34828 -24674 -4197
$$ packed form
1963A94611q643O9131K7939r8262m1455n8549L9338K2155r7041j2283J73808K3017
1951B33766p3833r3017L0737M0308K1833J3418K070l673j28310L5640J07038j71130
1939A4847L8864q504M4276N2665O579J7323K4570p8589q3760j6965K6105P8857
1927A16268j6790k6649J02847n5774j09346p3445K4121R6259O6701L7214q1027
1916H0379J7821q5992l353J18733n5188j03167O7244m9493m127K3745J7516J09767
1904A33885j12729j01149Q0508N3254p888J5484n1280L7420M5627k6828K2344
1893H8648m4667m1101o4898O2818N6881l3910p005j3998P502N7597r1091r0263
1881a13487J12203l3587O6983j08164K5875R326M8776J06733p9830n9502K0477
$$ plain form
1870 -4197 50339 40341 43404 39647 2142 48396 66094 6869 60724 33802 70373 62523 97890
1857 97890 177563 186318 136258 36234 31200 86212 127314 136672 82129 47050 -9907 58189
1845 58189 99830 163106 268895 219478 250784 248360 265479 183458 106328 141207 180333 135684
1833 135684 174154 190332 64668 185722 121127 -37233 -79695 -110076 9991 70785 -9291
1822 -9291 55133 13921 -61324 -54348 2875 51474 12965 -2885 63190 -50494 -66362 -16867
1810 -16867 27140 36126 -59491 31654 72699 -2405 -16093 -31014 25198 -46986 -89313 -37692
1798 -37692 -163201 -78386 -47908 -102212 -54546 -41415 3255 -3491 35164 23235 31906 44596
1786 44596 120162 57701 44694 -36947 -38305 -40249 -71464 -40382 -7440 44404 31609 40870
$$ packed form
1870d197N4536r998L063l757l7505M6254J7698n9225N3855k6922L6571p850L5367
1857I7890P9673Q755n0060j00024n034N5012M1102R358n4543l5079n6957O8096
1845E8189M1641O3276J05789m9417L1306k424J7119q2021p7130L4879L9126m4649
1833A35684L8470J6178j25664J21054o4595j58360m2462l0381J20067O0794q0076
1822i291O4424m1212p5245O976N7223M8599l8509j5850O6075j13684j5868M9495
1810a6867M4007Q986r5617R1145M1045p5104j3688j4921N6212p2184m2327N1621
1798c7692j25509Q4815L0478n4304M7666J3131M4670o746L8655j1929Q671J2690
1786D4596P5566o2461j3007q1641j358j944l1215L1082L2942N1844j2795R261
$$ plain form
1774 40870 91295 60035 44038 -31153 -15856 83263 -4587 -46455 1743 626 -54043 -3405
1762 -3405 -7130 -41338 24371 55672 -6688 6974 29095 160026 127906 -63310 -70128 -79512
1750 -79512 11481 81456 -19628 -112774 -105300 -32911 -25261 -123297 -105970 49760 27948 22668
1738 22668 -54199 -73336 -36736 38681 -2437 30636 13076 -10971 16974 -37565 -70448 34048
1726 34048 2057 59623 -3930 -64301 -107722 -26123 -17783 -56521 57136 44459 48466 -20306
1714 -20306 26691 -39797 -57571 -39817 -50162 -83164 -65936 -53258 -5002 -45292 -74224 -15050
1702 -15050 -148103 -142765 -78254 -229926 -173319 -3412 38730 42855 38272 86434 18192 61308
1690 61308 41700 37994 28891 -16903 3692 -42928 25457 57563 37694 47941 -25043 -9976
$$ packed form
1774D0870N0425l1260j5997p5191J5297R9119q7850m1868M8198j117n4669N0638
1762c405l725l4208O5709L1301o2360J3662K2121J30931l2120j91216o818r384
1750g9512R0993O9975j01084r3146P474P2389P650r8036J7327J55730k1812n280
1738B2668p6867j9137L6600P5417m1118L3073j7560k4047K7945n4539l2883J04496
1726C4048l1991N7566o3553o0371m3421Q1599Q340l8738J13657j2677M007o8772
1714b0306M6997o6488j7774J7754j0345l3002J7228J2678M8256m0290k8932N9174
1702a5050j33053N338O4511j51672N6607J69907M2142M125m583M8162o8242M3116
1690F1308j9608l706r103m5794K0595m6620O8385L2106j9869J0247p2984J5067
$$ plain form
1678 -9976 -91978 -40416 -34033 -64624 -19672 -72873 -81763 -74411 -98479 -168295 -116821 -96258 -78412
1665 -78412 -77464 -64113 1693 -22643 -1637 -4090 -16334 -57737 4801 -45886 -132675 -77073
1653 -77073 -48714 -16467 -26800 -65761 -36965 15399 -43661 -26967 -84592 28610 6939 -26732
1641 -26732 -27004 -55270 -98031 -153828 -172760 -179755 -101779 -69339 -124183 93680 115608 5670
1629 5670 -16427 -83308 -135144 -133040 -119815 -73234 37731 62984 63914 21487 47022 22213
1617 22213 53821 67078 93156 77371 -27146 -77811 -36012 25150 5371 -40511 -90540 -106789
1605 -106789 -76314 -3280 -45129 -59792 -60153 -99520 -85736 -96036 -139779 -177227 -186104 -124300
1593 -124300 -38899 44539 92234 64071 -78869 -39580 -12383 -58474 -88176 -118010 -137112
$$ packed form
1678i976q2002N1562O383l0591M4952n3201q890P352k4068o9816N1474K0563J7846
1665g8412R48J3351O5806k4336K1006k453j2244m1403O2538n0687q6789N5602
1653g7073K8359L2247j0333l8961K8796N2364n9060J6694n7625J13202k1671l3671
1641b6732k72k8266m2761n5797j8932o995P7976L2440n4844K17863K1928j09938
1629E670k2097o6881n1836K104J3225M6581J10965K5253R30m2427K5535k4809
1617B2213L1608J3257K6078j5785j04517n0665M1799O1162j9779m5882n0029j6249
1605a06789L0475P3034m1849j4663l61l9367J3784j0300m3743l7448q877O1804
1593a24300Q5401Q3438M7695k8163j42940L9289K7197m6091k9702k9834j9102
$$ plain form
1582 -137112 -135874 -68682 -17073 -11364 -61665 -37937 -13939 -78980 -60358 -85251 -91716 -13092
1570 -13092 -1593 -105639 -171431 -88210 -71395 -65303 -60389 -86316 -85635 120019 70071 26047
1558 26047 -132460 -57057 -46700 -43681 -50279 -77932 -68262 -129643 -92042 -39141 -15997 -27062
1546 -27062 29921 -11886 144540 28379 -25038 -64737 -64054 1966 -11288 -29169 92594 30395
1534 30395 33206 133751 21790 -202562 -235130 -129651 -84930 -25711 24156 14813 -31297
1523 -31297 -108888 -54171 -61278 37575 65074 39966 1308 5992 59954 -13286 -99873 -116760
1511 -116760 -67407 -39895 32324 -109185 -32967 102818 66762 -89461 -66375 65238 -34831
1500 -34831 -148869 -117259 -100463 21737 -64676 -65163 -86615 -31557 -44916 -32827 -19158 76701
$$ packed form
1582a37112J238O7192N1609N709n0301K3728K3998o5041J8622k4893o465P8624
1570a3092J1499j04046o5792Q3221J6815O092M914k5927O81K05654m9948m4024
1558B6047j58507P5403J0357L019o598k7653R670o1381L7601N2901K3144j1065
1546b7062N6983m1807J56426j16161n3417l9699O83O6020j3254j7881J21763o2199
1534C0395K811J00545j11961k24352l2568J05479M4721N9219M9867r343m6110
1523c1297p7591N4717p107R8853K7499k5108l8658M684N3962p3240q6587j6887
1511a16760M9353K7512P2219j41509P6218J35785l6056j56223K3086J31613j00069
1500c4831j14038L1610J6796J22200q6413m87k1452N5058j3359J2089J3669R5859
$$ plain form
1488 76701 33088 -51163 -26489 53061 103218 27708 -28353 -46120 -78991 -63494 -117473 -29085
1476 -29085 -28977 -77458 -72747 -46343 -27212 -68441 13430 -58234 -47243 4487 69157 73763 137149
1463 137149 42323 -51871 -9281 107906 -28644 -76999 30338 16739 14089 -21868 -35686
1452 -35686 -81768 -70434 -43110 -76495 -109856 -124630 -94871 -89520 -98334 -67810 -59106 -61069 -94525
1439 -94525 -136959 -129322 -102126 -82163 -136897 -60247 -7719 -46113 5429 27510 22934 -4857
1427 -4857 -62474 32664 4193 53037 73937 74152 1578 -59629 48396 8358 1462 -37960
1415 -37960 -95367 -87916 -100184 -58157 12226 61486 -16199 -49110 -4294 -19633 -2261 52138
1403 52138 16964 61943 25852 21309 -45623 8563 -66444 -24777 -26129 -82512 -94052 -86060
$$ packed form
1488G6701m3613q4251K4674P9550N0157p5510n6061j7767l2871J5497n3979Q8388
1476b9085J08m8481M711K6404J9131m1229Q1871p1664J0991N1730O4670M606O3386
1463A37149r4826r4194M2590J17187j36550m8355J07337j3599k650l5957j3818
1452c5686m6082J1334K7324l3385l3361j4774K9759N351q814L0524Q704j963l3456
1439i4525m2434P637K7196J9963n4734P6650N2528l8394N1542K2081m576k7791
1427d857n7617R5138k8471M8844K0900K15p2574o1207J08025m0038o896l9422
1415c7960n7407P451j2268M2027P0383M9260p7685l2911M4816j5339J7372N4399
1403E2138l5174M4979l6091m543o6932N4186p5007M1667j352n6383j1540P992
$$ plain form
1391 -86060 39562 99037 270955 88420 21928 3115 -35302 64145 104672 -6970 -102940
1380 -102940 -101925 -93358 -60283 48316 -37618 10285 -9590 -65242 -24377 -85835 -45975 -79754
1368 -79754 -60605 -30881 -51997 -38437 -22228 -58648 -104830 -81267 -65155 43978 46155 21104
1356 21104 -5933 -70461 -32767 2099 41109 48709 54809 47012 -13052 -81225 -103629 13632
1344 13632 16047 -93853 -34055 1879 -120241 -94969 -25436 91756 54903 21730 20739 -2543
1332 -2543 -43785 12155 17843 50658 37078 -76918 -91558 5548 8775 -5963 6849 -50367
1320 -50367 -12224 -35222 -35998 59435 37125 13682 31409 -54407 -73763 -69526 -24250 -56891
1308 -56891 -108191 -101515 -58329 -59213 65745 -2217 -35415 9768 -93289 -81769 65047 -9736
$$ packed form
1391h6060J25622N9475J71918j82535o6492j8813l8417R9447M0527j11642r5970
1380a02940J015Q567L3075J08599q5934M7903j9875n5652M0865o1458L9860l3779
1368g9754J9149K9724k1116J3560J6209l6420m6182K3563J6112J09133K177k5051
1356B1104k7037o4528L7694L4866L9010P600O100p797o0064o8173k2404J17261
1344A3632K415j09900N9798L5934j22120K5272O9533J17192l6853l3173r91k3282
1332b543m1242N5940N688L2815j3580j13996j4640R7106L227j4738J2812n7216
1320e0367L8143k2998p76R5433k2310k3443J7727q5816j9356M237M5276l2641
1308e6891n1300O676M3186q84J24958o7962l3198M5183j03057J1520J46816p4783
$$ plain form
1296 -9736 -83067 -69359 -69623 -120726 -86591 -67337 -91278 -84128 -98561 -98144 -51072 -128763 -57343
1283 -57343 -54373 -60246 -95328 -107516 -116398 -94138 -7268 9891 -63342 -28790 101399 66031
1271 66031 6749 94655 58131 349 51092 -81230 -142597 -61203 8056 45293 38291 -57098
1259 -57098 -90 -13936 193120 167065 70393 105242 143919 34445 58988 21528 6464
1248 6464 137679 -18984 -73219 -14436 -106339 -14807 -8753 -50372 -55667 -62529 -192536 -129407
1236 -129407 -25161 17647 67965 44446 67996 14008 49829 1356 -31357 -69639 -26106
1225 -26106 -11829 64069 158344 15423 -65492 -34112 -53612 -46458 9641 -31121 20117 -5283
1213 -5283 -76863 -43094 59667 67282 36713 -26749 -23300 7568 -73969 -11175 -12639 -75370
$$ packed form
1296i736p3331J3708k64n1103L4135J9254k3941P150j4433M17M7072p7691P1420
1283e7343K970n873l5082j2188q882K2260Q6870J7159p3233L4552J30189l5368
1271F6031n9282Q7906l6524n7782N0743j32322o1367Q1394O9259L7237p002r5389
1259e7098N7008j3846K07056k6055r6672L4849L8677j09474K4543l7460j5064
1248F464J31215j56663n4235N8783r1903R1532O054m1619n295o862j30007O3129
1236a29407J04246M2808N0318k3519K3550n3988L5821m8473l2713l8282M3533
1225b6106J4277P5898R4275j42921q0915L1380j9500P154N6099m0762N1238k5400
1213e283p1580L3769J02761P615l0569o3462L449L0868q1537O2794j464o2731
$$ plain form
1201 -75370 -51286 31606 14695 -100034 -169045 -95807 -39747 7161 -31989 6431 37014 22580
1189 22580 81179 64311 -36889 -48324 -56870 66650 13827 26259 1565 -5759 62502 72799
1177 72799 59015 -22880 -103814 -251174 -68136 -4208 31485 57058 68194 70500 94049 129603
1165 129603 102105 31402 -88703 -71810 -33559 29133 44397 -14180 -86521 -78660 -70213 -74429
1153 -74429 -59201 27704 -65301 -95888 -104723 21063 38141 -34153 30821 -1315 -58349 15774
1141 15774 66867 5481 30204 -70947 -116587 -5641 24889 69849 58455 16904 -46570
1130 -46570 -146523 1652 44853 21368 19886 -71258 -37987 -1720 -84626 -22671 -81854 -62915
1118 -62915 -96900 -174671 -99719 -46076 -21495 -223 71172 54975 41495 26734 29173 -29216
$$ packed form
1201g5370K4084Q2892j6911j14729o9011P3238N6060M6908l9150L8420L0583j4434
1189B2580N8599j6868j01200j1435q546J23520n2823J2432k4694p324O8261J0297
1177G2799j3784q1895q0934j47360J83038O3928L5693K5573J1136K306K3549L5554
1165A29603k7498p0703j20105J6893L8251O2692J5264n8577p2341P861Q447m216
1153g4429J5228Q6905r3005l0587q835J25786J7078p2294O4974l2136n7034P4123
1141A5774N1093o1386K4723j01151m5640J10946L0530M4960j1394m1551o3474
1130d6570r9953J48175M3201k3485j482r1144L3271L6267q2906O1955n9183J8939
1118f2915l3985p7771P4952N3643K4581K1272P1395j6197j3480j4761K439n8389
$$ plain form
1106 -29216 -65002 -8654 -24100 -92384 -7849 -12661 -26983 35254 33359 -8764 -23759 -112222
1094 -112222 -77267 7524 -56093 -112128 -156964 -137873 -127454 -97338 5062 48748 -8932
1083 -8932 -76282 -157209 -112359 -82710 -57095 -70484 37422 -33655 -24628 -65546 -50663 -36653
$$ packed form
1106b9216l5786N6348j5446o8284Q4535m812j4322O2237j895m2123j4995q8463
1094a12222L4955Q4791o3617n6035m4836J9091J0419L0116J02400M3686n7680
1083h932o7350q0927M4850K9649K5615j3389J07906p1077R027m0918J4883J4010
$$ [...]
##END NTUPLES=NMR SPECTRUM
##END=
