##TITLE=1H_EC-3264(7-2)
 CDCl3
 8 sc, 
 11.1.2022
##JCAMPDX= 6.0         $$ Bruker NMR JCAMP-DX V2.0
##DATA TYPE= NMR SPECTRUM
##DATA CLASS= NTUPLES
##ORIGIN= UXNMR, Bruker Analytische Messtechnik GmbH
##OWNER= root
$$ XWIN-NMR		Version 3.5
$$ Tue Jan 11 11:37:40 2022 Russian Standard Time (UT+4h)  she@DPX200
##.OBSERVE FREQUENCY= 200.131346
##.OBSERVE NUCLEUS= ^1H
##.ACQUISITION MODE= SIMULTANEOUS
##.ACQUISITION SCHEME= undefined
##.AVERAGES= 8
##.DIGITISER RES= 18
##SPECTROMETER/DATA SYSTEM= spect
##.PULSE SEQUENCE= zg30
##.SOLVENT NAME= CDCl3
##.SHIFT REFERENCE= (INTERNAL, CDCl3, 0, 15.7171)
##AUDIT TRAIL= $$ (NUMBER, WHEN, WHO, WHERE, WHAT)
$$ ##TITLE= Audit trail, XWIN-NMR		Version 3.5
$$ ##JCAMPDX= 5.01
$$ ##ORIGIN= Bruker BioSpin GmbH
$$ ##OWNER= she
$$ F:/spectra/data/she/nmr/H-F/1/pdata/1/auditp.txt
$$ ##AUDIT TRAIL=  $$ (NUMBER, WHEN, WHO, WHERE, WHAT)
(   1,<2022-01-11 11:36:32.54 +0400>,<she>,<DPX200>,
      <created by zg, POWCHK disabled, PULCHK disabled
       configuration hash MD5:
       00 E9 B6 7A A2 85 ED C7 34 08 36 98 17 FE 4E 26
       data hash MD5: 16K
       8F B2 14 25 13 FA 4C B5 D6 F7 85 24 51 C7 9A 91>)
(   2,<2022-01-11 11:36:35.18 +0400>,<she>,<DPX200>,
      <Start of raw data processing
       efp BC_mod = 2 LB = 0.24 FT_mod = 6 PKNL = 1 PHC0 = -15865.25 PHC1 = 10.20079 SI = 16K 
       data hash MD5: 16K
       ED 9F 2C 41 9C 54 56 96 D6 07 B1 A0 D2 26 DD 17>)
(   3,<2022-01-11 11:36:51.92 +0400>,<she>,<DPX200>,
      <pk PHC0 = 0.3574185 PHC1 = -0.6 
       data hash MD5: 16K
       A7 A1 12 84 15 D7 21 86 2A 3B 00 81 CF F0 17 5D>)
(   4,<2022-01-11 11:36:54.98 +0400>,<she>,<DPX200>,
      <abs ABSG = 5 
       data hash MD5: 16K
       BA 84 60 80 6A 9C EA 2E CB C7 37 12 40 B7 EB 4B>)
$$ ##END=
$$ 
$$ hash MD5
$$ 02 DE 51 CF A7 DA 5E 0B 8A C7 4C EF A0 0B 52 14
##$RELAX= 
##$RELAX= 
##$RELAX= 
##$RELAX= 
##$RELAX= 
##$RELAX= 
$$ Bruker specific parameters
$$ --------------------------
##$DU= <F:/spectra>
##$EXPNO= 1
##$NAME= <H-F>
##$PROCNO= 1
##$TYPE= <nmr>
##$USER= <she>
##$AMP= (0..31)
100 100 100 100 100 100 100 100 100 100 100 100 100 100 100 100 100 100 
100 100 100 100 100 100 100 100 100 100 100 100 100 100 
##$AQSEQ= 0
##$AQ_mod= 1
##$AUNM= <au_zg>
##$AUTOPOS= <>
##$BF1= 200.13
##$BF2= 200.13
##$BF3= 200.13
##$BF4= 200.13
##$BF5= 200.13
##$BF6= 200.13
##$BF7= 200.13
##$BF8= 200.13
##$BYTORDA= 1
##$CFDGTYP= 0
##$CFRGTYP= 5
##$CHEMSTR= <none>
##$CNST= (0..31)
1 1 145 1 1 1 1 1 1 1 1 1 1 1 1 1 1 1 1 1 1 1 1 1 1 1 1 1 1 1 1 1 
##$CPDPRG= <>
##$CPDPRG1= <>
##$CPDPRG2= <>
##$CPDPRG3= <>
##$CPDPRG4= <mlev>
##$CPDPRG5= <mlev>
##$CPDPRG6= <mlev>
##$CPDPRG7= <mlev>
##$CPDPRG8= <mlev>
##$CPDPRGB= <>
##$CPDPRGT= <>
##$D= (0..31)
0 1.2 0 0 0 0 0 0 0 0.06 0 0.03 0 0 0 0 0.0002 0 0 0 0 0 0 0 0 0 0 0 0 
0 0 0 
##$DATE= 1641886592
##$DBL= (0..7)
120 120 120 120 120 120 120 120 
##$DBP= (0..7)
150 150 150 150 150 150 150 150 
##$DBP07= 0
##$DBPNAM0= <>
##$DBPNAM1= <>
##$DBPNAM2= <>
##$DBPNAM3= <>
##$DBPNAM4= <>
$$ [...]
##$SUBNAM2= <"">
##$SUBNAM3= <"">
##$SUBNAM4= <"">
##$SUBNAM5= <"">
##$SUBNAM6= <"">
##$SUBNAM7= <"">
##$SUBNAM8= <"">
##$SUBNAM9= <"">
##$SW= 18.0517287032376
##$SWIBOX= (0..15)
0 0 2 0 0 0 0 0 0 0 0 0 0 0 0 0 
##$SW_h= 3612.71676300578
##$TD= 16384
##$TD0= 1
##$TE= 0
##$TE2= 300
##$TE3= 300
##$TEG= 300
##$TL= (0..7)
0 120 120 120 120 120 120 120 
##$TP= (0..7)
150 150 150 150 150 150 150 150 
##$TP07= 0
##$TPNAME0= <>
##$TPNAME1= <>
##$TPNAME2= <>
##$TPNAME3= <>
##$TPNAME4= <>
##$TPNAME5= <>
##$TPNAME6= <>
##$TPNAME7= <>
##$TPOAL= (0..7)
0.5 0.5 0.5 0.5 0.5 0.5 0.5 0.5 
##$TPOFFS= (0..7)
0 0 0 0 0 0 0 0 
##$TUNHIN= 0
##$TUNHOUT= 0
##$TUNXOUT= 0
##$USERA1= <user>
##$USERA2= <user>
##$USERA3= <user>
##$USERA4= <user>
##$USERA5= <user>
##$V9= 5
##$VALIST= <valist>
##$VCLIST= <CCCCCCCCCCCCCCC>
##$VD= 0
##$VDLIST= <DDDDDDDDDDDDDDD>
##$VPLIST= <PPPPPPPPPPPPPPP>
##$VTLIST= <TTTTTTTTTTTTTTT>
##$WBST= 1024
##$WBSW= 4
##$XGAIN= (0..3)
0 0 0 0 
##$XL= 0
##$YL= 0
##$YMAX_a= 231423
##$YMIN_a= -341795
##$ZGOPTNS= <>
##$ZL1= 120
##$ZL2= 120
##$ZL3= 120
##$ZL4= 120
##$ABSF1= 15.72595
##$ABSF2= -2.325899
##$ABSG= 5
##$ABSL= 3
##$ALPHA= 0
##$AQORDER= 0
##$ASSFAC= 0
##$ASSFACI= 0
##$ASSFACX= 0
##$ASSWID= 0
##$AUNMP= <proc_1d>
##$AZFE= 0.1
##$AZFW= 0.1
##$BCFW= 0
##$BC_mod= 2
##$BYTORDP= 0
##$COROFFS= 0
##$CY= -3
##$DATMOD= 1
##$DC= 0
##$DFILT= <>
##$DTYPP= 0
##$F1P= 0
##$F2P= 0
##$FCOR= 1
##$FTSIZE= 16384
##$FT_mod= 6
##$GAMMA= 0
##$GB= 0
##$INTBC= 1
##$INTSCL= 0
##$ISEN= 128
##$LB= 0.24
##$LEV0= 0
##$LPBIN= 0
##$MAXI= 10000
##$MC2= 0
##$MEAN= 0
##$ME_mod= 0
##$MI= 1.114404
##$NCOEF= 0
##$NC_proc= -6
##$NLEV= 6
##$NOISF1= 3.799351
##$NOISF2= 2.8
##$NSP= 0
##$NTH_PI= 0
##$NZP= 0
##$OFFSET= 15.71714
##$PC= 1
##$PHC0= -15864.89
##$PHC1= 9.60079
##$PH_mod= 1
##$PKNL= yes
##$PPARMOD= 0
##$PSCAL= 0
##$PSIGN= 0
##$REVERSE= no
##$SF= 200.130006886224
##$SI= 16384
##$SIGF1= 3
##$SIGF2= 2
##$SINO= 5.538805
##$SIOLD= 16384
##$SREGLST= <1H.CDCl3>
##$SSB= 0
##$STSI= 16384
##$STSR= 0
##$SW_p= 3612.71676300578
##$SYMM= 0
##$S_DEV= 0
##$TDeff= 16384
##$TDoff= 0
##$TI= <>
##$TILT= no
##$TM1= 0
##$TM2= 0
##$TOPLEV= 0
##$USERP1= <user>
##$USERP2= <user>
##$USERP3= <user>
##$USERP4= <user>
##$USERP5= <user>
##$WDW= 1
##$XDIM= 16384
##$YMAX_p= 291925810
##$YMIN_p= -296893
$$ End of Bruker specific parameters
$$ ---------------------------------
##NTUPLES= NMR SPECTRUM
##VAR_NAME=  FREQUENCY,     SPECTRUM/REAL,   SPECTRUM/IMAG
##SYMBOL=    X,             R,               I
##VAR_TYPE=  INDEPENDENT,   DEPENDENT,       DEPENDENT
##VAR_FORM=  AFFN,          ASDF,            ASDF
##VAR_DIM=   16384,         16384,           16384
##UNITS=     HZ,            ARBITRARY UNITS, ARBITRARY UNITS
##FACTOR=    0.220516191357247, 1,           1
##FIRST=     3145.47137600824, 0,            0
##LAST=      -467.245386997543, 0,           0
##MIN=       -467.245386997543, -296893,     0
##MAX=       3145.47137600824, 291925810,    0
$$ Real data points
##PAGE= N=1
##DATA TABLE= (X++(R..R)), XYDATA
$$ [...]
9563 143607 152297 102618 68743 72374 152164 197704 150042 224075 180478 221477 169849 190764
9551 190764 209058 135203 111268 100597 96311 27202 81138 41956 161504 74511 42634 82914
9539 82914 61040 69290 36025 26840 125954 153620 147835 160347 4323 108512 190981 118703
9527 118703 181397 180201 196740 249856 144171 138197 38071 19076 32336 44180 74021 134670
9515 134670 167332 204726 127691 98654 61786 80191 175054 207521 86974 26922 110781
9504 110781 156999 221169 198894 123277 59265 77083 121995 50318 62644 12956 98310 115765
9492 115765 109877 140071 206381 242297 210560 241282 172603 119435 97492 195044 74528 76755
9480 76755 107522 143966 249878 251532 221986 240068 273731 304036 351750 386810 434903 450155
9468 450155 363065 357819 303601 358093 430850 392109 376731 358524 476880 560028 483622 408667
9456 408667 426558 432588 480867 445630 467245 442157 471655 433617 333588 420096 360487 422464
9444 422464 299212 344220 400052 368318 361384 418036 478393 513225 445631 390063 431677 478961
9432 478961 527785 595643 605301 558775 578704 604771 514050 462094 571661 596929 592339 581687
9420 581687 555559 581992 644234 591560 558793 600133 654492 617698 575030 612744 519580 553534
9408 553534 507649 561480 570506 545274 509836 487765 570112 620159 592542 555032 610863 607389
9396 607389 668058 613480 669674 696167 610425 574332 531423 517499 541370 539199 545007 583964
9384 583964 696275 658500 669715 661766 707016 671241 674175 712699 648842 850964 919071 816987
9372 816987 893196 881948 849774 851406 814940 782097 876291 907307 918965 927878 992421 937634
9360 937634 990404 1031077 1003111 1028633 1076043 1101199 1055235 1067023 1081281 1085027 1064834 1189980
9348 1189980 1322812 1433522 1383012 1341565 1495729 1545212 1594735 1722416 1819519 1826923 1909949
9337 1909949 2047994 2134879 2330627 2403361 2394802 2492145 2717312 2930650 2956239 2983868 3110082
9326 3110082 3174359 3213787 3280166 3380537 3489117 3581975 3632962 3675306 3560815 3574283 3691687
9315 3691687 3743237 3813311 3799428 3890139 3879103 3932264 3946601 3843915 3877169 3858199 3845899
9304 3845899 3884499 3940172 3903573 3853811 4033566 4068303 4109015 4215941 4333333 4374392 4431652
9293 4431652 4596583 4723847 4844848 4842040 4858152 5025646 5144944 5174219 5274906 5345357
9283 5345357 5367234 5328654 5312025 5291829 5344461 5264027 5143619 5055896 5031855 5058366 4974597
9272 4974597 4917546 4892312 4894480 4898526 5007975 5083185 5110518 5012458 4907044 4913281 4883691 4880937
9260 4880937 4894744 4929198 4815157 4818860 4873334 4812208 4782778 4823717 4892536 5021369 4984597
9249 4984597 4860374 4772958 4810233 4846224 4940303 4844647 4744013 4560347 4394527 4330297 4124046
9238 4124046 4022315 4081084 3981414 4014739 4125668 4119711 4049583 4045804 4125532 4163732 4175290
9227 4175290 4200849 4247627 4215894 4235187 4281729 4436245 4318027 4286735 4251808 4219757 4226153
9216 4226153 4214254 4255798 4300586 4360239 4484742 4505528 4608926 4668880 4578230 4539207 4415199
9205 4415199 4232347 4075099 3926506 3716601 3688759 3581433 3596345 3491802 3511078 3568250
9195 3568250 3505470 3451858 3473668 3516892 3569828 3549715 3483928 3623878 3633500 3481948 3370840
9184 3370840 3287746 3257016 3290654 3270062 3280890 3290254 3463837 3544050 3532473 3598832 3614029
9173 3614029 3520947 3485012 3552049 3606521 3636472 3651488 3696124 3753047 3716175 3752825 3906236
9162 3906236 3961234 4018076 4118270 4081790 4166375 4207173 4229870 4272613 4463393 4438702 4520905
9151 4520905 4624771 4706064 4719041 4923039 5005166 5036430 5104824 5299599 5427230 5462934 5722227
9140 5722227 5842040 5988760 6110689 6253228 6416620 6620107 6646860 6878269 7099851 7195775
9130 7195775 7324914 7591191 7854419 7963009 8275999 8502336 8747146 9046302 9301294 9746797
9120 9746797 10075533 10365659 10719573 11258951 11670893 12026075 12685110 13362780 14110865 14915204
9110 14915204 15806366 16839612 17961829 19203355 20542175 22254107 24305577 26647088
9102 26647088 29141671 31691014 34439562 37307952 40540630 44455586 48358891 51076510
9094 51076510 52298970 52655800 53464882 55635562 58469295 60197028 59593443 56295413 51207901
9085 51207901 46180754 42171895 39602572 38209304 37629079 37152843 36613266 35642958 34487118
9076 34487118 33631430 33269713 33654747 34323008 35169399 36287154 37464739 39013575 41094764
9067 41094764 43800967 46970234 50558258 54202050 57778653 61255897 64259950 66793437
9059 66793437 69189506 71847496 74913465 78075579 79989294 80128046 78956218 77393154
9051 77393154 75088042 70770068 64459964 56915127 49604679 44112115 40186425 37480983
9043 37480983 35498299 34023556 33059153 32200417 31329248 30425859 29242441 28250547 27448405
9034 27448405 26848851 26237052 25560212 24838396 24346190 24136235 24062779 24070184 23997069 23900455
9024 23900455 23709903 23459742 23014272 22460326 21759918 20924613 20028594 19150457 18466130
9015 18466130 17825863 17121941 16451036 15766965 15121584 14619642 14127514 13559767 13217290
9006 13217290 12846817 12521937 12307398 12004984 11773112 11569919 11357013 11239694 11076630
8997 11076630 11009613 10839455 10704086 10551635 10388914 10212770 10144964 10023501 9812834 9702508
8987 9702508 9511955 9260872 9109081 8913728 8694240 8448603 8295420 8223215 8080402 7824026
8977 7824026 7552727 7343117 7156646 7071840 7013643 6859637 6771931 6560052 6470275 6318964
8967 6318964 6215535 6014026 5939317 5923976 5800068 5713018 5585348 5507203 5548634 5580198 5564518
8956 5564518 5543762 5441645 5356086 5371892 5376158 5299505 5339103 5321183 5369466 5354410 5302576
8945 5302576 5235401 5291141 5250391 5237398 5189690 5287239 5288498 5273976 5209180 5262550 5300269 5319870
8933 5319870 5420298 5387349 5408063 5486185 5608356 5657899 5736585 5739896 5769427 5866877 5825075
8922 5825075 5916047 6016906 6192122 6280137 6299346 6271534 6326866 6623822 6777114 6735940 6810936
8911 6810936 6970134 7088857 7225951 7431614 7418061 7594511 7907681 8065862 8216617 8462804
8901 8462804 8564258 8703563 8810811 9014539 9295178 9403558 9530970 9785014 10086200 10228821
8891 10228821 10389480 10633813 10898590 11228019 11581712 11958069 12351372 12738340 13229530
8882 13229530 13779232 14362918 15047130 15578534 16141255 17053977 17948677 18781735 19665335
8873 19665335 20480913 21494040 22512511 23605524 24902910 26187430 27573811 28999504
8865 28999504 30638807 32348412 33926314 35459799 37220450 39297789 41792016 44403747
8857 44403747 46661522 48529168 49794303 50370030 50066425 48530176 46162321 43961384
8849 43961384 42693445 42491749 42943340 43632394 44413699 44773560 44905618 44935095 45246535
8840 45246535 46191562 47540047 49021943 50753598 52387945 54011316 55748452 57458214
8832 57458214 59110489 60538135 62092103 63962270 66486482 69648932 73229614 77148781
8824 77148781 81126608 84744353 87647758 89163344 88774045 86247707 82003403 77250881
8816 77250881 73162279 70597611 69045587 67210515 64524498 61131386 57842711 55476901
8808 55476901 53798893 52314774 50759768 49496076 48394745 47417438 46586242 46189822 45938088
8799 45938088 45934553 46013207 46152883 46216847 46530393 47183444 48248172 49304490 50105065 50580538
8789 50580538 51265955 52329390 53911179 55821177 57325401 57744467 56678544 53801193
8781 53801193 49698995 45420235 41262500 38194181 36081646 34606255 33347256 32305591
8773 32305591 31414081 30347700 29165884 27906610 26786148 25753063 24796988 23853243 22965123
8764 22965123 22121012 21365603 20698112 20153276 19720033 19271990 18762798 18352082 18000997
8755 18000997 17594848 17364965 17050584 16847297 16749510 16607673 16540404 16582464 16470148 16471802
8745 16471802 16531899 16694818 16861783 17120450 17374858 17677659 18061810 18434739 18699172 18984737
8735 18984737 19401887 19953189 20558695 21388427 22168513 23139631 24452291 25932460 27526929
8726 27526929 29436966 31406408 33820541 36858273 40426197 44620279 50258348 57859490
8718 57859490 68231793 79876198 88718528 89416945 80918557 66055496 53072715 45547104
8710 45547104 40927617 38240619 36435301 35438262 35058095 35325222 36089045 37228211 38500449
8701 38500449 39602982 40043584 40488786 41358394 42582532 43354311 43137278 41666405 39659364
8692 39659364 38063155 37205260 36235945 34566228 32279228 29965745 28067354 26797360
8684 26797360 25932952 25302215 24720891 24431869 24222416 24215165 24361564 24576306 25055764 25922767
8674 25922767 27135808 28381850 29516155 30547587 31234368 32057930 33421933 35426718
8666 35426718 38143356 40972364 43398411 44814498 44449927 42327488 39133685 35354094
8658 35354094 31928407 29440805 27853192 26849223 25988716 25246837 24183675 22868073
8650 22868073 21321869 19963821 19126029 18503286 17829034 17403948 17021856 16780603 16615507
8641 16615507 16443103 16556091 16716468 17212610 17857250 18436311 19031418 19526825 19637604
8632 19637604 19875605 20269927 20623903 20596644 20129624 19048081 17796410 16799417 16085354
8623 16085354 15424377 14516967 13444010 12393927 11638670 11057814 10473613 10011875 9618659
8614 9618659 9152142 8759710 8454395 8269557 8054204 7816058 7488286 7244346 6979370 6700518
8604 6700518 6565057 6402329 6156585 6090043 5979286 5890214 5827947 5660776 5528552 5318837
8594 5318837 5067755 4943861 4800630 4751624 4516358 4310059 4155108 4195744 4165684 4025435
8584 4025435 3854884 3744263 3705572 3638580 3472730 3418649 3316761 3232352 3163628 3044337
8574 3044337 2994820 2933715 2775344 2798902 2754304 2583012 2552687 2465809 2519202 2509180 2334749
8563 2334749 2270655 2129177 2024348 2027010 2020021 1917338 1721792 1732155 1791629 1810213 1624799
8552 1624799 1650528 1625489 1605972 1613152 1630851 1546015 1668375 1667460 1606861 1523922 1502174 1577701
8540 1577701 1448667 1390445 1501241 1360134 1342173 1278573 1243347 1226401 1272420 1268989 1250585
8529 1250585 1137693 1002530 1131140 1093291 1076836 1049620 1017428 1024196 942100 915490 936141
8518 936141 983173 1007739 999634 939596 983078 926307 987965 944640 830600 808743 972254
8507 972254 977744 895644 854326 844700 906016 842137 878862 823468 854912 824973 872431 892223
8495 892223 875438 922848 962545 985333 992651 995072 982370 923737 904923 900120 901646 879051
8483 879051 831087 825083 896834 805247 706515 658494 547857 634406 772811 721299 661148
8472 661148 716941 727859 668324 663456 606974 600875 648362 664649 636146 750700 704809 708823
8460 708823 731216 646250 689026 745637 799530 794368 806373 776611 744096 739691 666689 669539
8448 669539 630835 815880 737926 620572 588599 600679 670297 581349 569575 680471 719705
8437 719705 567314 622257 613886 662817 615875 431825 536616 527547 475588 561636 562347 430527
8425 430527 404858 470599 502606 537409 489280 425457 503717 525183 383596 316117 421400
8414 421400 493923 393497 376359 360682 414493 413040 342999 304012 321734 382912 345196 336093
8402 336093 305060 238609 284540 357363 231122 213447 215244 221326 311607 263744 362382 276319
8390 276319 236263 229013 218371 197745 211559 219490 226196 246511 222419 219967 281862 211134
8378 211134 193028 259590 192634 157151 181701 242968 165018 99658 153988 186515 83374
8367 83374 226103 219106 196633 276212 124115 182332 155143 64319 236154 253903 281651
8356 281651 281856 243674 297018 257336 135304 139091 215342 207897 81183 109904 171301 146768
8344 146768 128123 141200 236944 273773 245064 292679 242906 313695 309947 336302 336536 269539
8332 269539 227601 199921 209347 94183 113464 176528 182917 262824 206829 181413 181330 162953
8320 162953 262045 189474 105319 187784 173471 246948 202609 101329 221950 241022 218626
8309 218626 224023 166874 133236 228419 196709 207123 175528 267987 298279 265850 221295 240604
8297 240604 273455 227713 256879 235127 209859 228540 225696 256982 165345 116540 65720 25466
8285 25466 69245 165119 226789 255662 155570 134962 168095 211260 289141 257054 203036 239925
8273 239925 160916 195184 298810 162039 228438 137183 138198 165101 166871 300347 221613
8262 221613 259226 198995 229225 200895 232826 167455 109808 137836 146345 81755 61296 104696
8250 104696 38989 72538 36243 75159 85808 187564 267457 235479 226977 298411 392946 539884
8238 539884 578548 497077 317488 404183 297382 124714 72425 57064 128693 145659 111536
8227 111536 154933 127036 83029 35397 77242 109588 87686 91643 112291 144400 61444 -15484
8215 -15484 -47105 107985 161042 115294 138071 34164 113168 45134 44565 57603 11073 -39577
8203 -39577 -18292 24898 78371 -31004 -87098 -68105 -983 -86549 63391 246073 260402
8192 260402 1143655 581474 209025 231995 127247 224244 96566 -10741 50710 9052
8182 9052 -102986 -79679 1496 -29367 -103416 -83822 -27883 -41994 -63395 -41856 -29558 -7007
8170 -7007 -112129 -45985 -43573 -104469 -20485 -55516 -90622 -93605 -58010 -22646 -85551 -19976
8158 -19976 -105103 -38778 -57857 -77420 -91927 -40960 45033 -36869 -73173 -37298 -11409 48484
8146 48484 -49803 -107336 -88859 -26549 -41623 -79908 -117213 -117609 27277 88353 -22080 -33531
8134 -33531 -28776 -56447 -54681 -12277 9719 30862 6598 6968 31589 -2707 -23012 -138644
8122 -138644 -142171 -64387 -98732 -89099 -88870 -79764 11526 -6337 -43557 -64974 -48134 54497
8110 54497 -44027 -61399 -71778 -64767 -38636 -6652 -14744 -77084 -135996 -2661 -34099 -33388
8098 -33388 -84899 -96835 -59338 -170985 -82905 27158 -38899 -142825 -149783 -158437 -57317
8087 -57317 -22041 -118948 -87197 -56624 -117257 -58845 -47477 -72938 -167901 -87004 6291 59344
8075 59344 -1108 53844 151661 75593 -92564 -58462 3551 35870 4036 -26225 22836 -28856
8063 -28856 30756 -58791 -84572 -78856 -34630 -13320 -34224 -11440 -18435 -72677 -54524 60724
8051 60724 -15190 -119483 -177154 -164548 -114333 -30892 -76040 -126800 -77262 -77127 -39993 -67306
8039 -67306 -80334 -75132 -118531 -12696 -25515 -26942 45546 47880 7851 33375 -48972 -165015
8027 -165015 -133832 -69221 -37089 -105866 -153131 -140713 -253028 -180783 -111853 -2296 45781
8016 45781 23202 -41376 28769 -83 -83169 -85835 -164849 -168128 -104064 -28304 -96999 -121548
8004 -121548 -41373 -48147 -53495 -12566 57958 -72486 -139369 -41187 -620 34427 -12670 -59545
7992 -59545 -68753 -114215 539 876 -77401 -77773 -155397 -64327 -23985 -81205 -51955 -45033 -56600
7979 -56600 -85327 -115636 -144074 2210 58207 25611 -29063 -56174 6205 -30298 -33954 -33484
7967 -33484 -32934 -17559 -43832 -21114 -98791 -7870 14422 -43939 -38823 -26142 794 -86447
7955 -86447 -126205 -106153 -69516 21171 67961 -10429 59261 7992 -93878 -127871 -100962 -58781
7943 -58781 4981 -16854 24555 53381 153792 37255 129699 94698 130 16018 62920
7932 62920 -57827 -10357 30333 -25751 -47890 -91709 -75507 -91570 -47312 -7296 -45606 -9526
7920 -9526 -74296 -14505 -49348 -1272 55453 -11047 2525 108097 79729 19658 23690 -32613
7908 -32613 -38131 -18954 4501 577 -53161 -85766 -134380 -89626 -123173 -124252 -72536 -76820 -160717
7895 -160717 -107136 -61254 -51825 -107110 -204010 -156654 -126488 -66077 -127225 -156733 -197947 -128207
7883 -128207 -79892 -70658 -95154 -38837 -26911 21603 27376 -87206 -112596 -122007 -78746 -4305
7871 -4305 -13871 4234 64187 119155 26527 -30393 -166029 -161839 -126508 -66837 -222506 -157102
7859 -157102 -166177 -158452 -116052 -66446 -110051 -110077 -119289 15860 -67915 -147296 -97792 -136908 -11770
7846 -11770 -51225 -111247 -202587 -137507 -15805 126403 94187 -16305 37362 20434 -71738
7835 -71738 -69926 -79848 -82327 -88076 13408 45995 -102777 -121086 -143293 -151652 -142587 -103536 -126387
7822 -126387 -86139 -156350 -128230 -96230 -52683 -126451 -184736 -163014 -84392 -103859 -56505 -69162
7810 -69162 -97475 -116116 -81383 -125799 -68754 32742 111021 59768 -3302 17517 147008
7799 147008 281420 -890 57676 -128087 -11174 48826 104466 6218 -84390 -116002 -51687
7788 -51687 -43957 -72506 -111278 -151474 -103039 -18385 19305 -85077 -98275 -93609 -113950 -66740
7776 -66740 -10599 -80276 -164551 -98476 -58274 -24763 -81357 -121932 -134275 -129717 -45201 -9318
7764 -9318 -36219 -62217 1677 -60946 -45222 -48787 -11033 -17353 4567 -27010 -58095 19777
7752 19777 9222 -19227 9823 -101195 -116332 -26475 -16745 29880 -95535 -102034 -38109 -29440
7740 -29440 -75565 -96435 -100412 -104893 -77498 -31216 -98714 -50048 -16592 -58727 -108926 -146892
7728 -146892 -133786 -108450 -174304 -47953 -64049 -20832 37638 -122283 -135478 -166117 -110936
7717 -110936 -111757 -153165 -117432 41574 -53601 -33238 2094 -48509 -86101 -89336 -80651 -84835
7705 -84835 -55916 -83075 -134814 -111683 -37848 26894 -50273 -76831 -14856 -81088 -123829 -139164
7693 -139164 -96557 -84448 26918 28548 -73329 -39690 -98252 -46403 49497 48042 88372 64178
7681 64178 112462 -23830 -38961 24243 -41520 -16704 -4268 -82115 -69983 8657 -27535 -24219
7669 -24219 19912 47530 42712 -28197 -103253 -92227 -39635 -176503 -296893 -143650 -139062 -147643
7657 -147643 -117255 -119679 -74137 -83074 -91517 -100192 -37111 -16796 -105024 -38425 -135435 -121626
7645 -121626 -109658 -137229 -73615 -59267 43444 70729 -95521 -112544 -2601 55387 131541
7634 131541 92811 37487 -59479 -58814 -74513 -77262 -86617 -83996 6821 -18377 -83977 -160243 -134526
7621 -134526 -109302 -38210 -24921 -119408 -96562 -39866 -91293 -32551 37707 16192 24374 -6442
7609 -6442 -18100 -41265 38178 23576 -74632 -12785 -45925 19738 117128 47199 -18905 54329
7597 54329 -30972 -60544 -100734 -73739 -38839 108 2745 -8824 39680 -15325 54219 51033
7585 51033 36014 -25640 -21979 2504 -20086 -82161 -70590 -3432 -67324 34382 79436 19679
7573 19679 -22419 -70072 -16952 -32358 18878 -41333 -73116 -87861 8625 56079 59630 79681
7561 79681 -24617 -85053 -83122 -51620 -52410 73903 49903 18045 -34692 -97031 13700 9542
7549 9542 -48487 7018 14117 -40069 -96115 35820 35230 115879 165797 91985 109558 40096
7537 40096 78953 -11714 34603 81754 128553 180576 179470 157700 129641 90916 163578 200586
7525 200586 195921 184963 258185 270932 151228 116466 147596 107575 12887 -20799 12300 6151
7513 6151 4912 32382 57021 140079 164400 136236 5902 17042 53106 30698 37774 159440
7501 159440 146839 79758 16226 69150 74565 94369 68038 52928 148528 211054 256812 89037
7489 89037 80412 17901 43501 132326 91148 141371 199260 211814 252780 298738 291260 278148
7477 278148 413967 550262 479374 486168 433659 357623 344783 241895 166961 114323 95934
7466 95934 141892 116474 16291 7730 -28060 -40258 101155 154289 115281 41508 36946 108942
7454 108942 50681 180956 178024 133263 72476 199611 242178 109094 117673 78121 -20705
7443 -20705 58048 111789 36908 -21416 -73985 14827 -10658 -10147 14997 37947 24783 -39831
7431 -39831 -39941 -2785 71831 75264 24952 100884 105952 92765 111830 161144 171516 217135 134312
7418 134312 49941 18949 12970 8152 64331 105777 25746 33105 33360 44880 -79402 -66058
7406 -66058 20141 43076 34380 45168 56401 16291 -30971 -21619 -5026 12696 22488 32468 135938
7393 135938 66779 157188 227039 138931 59573 151889 148093 131101 158468 44549 4565 93972
7381 93972 80718 16080 87576 42479 48828 -19469 -8699 79228 4751 -59687 -4928 34920
7369 34920 28694 88448 43838 54518 79811 70211 30724 -26667 -61194 -63048 73198 112907
7357 112907 57622 4507 10255 -8175 -9238 18697 76796 61330 69252 78102 -97 62039
7345 62039 27864 -11152 -71240 15576 107138 51569 -21953 29370 -54205 -30499 124480 93879
7333 93879 85967 111353 75848 92887 143402 153687 35854 63329 12682 15492 59631 43700
7321 43700 10526 -28376 47839 38969 81828 34058 105314 203682 117027 117712 195268 186440 138812
7308 138812 147359 92569 108574 180528 194998 196577 25791 -18343 60557 252013 191102 154518
7296 154518 122933 96702 48592 49176 187930 166397 153735 263387 242079 171643 153578 105407
7284 105407 193790 256960 137485 152143 192750 205562 157800 167567 169343 203182 219184 194090
7272 194090 166953 164410 207630 247874 154151 118037 80143 89840 233229 247467 313974 263532
7260 263532 245666 317305 322648 361572 282856 261998 183171 275190 316059 284440 330201 257433
7248 257433 273067 287658 290286 347779 324997 259322 284256 256382 239689 224817 310725 353164
7236 353164 328232 255368 270671 279290 258477 269050 319730 312287 337782 322773 234445 292591
7224 292591 298686 310031 390729 320901 372870 310390 339280 433213 445680 401599 483039 489067
7212 489067 508974 455414 462421 462558 481927 488998 545312 587017 616292 643643 534288 616518
7200 616518 609181 647217 704941 654753 598335 790288 763923 754191 805101 839336 785909 770886
7188 770886 833990 860946 860302 814158 857396 856533 845860 803321 854620 905601 945793 917103
7176 917103 916321 975679 1123064 1087786 1127953 1206595 1278001 1318350 1317003 1375397 1478870 1462365
7164 1462365 1433483 1612853 1678708 1740462 1804218 1896586 1932685 1930662 1957462 1964471 1969056 2063401
7152 2063401 2174738 2232223 2095783 2165130 2212627 2248676 2189895 2122131 2144853 2303756 2298453
7141 2298453 2332029 2344158 2389264 2483049 2519273 2687231 2729705 2667857 2609790 2696980 2819451
7130 2819451 2832894 2845528 2948642 3068366 3252714 3426447 3615486 3648477 3710192 3874504
7120 3874504 3958804 4094964 4307178 4454147 4487656 4651845 5005148 5278014 5471802 5689624
7110 5689624 5855971 6118522 6401983 6501136 6761031 7044322 7368776 7858352 8349114 8841763
7100 8841763 9387161 9907159 10604669 11316322 12032618 12806669 13732569 14911320 16160577
7091 16160577 17668102 19497493 21656279 24049827 26867193 30330268 34347983 39078045
7083 39078045 44802909 51968400 60639342 70006613 78432156 83352695 82980426 76868053
7075 76868053 66857039 55584478 45389235 37562363 32081359 28209646 25197755 22783273
7067 22783273 20824063 19246126 17807549 16536320 15409813 14568788 13640714 12819004 12005439
7058 12005439 11164541 10418991 9803383 9352846 8854174 8528857 8216393 8029436 7819002
7049 7819002 7546436 7296372 7085491 7063171 7085425 7011408 7007808 7192234 7162825 7197279 7247548
7038 7247548 7308295 7361919 7552520 7833970 8235068 8816821 9396246 9892556 10099794 9805477
7028 9805477 9110553 8288344 7306019 6386905 5738426 5214710 4816963 4549088 4350250 4141132
7018 4141132 3998116 3835254 3745644 3652799 3570138 3526092 3360850 3281074 3155644 3048844
7008 3048844 2985524 2880733 2786787 2680758 2747478 2626846 2614139 2676098 2661693 2847515 2922896
6997 2922896 2966986 2975533 2983288 2887580 2834128 2636782 2544094 2457344 2310653 2296506 2187134
6986 2187134 2069203 2035105 1944349 1945776 2010807 1916935 1873329 1827316 1689972 1590438 1662356
6975 1662356 1697386 1732700 1726586 1697337 1646245 1594493 1508395 1429879 1373337 1212224 1256729
6964 1256729 1220190 1247652 1158141 1186184 1158532 1104883 1031001 928415 981508 1055064 1092996
6953 1092996 1077976 1002096 1064948 1048710 1098477 1041706 975874 945564 999210 1071385 1076326 1065855
6941 1065855 1119332 1152732 1118212 1207672 1119849 1036141 910481 942169 914128 872803 865858
6930 865858 805128 738874 743758 693950 726509 711374 602673 504614 477066 512443 547930 567256
6918 567256 641531 600289 530779 540377 596969 561820 447482 434599 453045 491864 509565 530425
6906 530425 539701 589873 556811 477954 472847 437711 526468 526955 451117 301291 311354 378314
6894 378314 373709 364816 407298 396074 344012 267194 215000 330926 341641 270136 267739 270785
6882 270785 297727 249468 261118 346348 272751 276296 269224 315911 264522 290559 302429 342761
6870 342761 304863 354085 253310 308908 278661 218160 359255 309420 312912 244669 249194 270447
6858 270447 236594 178452 184276 256346 186439 111274 137010 144808 204909 87979 147491 163954
6846 163954 189027 240851 201709 140752 195045 174683 108489 103650 126289 82719 78927 198256
6834 198256 288555 352593 290855 204019 274824 332063 352553 287728 233705 295387 236972 141996
6822 141996 196811 120096 141446 151669 239675 274909 177552 168898 112719 121351 169782 94814
6810 94814 157588 203831 210330 194053 112503 171042 182704 183681 180145 212740 231187 272331 286755
6797 286755 232200 199706 169770 71178 110291 230622 278626 281752 260190 154855 165579
6786 165579 187895 237018 200436 209736 259483 207564 299933 264527 244619 268307 257943 253531
6774 253531 272275 308112 213950 275402 273398 313789 315702 316881 274359 278077 232355 276930
6762 276930 278649 228476 244159 242697 257228 239832 243929 263317 253491 289420 308793 322420
6750 322420 263153 211036 200857 220100 267910 288075 343167 365853 322242 303831 331691 316898
6738 316898 250183 250185 235355 289629 304910 341986 273028 242828 258360 356488 313990 279171
6726 279171 367849 382446 304525 330901 359425 232090 227194 249146 339107 356586 324220 288107
6714 288107 243184 289534 352643 264516 177301 147495 272850 253139 357684 339960 428090
6703 428090 334253 288813 261525 278249 279759 346951 416686 423128 432014 434615 413970 372386
6691 372386 412894 491356 549418 530847 597355 585953 630822 548198 516571 471278 538813 606866
6679 606866 681330 642005 574346 640960 659825 644124 645438 562588 496376 429797 344113 390743
6667 390743 327785 370019 312254 401206 382537 207227 186522 287271 322196 224029 309197
6656 309197 328153 436855 358630 310128 223414 252297 333288 306173 276182 167574 265937
6645 265937 301307 287939 220919 285925 341060 418686 304366 321280 252699 166049 151852
6634 151852 197125 300131 249039 314899 271590 329769 273039 202836 189078 149653 264132
6623 264132 284615 228267 203930 228828 319241 216322 73203 44533 111847 202657 185910
6612 185910 216376 207175 174345 142274 212158 173720 148265 161139 199435 131820 148080 133079
6600 133079 71336 38538 33930 141644 64661 172502 280895 172341 123808 78939 94592
6589 94592 250839 318937 245746 207707 189652 144221 153244 61505 28643 35061 -25764 -47853
6577 -47853 2123 73582 172556 218405 193067 82197 10594 -43003 -16551 75968 140574 103718
6565 103718 105262 88455 157547 58240 50330 74163 113508 61090 77009 157005 -61102 13174
6553 13174 134941 192336 163879 28707 134160 195838 193810 213745 85275 48139 124522
6542 124522 172117 156287 129155 185110 80228 33397 66322 35739 30588 40888 76362 169766
6530 169766 162498 118107 198247 173256 106552 93446 134825 113225 134520 105551 74956 113476
6518 113476 119767 73850 46874 68760 -38167 -17917 23838 104805 141115 139641 88307 21741
6506 21741 13450 131484 96883 -1418 73391 108557 116866 47643 -4592 31419 65970 8600
6494 8600 57629 -58320 -103517 -48694 18309 37512 -17891 42819 48077 9750 60556 76278
6482 76278 47220 33173 53491 110485 80503 -11897 15032 46389 21071 77618 14028 60413
6470 60413 225645 200910 84114 2256 -88034 -8123 20351 -18928 16210 44694 9423
6459 9423 -15335 65515 3279 22800 4183 -37347 57349 -10380 -69505 41159 -59268 -79729
6447 -79729 -90407 -65399 -43483 106662 16588 -42640 34969 78105 34062 4602 4998 -15903
6435 -15903 -3101 19627 68039 23741 18628 99277 105744 -15438 -6076 -31828 19475 -17877
6423 -17877 -47855 22681 161071 92776 56228 53618 -24959 17113 16164 -24249 -129023 -18816
6411 -18816 53795 1882 21489 39677 87762 132844 114225 -9098 -30474 -34670 -129851 -121981
6399 -121981 -15832 37429 -9580 1207 9540 -6064 7148 25366 90578 193714 168682
6388 168682 152137 215274 173655 78263 15449 1161 79913 96460 106300 179695 39563 137789
6376 137789 199294 96267 93973 95892 125060 121465 86229 86631 81204 53518 13271 58611 115712
6363 115712 -33104 -12443 -19346 33281 73954 34930 -32454 -15252 51098 -46 128506
6352 128506 130785 75055 77826 -29339 -71969 17278 85940 52749 38961 185091 59108
6341 59108 -40435 16856 90511 163761 72906 104636 135587 130607 152170 106282 101821 158042
6329 158042 129827 141173 84762 91044 51593 -2593 16066 2007 -52462 -92237 -1076 15152
6317 15152 89453 172870 211130 135663 86976 86651 15286 65412 108622 57585 3336 -37700
6305 -37700 -2568 7854 10628 -15433 68079 96980 50472 -41713 -62317 885 26324 133007
6293 133007 114847 51693 78209 57553 30581 -29164 -27607 25300 128012 93596 19559 36385
6281 36385 101630 45105 71740 30234 67168 52862 27088 93599 137998 145265 65008 4014
6269 4014 58066 47355 85873 96383 119530 63883 77955 119307 22909 32256 91959 49313
6257 49313 101138 92268 36719 71550 -1295 131451 90865 165782 202378 169019 174915 259997
6245 259997 206848 42293 27421 42024 -48640 101995 228553 69727 37888 31511 82084
6234 82084 257938 207940 53954 49013 168756 81549 102384 109215 109770 99855 200511 151546
6222 151546 174505 173816 129691 102303 208275 123470 33773 98488 138789 146813 80842 163226
6210 163226 111619 76693 111190 308122 336323 274422 256378 192396 148246 261277 364647
6199 364647 255435 207086 243360 281837 294301 218874 192008 274909 309450 243302 181321
6188 181321 219794 256975 192903 159802 193590 195510 238146 393245 386009 380623 456903 405741
6176 405741 428379 555783 535992 440866 503298 388195 427047 493511 499245 635701 598779
6165 598779 574178 551926 572116 539438 574533 491634 543340 506892 592821 634719 537857 527787
6153 527787 541321 636435 725858 670555 732823 691830 626246 689504 621159 563014 603839 703369
6141 703369 750114 701520 717843 803582 811670 756670 703116 634932 590670 556638 474875 437359
6129 437359 560895 453553 409078 427856 400267 470886 419458 531451 446045 428430 405685
6118 405685 392262 506557 574204 599611 505020 498607 570621 605620 569747 510821 679263
6107 679263 496775 493395 506844 469822 498111 397880 442044 390113 403768 491557 405547
6096 405547 373967 367596 267957 393362 471677 462043 488743 470482 522600 550798 624125 540722
6084 540722 489403 551501 502859 553974 602731 538132 494118 513668 371263 408302 445266
6073 445266 409938 449071 515781 555759 504459 511979 634876 653639 626508 526096 421006
6062 421006 460908 509800 544588 632842 644379 688627 680347 604786 553397 493958 489680 507947
6050 507947 405715 496838 535842 622238 701165 629772 628876 557743 583183 608809 691879 673318
6038 673318 644201 649291 645485 648390 628998 778454 781256 797564 872134 757979 705487 780089
6026 780089 682300 718659 704616 677897 710485 687790 798434 856089 785542 765818 801866
6015 801866 831221 898334 832156 803575 707336 625878 730632 804860 834368 829328 825262 871904
6003 871904 818784 800642 741753 861667 878210 862107 846610 864914 907544 834875 908061
5992 908061 981898 1036074 1058507 1120452 1106658 1028676 1016770 1056140 1075662 1062519 1058368 1075169
5980 1075169 1073636 1052551 1081465 1145292 1099381 1231788 1324630 1218549 1257242 1386044 1453896
5969 1453896 1344408 1297502 1315288 1408884 1314781 1206308 1287566 1458176 1407154 1491040 1545277
5958 1545277 1550843 1619313 1660928 1686056 1683160 1723870 1770200 1696066 1725425 1825908 1829202 1816185
5946 1816185 1886079 1904743 1793456 1801763 1824166 1978102 2091512 2077259 2061385 2103241 2171875
5935 2171875 2254244 2380136 2446995 2418666 2506843 2538484 2559758 2706886 2731293 2756935 2853506
5924 2853506 2937407 2973212 3046773 3055501 3048047 3092750 3142938 3189234 3299747 3519267 3563615
5913 3563615 3605933 3644272 3732295 3794838 3896145 4030687 4017526 4004893 4136153 4323084 4399170
5902 4399170 4467562 4542914 4661214 4829707 4929177 4985682 5126426 5365422 5529361 5742903
5892 5742903 5884793 5966073 6122085 6304092 6430030 6671386 6935001 7141990 7375336 7705597
5882 7705597 8077668 8370741 8886490 9194576 9542921 9959823 10370801 10792961 11159855 11375325
5872 11375325 11553946 11755139 11882639 12072915 12198981 12414774 12614342 12842720 13128484
5863 13128484 13585576 13837308 14329754 14988190 15719654 16645976 17506325 18417899 19425142
5854 19425142 20470180 21702078 23123362 24631907 26285839 28174320 30130551 32163418
5846 32163418 34280693 36176578 38206059 40443790 43035559 46209630 49589571 52587269
5838 52587269 54216726 53808456 51507782 48159350 45042511 42678604 40898729 39917440
5830 39917440 39191108 38610681 38160352 37917060 38161328 38625920 39533745 40906280 42596669
5821 42596669 44697611 47152584 49796260 52936077 56779269 61198755 66301563 72360671
5813 72360671 79515774 87429921 94334912 97684712 95725132 88522172 78424615 68175600
5805 68175600 59727744 53578246 48893834 45184371 42259692 39738265 37871076 36432995
5797 36432995 35288428 34438819 33827107 33526448 33496654 33745241 34340223 35173550 36111001
5788 36111001 37368915 39015093 41188459 43957641 47233554 50617752 53381720 54232602
5780 54232602 52606063 48460966 43043913 37742935 33405616 30095632 27470857 25422582
5772 25422582 23734522 22411983 21248969 20218109 19434298 18773987 18285495 17902909 17697011
5763 17697011 17464016 17086842 16687104 16272210 15996112 15703013 15402699 14946497 14480260
5754 14480260 14204019 13912305 13477806 13018967 12562251 12276893 12121112 11696247 11491002
5745 11491002 11258365 11034259 10952776 10918645 10896136 10829590 10919437 10934467 10909865 11034624 11152721
5734 11152721 11130633 11149132 11271191 11261542 11409381 11444440 11303539 11220515 11029385 10754630
5724 10754630 10410027 10094079 9849899 9544737 9205752 8862072 8597962 8292610 8112307
5715 8112307 7857137 7668243 7598704 7456782 7359901 7387078 7245094 7238415 7198008 7163244 7123844
5704 7123844 7086478 7100469 7135972 7228025 7294276 7314779 7277785 7236269 7085520 6948066 6871795
5693 6871795 6754653 6642526 6489247 6363144 6348590 6315688 6307984 6282971 6487472 6540017 6606954
5682 6606954 6616034 6454965 6379068 6278576 6045519 5998991 5844611 5878769 5839688 5689385 5553567
5671 5553567 5586955 5682436 5592293 5515493 5646466 5797883 5859481 6018162 6162178 6227650 6447852
5660 6447852 6809943 7065050 7293178 7565182 7891760 8230732 8362020 8453073 8309781 8146619
5650 8146619 7773144 7575426 7433124 7224153 7076631 6986322 7071528 7130287 7121009 7118944 7275276
5639 7275276 7444709 7644852 7860656 8095326 8295674 8520296 8689353 8936949 9244865 9492346
5629 9492346 9860480 10176333 10368327 10385067 10385489 10252070 9989294 9737002 9518339 9342331
5619 9342331 9282440 9259937 9213422 9248446 9254577 9331196 9427732 9536004 9651563 9777019 10048909
5608 10048909 10373336 10669204 10800586 11018774 11331542 11566717 11945352 12176044 12378698
5599 12378698 12060303 11447033 10878563 10156467 9595581 9194102 8745791 8329798 8108436
5590 8108436 7939682 7730321 7696816 7532361 7478923 7493821 7544365 7542322 7423907 7475162 7473454
5579 7473454 7478409 7531018 7658635 7757735 7953532 8322207 8448533 8639335 8644974 8645994 8535077
5568 8535077 8326829 8338849 8536798 8742047 9236769 9984325 10850414 11682787 12094197 11764631
5558 11764631 10863896 9614848 8464297 7660910 7058492 6627862 6307956 6053041 5711961
5549 5711961 5525212 5383458 5370861 5224520 5151954 5170434 5099308 5081694 4986342 4956450 5007322
5538 5007322 5069853 5264285 5502452 5558656 5684022 5863714 5996576 5879096 5604384 5475024
5528 5475024 5401738 5255866 5025555 5082439 5041865 4978174 4926737 4797339 4804461 4746218 4774749
5517 4774749 4772241 4654579 4706630 4626853 4631617 4699785 4759084 4891477 4971766 5099064 5105575
5506 5105575 5227906 5190881 5323608 5455211 5393855 5418293 5203656 5222168 5277108 5449894
5496 5449894 5639891 5646015 5663095 5773677 5825020 5894990 5933372 6094413 6232693 6285609 6429775
5485 6429775 6571548 6726815 6877608 7067182 7350183 7598073 7770169 7951771 8153400 8362362
5475 8362362 8468945 8611840 8849489 9096425 9298208 9451591 9714365 10029957 10223712 10528702
5465 10528702 10917189 11262680 11760129 12358294 12893863 13615841 14491084 15286432 16300688
5456 16300688 17542853 18790073 20297049 22129582 24232559 26826416 29934604 33527325
5448 33527325 37647943 41803068 45314604 47016017 46092681 42925078 38706444 34668938
5440 34668938 31702661 29609133 28101936 27108455 26436555 26124798 26079424 26261385 26691165
5431 26691165 27361625 28195846 29239792 30869116 32753035 34858414 37542163 40683743
5423 40683743 44553125 49257427 54874651 61642796 69394548 77073881 82481807 83490661
5415 83490661 79354790 71385923 62278144 54211290 47962212 43288526 39643079 36634273
5407 36634273 34111389 32029689 30486568 29357016 28545287 28112729 27961330 28083707 28403917
5398 28403917 29099096 30124104 31421462 32910319 34769111 37004276 39717611 42834073
5390 42834073 45682227 47674943 47863419 45596441 41563691 36962903 32795274 29644386
5382 29644386 27317002 25506369 23891057 22267492 20694784 19293586 17925876 16802656
5374 16802656 15790508 15009678 14350371 13747103 13214069 12801336 12360592 12109776 11814331
5365 11814331 11637860 11350491 11292610 11129166 10970656 10979087 11064171 11100497 11266768 11558969
5355 11558969 11846901 12145162 12547109 12852575 12658976 12328394 11682317 11123825 10512684
5346 10512684 10008491 9508350 9224456 9142298 8919944 8763654 8672487 8529478 8363018 8341527
5336 8341527 8356522 8374652 8424726 8378625 8467386 8535059 8732709 8930633 9291224 9571468 9706737
5325 9706737 9911908 10054977 10049877 9892924 9545643 9256385 9114677 8934686 8746104 8685981
5315 8685981 8718754 8705615 8570957 8380545 8321914 8151529 8029405 7978313 7774132 7572080
5305 7572080 7468447 7524990 7519412 7486881 7497103 7517698 7546991 7633409 7708177 7813734 7807456
5294 7807456 8033539 8132214 8356582 8680152 8963323 9098282 9253501 9362475 9348933 9266355
5284 9266355 9241264 9179924 9116656 8956805 8728798 8563601 8375086 8193600 8001655 7939496
5274 7939496 7717687 7625842 7650622 7668477 7823070 7892233 7970193 8143653 8291388 8604734
5264 8604734 8790212 9027533 9191225 9467221 9636102 9742223 9818955 9937702 9974788 9985693
5254 9985693 10091235 10136941 10032248 9850568 9729690 9570975 9506460 9466006 9458250 9577490
5244 9577490 9539401 9352058 9146648 9077540 9175145 9162891 9213953 9319183 9384128 9472615 9579253
5233 9579253 9816501 10084513 10247107 10370879 10471229 10626018 10831951 11159590 11390772 11371747
5223 11371747 11210310 10858254 10364079 9952812 9386372 8841693 8499527 8119663 7850998
5214 7850998 7723461 7485624 7164372 7077270 6913207 6781789 6602103 6446992 6455459 6467287
5204 6467287 6450536 6564099 6593501 6599463 6467462 6287135 6018319 5834181 5769647 5567059
5194 5567059 5465521 5253450 5153746 5130355 4960643 4904132 4806354 4670698 4625779 4529792 4505206
5183 4505206 4405419 4285669 4388562 4270156 4182818 4227449 4209092 4187958 4104846 3998663 4005272
5172 4005272 3989905 3889005 3853835 3881250 3797782 3752405 3682751 3630191 3506966 3394278 3341850
5161 3341850 3301173 3308442 3241722 3278618 3224416 3155616 3099576 3157895 3212497 3129946 3131097 3136886
5149 3136886 3034820 3038292 3192421 3230368 3320536 3314996 3301641 3305976 3175759 3101795 3066936
5138 3066936 2938115 2825394 2852185 2863076 2852005 2688155 2697541 2682439 2609007 2536511 2443769
5127 2443769 2506982 2552473 2587794 2693173 2659182 2596751 2469932 2537897 2634249 2583443 2553860
5116 2553860 2563198 2454080 2547240 2511332 2544173 2520651 2400664 2371876 2283237 2331920 2417701
5105 2417701 2349248 2270097 2207238 2187641 2266247 2276986 2221674 2228648 2288616 2357092 2418650 2370926
5093 2370926 2308978 2241542 2239894 2185658 2040210 1947067 2032778 2119208 2059380 1979265 1923742
5082 1923742 1878676 1839206 1866810 1918681 1778785 1740581 1752648 1753139 1683351 1522934 1553070
5071 1553070 1569553 1524304 1533836 1584283 1597836 1585313 1498194 1451056 1508306 1459133 1407499 1457541
5059 1457541 1402584 1407095 1525025 1445994 1510292 1606854 1591697 1562538 1498402 1399459 1360290
5048 1360290 1326418 1328721 1238442 1137525 1046437 996790 962976 931434 947502 969172 953069
5037 953069 984559 908202 961801 1043113 942080 874151 987362 1009806 1054202 1130315 1129400 1085243
5025 1085243 958781 1023656 1029310 1085248 958038 864406 909995 880019 813513 823290 781135
5014 781135 827759 798662 763308 869097 811026 717459 641960 674502 696104 770598 719540
5003 719540 641385 636268 587625 564519 594674 627536 565940 557944 413406 430554 478114 550137
4991 550137 474484 462208 439169 463769 552229 401473 387224 370396 294494 437988 443540
4980 443540 471746 498497 476604 530507 476043 531527 548131 559203 489501 533127 452908 475323
4968 475323 449191 398848 464433 560827 547976 385766 267552 307887 317010 402651 343920
4957 343920 356543 443310 474754 445507 276677 289825 391813 394005 401239 436601 333075
4946 333075 338151 399792 333110 328327 448801 498126 463959 546651 408735 342166 449225
4935 449225 495591 486407 436398 457777 509875 542713 591678 558263 504547 589910 488988 370475
4923 370475 321599 316551 404540 449725 371439 417785 386712 393952 364763 268749 279341 271858
4911 271858 375128 398932 311980 317537 412634 370523 338397 366999 347002 406732 438685 550996
4899 550996 494189 427050 384647 364963 438856 434739 365608 293419 290453 394900 272160 340033
4887 340033 325786 358815 334330 371812 341514 337315 336751 273327 330075 334026 359360 311494
4875 311494 362287 349007 405482 315438 307853 338662 286150 321334 378816 435555 414662 387471
4863 387471 433505 441586 420921 317569 290924 245968 309093 316570 324513 333098 371225 340749
4851 340749 283072 293646 229007 211190 197368 224466 161113 187990 349268 258755 278343
4840 278343 337388 219739 147234 178159 245730 348923 403813 495656 345404 298561 240144
4829 240144 229015 188378 204239 379892 324782 290779 274484 261917 235524 329732 344838
4818 344838 364615 278054 308857 298052 306162 352897 460344 499408 388856 344861 345383 293991
4806 293991 356729 402700 413634 381605 370376 434365 518446 522179 531190 453649 392944 348919
4794 348919 312421 336939 384114 412047 538805 512761 442568 525860 491313 518199 489900
4783 489900 520777 500389 486756 424859 517971 554103 630854 711629 682711 627313 590649 511836
4771 511836 568516 568863 507109 425957 360426 434231 385430 401667 481475 462604 461170 436202
4759 436202 472179 440049 312972 393126 423086 368535 366061 429523 486769 451939 480135 429968
4747 429968 393141 488764 437987 431400 357738 430152 438597 366925 386470 273290 354208 432596
4735 432596 471845 479243 472904 466825 408431 503364 487733 402972 475612 530926 540063 548288 534055
4722 534055 648811 714211 679005 703202 703021 768797 799947 798151 878885 747978 684155 642823
4710 642823 627803 568336 520782 573856 543730 553117 478930 450034 527963 534334 493590 480379
4698 480379 437599 470069 569847 568026 553291 607854 616105 535913 493013 406450 490635 587784
4686 587784 562987 561518 521517 626749 522292 495218 475751 546653 548256 572223 478313 493547
4674 493547 552604 478529 536498 514287 450750 388986 412442 491766 466993 478999 625989
4663 625989 529432 467751 508760 489842 462325 554587 638907 582455 557437 522910 475196 513085
4651 513085 631607 625123 553708 620513 594575 610411 651793 655138 549927 511142 593757 563412
4639 563412 557195 625824 650594 528920 510287 583401 554713 525923 545384 564653 575243 609510
4627 609510 554507 589318 595176 664646 667623 627592 556458 684412 736910 735435 695792 716008
4615 716008 800338 731696 732087 640656 644312 691578 721309 734435 684016 697423 672865 627929
4603 627929 610927 668186 714947 651136 705026 817416 876874 780331 677555 606577 653556
4592 653556 665110 704704 775326 781484 800162 855671 934685 878356 736229 741923 810784 776916
4580 776916 691923 647155 639311 787684 869397 810476 875221 902460 888853 884096 920692 883988
4568 883988 950135 999647 967579 999699 909986 963204 943049 900169 907241 890411 872170 886521
4556 886521 932365 966152 1042622 1056078 1049878 977941 1058245 1040387 1092286 1132158 1066334 1079686
4544 1079686 1110585 1161287 1128030 1108271 1108361 1124031 1213236 1153282 1105564 1075874 1061343 1147059
4532 1147059 1133240 1236460 1382658 1311336 1180939 1270877 1344898 1330727 1372954 1235684 1167277
4521 1167277 1198817 1208716 1295695 1369209 1277033 1286761 1265158 1197463 1227513 1212722 1317312 1281991
4509 1281991 1385457 1464751 1457978 1422880 1407568 1446357 1562244 1559185 1537450 1613977 1498571
4498 1498571 1515716 1610876 1601743 1624454 1532275 1649563 1720245 1771444 1718152 1681434 1755180
4487 1755180 1820926 1888410 1765361 1694732 1698828 1817646 1964049 1978877 2030549 2077435 2057533
4476 2057533 2052320 2114223 2080811 2110253 2288075 2217429 2300171 2368779 2464124 2659169 2676615
4465 2676615 2732405 2968939 3168481 3349983 3547383 3582805 3512685 3403130 3236328 3116817
4455 3116817 3087443 2989403 2936839 2771000 2872891 2773952 2609391 2636025 2628084 2673278 2699857
4444 2699857 2644916 2722285 2886748 2800468 2816617 2846766 2822385 2832878 2908975 2923112 2920421
4433 2920421 2917442 2988396 3093688 3082319 3046945 3005520 3002206 3114045 3146365 3236835 3344031
4422 3344031 3424369 3372648 3312428 3467803 3526165 3531701 3624637 3610902 3707306 3817290 3874922
4411 3874922 3923302 4001938 3991359 4006524 3985430 3992362 3999031 4005270 3979721 4036455 3983864 3945357
4399 3945357 3956996 3946883 3991709 4020711 3982780 4068389 3973423 4062340 4190238 4208039 4350880
4388 4350880 4249839 4255100 4304010 4275088 4377049 4447641 4497074 4513163 4520164 4672904 4635362
4377 4635362 4698393 4744406 4748266 4844614 4973490 5005932 5089593 5179189 5204185 5227834 5227451 5400271
4365 5400271 5638760 5676943 5792913 5931155 5970263 6086289 6185031 6243937 6391408 6402849
4355 6402849 6565776 6671489 6879663 6932589 6935763 7087626 7127066 7246787 7465032 7537345
4345 7537345 7628536 7771621 7792380 7981027 8182375 8404276 8656680 8912111 9195961 9417289
4335 9417289 9709716 10152668 10330974 10578643 10756203 10838728 10946911 10982233 11137414 11082500
4325 11082500 11171181 11208002 11268879 11366859 11489241 11653010 11772312 11885840 12105264 12268057
4315 12268057 12382291 12528195 12656207 12888694 13003736 13158516 13432308 13680081 14004867
4306 14004867 14332142 14701723 15045465 15385040 15839734 16198896 16680325 16946416 17170773
4297 17170773 17321536 17454669 17556423 17568360 17627390 17739274 17780691 17895693 17984884 18139214
4287 18139214 18055987 18041497 18203735 18162101 18140099 18294216 18497571 18620868 18760404 19001105
4277 19001105 19294741 19499592 19695090 19832552 20019680 20158315 20450845 20784298 21126340
4268 21126340 21568750 21999540 22308185 22440333 22390346 22101229 21909533 21713296 21541821 21544728
4258 21544728 21554197 21668822 21584230 21559888 21705149 21754143 21794459 21788258 21729413 21786335 21911914
4247 21911914 21981628 22034988 22112896 22123463 22110655 22116106 22134266 22198511 22249190 22259567 22307220
4236 22307220 22362419 22492424 22640220 22805511 22884485 23011156 23231005 23522699 23812478 23857319
4226 23857319 23961705 24004715 24189214 24370277 24520636 24756818 25046316 25405272 25778620 26191286
4216 26191286 26555439 26988891 27423781 27906843 28336529 28853360 29409069 30127584 30813381
4207 30813381 31398994 32028181 32638967 33118533 33666277 34316901 35040918 35993309 36860863
4198 36860863 37936499 39228701 40473172 41828449 43182423 44683760 46368803 48519710
4190 48519710 50943363 53805626 57261743 61497071 66489209 72415119 79136101 87112872
4182 87112872 96666293 108157754 122123390 139380692 160879602 187762763 220066218
4175 220066218 254093601 281401987 291925810 280497204 250654885 214226687 181478531
4168 181478531 157303980 139344154 124790225 112505121 102312725 93854755 86856949
4161 86856949 81022690 76049704 71835523 68049660 64635036 61590380 58850451 56534545
4153 56534545 54403474 52662971 51350686 50071205 48709278 47464607 46383065 45655965
4145 45655965 45462860 45523975 46132697 47329716 49034617 51310273 53899659 56153564 57087906
4136 57087906 56182137 53769110 50602804 47410389 44143886 40835298 37625273 35023718
4128 35023718 32943379 31282130 29767958 28467705 27515505 26743768 26055164 25592655 25246514
4119 25246514 25026311 24949633 24934358 24892289 24663025 24127091 23456191 22858533 22302592 21862960
4109 21862960 21695104 21586710 21370732 21386729 21490726 21784952 22228768 22883272 23633676 24336123
4099 24336123 25145120 25915992 26530594 26387909 25881755 24702276 22897419 21130770 19645726
4090 19645726 18476576 17519902 16808050 16295719 15968039 15761020 15542982 15414012 15261624
4081 15261624 15034418 14668684 14368595 14113100 13835451 13644879 13607311 13502800 13269229 12971682
4071 12971682 12603047 12207296 11792772 11340457 10921507 10634621 10414378 10383654 10237924 10109260
4061 10109260 9926992 9831860 9855566 9900551 9827125 9788397 9790600 9848349 9848880 9834854 9867726 9847888
4049 9847888 9844163 9893111 10116213 10175443 10316380 10480913 10712221 10995315 11422596 11932387
4039 11932387 12236115 12534786 12675569 12546861 12394042 12160678 11781476 11261039 10916186
4030 10916186 10658421 10451038 10250930 10155801 10029756 10056319 10027342 10061553 10200245 10194005
4020 10194005 10329484 10416773 10609575 10838083 11096687 11328241 11693729 12183232 12669439 13229724
4010 13229724 13796170 14053417 14155427 14061876 14048461 14161199 14476411 14793672 15208102 15767998
4000 15767998 16525732 17191619 17716334 18202485 18632351 19095566 19620132 20050530 20392488
3991 20392488 20528445 20332913 20153502 20151546 20474276 21247053 22486512 24075833 26234579
3982 26234579 29114684 32176333 34351834 34706366 33079029 30022287 27191418 25386924
3974 25386924 24613110 24497088 24986471 25614140 25873304 25920850 25843793 25826540 25863876 26224826
3964 26224826 27019522 28393362 29870478 31567352 33007904 33539369 33169163 32233198 31431307
3955 31431307 31069946 30764081 29714761 27616856 25079644 22867858 21313345 20363437 19854932
3946 19854932 19393013 19257642 19397724 19446494 19554685 19924564 20336785 20692406 20933495 20845943
3936 20845943 20835858 21083576 21490251 22228009 23183203 24447200 25990493 27605235 28850377
3927 28850377 29699162 30158726 30471921 30589902 30574832 30387363 30178256 29648022 28517766
3918 28517766 27332369 26495234 26465803 27115164 28324416 29404501 29797711 29034805 27262349
3909 27262349 25159018 23310084 21969875 21153725 20473651 19787702 19263537 18856670 18514480
3900 18514480 18370583 18403191 18618091 19004396 19457105 20009711 20334088 20407990 20208792 19636255
3890 19636255 19229911 18800321 18408505 18461731 18554785 18800395 18945580 18943796 18958177 18939446
3880 18939446 18814259 18764662 18960920 19138494 19358515 19773547 20191032 20421998 20431959 20292264
3870 20292264 20289535 20041310 19854032 19784436 19517940 19190469 19025733 19005815 18925427 18965913
3860 18965913 19229739 19590092 20053399 20618016 21028217 21358509 21512636 21747177 22302460
3851 22302460 23016638 24023709 25338461 26760327 28330227 30103245 31425634 32519293
3843 32519293 33392792 34178423 34692822 34787715 34605135 34151162 33185753 32081625 30798931
3834 30798931 29461103 28408936 27695520 27332249 27300192 27570730 28111388 28814354 29616955
3825 29616955 30396051 30937300 31344971 31831941 32494837 33315151 34603561 36117504 38124402
3816 38124402 40225367 42174128 43657545 44604290 44763399 44412423 44118239 44003608 43952635
3807 43952635 43929589 43601463 43124930 42435025 41644212 41193673 40818367 40382320 40171319 39981712
3797 39981712 39756891 39294895 38417003 37229304 35896771 34733180 34121128 33790714 33799026
3788 33799026 34142623 34591824 35258171 35780758 36267192 36776927 37382569 38208010 39437095
3779 39437095 40849052 42380994 43747064 44534498 44575693 43865867 42472776 40579760 38630714
3770 38630714 36795808 35303751 34225318 33311971 32323077 30991420 29454667 28073034
3762 28073034 26885930 25927998 25163622 24626826 24318340 24097782 24014456 24093377 24265511 24459411
3752 24459411 24835181 25353980 25877702 26444311 26762063 26767950 26408001 25831096 25250552 24577451
3742 24577451 23999249 23398218 22980655 22454900 21877954 21345730 20670677 20089684 19532696
3733 19532696 19086608 18645085 18329480 18060272 17803148 17610941 17443953 17290341 17125938
3724 17125938 17187206 17081083 17006214 17039741 17079096 17228616 17258394 17303006 17457661 17510013 17609658
3713 17609658 17755029 17818601 17835957 17993554 18171295 18452047 18626087 18785733 19003574 19154980
3703 19154980 19506841 19822557 20263674 20686019 21086579 21617259 22105565 22830201 23536843
3694 23536843 24347300 25113453 25872905 26659947 27431327 28033196 28680254 29352364 30022766
3685 30022766 30664032 31319749 32025977 32561868 32819186 32823202 32478545 31836658 31360510 30962109
3675 30962109 30878031 30944245 31280872 31729550 32319442 33107730 34183453 35491808 36954788
3666 36954788 38603495 40412313 42247333 43968212 45505456 46894697 48308902 49780050
3658 49780050 51561711 53208683 54686727 55616530 55844110 55543757 54474856 53118617 51813171
3649 51813171 50815831 50069137 49580301 49466855 49280536 48929335 48338167 47715210 47316912
3640 47316912 47163259 47514956 48226123 49352700 50906037 52624989 54146046 55372258 55989419
3631 55989419 56417431 56698946 57157712 57848591 58441399 58942559 59380621 59744789 60132761
3622 60132761 60327732 60433964 60498926 60646918 60740960 60828689 60535352 59346005 57557092 55462544
3612 55462544 53504760 51701159 50343155 49477954 48853405 48494827 48425848 48314743 47935134
3603 47935134 47483730 46859807 46335117 45954981 45900340 46288915 46785164 47722942 48863899
3594 48863899 50174447 51232897 52023363 52574415 52498480 52181091 51722305 50943887 49812888
3585 49812888 48453491 46975796 45368180 43575368 41927436 40459557 39178476 38111941
3577 38111941 37231028 36392038 35624069 35014188 34345454 33702668 33162489 32772194 32523207
3568 32523207 32488948 32480160 32446011 32545248 32661859 32724456 32604167 32232682 31724995 31235552
3558 31235552 30709910 30094190 29591275 29032127 28266961 27317823 26426091 25574279 24871173
3549 24871173 24069504 23495362 22959460 22440708 21915588 21428896 20950636 20539751 20144413
3540 20144413 19849473 19542271 19207893 18907445 18716727 18449157 18115557 17730057 17366322
3531 17366322 17282779 16997543 16767125 16626891 16465018 16205852 16013093 15812231 15608608 15360225
3521 15360225 15050890 14754302 14427972 14108340 13704907 13413334 13206379 12922869 12591075
3512 12591075 12290136 12148114 11972273 11669331 11424370 11252652 11066935 10869723 10763706
3503 10763706 10594705 10459289 10301809 10106093 10037878 9849400 9790057 9657905 9588429 9586605
3493 9586605 9470575 9345218 9234258 9067389 8855639 8862593 8756927 8638870 8442460 8172865
3483 8172865 8158876 8139855 8031482 7922673 7777667 7600388 7492017 7406713 7240275 7118508
3473 7118508 7085578 6955320 6969146 6859609 6735268 6635928 6570296 6458200 6407228 6476744 6411658
3462 6411658 6416156 6363180 6364501 6457349 6431798 6424902 6439620 6464762 6407139 6458815 6364649 6320179
3450 6320179 6280180 6250405 6201721 6262116 6167897 5967384 6014458 5973765 5964017 5995687 5910629
3439 5910629 5846771 5762163 5784892 5765530 5716973 5683716 5692673 5725389 5718915 5836146 5990733
3428 5990733 6008154 6037931 6125952 6135900 6264579 6270329 6326530 6311957 6263660 6183621 6228271 6357169
3416 6357169 6458777 6415122 6454225 6438444 6408670 6369667 6495120 6544050 6434531 6529448 6615003
3405 6615003 6667115 6689757 6583914 6517651 6582471 6601715 6710515 6746166 6734897 6802454 6711612
3394 6711612 6716809 6770019 6757213 6676846 6565360 6530289 6631878 6542945 6482853 6413117 6430979
3383 6430979 6585749 6665676 6703763 6645213 6672086 6691272 6697827 6644874 6699289 6623452 6566219
3372 6566219 6537392 6446814 6295323 6295409 6294427 6205248 6184504 6078832 5975360 5886421 5953738 5952046
3360 5952046 5880678 5915484 5894212 5844671 5964759 5983636 5913024 5939837 6093660 6279248 6233964
3349 6233964 6217147 6327827 6319506 6500872 6576723 6578124 6533103 6483991 6435679 6460235 6561871
3338 6561871 6498496 6480785 6493117 6497696 6556891 6574188 6575970 6671715 6712386 6673357 6763353 6805264
3326 6805264 6831262 6995519 7006442 7068845 7058752 7230900 7297033 7424342 7560065 7603886 7717852
3315 7717852 7860781 8064560 8109031 8160305 8340805 8481507 8459569 8542753 8478108 8508325 8732361
3304 8732361 8809996 8930980 9087586 9190550 9229565 9376866 9440586 9526477 9744502 9924837
3294 9924837 10093482 10331528 10476224 10622942 10905179 11168940 11339524 11669755 11929647 12244644
3284 12244644 12613896 12979178 13402251 13740296 14028401 14436725 14780330 15318305 15788093
3275 15788093 16199533 16665434 17270700 17912462 18439313 19191064 20092047 21116554 22152281
3266 22152281 23421138 24832122 26252388 27887990 29600438 31486993 33547149 35318987
3258 35318987 36807301 37995585 38716821 38609148 37880670 36395465 34426823 32040238 29423460
3249 29423460 26917377 24620522 22625679 20769490 19146496 17912229 16720661 15575225
3241 15575225 14580023 13796174 12981860 12437786 11860479 11288142 10829929 10341074 9899473
3232 9899473 9540668 9134713 8745321 8429569 8119251 7874875 7622347 7360415 7132985 6886998
3222 6886998 6855597 6725644 6481883 6374942 6315141 6283628 6277048 6440568 6391736 6375313 6254990
3211 6254990 5964554 5880023 5813447 5747064 5689299 5550590 5437923 5379989 5439603 5295466 5215204
3200 5215204 5179755 5122508 4962596 4849357 4720350 4644624 4570855 4533885 4506909 4519280 4453393
3189 4453393 4380493 4333886 4265803 4258906 4131608 4088727 4153799 4209176 4184425 4142483 4130911
3178 4130911 3974066 3961967 3954507 3842267 3859976 3805531 3749834 3823891 3848571 3879291 3854075
3167 3854075 3848614 3776242 3800154 3861792 3749741 3738879 3763120 3771459 3723168 3818527 3828541 3758273
3155 3758273 3715242 3789411 3760652 3628770 3624854 3524742 3476458 3392309 3365230 3384645 3374551
3144 3374551 3388517 3284161 3270633 3290317 3222633 3141525 3108461 3051139 2996614 2995572 3010425
3133 3010425 3011245 2969030 2946828 3013621 2980177 3019385 3017597 3085036 3095464 3028904 3038987 3126393
3121 3126393 3043600 2905569 2863613 2947067 2990004 3033530 2992465 2929969 2897667 2892390 2888397 2864383
3109 2864383 2817020 2785053 2752880 2565496 2519799 2573657 2475824 2522260 2549445 2445314 2327876
3098 2327876 2264949 2251122 2258799 2280407 2240533 2175875 2108142 2201556 2177989 2103706 2195439 2171643
3086 2171643 2099412 2096298 2111735 2156072 2043011 2001883 2033367 1972189 1947509 1971004 1916296
3075 1916296 2025724 1910132 1770026 1803280 1755645 1618191 1617932 1691711 1680707 1686474 1632614
3064 1632614 1561232 1500897 1454087 1481161 1465964 1429862 1446031 1384646 1289555 1354902 1316335
3053 1316335 1309703 1200226 1234562 1165125 1091620 1120885 1130116 1128861 1195747 1178030 1176641 1135293
3041 1135293 1101051 1106418 1039567 1022761 1025442 1026052 1040937 950167 937258 826346 912050 1016876
3029 1016876 968305 912524 862165 913349 927067 917456 825612 871152 957920 884404 817702 917261
3017 917261 753003 738885 743789 836611 826108 859579 822553 770821 816756 789421 751097 804469
3005 804469 814494 769994 735697 727909 806146 848514 877427 735033 689601 763048 824376 836053
2993 836053 834079 821224 775827 722929 738519 856270 836524 891367 857125 833363 789448 831359
2981 831359 769303 732498 797247 856252 877623 808120 800116 928573 926832 967222 911420 960163
2969 960163 907454 823016 976052 1117932 1098979 1081818 1220658 1233192 1096056 1126795 1093536
2958 1093536 1170324 1256730 1256780 1254039 1320862 1415798 1569691 1666992 1642693 1737882 1724890 1828462
2946 1828462 1929765 1918719 1949369 1970706 1960386 2071280 2039880 1979161 2029306 2103434 2033541
2935 2033541 1950064 1859383 1934355 1868767 1917790 2007376 2086581 2117279 2101481 2105185 2171218 2210404
2923 2210404 2290060 2419461 2531976 2721403 2883635 3124345 3321391 3402794 3423507 3351136
2913 3351136 3103798 2740941 2582155 2423984 2161974 1967234 1883658 1783002 1667744 1628711
2903 1628711 1692738 1533306 1563234 1567955 1521132 1501230 1541831 1526491 1530078 1553316 1577891 1483113
2891 1483113 1483908 1577854 1573370 1628310 1616217 1629091 1622350 1655358 1570201 1460584 1374078 1371800
2879 1371800 1254253 1071743 1046263 1165259 1033595 961581 959606 941511 863640 790826 780983
2868 780983 653604 580795 644409 678580 647387 655576 589193 580257 577465 573242 550721 510383
2856 510383 467122 426567 373023 363887 355802 364314 351137 414356 464188 410989 425502 405496
2844 405496 371119 333531 361132 327757 329085 226337 361205 407217 388946 413884 379878
2833 379878 321381 318813 297884 304925 370400 305815 224617 306997 368286 286110 177598 341285
2821 341285 395911 263786 250967 249173 313891 252105 265823 369099 299319 210085 173021
2810 173021 176559 217305 325785 274712 179119 228775 234107 253684 107286 105028 206967 217455
2798 217455 208539 153633 108049 95420 -25092 56629 171175 144051 158295 209347 172261
2787 172261 140922 190851 118273 119287 124382 103934 104018 114959 101954 198929 255018 204189 244183
2774 244183 194409 132929 152798 243141 287758 196273 223919 169055 115309 187335 63613
2763 63613 10573 89173 54417 147423 79711 -30257 59276 107038 -20913 -92606 -97134 11358
2751 11358 129734 92693 138821 50877 37771 26919 49270 66004 22443 26795 -28726 -63278
2739 -63278 26381 -34545 -49752 -84145 -435 17558 51834 88445 44159 6257 -26450 63758
2727 63758 59910 155685 139000 128752 93510 16825 60463 118671 176276 185389 142728 144274
2715 144274 89896 33921 97976 75597 69083 -13840 -2427 -17524 -73823 -31012 39620 68992
2703 68992 -93160 5281 178210 91067 -12169 -11963 31291 15566 -21571 -40561 -53445 -62256
2691 -62256 -37638 -65029 -14291 -22732 -38330 9284 -34033 -34573 31053 100867 53080 -35109
2679 -35109 -86418 73389 52726 59815 196670 87384 75901 69719 -16353 -4571 77560 60278
2667 60278 43607 105008 47442 55755 82602 11307 49186 177337 181211 129455 120778 74693
2655 74693 -14285 47439 42755 80462 65556 43842 29941 -33956 -130253 -26790 30295 -13557
2643 -13557 60043 -565 -74147 -90148 -73261 -57447 -94265 -38757 5868 -93858 -38513 7015
2631 7015 16514 68168 129892 39507 32428 9649 80326 47647 55644 100196 128696 101618 40886
2618 40886 14555 140627 278912 165189 230720 184922 54417 32701 107387 10459 15028
2607 15028 -31875 15227 23238 -52105 -62158 -28054 73985 77734 102849 1179 1643 -14487
2595 -14487 64625 96984 46848 107911 4905 -8203 120623 94538 51811 27737 -169156
2584 -169156 -187864 -53204 -26712 17393 111250 37084 25028 -9286 42217 39387 -19889 -17385
2572 -17385 -30914 -16225 42478 89906 -18410 58211 58038 -2814 -32553 8934 23670 41320
2560 41320 4362 68162 -40937 -28184 -71917 -127363 -104979 -81418 -104539 -64010 -41948 6673
2548 6673 -55192 -42925 -11163 7339 11916 25105 63686 -21722 25045 67491 64956 62190 45507
2535 45507 -56455 16151 18134 8445 40399 90818 6900 -97522 -70648 95866 86364 3333
2523 3333 -108957 -82350 -62006 -41443 -46681 -52844 -20185 1640 -25587 -71940 -105300 27035
2511 27035 5845 23992 120747 92608 85129 72610 -9097 -82916 -63940 -13625 -202267 -135532
2499 -135532 -7854 58718 24005 35780 -33387 12816 -39799 -53405 -80461 -136762 -73895
2488 -73895 -96605 -6854 -40595 50100 -59413 -13227 61791 51281 -4917 -84064 3370 10395
2476 10395 -32546 -5074 -29118 -16561 1714 109740 111134 -12915 -43102 37345 -120534
2465 -120534 -158743 -93314 -7097 -40692 -4850 45949 -10514 -54941 10034 4414 82243 185114
2453 185114 64801 35451 9492 -45221 -52878 -85323 63702 39997 113882 90292 -71
2442 -71 75112 71427 139600 99310 66851 8625 4735 96006 45833 76753 89776 -19751 -18139
2429 -18139 -28278 78568 53308 -46973 -144879 -123676 -58587 -21473 -5209 -15257 88521
2418 88521 10937 76595 128571 12385 -57664 -16502 -11644 22197 -44936 -29293 95657 8792
2406 8792 20193 85642 55380 -13289 6491 77761 68964 19158 -56166 -21798 101182 20893
2394 20893 58268 67957 45812 188825 235103 279394 302884 258663 244324 299221 277330 167834
2382 167834 181997 227253 220356 107603 14056 -4020 -7090 45766 132864 130763 122903 50546
2370 50546 47726 126874 183032 30421 23609 32194 109904 24068 -16539 56032 58495 10727
2358 10727 75934 103884 202003 303685 266018 239234 205464 114442 5856 128287 151154
2347 151154 105546 69459 -15626 -22147 20197 3160 8699 90572 153128 113833 144040 124157
2335 124157 131998 95622 27378 1615 101996 57245 9893 -5664 44474 103625 83146 104619
2323 104619 71827 65977 79830 81561 164445 173728 93191 24947 -5635 122629 132297 115983
2311 115983 69041 82978 55799 126101 132113 128553 208742 142241 155252 85766 127481 232451
2299 232451 161734 98065 92929 96754 44104 37931 26270 53024 39902 93976 99622 100698 222107
2286 222107 147194 187122 128645 120037 96778 95449 35018 74639 130503 157698 120575 239690
2274 239690 208902 149468 154119 -20342 2935 115012 67187 82121 110391 24906 159940
2263 159940 244577 190350 68985 198209 179239 72957 134879 80111 166049 207895 226437
2252 226437 221665 272907 267620 243088 219330 224572 203330 228958 381177 352901 294894 255007
2240 255007 204419 205964 274103 234847 299661 404226 464844 473322 340661 363842 477737
2229 477737 432386 449420 479905 375818 361288 350143 390790 489764 561173 494074 519165
2218 519165 493152 442580 519910 556561 671933 678722 770319 747336 735704 704696 783924 739292
2206 739292 815404 818378 801534 807217 872179 1041792 1057424 1119905 1161273 1147759 1194052 1214467
2194 1214467 1270231 1229788 1229831 1224115 1255433 1356939 1327349 1286845 1271516 1251157 1300907 1279756
2182 1279756 1341903 1344774 1339996 1386402 1436857 1442409 1409887 1545743 1695146 1681836 1641915 1515626
2170 1515626 1457232 1556477 1656576 1831396 1817523 1860947 1955511 2083232 2178064 2195359 2288523
2159 2288523 2462874 2492708 2512454 2676561 2907147 3011886 3161984 3301821 3375931 3485095
2149 3485095 3674650 3796992 3854353 3990567 4276191 4494164 4802749 5061076 5334179 5669051
2139 5669051 6118985 6293404 6644741 7227785 7978994 8702197 9373179 10096819 10930383 11861924
2129 11861924 13030935 14498909 16307324 18741286 21746354 25332188 30106819 36026930
2121 36026930 44097888 53368375 60741368 61920787 55531395 43730531 32524010 25762972
2113 25762972 21331302 18397537 16070160 14188842 12559551 11358681 10491073 9881970
2105 9881970 9388554 9001446 8473660 7774221 6977738 6415779 5868448 5339813 4889779 4608074
2095 4608074 4402757 4328147 4235907 4081654 3877418 3738604 3497618 3260017 3117372 3050065
2085 3050065 2910544 2710247 2589698 2527012 2283085 2203909 2085110 1964287 1789937 1730834
2075 1730834 1708981 1691607 1606966 1523047 1586159 1670763 1605219 1475954 1349473 1331396 1333963
2064 1333963 1293131 1198821 1146217 1052416 1071473 1100599 1075519 1201220 1099669 1058104 978450
2053 978450 1024531 1079271 939087 905666 911191 877574 894319 747023 781949 861676 887502
2042 887502 738800 659241 747192 796724 739086 811008 738228 701513 695864 642162 653850 696658
2030 696658 612507 610426 650306 657096 768705 682479 530270 496944 547249 576003 521482 475283
2018 475283 470144 497867 364112 410650 430512 394782 290797 276007 219793 318406 382627
2007 382627 337357 315978 378040 302243 391267 420002 341496 360323 246022 342751 322229
1996 322229 345556 281903 188656 199472 348330 344377 325637 286362 265956 257826 258913 249638
1984 249638 279305 226493 196947 164356 166069 114365 154636 253479 262870 326079 320139 249779
1972 249779 219943 194137 161914 205896 184095 140337 103601 151640 83431 98437 74886 93134
1960 93134 143604 156309 179590 75185 127837 148732 80735 120660 205709 181566 142650 172179
1948 172179 183793 178000 166034 178781 96716 160511 249293 144628 117828 42993 110659 101356
1936 101356 29447 19402 21905 14271 119979 188861 144229 112799 92759 68187 42223 112446
1924 112446 208522 145950 56986 188616 252765 168896 154442 103667 93771 75930 114812 175555
1912 175555 128777 12921 5984 69446 -27982 79470 107758 52086 9459 94375 42515
1901 42515 -77957 -56454 -57713 10463 -45101 -67821 51570 59269 3156 20185 -38172 48443
1889 48443 38329 11985 23959 124923 141850 43991 33845 22639 11082 -116843 42388
1878 42388 56730 -11802 -35935 -46080 43504 58296 41273 15037 156905 176002 84246 52896
1866 52896 44632 89628 84236 51490 113258 -10376 112440 180660 115132 183728 190528 205222
1854 205222 139445 224768 196718 223653 291865 252424 301023 269037 166367 181639 78460
1843 78460 7579 -29727 54589 157324 53314 -6489 5097 -19441 -16352 162562 141301
1832 141301 133747 104434 12524 -63164 -99555 -20981 72786 82356 39048 -11689 -77257 -87583
1820 -87583 -121865 -34278 23170 3343 -19970 -14745 87808 73517 88875 96095 142304 59411
1808 59411 -65510 11456 5348 -10933 41317 3259 -40749 32968 27978 16191 80539 39021
1796 39021 18002 51754 -6994 72780 149313 -16765 -109891 -59795 -69445 -85762 8947 86220
1784 86220 -54269 -77191 12028 128723 87129 -13944 -15688 -21065 -31113 90811 63399
1773 63399 -21592 -25920 -5132 -99030 -66047 9936 -14910 -21511 -83499 -110384 -78789 -190100
1761 -190100 -46305 10601 -32003 -107834 6654 65947 26365 14859 -104245 -59961 -67530
1750 -67530 -2794 91552 89903 23684 83119 207439 141820 20507 101573 3640 25011 -15758
1738 -15758 94053 95254 121249 106493 94107 4837 31678 54510 43079 72537 5969 -24634
1726 -24634 46531 11234 53598 78375 -63583 -58452 -40953 83717 7786 -116761 -125001 -73884
1714 -73884 -75658 -64945 -29856 -39141 -38898 43395 46167 28959 -53443 -164647 -176988 -41736
1702 -41736 31587 -31176 -26908 -50521 -117429 -102441 -65446 -25197 26250 -25319 -59041 24238
1690 24238 -2550 -93428 -102442 -93603 -51140 83916 -7935 -77414 -29452 -33364 -112444 -206886
1678 -206886 -91569 -70610 -68910 -144158 -144090 -15285 55069 39031 100927 31591 30816 45517
1666 45517 -8404 -56638 -16505 11972 13777 45097 106786 68159 -111339 -69980 45772 42015
1654 42015 6888 -5053 -8616 29725 -69801 56672 32781 -2252 -76116 -50301 14386 11145
1642 11145 -18005 -20830 -52854 -87841 -70466 4843 -24847 -119796 -77790 -96037 -90939 -4062
1630 -4062 -72819 -28130 79490 29853 -20236 -61365 -41295 -79742 -36701 -131134 -69730 31193
1618 31193 -20629 -57455 -39095 -60290 -26298 401 20991 -5659 -7968 26858 56320 -58619
1606 -58619 -151120 -96105 -111845 -96908 -108011 -94738 -36512 34442 -20387 -138127 -164383 -226800
1594 -226800 -165326 3178 1450 -35367 -82004 -196467 -54331 74334 26217 2878 93814
1583 93814 108934 -63724 -206290 -110658 -71456 -8278 -1688 64948 -108 -53758 25346 8720
1571 8720 10171 7987 44510 -56339 -90697 -107111 -39341 -33499 -77498 -101274 -78786 -6628
1559 -6628 40543 66432 116734 46844 -29028 -23335 7095 -60489 -33195 -131046 -106221 -113307
1547 -113307 -5379 57229 -16638 -15286 -24943 -42266 -43397 -20885 -31273 -65999 -63609 -98282
1535 -98282 -72282 -105619 -59411 -38351 -65611 37202 -42972 -64770 -33396 -120093 -153233 -32776
1523 -32776 -92914 -97535 -148971 -126368 -62471 8930 72947 58238 3870 -8541 -33651 -73885
1511 -73885 -3683 14754 44123 17617 -6410 -31662 -37862 -64633 -58267 -66976 -48453 -42867 -19772
1498 -19772 -42881 94896 162509 -51800 -26044 -49843 -6630 -53 -13770 20555 -64153 -81877
1486 -81877 -41680 11099 55501 78033 -15020 -32038 -4636 -111210 59190 -70500 -120661
1475 -120661 -41389 -135620 -78069 -19219 19450 -7700 -81569 -46578 -81170 -42565 -25409 30330
1463 30330 -13264 -45562 -32401 -45912 -86053 -23953 67259 -10616 -75267 -54443 -35540 -28126
1451 -28126 32432 -83498 -51293 91690 27863 -31475 -27000 -36381 -92342 -85707 -11043 -103210
1439 -103210 -147336 -22638 -28820 19379 21299 46970 18585 8916 82771 55332 140916 108782
1427 108782 48153 37680 -65637 -148188 -74137 -26852 -6626 -92897 -127763 -84098 -74672 -109681
1415 -109681 -35715 -50214 -15158 -12534 -58991 -19864 17947 34857 -85522 -128538 -77974 -75849
1403 -75849 -42615 -48353 -30970 35547 7052 -77295 -70002 -4503 15720 -23318 20517 -54941
1391 -54941 -38196 -97397 -116031 42636 117920 59709 -61700 -52113 -58315 -28157 31591 40030
1379 40030 -59232 -27521 20454 -11551 12103 10809 -9430 14435 37494 -45771 -85171 -69315
1367 -69315 -50969 -90879 -135949 -80747 -55716 -54397 4890 -996 -20554 -120270 -112108 -58815
1355 -58815 -101213 -57398 -18252 -42646 -96455 -101745 -71749 -38689 44861 48970 -104426 -169038
1343 -169038 -58616 70792 49704 -10698 -8776 50030 58454 118250 128210 116664 107103 33385
1331 33385 -86015 -64018 -67376 43282 50636 47833 64708 -41499 -70049 -55902 -384 -25347
1319 -25347 -82365 -86549 -43341 -10432 -18692 -78196 -29706 -15538 -32135 20663 68806 18136
1307 18136 40416 40040 -14223 40093 -32286 -103659 4115 887 52391 -14349 -15293 75947 121650
1294 121650 57512 -87839 -29255 47598 -42254 -108452 -14914 -56651 -77262 4067 -37396
1283 -37396 13706 -27611 -96741 -125450 -25509 89873 157962 140163 -30626 24908 89562
1272 89562 36789 -8478 -3300 39568 42493 -52401 -16387 -21417 39826 106096 24405 47100
1260 47100 41022 -89665 -96531 -66443 -61990 45420 72178 -30011 -160511 -125050 -63220 -129713
1248 -129713 -102731 -98401 35292 38471 -18559 59866 44965 -84810 -23925 36454 48792 124136
1236 124136 -15474 -106041 -32695 50544 90459 51105 7686 -23942 43252 26508 17347 -83534
1224 -83534 -157636 -50751 -61449 -75598 2293 48011 13032 41561 -5001 -13758 -60613 -15808
1212 -15808 3626 -90597 -42673 -52096 -11190 -4485 -35952 5005 17566 -39046 -4991 -57076
1200 -57076 -40984 43174 1120 -117005 -37408 -38136 22548 -16119 -50337 -57182 -60080 -100045
1188 -100045 257 79059 -24572 53265 -16994 -1073 -30055 23519 -46495 -54065 -58284 -81330
1176 -81330 -1464 23051 36563 -43258 -20170 111193 15561 5731 31927 135799 34582
1165 34582 -67552 -71904 -45912 -35619 68263 47001 31679 89451 103791 33673 16403 16321
1153 16321 97384 100503 7178 32074 -33138 -72440 65356 104636 104872 70662 -18860 2769
1141 2769 -71497 -50373 16489 -18742 11046 34392 45614 26321 -39705 24830 -8380 -48798
1129 -48798 -18716 -16603 7967 31153 -63818 -63721 -104130 10703 96495 -29107 -34970 -23530
1117 -23530 -102385 -13591 -7737 70362 77975 8230 -11561 19210 -69844 -53815 13761 -12848
1105 -12848 77969 61920 56572 -11256 -39800 -68739 -131874 -130984 -29705 9547 57198 -11034
1093 -11034 -39948 -64074 -41014 -32777 -140363 -80289 92571 -29783 -49493 -75072 -136365
1082 -136365 -35338 -38456 102076 17264 -26531 -103611 11690 153022 35193 44600 -39482
1071 -39482 -52113 -17325 -123568 -16666 16783 34809 -12256 24668 76483 83456 38382 4227
1059 4227 46540 65396 69753 -19630 -6838 -70933 -54566 -91534 8379 91291 30448 -21710
1047 -21710 -55713 23163 56732 -2211 16810 -163739 -141788 29189 33139 -65779 -54068 53656
1035 53656 108686 92289 62418 78307 114557 66646 -51998 -43540 29186 1262 6143 136942
1023 136942 132494 83758 52761 133585 -4212 -58300 -77287 -83298 -66621 -94040 -112998 -8246
1011 -8246 -19828 42896 64335 62043 21186 -32399 -42477 -139139 5558 89446 24766 -38010
999 -38010 -101674 -71979 -9774 46091 31872 -5473 -27824 -74555 20901 -105566 -161307 -87601
987 -87601 -10914 12638 -81672 -6187 76696 125337 -15990 -39949 -34718 -32242 -37616 29148
975 29148 -1825 2919 49279 -11419 -54784 -82429 -9290 22106 -52719 -67633 -17883 4212
963 4212 45989 50215 107595 53470 3208 48033 162153 -59103 -81604 -44980 -66722 15830
951 15830 35803 -57772 -19595 -22190 -43190 -46547 -89804 -57871 -39571 -12453 41459 2195
939 2195 79555 54379 74387 97694 -28985 -31750 63248 51693 15837 -17399 8535 -61021
927 -61021 -96281 10132 35542 70496 -11693 49138 63314 122218 176600 148512 64631 -13366
915 -13366 -72494 -58860 -67442 31299 42451 27196 108330 73306 9861 60885 91261 4925
903 4925 19019 5870 120602 154644 36680 78530 139567 64725 9430 2533 -23908 -32499
891 -32499 59483 59822 70903 -29989 -58811 -31976 21632 38785 59879 102938 -85151 -37378
879 -37378 -12604 1959 45051 -12745 -57953 -37944 -34512 -20362 7792 -70398 -63260 -13354
867 -13354 15447 42940 -24553 11846 57729 -854 -44501 -90637 -36426 -48857 -109926 -8976
855 -8976 6945 8770 53413 3110 30117 -8601 -59719 62271 64377 57098 -8016 -15134 13296
842 13296 -64223 -54899 -16324 8702 -55532 -46748 31417 33760 -44810 -42668 10075 -33312 -54063
829 -54063 13196 49991 45604 56770 -42878 -67269 29099 47157 -23583 -18016 -14417 4962 43179
816 43179 34057 -51609 -40976 -32473 -32545 55934 -89076 -101320 59984 4559 115183 94378
804 94378 75949 164637 98292 65102 -39857 20040 84166 74936 43158 -6093 61300 84587
792 84587 175630 91041 66088 -11707 -22640 34798 50119 -86778 -23236 77565 94923 96718
780 96718 54687 83588 16728 -60379 -71961 -43081 -67280 -55766 4777 -6860 -55182 66510
768 66510 38262 -53991 -80888 -4294 -53307 -148501 -58920 -40870 -88873 -26434 -81137 -135439
756 -135439 -171054 -59129 -25854 -18494 -74582 -183323 -57299 -110708 -92696 18536 -29111
745 -29111 -70571 -42787 -39020 38260 40367 -44412 13537 54220 37852 -11134 17136 9231 63325
732 63325 13656 -5142 -22623 3972 -88849 -60381 14298 28787 6530 41327 51448 -11008
720 -11008 12909 14164 -56540 -104158 -63458 12553 -16343 -101429 -123172 -125275 -72312 -59880
708 -59880 -87462 -10887 80914 3114 -35010 50178 -41070 -120930 -27598 26479 -52481 -20166
696 -20166 -76758 -5614 12826 -28860 65367 -56841 -85648 -151436 -78030 1287 -12614 41726
684 41726 76921 30862 -23107 -109093 -13704 48336 58414 76706 -38383 -180012 -125259 -33739
672 -33739 -11960 -26769 92009 5872 -36439 46559 -207 -53458 -404 112229 106345 67942
660 67942 29691 62158 134059 23869 16188 19601 -138196 -170285 -67780 -39671 41248 55988
648 55988 -29705 -30186 -39342 2993 8077 -28948 17918 60561 139609 73624 10722 3447 -105468
635 -105468 -70611 12903 -3367 -65147 -76162 -15824 23893 -54714 -21137 21616 43673 -63350
623 -63350 11828 42212 53484 44195 7017 45026 59221 46249 -72746 -76345 33606 -48800
611 -48800 -104739 -65621 -44376 30978 -5688 20885 58743 71649 15702 -59665 160764 110954
599 110954 88270 75872 -14214 -3905 49377 42026 -104756 -44852 -6355 4363 -9912 -59430
587 -59430 -37750 29207 22847 -2237 99 73781 2374 -1739 35510 -14251 -30964 -16532 15285
574 15285 25463 19748 110868 119803 -42547 -28958 88250 97010 85913 53090 15760 -109839
562 -109839 -12148 86114 -11477 33964 85384 23664 -60404 -2353 -11177 -73168 31948 -20369
550 -20369 39621 124009 33452 45711 50959 4066 88726 83229 50435 1157 -55934 56925
538 56925 40169 26369 107106 69515 34740 13015 65408 -26219 28960 98406 64702 1398
526 1398 50284 44568 -81450 -157018 -21246 23514 11347 77268 7758 23995 34597 -21958
514 -21958 -42771 62723 43015 97108 111763 39160 61401 57665 -6757 -69118 -20174 82004
502 82004 21417 77433 38453 53249 82076 -28295 -54034 -98114 -98550 -57103 -174942 -145434
490 -145434 -21355 16622 -41982 -133015 -38223 79124 -40985 56379 52599 143783 53083
479 53083 -35180 28467 -8421 12513 -12863 5458 -20615 -114877 -54778 -66523 -55393 -33220
467 -33220 1368 -29931 -18354 39922 70176 36083 91902 91367 -39722 -82465 -62096 -141178
455 -141178 -94117 45410 69665 -19979 11056 62226 -56004 -50081 -126799 -96939 -18808 18879
443 18879 40305 93823 99957 28088 -61948 45938 64483 -9912 -5201 -56014 -4870 140075
431 140075 107532 63908 35298 46000 -55380 17330 -7135 -2313 -88222 -48063 86202 124393
419 124393 86256 4331 110062 26356 -19966 49761 107893 179475 22715 -106696 -68421
408 -68421 -15021 71494 151617 69718 -86101 -65252 -52670 -68447 -39630 5070 88849 80119
396 80119 -56762 -150988 -8618 143478 64518 -92169 -79701 -14827 14303 23696 -17718
385 -17718 -27462 4976 56531 30068 103357 117273 20012 -8338 13409 1120 -13477 -55545
373 -55545 -75035 51323 -47096 -91289 -40289 6323 73497 148795 131495 37285 85751 81672
361 81672 48226 -116575 -118883 -58144 11718 83981 60712 88168 78314 -13365 -94347 114972
349 114972 137804 14836 -73647 -37184 55109 86468 49865 40639 -8828 -10722 6899 24225
337 24225 58017 39428 85501 52107 -26753 -46437 -69036 -138235 -86944 -37328 7685 86846
325 86846 -23529 42093 130548 58513 -89400 -143118 -133545 -105048 15103 45488 -44488 2127
313 2127 78134 44144 21467 -88812 -2778 -5270 30737 143885 4828 -48204 18065 -30297
301 -30297 -68979 -91762 -77464 17256 91193 18333 89192 75563 55584 -89596 -24477 -33728
289 -33728 -43132 -4711 -71118 -20114 -30893 39873 123744 100035 42811 92870 164309 41751
277 41751 45004 109989 58840 71293 64332 26517 23380 -42655 31800 -19628 47559 54174 -73827
264 -73827 -32316 -11498 -34271 -59000 -33000 69187 44092 -28211 44883 -9127 21710 -29473
252 -29473 40784 112182 53757 52134 50152 -38235 -44668 -109743 -129513 -76101 23909 122664
240 122664 35208 85893 65349 93268 45252 -41318 -9500 48300 102764 65357 -18957 -58594
228 -58594 -25870 -18059 -18197 -36025 21004 7031 -25600 24581 -28447 -35286 13145 34816 25119
215 25119 -97457 -46338 -14781 -4897 -80641 51659 128093 70886 91280 35582 18304 -69077
203 -69077 -60845 30469 141168 134634 38078 11826 -93279 -94838 -101126 -62872 95913 76194
191 76194 62154 -11136 -91138 -30973 -37855 88643 72502 -16824 -55772 -4845 64068 -12891
179 -12891 -51195 52674 -63587 -44076 119329 57882 28891 -6129 -7298 -61258 65847
168 65847 86013 14904 -14698 -1645 52421 -6929 -22979 9672 41553 13047 107644 55693
156 55693 -21472 -54104 -83575 -57616 -620 49277 24742 55409 64961 80563 69919 140877
144 140877 158521 35487 28831 89473 92389 131546 90567 23969 36022 82320 64446 26988
132 26988 63450 46683 52184 91453 13668 -7457 39996 61761 76304 -29911 -71617 31232
120 31232 -14137 27981 20894 -3206 -7224 10382 4264 -30631 93620 6490 -65288 44029
108 44029 92357 -15239 -26610 5382 24951 19595 64226 55350 39955 -11191 -44365 100599
96 100599 64440 35276 23840 -8448 39967 -14824 2159 7136 -69358 -58128 336 -54976
84 -54976 -74137 -44528 -13416 -12126 45473 70576 71115 29085 71160 49094 36284 42523 14998
71 14998 -5979 -32523 19609 -25976 27791 79115 90315 46085 71354 48154 59505 -27081
59 -27081 -16536 20901 18770 -7239 -8470 -10218 -28139 -58987 79520 59904 35409 -15261 -45588
46 -45588 -60288 -4114 11089 -24733 16958 64009 107333 128314 130023 83599 -19488 -52141
34 -52141 -11770 -49309 -23802 58151 128784 110034 118678 115628 23518 7985 -5547 -87753 -78360
21 -78360 899 -2922 -12103 56323 34978 3293 12332 20522 7869 -7531 -1414 21182 8926
8 8926 82163 34132 24258 37000 57395 74787 54859 70746
0 70746
$$ Imaginary data points
##PAGE= N=2
##DATA TABLE= (X++(I..I)), XYDATA
16383 -1036940 -1028497 -1015944 -1015144 -920934 -910668 -1030188 -996856 -868287 -852513 -893923 -887269 -881378
16371 -881378 -770886 -651207 -659234 -688861 -669237 -731369 -725836 -686880 -664486 -631275 -624734 -589362
16359 -589362 -514555 -532109 -511681 -504093 -461399 -401499 -362706 -362451 -363537 -340747 -303118 -276826
16347 -276826 -249131 -275882 -315147 -299511 -365627 -309440 -267323 -274237 -283696 -241530 -180475 -89571
16335 -89571 -89141 -147463 -110642 -91936 -160523 -138068 -1371 65547 96772 111000 84000 98621
16323 98621 26561 64264 50145 75563 182539 158318 141542 255576 298084 361200 308683
16312 308683 333314 329374 434902 425581 400842 402226 480527 512588 431648 427237 414740 453059
16300 453059 393788 468626 498675 547219 570598 534785 568535 549436 550747 580195 614894 699825
16288 699825 671130 693421 730820 751975 683751 675359 700173 699593 690675 753336 791751 779087
16276 779087 842942 908264 878832 852265 914861 928200 925280 917488 943165 923024 865373 942120
16264 942120 988024 953217 1035446 1057062 1114600 1129271 1044929 1056232 1087148 1098596 1083486
16253 1083486 1071585 1120899 1188429 1152246 1107420 1183321 1142650 1225051 1267978 1206260 1185921
16242 1185921 1230827 1217128 1284430 1277139 1259878 1319605 1294459 1359403 1363887 1346777 1297429 1226441
16230 1226441 1220820 1254636 1291579 1351962 1372642 1458158 1443978 1330074 1351521 1445566 1499621
16219 1499621 1527834 1473207 1442353 1500610 1418166 1441023 1515871 1618255 1627699 1489525 1469457
16208 1469457 1433562 1543913 1503199 1532124 1578041 1557357 1482390 1520184 1614007 1721844 1811145
16197 1811145 1753868 1642948 1678552 1679288 1689692 1699110 1602960 1668092 1749623 1815923 1797199 1761389
16185 1761389 1823648 1772873 1801599 1636125 1725380 1762010 1684999 1745597 1661911 1666239 1752824
16174 1752824 1768716 1718074 1773387 1849008 1883574 1905796 1870061 1903482 1883903 1813244 1916665
16163 1916665 1940278 1912168 1836683 1870837 1837391 1853559 1784219 1711410 1790614 1761099 1887809
16152 1887809 1955513 1881425 1931451 1940530 2005862 1987026 1978733 1903939 1879146 1901482 1868382 1821455
16140 1821455 1945378 1878361 1850701 1860386 1868114 1943155 1898048 1965949 1966811 1898165 1872803 1977038
16128 1977038 1925276 1739977 1770530 1929056 1960189 1904819 1899728 1964124 2031744 2028360 2037714
16117 2037714 1947853 1956178 1991158 2001620 1999933 1991884 1974181 1998194 1937947 1934317 1974482 2055026
16105 2055026 2005634 2062394 2008081 1908779 1952488 1972625 1948110 1955049 2063951 2047622 1911988
16094 1911988 1872346 1978967 1949296 1962769 1993698 2070599 2011703 1940393 1893337 1929753 2049601
16083 2049601 2105268 2085680 2094447 2081834 2039298 1994697 1987915 2012042 2137985 2115004 2050969
16072 2050969 1978987 1986427 1942942 1934358 1994701 1972257 1869551 2037078 2056087 2022480 2043763
16061 2043763 2096346 2088617 2010948 1901777 1924273 1908820 1957009 1992339 1982940 1971947 1965763 1928892
16049 1928892 1895418 2022413 2028015 2075349 2074632 2071850 2050692 2087140 2028100 2051062 2011375 2006187
16037 2006187 2078181 2119454 2098487 1990813 2077637 2179831 2166672 2090603 2020311 1976135 2016950
16026 2016950 2079929 2021151 1988596 2068705 2127826 2124137 2099025 2080673 2107818 2161879 2203615
16015 2203615 2174499 2162954 2002666 2113484 2141436 2100077 2087203 2095805 2179797 2176480 2147139
16004 2147139 2035605 2113296 2118071 2082078 2087595 2060544 1987567 2042605 2214658 2050916 2032060
15993 2032060 2041159 1952763 2062121 2162581 2134168 2018743 1909460 2067300 2138746 2214991
15983 2214991 2158832 2078132 2085591 2115099 2100951 2044534 2107198 2086184 2101908 2082744 2013285
15972 2013285 2053211 2048268 2003981 1993491 2025986 2057654 2131150 2140600 2149789 2121596 2089378 2102341
15960 2102341 2094719 2086491 2123204 2120610 2079638 2146116 2103897 2075869 2008384 2013682 2086803 2203949
15948 2203949 2178363 2239609 2226183 2116142 2173593 2107340 2071991 2086720 2142946 2035625 2052132
15937 2052132 2043565 2009121 2088880 2076210 2084632 2042099 2048453 2044825 2026003 2018453 2185201 2111987
15925 2111987 2029502 2043674 2077557 2058942 1971462 2077233 2078602 2091341 2190712 2182795 2203304
15914 2203304 2146650 2167295 2094536 2112434 2096842 2113631 2109645 2056591 2019819 2008534 2074208
15903 2074208 2105421 2166732 2164650 2119322 2152976 2180562 2117067 2128742 2201406 2125970 2018055
15892 2018055 2071636 2030386 2054193 2008202 2001215 2016037 2100072 2146426 2142343 2016355 2033976
15881 2033976 2056684 2008265 2085436 2097258 2099496 2063236 2052557 2143868 2090625 2001713 2012115
15870 2012115 2116997 2154060 2075978 2124478 2181211 2137750 2101904 2097802 2073518 2071269 2131812
15859 2131812 2156525 2078456 2051223 2148944 2172216 2090564 2143641 2206281 2213275 2107507 2062207
15848 2062207 2130315 2148492 2067672 2123274 2151882 2151965 2125751 2135710 2149778 2181405 2120784 2152595
15836 2152595 2147090 2094794 2121204 2131726 2164277 2120261 2032272 2064348 2131106 2089515 2071830
15825 2071830 2145184 2130367 2115610 2089947 2076739 2058109 2129735 2061701 1993641 2066529 1981898
15814 1981898 2028766 2089801 2148624 2231455 2135545 2048756 2073354 2104481 2120060 2079334 2098393
15803 2098393 2019202 2034186 2143630 2077700 2086285 2206757 2178414 2149774 2190077 2184458 2184263 2165187
15791 2165187 2037931 1974627 2019431 2040657 2052038 2065387 2040773 2079092 2135010 2083726 2096159
15780 2096159 2084797 2042646 2017022 1915802 2076957 2115969 1993406 1967648 2004989 2025217 2039799
15769 2039799 2005041 2087875 1968872 2056042 2056753 2005075 2079911 2004953 2044228 2198380 2139210
15758 2139210 2131606 2247269 2204997 2144256 2100985 2087321 2072596 2142400 2247466 2232757 2111851
15747 2111851 2078255 2063502 1974170 1996911 1995830 1997512 2062171 2107452 2149735 2126952 2112210 2149765
15735 2149765 2147548 2124399 2051392 2038235 2035106 2173234 2119991 2085775 2058148 2128588 2147124
15724 2147124 2144656 2145662 2093732 2017824 1955436 2126947 2221009 2253316 2139290 2118762 2079539
15713 2079539 2104324 2148162 2139164 2198690 2248021 2208585 2204736 2164091 2108049 2104665 2211523 2065362
15701 2065362 2080608 2127721 2207193 2091553 2136259 2175192 2156754 2085949 2086745 2130649 2090226
15690 2090226 2017610 1987585 1991743 2022620 2068122 2112926 2080586 2036476 2052863 2132657 2190124
15679 2190124 2132522 2172820 2139688 2214284 2180423 2068630 2060637 2120207 2167400 2200674 2147811
15668 2147811 2097971 2148853 2247027 2129993 2202948 2256212 2092479 2103747 2070379 1985527 1963210
15657 1963210 2109358 2279582 2300196 2158554 2108282 2106824 2046068 2131670 2167149 2163294 1981499
15646 1981499 2074551 2147814 2159994 2242119 2124621 2224755 2143286 2182258 2179292 2068061 2014274
15635 2014274 2078692 2113842 2042716 2048076 2034170 2060158 2114431 2152366 2151352 2050243 2147888
15624 2147888 2143051 2176200 2236356 2196185 2120256 2186293 2119237 2099253 2072051 2048882 2046612 2065330
15612 2065330 2183370 2177563 2203538 2139734 2083135 2052252 2045422 2004436 2070062 2085617 2094679 2252047
15600 2252047 2233392 2116982 2200955 2221168 2219350 2219425 2314491 2279231 2142116 1998332 2042280
15589 2042280 2074607 2168211 2106328 2137765 2114441 2032811 2080990 2133518 2055998 2192826 2214534
15578 2214534 2191106 2130905 2113117 2224078 2271288 2350004 2301084 2223472 2187363 2193090 2205319
15567 2205319 2209839 2196749 2223147 2191690 2090145 2009768 2005403 2094081 2257456 2287277 2287921 2209381
15555 2209381 2130312 2246635 2173659 2172436 2128738 2179812 2096273 2109061 2096140 2122656 2251065
15544 2251065 2292806 2187926 2111382 2138346 2137928 2164887 2166857 2239256 2145581 2127755 2137603 2223438
15532 2223438 2209672 2124003 2080724 2086962 2133454 2200911 2145206 2065491 2160124 2221927 2088923
15521 2088923 2132477 2214558 2232304 2177569 2144233 2119675 2140962 2117629 2098046 2260944 2256528
15510 2256528 2211122 2216531 2105917 2067218 2133723 2225126 2224462 2242624 2164402 2188771 2134240 2080378
15498 2080378 2189994 2244744 2090379 2133434 2196097 2203702 2158807 2138182 2239385 2255887 2246685
15487 2246685 2267904 2190404 2231225 2188326 2268236 2242449 2104508 2190917 2203996 2254534 2289500
15476 2289500 2199791 2120637 2216091 2160780 2167235 2239951 2231690 2254913 2163376 2095836 2155927 2238276
15464 2238276 2183876 2296442 2295257 2244621 2212216 2259622 2384637 2277958 2213124 2125590 2175774
15453 2175774 2213032 2097761 2167448 2181005 2277017 2251616 2251976 2214539 2144981 2207702 2215884 2273100
15441 2273100 2265593 2185768 2205218 2210156 2175186 2164458 2066629 2084479 2202491 2233633 2114272
15430 2114272 2082427 2114657 2159275 2181151 2162443 2070403 2123849 2180199 2157272 2146927 2209150
15419 2209150 2203559 2353533 2394747 2281526 2146094 2183609 2187245 2098902 2150370 2280610 2257164
15408 2257164 2146666 2117083 2147549 2140830 2225884 2197921 2181887 2131270 2131219 2187257 2272371 2232675
15396 2232675 2158075 2202490 2160078 2188560 2214347 2323804 2272167 2260703 2275072 2237007 2290477
15385 2290477 2216508 2262039 2200386 2180183 2128112 2194153 2238399 2209284 2197377 2291624 2274762
15374 2274762 2285599 2221033 2250658 2311698 2303477 2224900 2196962 2315097 2287283 2171785 2159807
15363 2159807 2204579 2204587 2277291 2165571 2174554 2186631 2205185 2238767 2150530 2184353 2268949 2117692
15351 2117692 2137275 2189439 2211766 2200631 2223822 2232384 2328507 2266681 2223641 2231097 2206881 2187433
15339 2187433 2197960 2255806 2294490 2275590 2275363 2188419 2109749 2189161 2252265 2185046 2185036 2200622
15327 2200622 2296219 2159297 2225484 2159801 2137837 2175015 2174286 2144985 2187611 2171346 2234498
15316 2234498 2189083 2144042 2244412 2148492 2193872 2189209 2222109 2239925 2233033 2238723 2248537 2088495
15304 2088495 2187458 2264010 2263300 2307166 2247110 2186044 2226362 2303779 2302837 2263710 2176224 2160409
15292 2160409 2187234 2305912 2198978 2192577 2256191 2191443 2211300 2172354 2213715 2255317 2191362
15281 2191362 2153277 2212903 2235914 2229140 2199527 2263393 2231538 2329521 2333109 2284017 2242090 2264409
15269 2264409 2273896 2230825 2144760 2191469 2162898 2261772 2275937 2313829 2258670 2248700 2289685 2143406
15257 2143406 2252569 2269431 2206643 2227476 2286579 2281628 2176528 2085303 2134718 2170336 2261484
15246 2261484 2269822 2147999 2129826 2220620 2229493 2216515 2211302 2259370 2270330 2192347 2192785 2269188
15234 2269188 2382846 2383088 2240614 2324507 2296135 2189933 2165105 2114788 2120630 2122631 2200348
15223 2200348 2232405 2264170 2236718 2267712 2248883 2259353 2236243 2265659 2291887 2278241 2234593
15212 2234593 2240418 2173032 2245386 2258548 2285386 2247839 2227359 2210630 2226764 2276256 2333665
15201 2333665 2333047 2283350 2242201 2247370 2264245 2173993 2222360 2229832 2260634 2164344 2202614 2151165
15189 2151165 2237164 2276212 2302885 2253076 2207238 2274671 2304336 2204300 2220171 2329965 2279631
15178 2279631 2132600 2137362 2204193 2296222 2248483 2257197 2260530 2301443 2352051 2369908 2464224 2362517
15166 2362517 2188147 2217307 2231679 2225444 2271285 2221164 2287279 2334202 2265279 2270027 2274590 2250527
15154 2250527 2238285 2287089 2212513 2251175 2281406 2204570 2254910 2284728 2242348 2254162 2305639
15143 2305639 2234899 2229980 2276773 2252905 2135788 2164110 2136188 2156864 2322677 2370668 2433140
15132 2433140 2368538 2372553 2427442 2478201 2456535 2412421 2340981 2317484 2325409 2322234 2344695 2348177
15120 2348177 2297464 2415258 2360591 2303566 2314329 2291926 2381067 2383677 2297646 2209879 2232526
15109 2232526 2317582 2344427 2345730 2308543 2237450 2264303 2268559 2287947 2192260 2264282 2189113 2216714
15097 2216714 2255077 2252348 2245482 2300027 2240400 2172315 2320966 2333044 2417439 2417838 2261326 2277372
15085 2277372 2265524 2272793 2208559 2219376 2196079 2223500 2283951 2299781 2312137 2313352 2226857 2278970
15073 2278970 2313556 2353651 2306956 2317288 2314881 2347964 2290512 2288999 2287908 2368576 2425018 2339009
15061 2339009 2328846 2367775 2436144 2440378 2454620 2400567 2390934 2360848 2365200 2343919 2272301 2195411
15049 2195411 2273104 2314209 2264140 2227891 2235013 2235386 2214539 2320650 2287210 2316886 2343612 2191297
15037 2191297 2277357 2223294 2283603 2286161 2229870 2259678 2330215 2361374 2438939 2382093 2352815
$$ [...]
##END NTUPLES=NMR SPECTRUM
##END=
