##TITLE=1H_EC-3264(6-2)
 CDCl3
 8 sc, 
 7.12.2021
##JCAMPDX= 6.0         $$ Bruker NMR JCAMP-DX V2.0
##DATA TYPE= NMR SPECTRUM
##DATA CLASS= NTUPLES
##ORIGIN= UXNMR, Bruker Analytische Messtechnik GmbH
##OWNER= root
$$ XWIN-NMR		Version 3.5
$$ Tue Dec  7 11:11:55 2021 Russian Standard Time (UT+4h)  she@DPX200
##.OBSERVE FREQUENCY= 200.131346
##.OBSERVE NUCLEUS= ^1H
##.ACQUISITION MODE= SIMULTANEOUS
##.ACQUISITION SCHEME= undefined
##.AVERAGES= 8
##.DIGITISER RES= 18
##SPECTROMETER/DATA SYSTEM= spect
##.PULSE SEQUENCE= zg30
##.SOLVENT NAME= CDCl3
##.SHIFT REFERENCE= (INTERNAL, CDCl3, 0, 15.7205)
##AUDIT TRAIL= $$ (NUMBER, WHEN, WHO, WHERE, WHAT)
$$ ##TITLE= Audit trail, XWIN-NMR		Version 3.5
$$ ##JCAMPDX= 5.01
$$ ##ORIGIN= Bruker BioSpin GmbH
$$ ##OWNER= she
$$ F:/spectra/data/she/nmr/H-F/1/pdata/1/auditp.txt
$$ ##AUDIT TRAIL=  $$ (NUMBER, WHEN, WHO, WHERE, WHAT)
(   1,<2021-12-07 11:10:35.89 +0400>,<she>,<DPX200>,
      <created by zg, POWCHK disabled, PULCHK disabled
       configuration hash MD5:
       00 E9 B6 7A A2 85 ED C7 34 08 36 98 17 FE 4E 26
       data hash MD5: 16K
       04 F8 93 2A C7 08 C8 3B 4E C7 6D C8 44 C2 FF EB>)
(   2,<2021-12-07 11:10:38.01 +0400>,<she>,<DPX200>,
      <Start of raw data processing
       efp BC_mod = 2 LB = 0.24 FT_mod = 6 PKNL = 1 PHC0 = -15514.91 PHC1 = 16.8008 SI = 16K 
       data hash MD5: 16K
       54 B5 B1 53 19 4C B9 A8 08 05 46 EB 82 92 37 69>)
(   3,<2021-12-07 11:10:54.82 +0400>,<she>,<DPX200>,
      <pk PHC0 = 2.870687 PHC1 = -5.799999 
       data hash MD5: 16K
       59 5D 22 9F 47 0D 7C 78 40 25 79 E4 C0 C6 B3 6A>)
(   4,<2021-12-07 11:10:57.79 +0400>,<she>,<DPX200>,
      <abs ABSG = 5 
       data hash MD5: 16K
       0C 82 2C E8 97 32 E2 85 40 9A 90 28 D9 E3 1C 38>)
$$ ##END=
$$ 
$$ hash MD5
$$ FF 7C DC 85 8A 9E A9 82 9A 93 D6 1C C2 27 A1 7A
##$RELAX= 
##$RELAX= 
##$RELAX= 
##$RELAX= 
##$RELAX= 
##$RELAX= 
$$ Bruker specific parameters
$$ --------------------------
##$DU= <F:/spectra>
##$EXPNO= 1
##$NAME= <H-F>
##$PROCNO= 1
##$TYPE= <nmr>
##$USER= <she>
##$AMP= (0..31)
100 100 100 100 100 100 100 100 100 100 100 100 100 100 100 100 100 100 
100 100 100 100 100 100 100 100 100 100 100 100 100 100 
##$AQSEQ= 0
##$AQ_mod= 1
##$AUNM= <au_zg>
##$AUTOPOS= <>
##$BF1= 200.13
##$BF2= 200.13
##$BF3= 200.13
##$BF4= 200.13
##$BF5= 200.13
##$BF6= 200.13
##$BF7= 200.13
##$BF8= 200.13
##$BYTORDA= 1
##$CFDGTYP= 0
##$CFRGTYP= 5
##$CHEMSTR= <none>
##$CNST= (0..31)
1 1 145 1 1 1 1 1 1 1 1 1 1 1 1 1 1 1 1 1 1 1 1 1 1 1 1 1 1 1 1 1 
##$CPDPRG= <>
##$CPDPRG1= <>
##$CPDPRG2= <>
##$CPDPRG3= <>
##$CPDPRG4= <mlev>
##$CPDPRG5= <mlev>
##$CPDPRG6= <mlev>
##$CPDPRG7= <mlev>
##$CPDPRG8= <mlev>
##$CPDPRGB= <>
##$CPDPRGT= <>
##$D= (0..31)
0 1.2 0 0 0 0 0 0 0 0.06 0 0.03 0 0 0 0 0.0002 0 0 0 0 0 0 0 0 0 0 0 0 
0 0 0 
##$DATE= 1638861035
##$DBL= (0..7)
120 120 120 120 120 120 120 120 
##$DBP= (0..7)
150 150 150 150 150 150 150 150 
##$DBP07= 0
##$DBPNAM0= <>
##$DBPNAM1= <>
##$DBPNAM2= <>
##$DBPNAM3= <>
##$DBPNAM4= <>
$$ [...]
##$SUBNAM2= <"">
##$SUBNAM3= <"">
##$SUBNAM4= <"">
##$SUBNAM5= <"">
##$SUBNAM6= <"">
##$SUBNAM7= <"">
##$SUBNAM8= <"">
##$SUBNAM9= <"">
##$SW= 18.0517287032376
##$SWIBOX= (0..15)
0 0 2 0 0 0 0 0 0 0 0 0 0 0 0 0 
##$SW_h= 3612.71676300578
##$TD= 16384
##$TD0= 1
##$TE= 0
##$TE2= 300
##$TE3= 300
##$TEG= 300
##$TL= (0..7)
0 120 120 120 120 120 120 120 
##$TP= (0..7)
150 150 150 150 150 150 150 150 
##$TP07= 0
##$TPNAME0= <>
##$TPNAME1= <>
##$TPNAME2= <>
##$TPNAME3= <>
##$TPNAME4= <>
##$TPNAME5= <>
##$TPNAME6= <>
##$TPNAME7= <>
##$TPOAL= (0..7)
0.5 0.5 0.5 0.5 0.5 0.5 0.5 0.5 
##$TPOFFS= (0..7)
0 0 0 0 0 0 0 0 
##$TUNHIN= 0
##$TUNHOUT= 0
##$TUNXOUT= 0
##$USERA1= <user>
##$USERA2= <user>
##$USERA3= <user>
##$USERA4= <user>
##$USERA5= <user>
##$V9= 5
##$VALIST= <valist>
##$VCLIST= <CCCCCCCCCCCCCCC>
##$VD= 0
##$VDLIST= <DDDDDDDDDDDDDDD>
##$VPLIST= <PPPPPPPPPPPPPPP>
##$VTLIST= <TTTTTTTTTTTTTTT>
##$WBST= 1024
##$WBSW= 4
##$XGAIN= (0..3)
0 0 0 0 
##$XL= 0
##$YL= 0
##$YMAX_a= 215308
##$YMIN_a= -323970
##$ZGOPTNS= <>
##$ZL1= 120
##$ZL2= 120
##$ZL3= 120
##$ZL4= 120
##$ABSF1= 15.71714
##$ABSF2= -2.334709
##$ABSG= 5
##$ABSL= 3
##$ALPHA= 0
##$AQORDER= 0
##$ASSFAC= 0
##$ASSFACI= 0
##$ASSFACX= 0
##$ASSWID= 0
##$AUNMP= <proc_1d>
##$AZFE= 0.1
##$AZFW= 0.1
##$BCFW= 0
##$BC_mod= 2
##$BYTORDP= 0
##$COROFFS= 0
##$CY= -3
##$DATMOD= 1
##$DC= 0
##$DFILT= <>
##$DTYPP= 0
##$F1P= 0
##$F2P= 0
##$FCOR= 1
##$FTSIZE= 16384
##$FT_mod= 6
##$GAMMA= 0
##$GB= 0
##$INTBC= 1
##$INTSCL= 0
##$ISEN= 128
##$LB= 0.24
##$LEV0= 0
##$LPBIN= 0
##$MAXI= 10000
##$MC2= 0
##$MEAN= 0
##$ME_mod= 0
##$MI= 1.114404
##$NCOEF= 0
##$NC_proc= -6
##$NLEV= 6
##$NOISF1= 3.799351
##$NOISF2= 2.8
##$NSP= 0
##$NTH_PI= 0
##$NZP= 0
##$OFFSET= 15.72045
##$PC= 1
##$PHC0= -15512.04
##$PHC1= 11.0008
##$PH_mod= 1
##$PKNL= yes
##$PPARMOD= 0
##$PSCAL= 0
##$PSIGN= 0
##$REVERSE= no
##$SF= 200.130006225385
##$SI= 16384
##$SIGF1= 3
##$SIGF2= 2
##$SINO= 5.538805
##$SIOLD= 16384
##$SREGLST= <1H.CDCl3>
##$SSB= 0
##$STSI= 16384
##$STSR= 0
##$SW_p= 3612.71676300578
##$SYMM= 0
##$S_DEV= 0
##$TDeff= 16384
##$TDoff= 0
##$TI= <>
##$TILT= no
##$TM1= 0
##$TM2= 0
##$TOPLEV= 0
##$USERP1= <user>
##$USERP2= <user>
##$USERP3= <user>
##$USERP4= <user>
##$USERP5= <user>
##$WDW= 1
##$XDIM= 16384
##$YMAX_p= 268477844
##$YMIN_p= -409962
$$ End of Bruker specific parameters
$$ ---------------------------------
##NTUPLES= NMR SPECTRUM
##VAR_NAME=  FREQUENCY,     SPECTRUM/REAL,   SPECTRUM/IMAG
##SYMBOL=    X,             R,               I
##VAR_TYPE=  INDEPENDENT,   DEPENDENT,       DEPENDENT
##VAR_FORM=  AFFN,          ASDF,            ASDF
##VAR_DIM=   16384,         16384,           16384
##UNITS=     HZ,            ARBITRARY UNITS, ARBITRARY UNITS
##FACTOR=    0.220516191357247, 1,           1
##FIRST=     3146.13383667926, 0,            0
##LAST=      -466.582926326524, 0,           0
##MIN=       -466.582926326524, -409962,     0
##MAX=       3146.13383667926, 268477844,    0
$$ Real data points
##PAGE= N=1
##DATA TABLE= (X++(R..R)), XYDATA
$$ [...]
7229C38717J9708P9135J4234r2082o5583J34816K3971m2200j08515k3519N4330
7218C33012k7384L8150J3286M7340Q832K8235L464l2931j0154j0625J04178l4592
7206D60811k8428Q3153O1028j5970o3927k1832j6408N1506N5112p4229O1492N6786
7194F09094k7768J7319j581Q348o2236J05488m3213q9018O8355J20098K3299n2120
7182F76065L4940J55337N3185J1659O1975j17357k910P4122M8248K1687q9921
7171I27030J6228j8331n3933N6596M2555J03278O6645n8691N2897M1632L0110
7160A206016n2806k9341R4769M0280J07165R3672M0000j9754N7716P3423Q0816
7149A691956p478m1647l3230M2006J44336J4594O9803Q2994P8188P1208J17219
$$ y = [338717, 358425, 437560, 451794, 359712, 294129, 428945, 452916, 410716, 302201, 278682, 333012, 305628, 343778, 357064, 404404, 413236, 441471, 444935, 412004, 401850, 391225, 495403, 460811, 432383, 515536, 576564, 560594, 496667, 474835, 458427, 509933, 565045, 490816, 552308, 609094, 581326, 598645, 597064, 605412, 543176, 648664, 605451, 516433, 584788, 704886, 728185, 676065, 711005, 866342, 919527, 931186, 993161, 875804, 872894, 947016, 995264, 1016951, 927030, 943258, 924927, 870994, 927590, 970145, 1073423, 1140068, 1081377, 1134274, 1175906, 1206016, 1153210, 1123869, 1218638, 1258918, 1366083, 1459755, 1499755, 1480001, 1537717, 1611140, 1691956, 1684478, 1642831, 1609601, 1651607, 1795943, 1810537, 1880340, 1963334, 2041522, 2112730, 2229949]
7138B229949k3433m9585L7979N5231Q2809N7213N6998L7572R5903J14966O9485
7127B765087N3119J34235P8573M7075Q3238m566R6982J38633J17545J18185J06565
7116C734671K3230J43006N5945O6708K63780J09236Q9358R8543K72665J83355
7106E040497K46656K71229K68788L24800K97643M32001L69425M87795M36807L18443
7096H494084O49311P22223Q02573Q87683Q69745J075689J278941J432238J653767
7087A7866254K059142K282984K663871L093213L627051M197052M653513N218695
7079D5661775N988075P009220P761197P107208M147019l60967n422295r024858
7071F2866374j0145946r136184p430885n495405m050653l177973k399872j936236
$$ y = [2229949, 2206516, 2156931, 2194910, 2250141, 2332950, 2390163, 2447161, 2484733, 2580636, 2695602, 2765087, 2818206, 2952441, 3031014, 3078089, 3161327, 3156761, 3253743, 3392376, 3509921, 3628106, 3734671, 3757901, 3900907, 3956852, 4023560, 4287340, 4396576, 4485934, 4584477, 4857142, 5040497, 5287153, 5558382, 5827170, 6151970, 6449613, 6881614, 7251039, 7738834, 8175641, 8494084, 9143395, 9865618, 10668191, 11555874, 12425619, 13501308, 14780249, 16212487, 17866254, 19925396, 22208380, 24872251, 27965464, 31592515, 35789567, 40443080, 45661775, 51649850, 58659070, 66420267, 73527475, 77674494, 77313527, 71891232, 62866374, 52720428, 43584244, 36153359, 30657954, 26607301, 23429328, 21029456, 19093220]
7063A9093220j624028j266793j163239j056211r27226q73851p73680q34950o69420
7054I903822o10860n79241l68315l98268j80462k78720l74809j80069k09366j70645
7044F553067j51870l1990q2761l7743K6379k061o2546p4275Q2939r3594k54840
7033E870705r8410m5502r726o2142J20128Q9832j03103k00897k46603m34916m31192
7022D448174k73064k16923k11855j33481k13812r7285j10856j35842j54601j67173
7012B733282o7250q585N0461K0794j14061q9040R1612j8573q2794Q9143l9928
7001B565061N4365P5251p4309R6530J17009P2433J14635K12774J32433P3587k6568
6990C413201j50858j38678j71662j44898j19602k9756J07052O2869O4673J07039
$$ y = [19093220, 17469192, 16202399, 15039160, 13982949, 13055723, 12181872, 11408192, 10573242, 9903822, 9292962, 8713721, 8345406, 7947138, 7766676, 7487956, 7113147, 6933078, 6723712, 6553067, 6401197, 6369207, 6286446, 6248703, 6275082, 6273021, 6210475, 6136200, 6219139, 6125545, 5870705, 5772295, 5726793, 5717067, 5654925, 5775053, 5864885, 5761782, 5560885, 5314282, 4879366, 4448174, 4175110, 3958187, 3746332, 3612851, 3399039, 3301754, 3190898, 3055056, 2900455, 2733282, 2666032, 2657447, 2707908, 2728702, 2614641, 2525601, 2617213, 2598640, 2515846, 2604989, 2565061, 2619426, 2694677, 2620368, 2716898, 2833907, 2906340, 3020975, 3233749, 3366182, 3439769, 3413201, 3262343, 3123665, 2952003, 2807105, 2687503, 2657747, 2764799, 2827668, 2892341, 2999380]
6980B999380Q2553J4926Q4224n1483m8901O8990j77245j62808j05311n1797l9444
6969B613084j80378j09206m9818j59250n3983J4738q1490N0836L2446K1066j58915
6958A939130k8060K7736l8749j0702j46928q7329q4525K666p4499o8086K3871
6947A454525m6718j49966p9935l4055l4933n3m1969l7778j42059k9274M9909n5447
6935H52247k152J42740j71378j14008L9680J0695q2488q2207M9905k8955m2454
6924E71625p9392N2707M5223J7566Q4365m4452m5394l4017K3340j13228p7825
6913D00518m0156j6104N1970M986P2691O0707k0716J5277o7910j5636n3122m4882
6901C47623K9007N806K6271j9901k1908J04482J07273j37981p1245L8467J13811
$$ y = [2999380, 3081933, 3096859, 3181083, 3129600, 3080699, 3149689, 2972444, 2809636, 2704325, 2652528, 2613084, 2432706, 2323500, 2273682, 2114432, 2060449, 2075187, 1993697, 2044533, 2076979, 2098045, 1939130, 1911070, 1938806, 1900057, 1889355, 1742427, 1655098, 1570573, 1573239, 1498740, 1430654, 1454525, 1407807, 1257841, 1177906, 1143851, 1108918, 1108865, 1066896, 1029118, 887059, 857785, 907694, 852247, 850095, 992835, 821457, 707449, 747129, 757824, 675336, 593129, 643034, 614079, 571625, 492233, 544940, 590163, 607729, 692094, 647642, 602248, 568231, 591571, 478343, 400518, 360362, 344258, 396228, 401214, 473905, 534612, 513896, 529173, 461263, 445627, 392505, 347623, 376630, 382436, 408707, 388806, 366898, 471380, 578653, 440672, 369427, 407894, 521705]
6890E21705N8568n1926p2805j55428K3857O5226L3890N7192j37921L1246O5696
6879D39300K0143m1671M6207m9039n2820k3860q6119P5300Q4780o7241r5282J27463
6867C77161m432o7762l5088M3891P6061J0835R4374j43044r9005J04315Q4890
6856D42196k6009r9412n5166J32215J5663m8711J6051J4296N1945n1071k2616
6845C69381P372l0360N9721k055k673R8934q5776k9529j7067J5091R2118l532
6833D71625n522n1959O0623j9662o0113M6099J3807k9716l0599Q4077m8178M6039
6821D76521m4802J71192m5318j22005Q8350o8166o2479R1464l2280q7833J84480
6810E49124k5087k8056O859n5098j29241M7687M2837J4525q846O0543j57170j15144
$$ y = [521705, 580273, 528347, 455542, 300114, 323971, 389197, 423087, 480279, 342358, 373604, 439300, 459443, 417772, 463979, 414940, 362120, 338260, 252141, 327441, 412221, 344980, 249698, 377161, 372729, 304967, 269879, 313770, 389831, 400666, 495040, 351996, 252991, 357306, 442196, 416187, 316775, 261609, 393824, 409487, 360776, 376827, 391123, 443068, 391997, 369381, 376753, 346393, 406114, 404059, 401386, 500320, 414544, 385015, 367948, 383039, 475157, 471625, 466103, 414144, 474767, 455105, 394992, 441091, 454898, 425182, 394583, 478660, 430482, 476521, 431719, 602911, 557593, 435588, 523938, 455772, 393293, 484757, 452477, 364644, 549124, 524037, 495981, 502840, 447742, 318501, 366188, 409025, 423550, 414704, 475247, 318077, 202933]
6798B02933O9461J32990O1337m0775j1515L102m2449j20900J08323P1953r1227
6787C43233m5246Q0017K9586L4419m8698L9024j06069J7930M5109q6705k3092
6776B79508p2484N2703j578O6503J9276m0088j15438M8811O2468p8050n8598K9640
6764A92673l8646N907P3210j23043j0152K7392J4437J13401J7407N6568k8262
6753C00892n1299q3324m9449N9851j6937j4267P1617N6009r2185j03946K5366
6742A02328j1357M4331L3873J2463l0129L277R7943k5953j02743M1897l3587J3901
6730A46244o0231k0429Q893k3955J10808N0948k2433m3082R2934q1406n4266J2148
6718A16173N0745K5292P4218o4242m7597r8548K5783R308l5155O1096n50n2610
$$ y = [202933, 272394, 405384, 466721, 425946, 414431, 417533, 375084, 254184, 362507, 434460, 343233, 297987, 378004, 407590, 442009, 393311, 432335, 326266, 344196, 389305, 302600, 279508, 207024, 259727, 258149, 324652, 343928, 303840, 188402, 237213, 299681, 221631, 163033, 192673, 154027, 159934, 233144, 110101, 99949, 127341, 141778, 255179, 272586, 329154, 300892, 249593, 166269, 116820, 176671, 159734, 145467, 217084, 273093, 180908, 76962, 102328, 90971, 135302, 169175, 181638, 151509, 154786, 252729, 226776, 124033, 165930, 132343, 146244, 86013, 65584, 74477, 50522, 161330, 212278, 189845, 146763, 239697, 158291, 104025, 116173, 166918, 192210, 266428, 202186, 154589, 56041, 81824, 91132, 55977, 117073, 116523, 63913]
6706F3913M7840m803N7752J284o0303J2678P6851m091q239m9282Q9021J09460
6694C32081m4196L3917M9108j06487k2661M557L9849L2678Q104k1448j33219J06995
6682B79278r6092p4506J41388J31870q844J167P9521M2217K6674K0807l4244j45177
6670C64059k4800q322p2778J1346N642r459k2526p9445P463N6129J8516p7815
6658A68010L3481j0648M0268J1145r4904P0418J5126p9145p9296k381j3526J8226
6646G6774Q5079K8945k312p1460p7267m687N9173Q352j5856L6646k2502P5492
6634A76377o2266j5126P04N785p8151m9961O7176N2652o8757N6509l1350K4211
6622G7803J06389m2718m2577m4903K5978J10601k7959l3463o3198k0997j1920
$$ y = [63913, 111753, 106950, 164702, 165986, 105683, 118361, 195212, 191121, 182882, 133600, 222621, 332081, 287885, 321802, 370910, 264423, 241762, 246319, 286168, 318846, 326950, 305502, 172283, 279278, 183186, 108680, 250068, 381938, 373094, 374261, 453782, 495999, 522673, 543480, 509236, 364059, 339259, 330937, 258159, 269505, 275147, 265688, 243162, 163717, 171180, 227309, 245825, 168010, 201491, 190843, 231111, 242256, 147352, 217770, 232896, 153751, 74455, 72074, 58548, 76774, 161853, 190798, 188486, 117026, 39759, 35072, 94245, 102597, 86741, 123387, 100885, 176377, 114111, 98985, 99689, 105474, 27323, -22638, 44538, 97190, 28433, 84942, 53592, 77803, 184192, 141474, 98897, 53994, 79972, 190573, 162614, 129151, 65953, 44956, 33036]
6611C3036O558O2823l4490l2112o155J12125L1656j01162L0670j5320J36704L8808
6599B63141j19922m057n7138k8183M3853j12244l132M7916j1194J21820l4408
6588A06452N4658Q1921o0384j62654M2761K4930j7911J7544q7967o8033O5207
6577c476K251J5340R1783J2549m4462J31041m3716j76287O6654k9207r498O2020
6565G4992p6508O0804J02056J9358L1705o988q6681j05758K3725N9326L4392o3278
6553F7145o884o1968M5610J7648J8804j8484K5060j0795l2058K9688R616l078
6541H0304K0809K5482j4610J4782O1707j06280q9984J57442K1071j15020n3610
6530B093J04583m6887m9674J2079O5132m6995K2247l687l2215K9988J045J4198
$$ y = [33036, 39594, 102417, 67927, 35815, 29660, 141785, 173441, 72279, 102949, 87629, 224333, 263141, 143219, 139162, 82024, 53841, 97694, -14550, -17682, 30234, 19040, 140860, 106452, 161110, 243031, 182647, 19993, 62754, 87684, 69773, 87317, -650, -68683, -3476, -1225, 14115, 105898, 118447, 73985, 205026, 161310, -14977, 51677, 22470, 12972, 74992, -1516, 59288, 161344, 180702, 212407, 205419, 118738, 12980, 36705, 96031, 130423, 67145, 60261, -1707, 43903, 61551, 80355, 61871, 86931, 76136, 44078, 73766, 83382, 80304, 101113, 126595, 111985, 126767, 188474, 82194, -7790, 149652, 170723, 55703, 2093, 106676, 59789, 10115, 22194, 87326, 40331, 62578, 58891, 26676, 56664, 57709, 71907]
6518G1907M4516n8215j25212K8522J09901J2538r4787o8887q545J10117j22742
6507a00887M3667L3472l0676R4246q170k7815m19r56j8102O370l3663K2009J12726
6494I1802j5312j01420P8176n5828R0575J5664l6892j9689L5202o8459M9657j6919
6482D6557k3576K7592M71l3312L8215L87K5125J2686M777l7999j9738N3127k1744
6469G2568j01921j179K00692n9801n7076j7748o0436p0307J8986L2502L4163l3795
6457d3352O915J8034n6985m017J17166L6601O2853j04523r259L0531O0102j1453
6445A02613j86389L2630k5334k8900J25385M5000m5960j4042k025N29k773J14778
6433A15512R4935n3100q3381O714m9156K4970J4999j18088O7530L0759k2388n2791
$$ y = [71907, 116423, 58208, -67004, -38482, 71419, 83957, -10830, -79717, -88262, 21855, -100887, -57220, -23748, -54424, 39822, 31652, 3837, 3418, 2462, -15640, -9270, -42933, -20924, 91802, 76490, -24930, 53246, -2582, 87993, 103657, 66765, 47076, 82278, 13819, 63476, 46557, 22981, 50573, 51044, 17732, 55947, 56334, 81459, 94145, 98922, 60923, 41185, 94312, 72568, -29353, -30532, 170160, 110359, 53283, 35535, -24901, -95208, -76222, -43720, -9557, -43352, -36437, -18403, -75388, -79405, 37761, 74362, 137215, 32692, 23433, 53964, 114066, 102613, -83776, -51146, -76480, -105380, 20005, 65005, 19045, 5003, 2978, 3507, 734, 115512, 210447, 157347, 73966, 80680, 31524, 56494, 71493, -46595, 20935, 51694, 29306, -23485]
6421b3485N8331K6780n0528M4404R5990J3646p798q4983o3218L2061M0254k9998
6409E1456K1482Q459k7418P743N9899J02239p3501q3381Q741r8238M8947j6914
6397I514Q5984K6571n6715p0117p6909J21466l2636K0999J31393q8043p620j5012
6385D8875L2403P4972q6571J3384l5821m1976L0216P0355j7853N3604k6542r5564
6373A9482N0955R7758o4937M5153j9313n063N9039K5294j04829L425K687j7200
6361I2451j9670J7900n6855o458J61900p2366M0648j7735j75599N5437j82n9309
6349c9838K8080J2779j6907M1216q9607O154J01287O2383q567j14417m3330J1773
6337d8994N2653K5809j6266N8421k2504P8966N3576j35380K9712o5091N0293J8118
$$ y = [-23485, 34846, 61626, 11098, 55502, 151492, 165138, 157340, 72357, 9139, 41200, 81454, 51456, 72938, 81397, 53979, 61722, 121621, 223860, 150359, 66978, 75719, -22519, 26428, 9514, 95498, 122069, 65354, -4763, -81672, 39794, 7158, 28157, 159550, 71507, 63887, 48875, 81278, 156250, 69679, 83063, 47242, 5266, 35482, 105837, 87984, 141588, 115046, 19482, 70437, 168195, 103258, 148411, 129098, 124035, 183074, 208368, 103539, 106964, 109651, 92451, 72781, 90681, 33826, 27368, 189268, 116902, 157550, 139815, -35784, 19653, 19471, -39838, -11758, 1021, -15886, 25330, -64277, -58123, 43164, 105547, 96980, -17437, -60767, -48994, 3659, 29468, 13202, 71623, 49119, 128085, 181661, 46281, 75993, 10902, 61195, 79313]
6325G9313r678r4295J05989N2395r0813M1845P5341J5223l866o3617L9190J07609
6313B54636j40684o0009Q1809J1861j4079k0184L6900o8244p509n415P2823n6407
6301H5498k1576Q7122q8963m4518Q7140n9096R736N6263j201J10340J8510j22006
6289A17249j8196K2151L4401J1357m8147N936k180m0744J03463M7692q6328J8502
6277A65156l9752n2038P632O7661n3504K5660L0940m6438q4896J25754Q9855o9379
6265A66651n6115L0333R779K771L3640p1571q8198M5874j5633J07160O7996r8101
6253A34586J23758K6947j13347l3699l9310n532N4719J08949J49k2998l1931N3093
6241B55384k043l1298M1992p7124o1627P6205M87Q5945L6739j48039m7137j2584
$$ y = [79313, 69635, -24660, 81329, 133724, 42911, 84756, 160097, 175320, 171454, 107837, 147027, 254636, 113952, 53943, 135752, 147613, 133534, 113350, 150250, 82006, 74497, 69082, 141905, 85498, 63922, 151044, 62081, 17563, 104703, 45607, 55343, 111606, 110405, 220745, 239255, 117249, 99053, 121204, 155605, 166962, 118815, 124751, 122571, 81827, 185290, 232982, 146654, 165156, 125404, 73366, 80998, 148659, 95155, 120815, 151755, 105317, 20421, 146175, 236030, 166651, 110536, 140869, 150648, 153419, 187059, 115488, 27290, 73164, 57531, 164691, 232687, 134586, 258344, 285291, 171944, 138245, 98935, 93403, 148122, 257071, 257220, 234222, 202291, 255384, 253341, 222043, 264035, 186911, 125284, 201489, 201976, 287921, 324660, 176621, 129484, 116900]
6229A16900L9565J44358M2154r7715m7650L8319m4287j6479j4125N1125N6629
6218B68794k3378j1218M5535n8404L6984M9731r1479p1165k319n7412o667o0602
6206A8400N6565Q3506J26887k4237J0830K1137j11679P1207q6960n1588j6614
6195I7454j9378J45430J77999q0831j31014M6677N5912M2518N2893n5162r5o4798
6183B67605O9452l6628p8508J52956k327P149m7294m8363M077l352P9241q533
6171C55475l3992K36k5124O5624J29117q0573j0366J5707Q1756Q8678n8689m8604
6159D79245L5707n552K549k5894n6145L7088K1924n5650k5124P2237O4052j14183
6147D30254n2760K7519J45047N1562k5564k4054K2208j3802L6181O609L1725J5909
$$ y = [116900, 156465, 300823, 342977, 245262, 197612, 235931, 191644, 175165, 161040, 212165, 268794, 245416, 234198, 279733, 221329, 258313, 308044, 216565, 145400, 143081, 85669, 79002, 18400, 74965, 158471, 285358, 261121, 271951, 293088, 181409, 252616, 165656, 114068, 97454, 78076, 223506, 401505, 320674, 189660, 236337, 292249, 334767, 387660, 332498, 332403, 267605, 337057, 300429, 221921, 374877, 372550, 379699, 332405, 284042, 288119, 284767, 364008, 355475, 321483, 321719, 296595, 362219, 491336, 410763, 400397, 416104, 497860, 586538, 527849, 479245, 514952, 509400, 511949, 486055, 429910, 466998, 488922, 433272, 408148, 480385, 544437, 430254, 377494, 405013, 550060, 601622, 576058, 552004, 574212, 560410, 596591, 603200, 634925, 650834]
6135F50834k5699r98n5189o8592N8816P8600k7233n8700r298L6815J8792k5851
6123E72297n3574j04785N9142P0693K7739m8262k5899N1166J01411K064q3481
6112E68511k1205O2135j04799R2713O169M0638J1769k9366M6717m2342m6227J21027
6100G05740j10818p8721M9662o7356O9362o7616O3358J9025M7607p6166p1647
6089D82430p0614M2627n6546O4744K8330N7815L1328L779n5012m5514o90n6163
6077D26514l2114R0022j2467k9286l9614P5911M4320m8181j07523M0986N5034
6066D63602J2576L6634k7120l1582J7140O8221m526n3387O9236k7994o6723P0132
6054E26209K7000m8808k3475J7563n6358J53775Q585O332K2021l8297N5936K2445
$$ y = [650834, 625135, 624137, 568948, 500356, 559172, 637772, 610539, 551839, 542541, 579356, 598148, 572297, 518723, 413938, 473080, 543773, 571512, 523250, 497351, 548517, 649928, 651992, 568511, 547306, 609441, 504642, 597355, 603524, 644162, 655931, 626565, 673282, 630940, 584713, 705740, 594922, 516201, 565863, 498507, 567869, 500253, 563611, 582636, 630243, 554077, 482430, 411816, 454443, 397897, 462641, 490971, 548786, 580114, 583893, 528881, 483367, 482677, 426514, 394400, 484422, 471955, 442669, 403055, 478966, 523286, 475105, 367582, 408568, 463602, 476178, 512812, 485692, 454110, 471250, 539471, 534945, 481558, 550794, 522800, 456077, 526209, 553209, 504401, 480926, 498489, 442131, 595906, 604491, 610823, 632844, 594547, 650483, 672928]
6042F72928K4878n7973l1654m1794j2611n206P7337L7693N0229j36745L6646J15996
6030G29724l6867p8606l3605J38669k1689k8552q8761M1466J2068K8550P9196
6019G41593L9716l189R8902P2396K4574n7950j48612o9942P6141m819M4926o5497
6007G48239q4608P2992l5508l5304J37929K9834k4301J14380q9885L9101p4106
5996G98763K7422J1503J1802K8615J17741m1088R8390r586m3061N4421O1583j12523
5984A003982p0727P4587p8071J5230Q3637O2535j8273N8979j1729k7016j18589
5973I74545m2201J22505P0359k8620Q7335N0868j29069O2322N6960J0609M6649
5962A282262p3158K0156P6624j9493j01749Q2529J32937R341j14247J6053j3621
$$ y = [672928, 697806, 639833, 608179, 566385, 553774, 548568, 625905, 663598, 713827, 577082, 613728, 729724, 692857, 614251, 580646, 719315, 697626, 669074, 580313, 621779, 633847, 662397, 741593, 781309, 778120, 877022, 949418, 973992, 916042, 767430, 697488, 773629, 768810, 813736, 748239, 663631, 736623, 701115, 665811, 803740, 833574, 809273, 923653, 833768, 872869, 798763, 826185, 837688, 849490, 878105, 995846, 954758, 1053148, 1043562, 1000501, 1054922, 1116505, 1003982, 933255, 1007842, 929771, 945001, 1028638, 1091173, 1072900, 1131879, 1120150, 1093134, 974545, 932344, 1054849, 1125208, 1096588, 1183923, 1234791, 1105722, 1168044, 1225004, 1235613, 1282262, 1209104, 1229260, 1305884, 1286391, 1184642, 1267171, 1400108, 1409449, 1295202, 1311255, 1297634]
5951A297634k465K6181M4108L4051N1117j0304M1291j04346M7509Q8842J15327
5940A628945J21189m5884m0349m161n0948O2598m099J8366l2492N3053J54745
5929A860963Q0088N6059O2952N650P9559j12738N1412Q9181K3150n351O5395K0428
5917B276748J48860J22457j06522M6030J6318R7579N3336M2533N8793N6273N750
5906B818155m956J24049N852J09496P8399P5946R8809R1445R6829M5543Q7494
5895C627061J4058R1848Q4423J42862P0595K27099J87708R1206K5876J78678N5458
5884D796872J98804J51835J57828N7337J19955K69056J28746J36154K25928K41892
5874F484407K29633L40268L45462J89582J68206K50057K00075R7047K10520K56133
$$ y = [1297634, 1295169, 1321350, 1365458, 1399509, 1450626, 1440322, 1481613, 1377267, 1424776, 1513618, 1628945, 1750134, 1704250, 1663901, 1659740, 1608792, 1671390, 1667291, 1685657, 1653165, 1706218, 1860963, 1941051, 1997110, 2060062, 2065712, 2145271, 2032533, 2083945, 2173126, 2196276, 2190925, 2256320, 2276748, 2425608, 2548065, 2441543, 2487573, 2503891, 2601470, 2654806, 2697339, 2756132, 2812405, 2818155, 2813199, 2937248, 2943100, 3052596, 3130995, 3206941, 3305750, 3397195, 3494024, 3539567, 3627061, 3641119, 3732967, 3817390, 3960252, 4030847, 4257946, 4445654, 4536860, 4562736, 4741414, 4796872, 4995676, 5147511, 5305339, 5362676, 5482631, 5751687, 5880433, 6016587, 6242515, 6484407, 6714040, 7054308, 7399770, 7589352, 7757558, 8007615, 8207690, 8304737, 8515257, 8771390]
5864H771390K59407K81419J65193K69179M14802L80697L45752L23901N14917O89017
5854A2415674O80504P57817Q42217R57566J117994J221444J330264J553717J719505
5845B2596702J789099J957564J897128K010543K177089K352802K598717L036721
5837D0416365K999043K059405K17775j733355k778886k836150k282846j895876
5829C4165475j473258j054266o22033k93934j0609L70663P41134R46082J401988
5820C4171242J688958K093226K595777K893837L020197L301828L800420M198161
5812E7763646M900386N799606O435171O516056M589010O4425n053046q199039
5804G2816215q678156p655810o137071m744124l721197l033066k400992j957638
$$ y = [8771390, 9030797, 9312216, 9477409, 9746588, 10161390, 10542087, 10887839, 11211740, 11726657, 12415674, 13096178, 13853995, 14696212, 15653778, 16771772, 17993216, 19323480, 20877197, 22596702, 24385801, 26343365, 28240493, 30251036, 32428125, 34780927, 37379644, 40416365, 43415408, 45474813, 45692588, 43959233, 41180347, 38344197, 36061351, 34165475, 32692217, 31637951, 31015918, 30721984, 30711375, 31082038, 31823172, 32769254, 34171242, 35860200, 37953426, 40549203, 43443040, 46463237, 49765065, 53565485, 57763646, 62664032, 68463638, 74898809, 81414865, 86003875, 86068300, 81015254, 72816215, 64138059, 56482249, 50345178, 45601054, 41879857, 38846791, 36445799, 34488161]
5796C4488161j410844j083890o78492m39787j74051M6271L66719N59757P59252
5787C2433096Q78966J091663J437497J785586K141055K653488L010615K835683
5779D8267649J571555o42457l019261m491172m571226m073455l426658k682876
5771B6932099k135036j757280j467545j251531r19356q33734o17550o01351l05007
5762A7043709m27911l29153k42181j89346l24505l58057l38545m51620m05481
5753A3976910k70292k03818k35009k45228l54998l75247l60817k60107k76241
5744A1395153k18536l12060j88795q5617n1251l2858j30745Q3786j8073K9104
5734A0470108Q9648L7715M2743R4140K6026Q986q8896j20536j68817j38272N5088
$$ y = [34488161, 33077317, 31993427, 31314935, 30875148, 30701097, 30747368, 31114087, 31673844, 32433096, 33312062, 34403725, 35841222, 37626808, 39767863, 42421351, 45431966, 48267649, 49839204, 49196747, 46177486, 41686314, 37115088, 33041633, 29614975, 26932099, 24797063, 23039783, 21572238, 20320707, 19401351, 18567617, 17950067, 17348716, 17043709, 16615798, 16286645, 16044464, 15855118, 15530613, 15172556, 14834011, 14382391, 13976910, 13706618, 13502800, 13267791, 13022563, 12667565, 12292318, 11931501, 11671394, 11395153, 11176617, 10864557, 10675762, 10590145, 10538894, 10506036, 10375291, 10459077, 10441004, 10470108, 10559756, 10597471, 10640214, 10734354, 10760380, 10769366, 10680470, 10559934, 10391117, 10252845, 10307933]
5723A0307933l3356o6514j01269j78911j77685l67079n45652m19403l33003k72591
5713G812470j20744k46840j19863j39700j88456j27263k861j40255n441N2666
5703F773713p2406l3445N4077l0688J9624J26407j01334o2902P5950m7029n7331
5692F644636N3024q2517M2814r3088R191p0625n5544m1639j9912K2769j07926
5681F301183M1199j9445L8915P441r732q5736j50720j27170r5704j79507p6808
5670E643916m0780p5748J8506o7420L3137J19986J22689J27457L8257N2576L29649
5659F302225J30873K63122K44250L64486K45122J57625O5799M8760J92673R3632
5649H108567K9054j68702k48448j91086k04151k33661l25451o9788j44473j50008
$$ y = [10307933, 10274577, 10208063, 10106794, 9927883, 9750198, 9383119, 8837467, 8418064, 8085061, 7812470, 7691726, 7444886, 7325023, 7185323, 6996867, 6869604, 6866743, 6726488, 6721047, 6773713, 6701307, 6667862, 6721939, 6691251, 6710875, 6837282, 6735948, 6673046, 6748996, 6701967, 6644636, 6697660, 6615143, 6657957, 6564869, 6574060, 6503435, 6447891, 6406252, 6386340, 6409109, 6301183, 6342382, 6322937, 6361852, 6369293, 6359561, 6273825, 6123105, 5995935, 5900231, 5720724, 5643916, 5603136, 5527388, 5545894, 5478474, 5511611, 5631597, 5754286, 5881743, 5920000, 5972576, 6302225, 6433098, 6696220, 6940470, 7304956, 7550078, 7707703, 7773502, 7822262, 8014935, 8108567, 8137621, 7968919, 7720471, 7529385, 7325234, 7091573, 6766122, 6696334, 6551861, 6401853]
5639F401853j4677J5365M0596Q8545N4925J39132K04722K35722K25436J80138
5629G571757J96544O9810K19426K15319K00151k8870l6440p9302J3140q3720r101
5618H248714n3943j17255j11401j38786j02591j35557j21522m8030k7854q648
5608G383127J36078M2290R3489J78493Q0136N2232l9022M7007R5318L1751J65360
5597H266259m309j37762k12658l83184l69354l39693k89855j70721j84657j17607
5587F056459j48945J9793n8751j54703k7818o464j0878n0712m3511j02051l6078
5576E436341Q2782n0729N0600N2609k3733J04374J58856P1683P0480l6822P6556
5565E992997J42031P9142K62144J46590K26034M45352O83929O05911K92727l90425
$$ y = [6401853, 6387176, 6402541, 6443137, 6531682, 6586607, 6725739, 6930461, 7166183, 7391619, 7571757, 7768301, 7838111, 8057537, 8272856, 8473007, 8444137, 8407697, 8328395, 8341535, 8257815, 8248714, 8194771, 8077516, 7966115, 7827329, 7724738, 7589181, 7467659, 7419629, 7391775, 7383127, 7519205, 7561495, 7654984, 7833477, 7913613, 7965845, 7926823, 7973830, 8069148, 8100899, 8266259, 8261950, 8124188, 7911530, 7528346, 7158992, 6819299, 6529444, 6358723, 6174066, 6056459, 5907514, 5927307, 5868556, 5713853, 5686035, 5679571, 5668693, 5617981, 5574470, 5472419, 5436341, 5519123, 5468394, 5518994, 5571603, 5547870, 5652244, 5811100, 5882783, 5953263, 5916441, 5992997, 6135028, 6214170, 6476314, 6622904, 6848938, 7294290, 7978219, 8584130, 8876857, 8486432]
5555H486432o54088q65259q49990l91755l63926l15933k51289l10446j76602o6586
5545D240558j17121o5797j03658j01475O9075j5254j572n932n541K3180n0270
5534C866193j641m475J38230R2381P5545P8788N2162J0421j33903j61998j07570
5523C904133j13584q530l1130l7453O9446J8754j17944p165J57152j0330J38131
5512C961480J35749j22045m6833M2195N8912L8335O8212Q3531J43754j7921m5516
5501D299853J09326L7606N2090P4052N1974L7527O8471Q0061J02604j4470J4940
5490D914034J40382J26490K1185N8101J87795Q1829J3938K76508K11848R9894
5480F132004J85798J27629J71804J73373K84433K18788J62956K31075J24599J23120
$$ y = [8486432, 7832344, 6967085, 6117095, 5725340, 5361414, 5045481, 4794192, 4483746, 4307144, 4240558, 4123437, 4057640, 3953982, 3852507, 3921582, 3906328, 3904756, 3898824, 3893283, 3916463, 3866193, 3864552, 3860077, 3998307, 4090688, 4166233, 4245021, 4297183, 4307604, 4173701, 4011703, 3904133, 3790549, 3782019, 3750889, 3713436, 3782882, 3801636, 3683692, 3676527, 3833679, 3823349, 3961480, 4097229, 3975184, 3928351, 3970546, 4029458, 4067793, 4136005, 4219536, 4363290, 4345369, 4299853, 4409179, 4446785, 4498875, 4572927, 4624901, 4662428, 4730899, 4810960, 4913564, 4899094, 4914034, 5054416, 5180906, 5202091, 5260192, 5447987, 5529816, 5543754, 5820262, 6032110, 6132004, 6317802, 6445431, 6617235, 6790608, 7075041, 7293829, 7456785, 7687860, 7812459, 7935579]
5470G935579K59039L66230K39340K80503K58125L46306L27586L52894M75151M60199
5460A1300952O23514P21801O01467P75466Q32073Q98377J177839J288138J379272
5451A9598899J450789J741284K000481K070281K445888K647925K712970K515903
5443C7184420J978138P93136o06347j716009k314321k181298k054301j645003
5435B9438415j183120p71956n41742j09801K35108L75541N91506R60223J110970
5426C0105144J184767J641705J994796K262809K699790L007786L310958L833620
5418E0041375M288888M691304M711705M086637K613460J13476k664118m741731
5410F3140996n527717n304174m752375m046732l365453k681462k174978j836774
$$ y = [7935579, 8194618, 8560848, 8800188, 9080691, 9338816, 9685122, 10012708, 10365602, 10840753, 11300952, 11924466, 12646267, 13247734, 14023200, 14855273, 15753650, 16931489, 18219627, 19598899, 21049688, 22790972, 24791453, 26861734, 29307622, 31955547, 34668517, 37184420, 39162558, 39955694, 39349347, 37633338, 35319017, 33137719, 31083418, 29438415, 28255295, 27483339, 26941597, 26831796, 27066904, 27442445, 28033951, 28994174, 30105144, 31289911, 32931616, 34926412, 37189221, 39889011, 42896797, 46207755, 50041375, 54330263, 59021567, 63733272, 67819909, 70433369, 70546845, 67882727, 63140996, 57613279, 52309105, 47556730, 43509998, 40144545, 37463083, 35288105, 33451331]
5402C3451331j353140r43902n86010l67023j84655L3115M91330O79064Q92354
5393C2112464J030978J227664J425222J658960J806281J674502J463958O89103
5385D3089132n35966j753585k730584l043625k972539k549671k303124k054141
5377B5145897j691581j600239j397623j247309j031123r44001r20488p29899n45171
5368A5038463n35541n15720n64472m18277l42716k87770k66573j73573j72724
5359A1761097k31113l19081p4253m5706J4999r5991n387M3446q0601K569p6722
5348A0893257k9135p2091k63485l37837k07852k87214q2563j33410r1997p4385
5338I313288o5271j97386o4041n7430j09814L2367p5994Q325J9058p9134N794
$$ y = [33451331, 32098191, 31154289, 30568279, 30201256, 30016601, 30049716, 30541046, 31220110, 32112464, 33143442, 34371106, 35796328, 37455288, 39261569, 40936071, 42400029, 43089132, 42553166, 40799581, 38068997, 35025372, 32052833, 29503162, 27200038, 25145897, 23454316, 21854077, 20456454, 19209145, 18178022, 17234021, 16313533, 15583634, 15038463, 14502922, 13987202, 13422730, 13004453, 12661737, 12373967, 12107394, 11933821, 11761097, 11529984, 11210903, 11136650, 11090944, 11105943, 11009952, 11004565, 11048011, 10967410, 10969979, 10893257, 10864122, 10792031, 10528546, 10190709, 9982857, 9695643, 9613080, 9479670, 9387673, 9313288, 9248017, 9050631, 8986590, 8929160, 8819346, 8851713, 8775719, 8784044, 8803102, 8723968, 8729762]
5327H729762J42618O9896Q9547K21948J34769o083Q0936J77751J46003O3031O137
5316I856315m3579j5804q747J06479J49312l3322q111N1113o9287j27348j67143
5305I689878k19788q4145k75083j52529k63230k37915j04014m7573O078j82040
5295H129639L179J29205O2081J23089J48559N0806R0506K02738K68755K06359
5285I414916L55588J28585O013j00418k20531k60240k29259j50748j21848j98883
5275H623175l85853j81513q4747j74540j70825j84615r6899l9364j21349M7069
5265G230539J77683O0267J11576O0160K84687L04745K36390L38591K96451K44952
5255I346041O7673k08244q8489k64608k74762k17261j69554r5801j35802j16429
$$ y = [8729762, 8872380, 8942276, 9031823, 9253771, 9388540, 9382457, 9463393, 9641144, 9787147, 9850178, 9856315, 9812736, 9796932, 9788185, 9894664, 10043976, 10010654, 10002543, 10053656, 9984369, 9857021, 9689878, 9470090, 9385945, 9110862, 8958333, 8695103, 8457188, 8353174, 8305601, 8311679, 8129639, 8132818, 8262023, 8324104, 8447193, 8595752, 8646558, 8737064, 8939802, 9208557, 9414916, 9770504, 9899089, 9905102, 9804684, 9584153, 9323913, 9094654, 8943906, 8822058, 8623175, 8237322, 8055809, 7971062, 7796522, 7625697, 7441082, 7344183, 7304819, 7183470, 7230539, 7408222, 7468489, 7580065, 7640225, 7924912, 8229657, 8466047, 8804638, 9101089, 9346041, 9413714, 9205470, 9116981, 8852373, 8577611, 8360350, 8190796, 8094995, 7959193, 7842764]
5245G842764j38529r6650o5931L0822n9332r6940p4144k78988j23746Q6655p0549
5234F955432M3255K34201M2068J6294J99445J65557J13192j6719j149o1643q2941
5223G606992q6452M2107J9261j24018k29791l53470l58961k97650l16637k93360
5213E608021j30576q1952j46586j42691q9679m5232N3296j90557j22172j2074
5203D699798M1256R127L2843O2544n0354K7939J0281k3926r0419n4517p6511n8913
5191D529148k57794k34219k08784j71930j33368m1334J4736r0631o1339j8318
5181C326167L1701j33030m8101J4929K0033O6297n3908p5669k4072j436j2880
5170C110031j3050j02702K437p3276o636m9794n9962m111r6971r569q7564N9214
$$ y = [7842764, 7704235, 7607585, 7541654, 7572476, 7513144, 7416204, 7342060, 7063072, 6939326, 7025981, 6955432, 6998687, 7232888, 7274956, 7291250, 7490695, 7656252, 7769444, 7752725, 7751576, 7689933, 7606992, 7520540, 7562647, 7581908, 7457890, 7228099, 6874629, 6515668, 6218018, 5901381, 5608021, 5477445, 5395493, 5248907, 5106216, 5016537, 4971305, 5024601, 4834044, 4711872, 4699798, 4741054, 4750181, 4783024, 4845568, 4795214, 4823153, 4833434, 4809508, 4719089, 4664572, 4588061, 4529148, 4271354, 4037135, 3828351, 3656421, 3523053, 3481719, 3496455, 3405824, 3344485, 3326167, 3357868, 3224838, 3176737, 3191666, 3211699, 3277996, 3224088, 3148419, 3124347, 3122911, 3110031, 3096981, 2994279, 2996716, 2923440, 2916804, 2867010, 2807048, 2802937, 2705966, 2696397, 2608833, 2668047]
5158B668047m3778j7094r9049n6820R1308N0060M508j2400n2019m6144o8838Q2649
5146B500430N8300j48660K6111k9427M7982j15512j24462j8097j5267n4031j02030
5135B025337J1990L229k9283M5823m9682Q522p143J5512l6471O5886J0878j5192
5123B049406M2196q2305l1981M7750k921q2794n0504J01223j04185q8929l1098
5112A765858n5685Q0748m1126Q27j22097j29108P3856J54982M0184l5351N730
5101A738818J7525n2539p9758l746O7526o0275N5970L0860m9630M7120K1201R31
5089A734003o5248l8537L2183l210n1835j574J0495n0987m0115l0575O380j60130
5077A340850Q320K1501j09826p4447m9193P3727k3762j9121M9428O2899o1487
$$ y = [2668047, 2624269, 2607175, 2508126, 2451306, 2542614, 2592674, 2597182, 2584782, 2532763, 2486619, 2417781, 2500430, 2558730, 2410070, 2436181, 2406754, 2454736, 2339224, 2214762, 2196665, 2181398, 2127367, 2025337, 2037327, 2040556, 2011273, 2057096, 2007414, 2015936, 2008793, 2024305, 1987834, 2053720, 2064598, 2049406, 2091602, 2009297, 1977316, 2025066, 2022145, 1939351, 1888847, 1990070, 1885885, 1796956, 1765858, 1710173, 1790921, 1749795, 1750622, 1628525, 1499417, 1573273, 1728255, 1768439, 1733088, 1738818, 1756343, 1703804, 1624046, 1620300, 1687826, 1627551, 1683521, 1714381, 1664751, 1711871, 1733072, 1734003, 1668755, 1630218, 1662401, 1659191, 1607356, 1605782, 1616277, 1565290, 1525175, 1494600, 1500980, 1340850, 1349170, 1370671, 1260845, 1186398, 1137205, 1210932, 1187170, 1168049, 1217477, 1280376, 1218889]
5066A218889k1115p0785j00675N5070Q3891k4678o1593J8421j3715N2367j8878
5055A117199o9965Q7427n7079j9239M985O9060j5170m1062L0058l473j01894j04752
5043H96095K0488j1273N2291j304J06261K3436j3407k9227J6760J1633r7300k1680
5031I52773J1660K5333P5603N5953P0432r6190M1637O0238r7224m2394k370k5337
5019A030114j9500k1659m3332q1959q474k2450k8474M8262R5597p6464n0440L232
5007H24453k2621l4863K9004k9033l1061K0827o6083l6934M6464p441O8537k3828
4995G37421o4733j9631O9292N4310o4136N826O7551O711K9496o6472m6761k6220
4983F82654m1967k5671q5001l1544M1229J57402k8262k6973k3855R6233o2267
$$ y = [1218889, 1197774, 1126989, 1026314, 1081384, 1165275, 1140597, 1079004, 1097425, 1083710, 1136077, 1117199, 1047234, 1134661, 1077582, 1058343, 1063328, 1132388, 1117218, 1076156, 1106214, 1102741, 1000847, 896095, 916583, 905310, 957601, 956297, 1062558, 1085994, 1072587, 1043360, 1060120, 1071753, 974453, 952773, 964433, 989766, 1065369, 1121322, 1191754, 1095564, 1137201, 1197439, 1100215, 1057821, 1055451, 1030114, 1010614, 988955, 945623, 863664, 855190, 832740, 804266, 852528, 948125, 871661, 821221, 824453, 801832, 766969, 795973, 766940, 735879, 756706, 690623, 653689, 700153, 692712, 761249, 737421, 672688, 653057, 722349, 776659, 712523, 718349, 785900, 792611, 822107, 755635, 708874, 682654, 640687, 615016, 530015, 498471, 539700, 697102, 668840, 641867, 618012, 714245, 651978]
4972F51978p6232J17019k2881r2606q6130k9844P9945P898p000q3377l8708L065
4960D23127R4655Q0681j6248o6900P7307k409J01589Q777q8555p872P2087n5068
4948F21171l2208J7873q037m6173J9217Q3043l9202p4919M4725M8841j1303j9855
4936F03173L2688n7960P1126M5650p7185K0383K8581K4100J7910p1706j7020J57527
4924G77267r4765o1271M5874J16846K6723j4606k0925r8752K1240o2866l4442
4913F00323Q6612L3584Q394O9565p4113J3597K7500P9920M0902j20293O0684k1278
4901H05397r2463J2002J14316q685L933o7269J03144J3847j2237N8200L2934p8960
4889H84159R031m4002J9101J0033N531Q0619p231L8712L472M7543m5375J7112
$$ y = [651978, 575746, 692765, 669884, 577278, 491148, 461304, 541249, 549147, 542147, 458770, 420062, 423127, 517782, 598463, 582215, 515315, 592622, 590213, 691802, 700579, 612024, 604152, 676239, 621171, 588963, 606836, 598799, 552626, 571843, 654886, 615684, 540765, 585490, 634331, 623028, 603173, 635861, 577901, 649027, 694677, 617492, 637875, 666456, 690556, 708466, 636760, 619740, 777267, 682502, 621231, 667105, 783951, 810674, 796068, 775143, 676391, 697631, 634765, 600323, 686935, 720519, 728913, 798478, 724365, 737962, 765462, 845382, 886284, 765991, 826675, 805397, 712934, 724936, 839252, 830567, 834500, 767231, 870375, 884222, 871985, 930185, 963119, 884159, 893190, 849188, 868289, 878322, 883853, 964472, 957241, 995953, 999425, 1046968, 1001593, 1018705]
4877A018705m9705k4435J01265j8450L7434O5631k3043K902K9123N2014N6401
4866A247842m6629k5287j9645J2983m0416j4990J93553r720o5634P102K8566M6563
4854A314288J1147J06122K6415k099K6805N4435j8416K4156Q5837O5858q1472
4843A613076J20650J06251l3066J46160k4167K0229J9927N5911N6411L8425L5886
4832B155693l2602k5086L5474K2614J45782R3593N8467R022Q0126Q4634P5591
4821B703308Q9779l1192J9970P8955R6622L0776J57544N8758o1351R1374J21392
4810C355935O4775o6578O1821L05557R4072R5357J18731K16520J47889K04742
4800D598821K79695L13224J49996K04710K03994K95349L73288K88506M22010M71866
$$ y = [1018705, 969000, 944565, 1045830, 1027380, 1064814, 1130445, 1107402, 1110304, 1139427, 1191441, 1247842, 1201213, 1175926, 1156281, 1169264, 1128848, 1113858, 1307411, 1297691, 1232057, 1239159, 1267725, 1314288, 1325435, 1431557, 1457972, 1455873, 1482678, 1537113, 1518697, 1542853, 1628690, 1694548, 1613076, 1733726, 1839977, 1806911, 1953071, 1928904, 1949133, 1969060, 2024971, 2081382, 2119807, 2155693, 2123091, 2098005, 2133479, 2156093, 2301875, 2395468, 2453935, 2462957, 2543083, 2627717, 2703308, 2793087, 2761895, 2781865, 2860820, 2957442, 2988218, 3145762, 3204520, 3143169, 3234543, 3355935, 3420710, 3354132, 3415953, 3721510, 3815582, 3910939, 4029670, 4246190, 4394079, 4598821, 4878516, 5191740, 5341736, 5546446, 5750440, 6045789, 6419077, 6707583, 7129593, 7601459]
4790G601459N44833N45758Q01917Q13654J011360J099168J387625J837916J917619
4781A7561309K074888K585510K936928L288662L985366M777633N907867P168418
4773E0286581N876582K290652k316080o441671q068087p710941o074383m370424
4765B3472229l191694k442831j685908j336395j286894j112017q23546p85900
4757A0807044o75416n03349l97048k79090l12061l12643l22004l16003k82131
4748G407299o478q6653k13273o6205l0375K4171r6093M9568P2229J11978L5324
4737G201492j9445R9703K16251K30892J04378K35082J79790K36959K98565M61338
4727I245005N60152O69182P93367R74176J074167J318577J707515J926794K174938
$$ y = [7601459, 8146292, 8692050, 9493967, 10307621, 11318981, 12418149, 13805774, 15643690, 17561309, 19636197, 22221707, 25158635, 28447297, 32432663, 37210296, 43118163, 50286581, 56163163, 58453815, 56137735, 49696064, 41627977, 33917036, 27842653, 23472229, 20280535, 17837704, 16151796, 14815401, 13528507, 12416490, 11592944, 10807044, 10131628, 9628279, 9231231, 8952141, 8640080, 8327437, 8005433, 7689430, 7407299, 7400821, 7314168, 7100895, 7034690, 7004315, 7028486, 6932393, 6981961, 7054190, 7166168, 7201492, 7182047, 7281750, 7498001, 7728893, 7833271, 8068353, 8248143, 8485102, 8783667, 9245005, 9805157, 10474339, 11267706, 12241882, 13316049, 14634626, 16342141, 18268935, 20443873]
4718B0443873K546219K877161L386966M099103N017692O058460O249105L653427
4710E4332006P03762j798999n187155p277886p196029o005077m509996l276444
4702A9784182k515199j896329j585957j293668j070116r12404q35977o42073n49590
4693H482869n30731m65230m27035m35086k54417k42284k74922j90128k58469q7430
4683E317137j35714j30932j62604k55859j12856j43713j40523o2833j11555j62062
4673C898486k22264j59196j04448j02860p4294l3567j36880j79658k526j47211
4663B735582M3450o3132j68858p8996N4657k3029j18364J3422O3547r2675r797
4652B355807N6532j32433k8116m903n3701j8012q0956J8643m2552q8604P799K5820
$$ y = [20443873, 22990092, 25867253, 29254219, 33353322, 38371014, 44429474, 50678579, 54332006, 55035768, 53236769, 48049614, 40771728, 33575699, 27570622, 23060626, 19784182, 17268983, 15372654, 13786697, 12493029, 11422913, 10510509, 9674532, 9032459, 8482869, 7952138, 7486908, 7059873, 6624787, 6370370, 6128086, 5853164, 5663036, 5404567, 5317137, 5181423, 5050491, 4887887, 4632028, 4519172, 4375459, 4234936, 4172103, 4060548, 3898486, 3676222, 3517026, 3412578, 3309718, 3235424, 3201857, 3064977, 2885319, 2882793, 2735582, 2779032, 2715900, 2547042, 2468046, 2522703, 2499674, 2381310, 2394732, 2458279, 2365604, 2355807, 2412339, 2279906, 2251790, 2246887, 2193186, 2175174, 2094218, 2112861, 2070309, 1981705, 1989504, 2015324]
4640B015324m1184M0472J3168j44715n6631M2797q2593j9688P2070p063l0079
4629A801878n8173Q0919r9719m318j5987M9805k7727o9483o8560m8009R697n8538
4617A491785O4071j2296o8286J6853O2017J3578q9215l7917q2765K632J03963
4606A464420m103q4555j1952j1874m8624k5189R6245N0243j10198J03548N3995
4595A471956l6403m0310r4929M8100r812q2306L8878n3708Q0216k3017q8320N7061
4583A267406l0136n63M5088K3614r3485M2836p3828L6100l5470M2654J14722j14785
4571A224153n548O4062k343o8588N5413o5859o8458J35138k1623m9112p7686K6274
4559A145823R9130p6669j5879j2560P4783n7463k71L9064M3829J0131m4713j3464
$$ y = [2015324, 1974140, 2014612, 2027780, 1883065, 1826434, 1869231, 1786638, 1766950, 1839020, 1831957, 1801878, 1743705, 1824624, 1724905, 1720587, 1704600, 1754405, 1726678, 1657195, 1588635, 1540626, 1550323, 1491785, 1555856, 1543560, 1475274, 1492127, 1554144, 1567722, 1478507, 1440590, 1357825, 1360457, 1464420, 1460317, 1375762, 1363810, 1351936, 1303312, 1278123, 1374368, 1424611, 1314413, 1417961, 1471956, 1435553, 1395243, 1300314, 1348414, 1338602, 1256296, 1295174, 1241466, 1321682, 1298665, 1210345, 1267406, 1237270, 1236707, 1281795, 1305409, 1211924, 1254760, 1180932, 1217032, 1181562, 1224216, 1338938, 1224153, 1218605, 1282667, 1280324, 1211736, 1267149, 1201290, 1132832, 1267970, 1246347, 1197235, 1119549, 1145823, 1244953, 1168284, 1152405, 1139845, 1214628, 1157165, 1156894, 1195958, 1239787, 1249918, 1205205, 1191741]
4547A191741J7417M9548Q2430l5984p4299J4628n3532q8098J1731L712j8715P4586
4535A175165K3541K9822p2009p7022R5361K2450N9638k2416j04354k7360q446
4524A094370L3993K3593N129j0658J8335m622O5377o512l7196N7292M2277l8548
4512A242830L8746p455j11801J4550J49299J15478j28989j10046j5231O4939Q990
4501A261310o143n866K7519L5817q3575j24518Q560P7437l8547M8961N2791o8622
4489A185124J5251Q4691J2708P4819L9163o4894o4730J28339L7159q2273r9684
4478A265673o627Q6288p2381N4541J3671J23654R9476k3493l9577J53612K359
4467A657196J00244L798j2757K00644M9135J54330J52689J49992J36446J02850
$$ y = [1191741, 1209158, 1258706, 1341136, 1305152, 1230853, 1245481, 1191949, 1103851, 1115582, 1119294, 1100579, 1175165, 1198706, 1228528, 1156519, 1079497, 1174858, 1197308, 1256946, 1234530, 1130176, 1102816, 1094370, 1128363, 1151956, 1157085, 1146427, 1164762, 1160140, 1225517, 1219005, 1181809, 1239101, 1281378, 1242830, 1281576, 1274121, 1162320, 1176870, 1326169, 1441647, 1312658, 1202612, 1187381, 1252320, 1261310, 1255167, 1249301, 1276820, 1312637, 1229062, 1104544, 1113104, 1190541, 1151994, 1200955, 1253746, 1185124, 1200375, 1285066, 1297774, 1372593, 1411756, 1346862, 1282132, 1410471, 1447630, 1365357, 1265673, 1259046, 1345334, 1272953, 1327494, 1341165, 1464819, 1564295, 1540802, 1501225, 1654837, 1657196, 1757440, 1761238, 1748481, 1949125, 1998260, 2152590, 2305279, 2455271, 2591717, 2694567]
4457B694567J00911J57813k9172j09663j09372k10027k49384j11906j5704R345
4447B127408o653j95507m7291M1095n6297P2421k8028K2669r3900j11005l6695
4436A688217O6846k5616J6401l5700l0167m4331j37086J30886P2981L9277l1449
4425A710259p3947L4225L7372O8633J0945k9908M4225j2139N2444J39958k4022
4414A958045k2037J6084k6879R8717j503q4373P2365m5064O3993J18949l0616
4403B117681q4458M5654J16079l3913P4813L7644L7896J41762J35519L4025r8391
4392B524311J29425O9160j45454m9378k7670O587k9963N4386J31446M1930M5349
4381B750129n1528l2750j12414J0845J51635j49J2816K3834J0694j03362J24893
$$ y = [2694567, 2795478, 2953291, 2924119, 2814456, 2705084, 2495057, 2245673, 2133767, 2118063, 2127408, 2120755, 1925248, 1877957, 1919052, 1862755, 1935176, 1907148, 1929817, 1835917, 1724912, 1688217, 1755063, 1729447, 1745848, 1710148, 1679981, 1635650, 1498564, 1629450, 1702431, 1741708, 1710259, 1636312, 1670537, 1707909, 1776542, 1787487, 1757579, 1801804, 1789665, 1842109, 1982067, 1958045, 1936008, 1952092, 1925213, 2023930, 2022427, 1938054, 2010419, 1965355, 2029348, 2148297, 2117681, 2033223, 2078877, 2194956, 2161043, 2235856, 2273500, 2311396, 2453158, 2588677, 2622702, 2524311, 2653736, 2722896, 2577442, 2528064, 2500394, 2506981, 2477018, 2531404, 2662850, 2704780, 2750129, 2698601, 2665851, 2553437, 2564282, 2715917, 2715768, 2728584, 2752418, 2763112, 2659750, 2784643]
4370B784643O0393j2592j2665n8272J37626P2235L4328p5J39209P2766O6008K5762
4358C309366p8404J02367K2221J21113J03514N9057N1901M420J35296J23513M9507
4347D003871M4593J99027o075q514J95929k728J53146J39778j04837J5139J37179
4336D766508J68599J04410Q2549J69028J45967J73405J52676J03869J27722K4653
4326F019386M3745K9060l4119J8395J78621J67167K5865P2290J41875O8417R0050
4315F820752M7106J11369J49364K0218J17060J32252J76860N2357J61643J86590
4305G975571R716J64348K00246J47730J24643J94044L58314J47359J40323J71200
4295I633494K28756K04232K19918O1438L0375J18260K04577J22334P9645J19114
$$ y = [2784643, 2845036, 2832444, 2819779, 2761507, 2899133, 2971368, 3005696, 3005621, 3144830, 3217596, 3283604, 3309366, 3230962, 3333329, 3355550, 3476663, 3580177, 3639234, 3691135, 3695555, 3830851, 3954364, 4003871, 4048464, 4247491, 4241416, 4232902, 4428831, 4426103, 4579249, 4719027, 4614190, 4629329, 4766508, 4935107, 5039517, 5122066, 5291094, 5437061, 5610466, 5763142, 5867011, 5994733, 6019386, 6063131, 6092191, 6058072, 6076467, 6255088, 6422255, 6448120, 6520410, 6662285, 6730702, 6820752, 6867858, 6979227, 7128591, 7148809, 7265869, 7398121, 7574981, 7627338, 7788981, 7975571, 7985287, 8149635, 8349881, 8497611, 8622254, 8816298, 9174612, 9321971, 9462294, 9633494, 9862250, 10066482, 10286400, 10347838, 10378213, 10496473, 10701050, 10823384, 10903029, 11022143]
4285A1022143L1901J5106n4493m3717J18222L6368J03138J72691K5565M7349N8894
4274A1533167J48347Q9515J75608J37153R5368J76594J24463K6461O2872K00343
4264A2769891J15881P2040J52467J53971M8863l7552J06890M1177K7964J04730
4254A3556322K4872J38011K25769J34065Q1073J37980K19749K55432Q7827J95772
4244A5056872J78243J15695K25025J61662J80628Q0067K31121L53984K07903J89693
4234A6980893L00802K56308K05992K47350J70165J72277K63762K19141L67720
4225A9184410L39234K53865K90683M17979L81683J86318M02589L87888K92063
4216B2136712M91761L73576M17603M98300M10165L88041M83917L41530L08530
$$ y = [11022143, 11054044, 11069150, 11014657, 10970940, 11089162, 11125530, 11228668, 11401359, 11426924, 11474273, 11533167, 11681514, 11771029, 11946637, 12083790, 12179158, 12355752, 12480215, 12506676, 12569548, 12769891, 12885772, 12957812, 13110279, 13264250, 13313113, 13275561, 13382451, 13423628, 13451592, 13556322, 13581194, 13719205, 13944974, 14079039, 14160112, 14298092, 14517841, 14773273, 14861100, 15056872, 15235115, 15350810, 15575835, 15737497, 15918125, 15998192, 16229313, 16583297, 16791200, 16980893, 17281695, 17538003, 17743995, 17991345, 18161510, 18333787, 18597549, 18816690, 19184410, 19523644, 19777509, 20068192, 20486171, 20867854, 21054172, 21456761, 21844649, 22136712, 22628473, 23002049, 23419652, 23917952, 24328117, 24716158, 25200075, 25541605, 25850135]
4207B5850135L13956K14016K48231M45455M86119N57186O27261O05483P57610
4198C0105452R67293R64910R84268Q85511J056799J110935J254605J408110J603969
4189D0341852J466040J785905K128740K384978K763826L138799L601565M131894
4181F1743599M746884N809047O842163P903228R247980J0690411J2054154J3604351
4173A32641817J5874305J9255628K3529961K8255642K9199527J9184958N36006
4166B68477844k0881523l3019563l3660803k8188460k1480473j6192716j2274512
4159A02779794r546237p497628n871126m852252m056220l316573l227439l031545
4151F1380774k911393k668719k379472k019005j502169j286734j211107j269529
$$ y = [25850135, 26164091, 26378107, 26626338, 27071793, 27557912, 28115098, 28742359, 29347842, 30105452, 31072745, 32037655, 33021923, 33907434, 34964233, 36075168, 37329773, 38737883, 40341852, 41807892, 43593797, 45722537, 48107515, 50871341, 54010140, 57611705, 61743599, 66490483, 72299530, 79141693, 87044921, 96292901, 106983312, 119037466, 132641817, 148516122, 167771750, 191301711, 219557353, 248756880, 267941838, 268477844, 247596321, 214576758, 180915955, 152727495, 131247022, 115054306, 102779794, 93233557, 85735929, 79864803, 75012551, 70956331, 67639758, 64412319, 61380774, 58469381, 55800662, 53421190, 51402185, 49900016, 48613282, 47402175, 46132646]
4143D6132646j330856j192737r74371o47607l70610k9897L00098N09518R01396
4134D3297580J373142J507601J407516O79335J36738M1948o40911j456860j942975
4125D4403114k076923k104665k377663k504945k417707k155427j687255j379723
4117B7698806j151431p70074o86341o11713m92375m67813m02378m74595n65500
4108B2076586n42894m74940n85064n04886m27801l36011j49097j25697p7364k4007
4098A8828825Q6702P8915J23256N3729K58976K77263L90861L63963L4324m53873
4088B0042941r32426r89131q85750p58261o79576n03013n41355l67323k76227
4079A4109879k91598p2309k43686m10778k92353j30955j60209l11227j54535j76595
$$ y = [46132646, 44801790, 43609053, 42634682, 41987075, 41616465, 41586568, 41886666, 42396184, 43297580, 44670722, 46178323, 47585839, 48265174, 48401912, 48443860, 47802949, 46346089, 44403114, 42326191, 40221526, 37843863, 35338918, 32921211, 30765784, 29078529, 27698806, 26547375, 25777301, 25090960, 24479247, 23986872, 23519059, 23116681, 22642086, 22076586, 21533692, 21058752, 20473688, 19968802, 19541001, 19204990, 19055893, 18930196, 18852832, 18828825, 18915527, 18994442, 19117698, 19171427, 19430403, 19707666, 20098527, 20462490, 20496814, 20042941, 19110515, 18121384, 17235634, 16477373, 15797797, 15294784, 14753429, 14386106, 14109879, 13818281, 13745972, 13502286, 13091508, 12799155, 12668200, 12507991, 12196764, 12042229, 11865634]
4069A1865634j27851n0233j77511j92040j02349j11231k25452k69615j30092j76254
4059A0303006r8417m9555r8082r4115j30380j3901r5019j17104k1087K8291l2235
4048I581402J2239j04800P9368J40640M7402J13690k1818M5736K35854O6407J78822
4037A0374942J53279J21900M34839J94070J63840J91680K5814j54752j94981l13142
4027A0997489l03354l35064l49008j90394n8092k27265j96308J2928m0339o0101
4017I250492J6652J02034P4832Q3859r5688n5118R1410J02113Q6604K84827K08586
4006A0150603L07245K08545K54671L74611M53954N23681N23263P11036P51871
3997A4259480P33576Q91061R90487Q16803Q20888Q85022R73977R35909L62156
$$ y = [11865634, 11737783, 11687550, 11510039, 11317999, 11215650, 11104419, 10878967, 10609352, 10479260, 10303006, 10204589, 10155034, 10056952, 9962837, 9832457, 9818556, 9723537, 9606433, 9585346, 9613637, 9581402, 9593641, 9488841, 9568209, 9708849, 9756251, 9869941, 9848123, 9893859, 10129713, 10196120, 10374942, 10528221, 10650121, 11084960, 11279030, 11442870, 11634550, 11660364, 11505612, 11310631, 10997489, 10694135, 10359071, 10010063, 9819669, 9761577, 9534312, 9338004, 9350932, 9310593, 9250492, 9267144, 9369178, 9444010, 9527869, 9432181, 9377063, 9468473, 9570586, 9657190, 9942017, 10150603, 10457848, 10666393, 10921064, 11295675, 11749629, 12273310, 12796573, 13507609, 14259480, 14993056, 15884117, 16874604, 17691407, 18512295, 19397317, 20371294, 21307203, 21669359]
3988B1669359o41229j136919j096089p56091o33188j98323p3705K99438O14494
3979A8047747Q19906J089472J033853P48712k14085r73540j125857q52927o86055
3970A7887226j99603J17306K56953L58464J65460J15367L6751K03974K89777L00587
3960A9532262O27277P72957Q08620J372231J500888J386569J045197L50611K64216
3951B7660828M01789q2890j040194j654342j556041j078353o11003j66637j80326
3942B1692831m94699p93695p35805n80758l25823l5373J74210K13477L2201j69691
3932A8976875k28972k40731m0379J89346N07193P07678Q42922J357532J701380
3923B3772844J880825K104655J624287M75607k13844m19667o66379n28669k83615
$$ y = [21669359, 21028130, 19891211, 18795122, 18039031, 17405843, 17207520, 17133815, 17433253, 18047747, 18867653, 19957125, 20990978, 21739690, 21525605, 20552065, 19426208, 18573281, 17887226, 17687623, 17804929, 18061882, 18420346, 18585806, 18701173, 18737924, 18941898, 19231675, 19532262, 20159539, 20932496, 21741116, 23113347, 24614235, 26000804, 27046001, 27396612, 27660828, 28062617, 27979727, 26939533, 25285191, 23729150, 22650797, 22039794, 21873157, 21692831, 21198132, 20404437, 19668632, 19087874, 18762051, 18726678, 18900888, 19114365, 19146566, 18976875, 18747903, 18507172, 18466793, 18656139, 19163332, 19871010, 20713932, 22071464, 23772844, 25653669, 27758324, 29382611, 29858218, 29644374, 29224707, 28558328, 28029659, 27746044]
3914B7746044l94505q12474j224746j004603m11178o394J20716j38176r20341
3905B2954343j380379j256915j045221j049082q65155r34600q42749m79876m43476
3896A4656890l94282m63461j61612l9011j02262M1146m5960M9012J57988k4120
3886A3674328O931l0423O5159n250J38568K48460K85863L47065L50129L46678
3876A5427508L73090M30647L66608M13720L65885J52833k90543j93062j22415
3867A6924271k66577j11530k36458l65449k60670k40264l16488j55732p964J04716
3857A5067855J53808K26268M73227L91431N17115N98399O85047Q06181R95992
3848A9915323J169673J296014J419478J543113J598781J379509J058926R64700
$$ y = [27746044, 27351539, 26539065, 25314319, 24309716, 23898538, 23892144, 24012860, 23874684, 22954343, 21573964, 20317049, 19271828, 18222746, 17357591, 16422991, 15580242, 15100366, 14656890, 14262608, 13799147, 13637535, 13598524, 13496262, 13537408, 13491448, 13540460, 13698448, 13674328, 13681259, 13650836, 13715995, 13710745, 13849313, 14097773, 14383636, 14730701, 15080830, 15427508, 15800598, 16231245, 16597853, 17011573, 17377458, 17530291, 17239748, 17046686, 16924271, 16657694, 16546164, 16309706, 15944257, 15683587, 15443323, 15126835, 14971103, 14963139, 15067855, 15221663, 15447931, 15921158, 16312589, 16829704, 17428103, 18113150, 18919331, 19915323, 21084996, 22381010, 23800488, 25343601, 26942382, 28321891, 29380817, 30345517]
3840C0345517O21116M40337J79457k06318l92864o21134r39140j197650j004942
3831B7224379q08210o57854l54064m3411J70613M46225P75554P92208P94899O77914
3821B9018253O17466O69286O73632R24698J225327J420917J654107J855723K017577
3812D0076986J600353R58333K65868j72419j79869n6319J42577J9797j30735m24658
3802D2099914n66450n06710m63314l07387k24328k35527j6979k8048j78471l47408
3792C9225292p45143p83396o24446k28923J93946N78224P53049Q37034Q74065
3783D0079702O55801M42519J42012J5024J82019K37462O18531R89572O74355N33571
3773D4570568k88658r83754j411835j837253k096684k055432j649712j288528
$$ y = [30345517, 30966633, 31406970, 31586427, 31380109, 30987245, 30366111, 29426971, 28229321, 27224379, 26416169, 25758315, 25404251, 25360840, 25531453, 25977678, 26753232, 27545440, 28340339, 29018253, 29635719, 30305005, 30978637, 31903335, 33128662, 34549579, 36203686, 38059409, 40076986, 41677339, 42635672, 42901540, 42729121, 42549252, 42492933, 42635510, 42655307, 42524572, 42099914, 41533464, 41026754, 40563440, 40256053, 40031725, 39796198, 39779219, 39751171, 39572700, 39225292, 38480149, 37696753, 37072307, 36843384, 37037330, 37615554, 38368603, 39205637, 40079702, 40735503, 41178022, 41320034, 41335058, 41517077, 41754539, 42373070, 43362642, 44036997, 44570568, 44281910, 43298156, 41886321, 40049068, 37952384, 35896952, 34247240, 32958712]
3765C2958712j103092j069634j330489j380131j430227j256433q25619q22624
3757B3740463o40102m32268l19735j05400N9383R7003K27400K20605L49510M93328
3747B3690187M64506K19686j34749l59868m81191o39696o27708n49042n60104
3738B1022021n82450o53046m46372n46121n13352n85212m57706l40888m17529
3729A6479345m51308k14243k72358k13364k04428l70220j96706j51461k1226j93170
3719A4190861j66483p9990j19619j09199N7771M6462N9348K9473P3032J29040
3709A4110696N0505J83497J80149J30852K63453K23389K03751J20908J33982L77306
3699A5978488M30970L43790L90435L65659L71926M44136N47886O62843O98844
$$ y = [32958712, 31855620, 30785986, 29455497, 28075366, 26645139, 25388706, 24563087, 23740463, 23100361, 22668093, 22348358, 22242958, 22302341, 22399344, 22626744, 22847349, 23196859, 23690187, 24154693, 24374379, 24239630, 23879762, 23398571, 22758875, 22131167, 21582125, 21022021, 20439571, 19786525, 19340153, 18794032, 18280680, 17695468, 17237762, 16896874, 16479345, 16028037, 15813794, 15541436, 15328072, 15123644, 14753424, 14556718, 14405257, 14384031, 14190861, 14024378, 13944388, 13824769, 13715570, 13773341, 13819803, 13879151, 13908624, 13981656, 14110696, 14161201, 14344698, 14524847, 14655699, 14919152, 15142541, 15346292, 15467200, 15601182, 15978488, 16409458, 16753248, 17143683, 17509342, 17881268, 18325404, 18873290, 19536133, 20234977]
3690B0234977P07359P45303N81666N84091P08223N33997M99385N05146N34197
3681B5634344N29020O08173N58898J73304k77358m55810o06172m69807j92987
3672B5501605P5641L30842L66212N90055P26690R08813J049650J223425J421187
3663C2194120J726687J757993J670798J464434J242322J202510J250418J543877
3655D4053159J662142J366316J026841O66421M1982p14799j161362j271742j136748
3646D4532210q90009n35586k48984n866J00862j17709l63631n55017k87876j34543
3636D1493851K33507P37385J103305J301006J358620J172931P63993N31140L03354
3627D8999092L40535N20040M92753N29839M24813J91603M36165M90923L73958
$$ y = [20234977, 20942336, 21687639, 22269305, 22853396, 23561619, 24095616, 24595001, 25100147, 25634344, 26163364, 26771537, 27330435, 27503739, 27226381, 26770571, 26164399, 25694592, 25501605, 25577246, 25908088, 26274300, 26864355, 27591045, 28499858, 29549508, 30772933, 32194120, 33920807, 35678800, 37349598, 38814032, 40056354, 41258864, 42509282, 44053159, 45715301, 47081617, 48108458, 48774879, 48816861, 48102062, 46940700, 45668958, 44532210, 43642201, 43106615, 42857631, 42851765, 42952627, 42834918, 42471287, 41916270, 41628394, 41493851, 41727358, 42464743, 43568048, 44869054, 46227674, 47400605, 48164598, 48695738, 48999092, 49339627, 49859667, 50352420, 50882259, 51307072, 51498675, 51934840, 52425763, 52799721]
3618E2799721J06199P5986K42148L55311J38874m94355j373152k080377k094996
3609D7675359j907180j593786j284671r81745n37109k35337k09195n8930k00008
3600D0667398k79904m07480l76490o6297Q4944L33374P08518R40121J100512J179385
3590D3884081J048734P84430M98889Q7808k19629n08722q69226j084225j452343
3581D2169797j658175j771688j679831j447085j235233j114101q83731p51717
3573C1628236n74435m28317m90201m65541m63117m47237l46656k62991j17856
3564B8031885r6491K03280R5331L2186J62811j3622k18846m82301m24518m38649
3554B6851066n27041o30464p51508r14845p69304o82761o88052n14971m85860
$$ y = [52799721, 52905920, 52981906, 53224054, 53579365, 53718239, 53223884, 51850732, 49770355, 47675359, 45768179, 44174393, 42889722, 41907977, 41370868, 41135531, 40926336, 40867406, 40667398, 40387494, 39980014, 39603524, 39537227, 39622171, 39955545, 40664063, 41604184, 42704696, 43884081, 44932815, 45717245, 46216134, 46303942, 46084313, 45575591, 44706365, 43622140, 42169797, 40511622, 38739934, 37060103, 35613018, 34377785, 33263684, 32379953, 31628236, 31053801, 30625484, 30135283, 29669742, 29206625, 28759388, 28412732, 28149741, 28031885, 27935394, 28138674, 28234005, 28266191, 28429002, 28415380, 28196534, 27714233, 27289715, 26851066, 26324025, 25693561, 24942053, 24027208, 23257904, 22575143, 21887091, 21372120, 20886260]
3545B0886260m35795l77166l55210l63960m09338l94927m43525l38683k91763
3536A7475893l63619l76384k79967l11908l22679k77178l22700l37108j89200
3527A4695150k46750l11660q6765k36876k49424k44480j54513j26761j94533j43915
3517A2699473k03336j84263j84329o4448k20251k25782l27124k63891k17992k35132
3507A0572925l31732k68866j60714k06252p4266j39615k35263k09613l3323q6498
3497H826783j41690j77121j44033p2334j61006m5684q2168O986l5313p0609j18987
3486G784824o3714J7949j77946j64252j28050r6450j37370m1395r871j83928j08087
3475F691710j55449r0751P3918j17000L380j24282j27591M2612P9789j10778o8599
$$ y = [20886260, 20450465, 20073299, 19718089, 19354129, 18944791, 18549864, 18106339, 17767656, 17475893, 17112274, 16735890, 16455923, 16144015, 15821336, 15544158, 15221458, 14884350, 14695150, 14448400, 14136740, 14049975, 13813099, 13563675, 13319195, 13164682, 13037921, 12843388, 12699473, 12496137, 12311874, 12127545, 12063097, 11842846, 11617064, 11289940, 11026049, 10808057, 10572925, 10241193, 9972327, 9811613, 9605361, 9531095, 9391480, 9156217, 8946604, 8913281, 8826783, 8685093, 8507972, 8363939, 8291605, 8130599, 8084915, 8002747, 8009733, 7974420, 7903811, 7784824, 7721110, 7739059, 7561113, 7396861, 7268811, 7172361, 7034991, 6993596, 6983725, 6799797, 6691710, 6536261, 6445510, 6519428, 6402428, 6405808, 6281526, 6153935, 6196547, 6276336, 6165558, 6096959]
3464F096959o7683p8466L2795m9687n4156J2152N1031O3045k2711j49008m147
3453E830124L7864r0274q1797N1619n2234j29962o1409l974R8793J12144n8197
3442E652697r4999q0052P308M1342o6574p5894l555n8163n8289Q3567L2478r2677
3430E287189k1748N4395n2459M0708K3794J6084J51555Q56m9119K9751q090L7204
3418E510120k6292j952o8235j2406K4329j5845K9450o1570j9217N6065j0027P3873
3406E478293m0582J6414n6094r492P6207m6197P6243k832j1626P2243q1052O790
3394E478315R4602j1306Q5676o8450m6425L9412J24302q5913k5709K2197J01364
3383E708065N7694n2719m693n0556O1000l474J0130O8022P570J1101P1535j16913
$$ y = [6096959, 6029276, 5950810, 5983605, 5933918, 5879762, 5891914, 5942945, 6005990, 5983279, 5834271, 5830124, 5867988, 5777714, 5695917, 5747536, 5695302, 5565340, 5503931, 5499957, 5598750, 5710894, 5652697, 5557698, 5477646, 5484954, 5526296, 5459722, 5383828, 5380273, 5322110, 5263821, 5347388, 5379866, 5287189, 5265441, 5319836, 5267377, 5308085, 5331879, 5347963, 5499518, 5500374, 5451255, 5481006, 5472916, 5510120, 5483828, 5481876, 5413641, 5401235, 5425564, 5409719, 5439169, 5377599, 5358382, 5414447, 5404420, 5478293, 5437711, 5454125, 5398031, 5388539, 5464746, 5418549, 5494792, 5491960, 5480334, 5552577, 5471525, 5478315, 5572917, 5561611, 5647287, 5578837, 5532412, 5571824, 5696126, 5610213, 5584504, 5606701, 5708065, 5765759, 5713040, 5708347, 5657791, 5718791, 5715317, 5725447, 5793469, 5801039, 5812140, 5883675, 5766762]
3371E766762l9473n5848o2245M4446q7011q6215m0210q0150r636q3863r8780Q5536
3359E253313L1198j14565k0891M0718m4377q0923q9297n6153k0632j3732o2857
3348D821802k9800j34729K0601O4765J4233j99487k4289J96336O8336P6203o2916
3337D811055m7164q622J8994k531m0529L2644J5188n8130N9623P7916j00697J4456
3325D772203l8362k26936n6907q9208L4999m7224j28487j4469j371J46481P4227
3314D424946l355R2744K3270K7970o2185r0246j31813R1919L9741J05699j4217
3303D504473r4021M6509j5447j3428J8590J24575O0218r3566L2719P3642p7657
3292D566607l5727j10236j2447K9238l3942j1403M8556J31335J44395Q5765m6132
$$ y = [5766762, 5727289, 5671441, 5609196, 5653642, 5566631, 5480416, 5440206, 5360056, 5350420, 5266557, 5167777, 5253313, 5284511, 5169946, 5149055, 5189773, 5145396, 5064473, 4975176, 4919023, 4898391, 4884659, 4821802, 4792002, 4657273, 4677874, 4742639, 4756872, 4557385, 4533096, 4729432, 4797768, 4873971, 4811055, 4763891, 4755269, 4774263, 4771732, 4731203, 4763847, 4779035, 4720905, 4780528, 4858444, 4757747, 4772203, 4733841, 4506905, 4449998, 4360790, 4395789, 4348565, 4220078, 4205609, 4204238, 4350719, 4424946, 4421591, 4514335, 4537605, 4565575, 4503390, 4413144, 4281331, 4373250, 4412991, 4518690, 4504473, 4410452, 4456961, 4441514, 4428086, 4446676, 4571251, 4631469, 4537903, 4570622, 4644264, 4566607, 4530880, 4420644, 4408197, 4437435, 4403493, 4392090, 4440646, 4571981, 4716376, 4802141, 4756009]
3281D756009r7485K7349L8714P0655L5635J54326M9561N5486J19092J59263J9602
3270E388207M1652N8947k019J70708J27725J11984J58041K55128K78493J13837
3260F702703J67197L20133K72702K01563J41774K09165J73995P5287k6687j37602
3250H100230j63676k35438k51794l53341k99444l77122k53910j93889k48677k41327
3240E481612j19192j90952j47813k37393j37563j94850l25571p3356j5523p6012
3230C963387j86095l5805l5459j03112m7331m3978q9359J7363J3872m1384n4857
3219C357242n4112J0710l8959k099N5722Q9209R7550Q1495L2857J25141L3320
3208C788076p0243o0927j27413R401j01085q7854N154o5542l0949j12973j00881
$$ y = [4756009, 4658524, 4685873, 4724587, 4795242, 4830877, 4985203, 5034764, 5090250, 5209342, 5368605, 5388207, 5429859, 5488806, 5486787, 5657495, 5785220, 5897204, 6055245, 6310373, 6588866, 6702703, 6869900, 7190033, 7462735, 7664298, 7806072, 8015237, 8189232, 8264519, 8237832, 8100230, 7936554, 7701116, 7449322, 7095981, 6796537, 6419415, 6165505, 5971616, 5722939, 5481612, 5362420, 5171468, 5023655, 4786262, 4648699, 4453849, 4128278, 4054922, 4039399, 3963387, 3777292, 3741487, 3706028, 3602916, 3555585, 3511607, 3422248, 3439611, 3453483, 3412099, 3357242, 3303130, 3313840, 3274881, 3272782, 3328504, 3417713, 3515263, 3596758, 3629615, 3754756, 3788076, 3717833, 3656906, 3529493, 3538894, 3437809, 3349955, 3355109, 3289567, 3258618, 3145645, 3044764]
3197C044764J34969l3422M2635j36229J9929k3478q6633K8194n454L9548N1285
3186C076108K5611J65019m7303j1257O3084N4207J13042M8654q6088r8516J6040
3175C318601q765m574r8690p7707p366M5307M0869K4288K7938n7672L3285o5969
3163C169545J5896L6207o6112J46632P5082J5265n0757O0206L3582O5460j2172
3152C488834J55415J30918R8354r3760K357l6211k4571l2230m6334o2200j37444
3141C443128j5900p3663J7403K7921p1569j36733P6350N4369L7410l9721j54000
3130C164995k6082J31658N57J34426o3457q1165J09317l1591N5545R8046K883
3119C495132L5239j888j3880M7791j04100K5611k1172R106K2080n1281J13479
$$ y = [3044764, 3179733, 3146311, 3188946, 3052717, 3072646, 3049168, 2962535, 2990729, 2985275, 3024823, 3076108, 3101719, 3266738, 3219435, 3208178, 3271262, 3325469, 3438511, 3487165, 3401077, 3302561, 3318601, 3309836, 3305262, 3206572, 3128865, 3121499, 3166806, 3207675, 3231963, 3259901, 3202229, 3235514, 3169545, 3185441, 3221648, 3155536, 3302168, 3377250, 3392515, 3341758, 3401964, 3435546, 3501006, 3488834, 3644249, 3775167, 3873521, 3779761, 3782118, 3745907, 3721336, 3689106, 3642772, 3580572, 3443128, 3427228, 3353565, 3370968, 3398889, 3327320, 3190587, 3266937, 3321306, 3358716, 3318995, 3164995, 3138913, 3270571, 3271128, 3405554, 3342097, 3260932, 3370249, 3338658, 3394203, 3492249, 3495132, 3530371, 3528483, 3514603, 3562394, 3458294, 3483905, 3462733, 3471839, 3493919, 3442638, 3556117]
3108C556117k824j23899j12878j01734n3544l7647j33966m3472Q0359K7920o941
3097C047491j00343j28710q5299J0528J6877p111j08786j07985r2707J0549O0239
3086B514743l5847J2685m4619q0545r4029M1607r701l389p3282L0189M4248k3303
3074B278757K706P187j59134o1093K6013q1981J6279j152q9268m0136m3214o6141
3062A788823m7379q1921m2710N008k3141q0602o468j01982K2848q0058m8111j8406
3050A285901m9413j38046O3476N7437l1809k5943o7953q2492o4376O8339o179
3039A008942m5672M809K901o763k3015m2386M0344M2194M1240j06747j05358q5573
3027G24916M3132O1290p5536l2887q8547o8180m9432o014J1178J7560Q4004O2326
$$ y = [3556117, 3553293, 3429394, 3316516, 3214782, 3161238, 3123591, 2989625, 2946153, 3026512, 3054432, 3047491, 2947148, 2818438, 2733139, 2743667, 2760544, 2753433, 2644647, 2536662, 2443955, 2454504, 2514743, 2478896, 2491581, 2446962, 2366417, 2272388, 2313995, 2304294, 2300905, 2227623, 2257812, 2302060, 2278757, 2281463, 2288650, 2129516, 2068423, 2094436, 2012455, 2028734, 2027582, 1938314, 1898178, 1854964, 1788823, 1741444, 1659523, 1616813, 1621821, 1598680, 1518078, 1511610, 1409628, 1432476, 1352418, 1304307, 1285901, 1236488, 1098442, 1161918, 1219355, 1187546, 1161603, 1093650, 1011158, 946782, 1015121, 1008942, 963270, 968079, 970980, 964217, 941202, 898816, 939160, 981354, 1022594, 915847, 810489, 724916, 768048, 829338, 753802, 720915, 632368, 564188, 514756, 508742, 519920, 537480, 621484, 683810]
3015F83810l9577m6425n755M5942q7176Q729J2828q0954j09300M4532J0351j9120
3003D17885R9131K7833q1113m4834M3915o5199L1844P9762o596j20011K0809J5662
2991D19088j15536J697O744j635J9673J7416k845J0439O1893K3054O3723n7906
2979D45805m9767Q351J3833J8696m5463Q099k0864K6244P274p2499P1490L0634
2967D41833m527q1889q1898N7677N2939M3010j8853o3911K1729j7513p989N3246
2955C93854M4627m9548n739J9030J9127l3301m3995M3840K2766Q5480K1253M1720
2943E59114k9807q2742m0632J11891k051m4065o082j8518m1618O2478K3725L0364
2931E22057M1881K287P6043j71537j2978M6234o284j8341L7853K615L6422K5755
$$ y = [683810, 644233, 597808, 592053, 637995, 550819, 559548, 572376, 491422, 382122, 426654, 437005, 417885, 517016, 544849, 463736, 418902, 462817, 397618, 429462, 509224, 502628, 382617, 403426, 419088, 303552, 305249, 311993, 310358, 330031, 347447, 344602, 355041, 416934, 439988, 503711, 445805, 396038, 404389, 418222, 436918, 391455, 399554, 378690, 404934, 412208, 339709, 411199, 441833, 437306, 355417, 273519, 331196, 384135, 427145, 408292, 344381, 366110, 348597, 340608, 393854, 438481, 388933, 383194, 402224, 421351, 388050, 344055, 387895, 410661, 496141, 517394, 559114, 529307, 446565, 405933, 517824, 515773, 471708, 465626, 447108, 405490, 467968, 491693, 522057, 563938, 566225, 642268, 470731, 457753, 503987, 497703, 479362, 517215, 519830, 556252, 582007]
2919E82007N1667l8236J9293m203L9720J1478N2044n141j28894l477p3591J7635
2907E20302M3991j69891j31106M5715R5738N869N2216J4573o2064j3938L8285
2896D39690k7897r8084J3455J13125k9836m8100L8686P630L0669J0885L3912J5644
2884D99779m0258j15193j15633R7293N9836j43O1376p7518q8214O029j9706q1463
2872A86185O1397K5086l1019L8198K1374J4293k2240j00224l9977j7863J6242
2861A51452J3831k6379j024j10205p0927J44506P8594m0946n665j4514o6268n0042
2849B413r341N1053O215Q1715r674m5607K1526n4888N6516k983l7464Q9206j14919
2836C3768n3313O2461L3403k7459O1221j2926J5624n975M1872l6167M8592n9572
$$ y = [582007, 633674, 595438, 614731, 610528, 650248, 661726, 713770, 708629, 579735, 576258, 502667, 520302, 564293, 394402, 263296, 309011, 404749, 410618, 462834, 477407, 415343, 401405, 439690, 411793, 313709, 327164, 440289, 410453, 362353, 401039, 408669, 439338, 450223, 484135, 499779, 459521, 344328, 228695, 325988, 385824, 385681, 447057, 369539, 281325, 287354, 267648, 186185, 247582, 272668, 241649, 279847, 301221, 315514, 293274, 193050, 153073, 135210, 151452, 165283, 138904, 137880, 27675, -43252, 101254, 179848, 138902, 133237, 118723, 52455, 2413, -6928, 44125, 50340, 132055, 122381, 76774, 98300, 43412, 99928, 96945, 59481, 148687, 33768, -19545, 42916, 76319, 48860, 110081, 97155, 112779, 106804, 148676, 112509, 161101, 101529]
2824A01529n5344L9435q3475n6720M6886K9969J4117R1882o7415j21732l253M6813
2812a7308J49210Q103o1420J5179J9085k4978j18763J9110Q654Q553o745m5588
2800d6908M9374P2227j12236K3219j0577q1763J9946K4693k8038J933J8053O5708
2788d369Q031m6439l4611m4397P3473J12815J3000r7399j11991N9418l6092J01798
2776f763K2402n3369M9218o9848O2606N8735m4335j379J5350J1568P0235n0111
2764F4309K3248P422m1330p5673M464L4047J405l0807p3728q679M4698j1687o8661
2751a30972J02323K5181p8601N588M2792P8702j2203n3345l6744o8841m0111L3217
2739a33014L0771K6273l680M4184k826j4338O2685j58900J8394N2952j0549J4866
$$ y = [101529, 46185, 85620, 2145, -54575, -7689, 22280, 36397, 128279, 60864, -60868, -64121, -17308, 131902, 140005, 78585, 93764, 112849, 87871, -30892, -11782, -3128, 5425, -1320, -46908, 2466, 74693, -37543, -14324, -24901, -106664, -86718, -62025, -90063, -88130, -70077, -4369, 3662, -42777, -77388, -121785, -48312, 64503, 77503, -19896, -131887, -72469, -108561, -6763, 15639, -37730, 11488, -58360, 4246, 62981, 18646, 17267, 32617, 44185, 114420, 64309, 87557, 94979, 53649, -22024, -17560, 16487, 17892, -12915, -86643, -95322, -50624, -62311, -130972, -28649, -3468, -82069, -76481, -33689, 45013, 32810, -20535, -57279, -126120, -166231, -133014, -102243, -75970, -79650, -35466, -38292, -52630, 10055, -148845, -130451, -77499, -88048, -73182]
2727g3182M9095k4235O0534Q33p2885P117j4536L778R241M0141k853n8168L8226
2714c6894K0978K6179l9625K658j1015p5416o60K576M8118n6128M6371M1598j15626
2701a46886P0643j7627P483M7898o0945j9463p664P3210j6925p2034m0797Q402
2689a74705M9039L3371O3605J6840j03059N6053J00146m4981j15912o2250N9842
2678a22011J34785l7252q9743O6787j6180o580j8452L5551L9441R529P828K8540
2666C2243L8241O65r8472N3220o0081j0694K8223k1972Q174K1189o3474j7837
2654i0575k9929L6135M193M9831j7665j46749M6082N8542K9742k3222l8902m5886
2642a68403J47771L7031m9854m4299J3664L4981N9831J763r1546J5639J3120n2766
$$ y = [-73182, -24087, -48322, 12212, 13045, -59840, -52723, -67259, -63481, -54240, -14099, -16952, -75120, -36894, -15916, 10263, -29362, -26704, -37719, -113135, -113795, -111219, -63101, -119229, -72858, -31260, -146886, -76243, -93870, -86387, -38489, -99434, -118897, -126561, -53351, -70276, -142310, -183107, -174705, -125666, -92295, -28690, -11850, -114909, -58856, 41290, -3691, -119603, -181853, -122011, 12774, -24478, -114221, -47434, -63614, -70194, -88646, -53095, -13654, -4125, 3703, 32243, 70484, 71149, -27323, 25897, -34184, -44878, -16655, -38627, -30453, -9264, -72738, -90575, -120504, -84369, -80176, -30345, -48010, -194759, -148677, -90135, -60393, -83615, -122517, -168403, -20632, 16399, -33455, -77754, -64090, -29109, 30722, 32485, -59061, -43422, -30302, -83068]
2630h3068P8327j9229J5439j7794O7147j39869L3707o965q069K2292J7428l7310
2618g7964j0230j8373M7626R5488L2886j13471m9553k3504J1341k9349K8069j4363
2606a21397J3500L1011O9735J06783j07351l3486l3485l3304M5071m0056N8101
2595d4878L4327r438R8344N6753n6140j88616K7563m0296N446K8383R6715p2011
2583f3848q9286R0187k7848p8916L4598m0249L0715k6494N9207M7507N1429J6914
2571C916K9991M7658m6901j61258N4505L6501q940O4679l4902l9587N2852j2846
2559a4332k783J20089l9410n5320L2192n772o4092o2347l246M229p2869O8220
2547i5441J376m4724J55000k5258P9183k4106q395p8249p4385N0905J8812J9051
$$ y = [-83068, -4741, -23970, -8531, -26325, 40822, -99047, -65340, -72305, -80374, -58082, -40654, -77964, -88194, -106567, -58941, 36547, 69433, -44038, -93591, -117095, -105754, -135103, -107034, -121397, -107897, -76886, -7151, 99632, -7719, -41205, -74690, -107994, -62923, -102979, -44878, -10551, -19989, 78355, 135108, 78968, -109648, -82085, -122381, -116935, -88552, 8163, -63848, -153134, -62947, -90795, -169711, -135113, -175362, -144647, -171141, -111934, -64427, -12998, 3916, 33907, 81565, 34664, -126594, -72089, -35588, -44528, 20151, -14751, -54338, -1486, -14332, -17115, 102974, 63564, 8244, 40436, 34664, -29428, -91775, -95021, -90792, -163661, -95441, -94065, -138789, 16211, -9047, 70136, 46030, 37635, -40614, -114999, -64094, -45282, -26231]
2535b6231l5297J3740j0156K5892k9299R381L679o5685K0765P5566l8644L0981
2523b5308J7418n349R6001p255q5249k9170l9220K381m252k9096n93O5929P6443
2510C2680k3456m1638N5850j3127m8421L21Q5738o0351k6742O4618L2365j36710
2498g8873K384m9514p8535J55152P5814l9106L3893R9833n1087J659p6897k0341
2486b5618n3367k4016O1535k7929N3627N8719j08326J8882J39043l3286N6550
2475A15814n195j35497r2520r7759M7521J31739m2341P506O1710n3992o4571m3763
2463a71348J7839l123N1148R5970K2797j1461N0017n6845j579M2710J01059k8832
2451A08352j43818m8319p5753L375m9101J00046J35365M6291m8214k6630p1400
$$ y = [-26231, -61528, -47788, -57944, -32052, -61351, -51970, -48291, -113976, -93211, -17645, -56289, -25308, -7890, -13239, 82762, 75507, -9742, -38912, -78132, -75751, -80003, -109099, -109692, -43763, 32680, 9224, -32414, 23436, 10309, -38112, -37791, 47947, -12404, -39146, 25472, 57837, -78873, -76489, -126003, -204538, -49386, 26428, -12678, 21215, 121048, 69961, 71620, -5277, -25618, -78985, -103001, -41466, -69395, -15768, 42951, -65375, -46493, 92550, 59264, 115814, 110619, -24878, -117398, -215157, -167636, -35897, -78238, -70732, -9022, -63014, -127585, -171348, -153509, -156632, -105484, -9514, 13283, 1822, 51839, -5006, -6585, 36125, 137184, 108352, -35466, -83785, -159538, -156163, -205264, -105218, 30147, 76438, 28224, 1594, -69806]
2440f9806m0991P1521q390j123O1430n039K9861p64K8556p3792q2843J17205K7121
2427E2946j4818M0181j13102l4608J36818M1483p6159k8041L1560j1297R163P826
2415D1952M7557q1247n1782K8890j3945m7435O2771L5067j2889O750R825N0003
2403G5517N956m0042o780k3204q392l662P6902m8988l5695Q8920l1629p5082r406
2390c5585J33133J4529L7123k1761j03161N9325J22878M3304N2227Q5155j84210
2379B02957l9010n95m4129M9012J9034p7347o5382l6732k611P8154l7388J2820
2367E8783P0139o5055p0349j2272n7980M2740O9031K5752Q830l543q958o7663
2355a0545o6942J57888l741j06111J08642J2139q3508N2934o9587R0759l0630
$$ y = [-69806, -110797, -39276, -47666, -48789, 12641, 7602, 37463, 36699, 65255, -8537, -91380, 25825, 52946, 38128, 78309, -34793, -69401, 67417, 108900, 32741, 4700, 36260, 24963, 34126, 41952, 89509, 8262, -43520, -14630, -28575, -76010, -13239, 21828, 8939, 15689, 25514, 75517, 81473, 41431, 34651, 11447, 3055, -607, 76295, 27307, -8388, 80532, 48903, -26179, -35585, 97548, 112077, 149200, 127439, 24278, 83603, 206481, 249785, 302012, 387167, 202957, 163947, 163352, 119223, 168235, 187269, 109922, 44540, 7808, 5197, 83351, 45963, 58783, 128922, 63867, -6482, -18754, -76734, -33994, 35037, 60789, 69619, 66076, 57118, -10545, -77487, 80401, 76660, -29451, 79191, 91330, 7822, 60756, -8831, 81928, 51298]
2344E1298J2214N3817l7724m7513j12778J08395o6250M980p6114k5284R7870L697
2332c3392k107O6223O4817J4022R340M4769j2440m588M004M2517q6215m4794L100
2319F5256k6454L379n5910Q1375M4294p1025q5463P0316J20706j47730o6873Q0363
2307A2234M794k5532O6403L9981m8492M5809p0524j6456J2929j0957j1207J09722
2295A08704N2014q238r4736R0556J00965j37122j13191J99648J32493q1838j10115
2284A39140j00006J54813k6996q4037Q3713L7149o4036M2394l2151o9014k55K7819
2272A08533L8273O5274J7159l3020j9470L524O8735J1702K6984r583l4956o4708
2260A78447O2802m3336n2021M1191R2301m9790n0214m465M6966K0869j40553L7739
$$ y = [51298, 63512, 117329, 79605, 32092, -80686, 27709, -38541, -33561, -109675, -134959, -37089, -33392, -35499, 30724, 95541, 109563, 118903, 163672, 151232, 146644, 150648, 193165, 106950, 62156, 65256, 38802, 42181, -13729, 67646, 111940, 40915, -44548, 25768, 146474, -1256, -68129, 12234, 17028, -8504, 57899, 97880, 49388, 95197, 24673, 8217, 21146, 10189, -1018, 108704, 160718, 152480, 57744, 148300, 249265, 112143, -1048, 198600, 331093, 249255, 139140, 39134, 193947, 166951, 82914, 166627, 203776, 139740, 182134, 149983, 80969, 80714, 108533, 146806, 212080, 229239, 196219, 176749, 180273, 249008, 260710, 287694, 278111, 243155, 178447, 241249, 197913, 145892, 187083, 279384, 229594, 179380, 174915, 221881, 242750, 102197, 139936]
2248A39936L7528K0465P1922l3383p3610L5854P0274K2501L0935P290r2419m561
2236B32732M9932O7335K2512p3602O7923n4311P2063m8476m2390J8855n586l542
2224C03445j8307q536Q0002j2612n3157J13585P0866q085r4317R1316L602n2260
2212D15542L2580P0412m8068M8443J7519m9439L346Q3290m5220k2529K7728M2206
2200E75810n9805J11855K5809O1574Q4319R8357j1447j2419M0409M3799Q223M0159
2188A006643k8755J16280l6459m1797R1821O2021L7485M749m7676J09824L7391
2177A311527J0303p852L2706Q2278l3842n0488q16K9733J14613R2478R3569K9792
2165A704001p182Q1294O4867J8216L4385N4605M9682N2958O1569J81037P4420
$$ y = [139936, 177464, 197929, 269851, 236468, 162858, 198712, 268986, 291487, 322422, 329712, 237293, 232732, 282664, 349999, 372511, 298909, 366832, 312521, 384584, 336108, 293718, 312573, 306987, 303445, 285138, 276602, 356604, 343992, 290835, 404420, 475286, 467201, 372884, 464200, 467802, 415542, 448122, 518534, 470466, 518909, 536428, 486989, 490335, 573625, 528405, 505876, 533604, 575810, 516005, 627860, 653669, 715243, 799562, 897919, 886472, 874053, 914462, 958261, 966484, 1006643, 977888, 1094168, 1057709, 1015912, 1107733, 1169754, 1207239, 1211988, 1164312, 1274136, 1311527, 1321830, 1313978, 1346684, 1428962, 1395120, 1344632, 1343816, 1373549, 1488162, 1580640, 1674209, 1704001, 1696819, 1778113, 1842980, 1861196, 1895581, 1950186, 1999868, 2052826, 2114395, 2295432, 2369852]
2154B369852K9331p4178P1338L0326K05924J50492J52726J05375J25201K20731
2144C387118Q6584J68591J83987L24732L26131K19896L11596L15095L55521K50359
2134E929610N62250P13257P30377Q34940P45920Q20440Q55469J049353J421830
2125A3663446J709410K079565K237253K803686K921120L593570M467827O036029
2117C9511906P275259R298666L915567n588873r737531r409011p256755n050396
2109B2958832l458251k876682k042298j606417j056392r68109q36548o56071l31794
2100I126270n14545o52418p89271n91809n29327l94958l33775l78560k43884k10603
2090D487120j66717k89753j80878n5642j68761j73476j87493p0397p5678j35583
$$ y = [2369852, 2399183, 2325005, 2396343, 2426669, 2632593, 2783085, 2935811, 3041186, 3166387, 3387118, 3473702, 3642293, 3826280, 4151012, 4477143, 4697039, 5008635, 5323730, 5679251, 5929610, 6491860, 7205117, 7935494, 8770434, 9516354, 10336794, 11192263, 12241616, 13663446, 15372856, 17452421, 19689674, 22493360, 25414480, 29008050, 33475877, 39511906, 46787165, 56085831, 60001398, 54412525, 44674994, 35265983, 28009228, 22958832, 19500581, 16623899, 14581601, 12975184, 11918792, 10950683, 10114135, 9458064, 9126270, 8611725, 7959307, 7170036, 6578227, 6048900, 5653942, 5320167, 4941607, 4697723, 4487120, 4320403, 4030650, 3849772, 3794130, 3625369, 3451893, 3264400, 3194003, 3118325, 2982742]
2080B982742r0876k06380j38626j26170q4531j21516r6829n0631o2961J9216j37001
2069A886437o2335m7630j38991q0491q7223p7013j4670R6042L6439r1234k0049
2058A399282q3441P6138q6592l9264k2378q555r1841k9513K0026j21212M01Q0304
2046A093355L941j8879j37434r6005p6305M1893j0756k1001n6249m0639N7721
2035G39642J42593m9355l6174J5438n9532N3751k2709k20753K9548Q75N3533M9078
2023F95935q7934m6706J8606O9045r6467l7861o744j20000n3541Q1697K1809k2774
2011D15065M7946K5246r8708j7053l3722M2072k8976O2847L6847l5747n0291o3139
1999C02387Q6477p9475K7294n062k0056K3359j1251R973m1314o4379M1391j2696
$$ y = [2982742, 2891866, 2685486, 2546860, 2420690, 2336159, 2214643, 2117814, 2067183, 2004222, 2023438, 1886437, 1824102, 1776472, 1637481, 1556990, 1469767, 1392754, 1378084, 1474126, 1510565, 1419331, 1399282, 1315841, 1391979, 1305387, 1266123, 1243745, 1235190, 1143349, 1113836, 1133862, 1012650, 1013051, 1093355, 1097296, 1078417, 940983, 844978, 768673, 810566, 799810, 778809, 722560, 681921, 739642, 882235, 832880, 796706, 812144, 752612, 806363, 783654, 562901, 592449, 593324, 646857, 695935, 608001, 561295, 579901, 648946, 552479, 514618, 507874, 387874, 334333, 416030, 437839, 415065, 463011, 488257, 389549, 372496, 338774, 380846, 351870, 414717, 451564, 415817, 365526, 302387, 388864, 309389, 336683, 331621, 311565, 334924, 323673, 333646, 292332, 227953, 269344, 256648]
1987B56648q8737N8802M2467M0961l8615J26844n5986q1539l9700o9555L9703
1976A91293p258Q0884M7999o7180J9021K8273p1821K0973o0389k0770k5274k6973
1964A08778k2643Q3256J10497j7548j67124m06k3020k6758l3283J72738n9993
1953A24494l2550J95191j21432m6966r288R3576p9186O8834m4090n5701q4302
1942H580K880L2399K13744k3757o4370l4279l4736K757M3174o979m9404j16349
1930b6340K2981P0573R9235K5065j04374q149R0866q5987m8486N1693L4824K819
1918A24720k9744P1611j08473n6235L7971M8280R4850M9963j04922j16584l6954
1907b5517J914N3417N6060n4261n0244J24456p3565L6963l5923n3748P4693L8021
$$ y = [256648, 167911, 226713, 269180, 310141, 271526, 398370, 342384, 260845, 221145, 151590, 191293, 184035, 264919, 312918, 245738, 264759, 293032, 221211, 242184, 181795, 161025, 135751, 108778, 86135, 169391, 279888, 262340, 95216, 94810, 71790, 45032, 11749, 184487, 124494, 91944, 287135, 165703, 118737, 109449, 203025, 123839, 192673, 148583, 92882, 8580, 11460, 43859, 257603, 233846, 169476, 135197, 100461, 103218, 146392, 139413, 90009, -26340, -3359, 67214, 166449, 191514, 87140, 78991, 169857, 83870, 35384, 87077, 121901, 124720, 94976, 166587, 58114, 1879, 39850, 88130, 182980, 232943, 128021, 11437, -25517, -23603, 29814, 85874, 31613, -18631, 105825, 32260, 69223, 33300, -20448, 54245, 92266]
1895I2266K890O3142K7694o8266m1166j4456k3149m782M7646R608l8044j6862
1883C6521J00551J6734j29953k0693J47083n7258N1534j60342J340J55141L754
1872A44412j37151m0324J8275j4457K451n3521R5353J58674o4094p6618l7610
1861d610l9293J48954P0614j4624K7043l7130J16490o8006r8505L1877P4033N3309
1849B60152N251k0087O0673J15279J2131j69783R7242o6919j06619q3541l9193
1838F4586J85441j03870k2579L9441J6282o3876r1667l6175J1422M4797n4527
1827a0725q7687J7068n4221L3639J06322J6523Q278Q9344K3221m6789j10841q9192
1815a05060N4559L3110Q8192J4769L2446o5949L6038j25745L8477L5096k7843
$$ y = [92266, 95156, 158298, 185992, 117726, 76560, 62104, 38955, 34173, 81819, 91427, 53383, 36521, 137072, 153806, 23853, 3160, 150243, 92985, 144519, -15823, -14483, 140658, 144412, 7261, -33063, -14788, -29245, -26794, -80315, 15038, 173712, 109618, 33000, -4610, -43903, 105051, 175665, 161041, 188084, 150954, 267444, 199438, 100933, 132810, 206843, 260152, 265403, 245316, 305989, 421268, 433399, 263616, 360858, 293939, 187320, 103779, 64586, 250027, 146157, 123578, 163019, 179301, 115425, 23758, -12417, -995, 43802, -10725, -98412, -81344, -135565, -101926, 4396, 20919, 29197, 118541, 141762, 94973, -15868, -105060, -50501, -17391, 70801, 85570, 118016, 52067, 88105, -37640, 837, 35933, 8090]
1804H090M6771J4204m4665n3283j7618n7915M5794K8581L7081m3863J1611K7691
1792B479p5485l1622P1393p5764O845Q0891K7494P2983l7084Q0685r7392J3206
1780C8629J37093r0313j0595p5240j8422m8246L1596N8418r8120O5289P0243n8925
1768A407K7646p2331J8837K3405n0825l8468K2682J14656L9786q3209K2713Q2067
1756A08366N37o8449m2769J159L3730n796k7152J4359J9252k5027R909q6856L004
1743f5733K2278N7001k1339k983N9841n0501o6970L4401O8431l9252N7838P3725
1731A26737j60153q3282L0643Q3672J0640j21618L3752J02119j16357P4233M0279
1720B0665l6717M0669k6014J5274N7926m6275k7869k7155j201J8230K9441J3828
$$ y = [8090, 54861, 69065, 24400, -28883, -46501, -104416, -58622, -30041, 7040, -36823, -25212, 2479, -73006, -104628, -33235, -108999, -102154, -21263, 6231, 79214, 42130, 122815, 25423, 38629, 175722, 85409, 74814, -426, -18848, -67094, -35498, 22920, -75200, -9911, 60332, 1407, 29053, -43278, -24441, -1036, -51861, -90329, -67647, 47009, 86795, 3586, 26299, 108366, 108903, 40454, -2315, -1156, 32574, 26778, -374, 13985, 33237, 8210, 18119, -68737, -65733, -43455, 13546, -7793, -10776, 49065, -1436, -68406, -34005, 34426, -4826, 53012, 126737, -33416, -116698, -86055, -2383, 8257, -113361, -79609, 22510, -93847, -19614, 20665, -16052, 24617, -1397, 13877, 71803, 25528, -2341, -29496, -30697, -12467, 16974, 30802]
1708C0802K6125J2992m5418j4561j3225N2874l5512m0627j5241K979K6640l0757
1696d2929k7743l584K1328K7529l3192N4415r464N4475j4726P2555r1724p0065
1684f3125M3613o9313p2113O6932M2264L3261n6299n6890J22056p9210K1783J28998
1672F1957K847p2431q3230P40L8580j01752P4081q2984J30344K578q4820M3867
1660g0223J19042L6505n4895K2162j63147J28895K3804J7431o2864L9079l1520
1649D269R307j6150J7118J8951j02781l817Q475L9190M9002o184l8105K886M5825
1636B7986m7586O8092j1412q3315k4875O2910m1633q8766Q5387O9547l4755l4956
1624e3376O5021j19060P640M4820j7829N8207N4470m7581J4760k3770k1040L7469
$$ y = [30802, 56927, 69919, 24501, 9940, -3285, 49589, 14077, -26550, -41791, -38812, -12172, -42929, -70672, -74256, -52928, -25399, -58591, -4176, -13640, 40835, 26109, 98664, 6940, -63125, -19512, -88825, -160938, -94006, -51742, -18481, -74780, -131670, -9614, -88824, -67041, 61957, 64804, -7627, -90857, -90117, -51537, -153289, -79208, -162192, -31848, -29270, -114090, -70223, 48819, 85324, 30429, 52591, -110556, 18339, 42143, 59574, -3290, 35789, 4269, 13576, -2574, 14544, 33495, -69286, -73103, -64628, -25438, 23564, 17380, -20725, -17839, 27986, -19600, 48492, 37080, -46235, -71110, -8200, -49833, -138599, -53212, 16335, -18420, -53376, 11645, -107415, -99775, -54955, -72784, -14577, 39893, -7688, 7072, -16698, -37738, -269]
1612b69m28p9802J00248M315j2224p825j4759l640k1747q8362j6922L4071m1606
1599a48950M6496M1596J07505r0832R5903j9160j08095L7908O9921n4788Q7709
1588F5213P3044n7945L941O748o1416L1144O872j08347L0765Q45J10294j01216
1576e8n0062J5186l0117k471J026K1255m0721K5777M7470N0728r8580N4117J24633
1563A18183q3888r9794j9175L5059j9643L7063j2368R8030R269k2957p9997j3293
1551e3511j3503p5655J47050J4502j9118K3142M7001j16098q6878j4079L0000
1540a17147O2654J9902n3313m73k3831J1948R0102J4595J6695o2158j0953O0020
1528H041m5776j18964Q3676N1135J3151m2877M1858K2653m8048P5816m7885n5034
$$ y = [-269, -697, -80499, 19749, 24064, 11840, 4015, -10744, -14384, -36131, -124493, -141415, -107344, -148950, -102454, -60858, 46647, -44185, 51718, 32558, -75537, -37629, 32292, -22496, 65213, 138257, 80312, 84253, 91001, 29585, 60729, 67601, -40746, -9981, -9136, 101158, -58, -50120, -34934, -65051, -67522, -66496, -45241, -85962, -60185, -12715, 38013, -60567, -6450, 118183, 34295, -65499, -84674, -49615, -69258, -32195, -44563, 53467, 62736, 39779, -40218, -53511, -67014, -142669, 4381, 18883, -235, 22907, 69908, -46190, -133068, -147147, -117147, -54493, -34591, -87904, -88377, -112208, -100260, -10158, 4437, 21132, -41026, -51979, 8041, -37735, -156699, -73023, -21888, -8737, -51614, -9756, 12897, -35151, 40665, -7220, -62254]
1516f2254n1790J9719O4042J2176l1138k233K6560J4318m2470r09R961j06004
1504a50022N197Q3946J39228l0364m1884n8077p5221K8403O8177M6188m2257r4022
1492a20708N7642J01986n3099L6005k8116o9709J1804k3366o3467J008Q8098M8810
1480a3112n6022q360N2562j2715l6011n6249M8269j4385j675j5857J34321O9244
1468I0010j09564p3237J0562M0504j08555J3112N1685Q8690K3908p2994N392J27586
1456H7099j02919p0599K0245n2688J16571L3188J93m9964k7843J5874p0753p3905
1444a75501L1015M0723N7560M326J0116k160k1785J821j5174j1024m36O817m6206
1431a19908M3398N3102l8217n335J7883M1307j07793K5569P0623o0332k760M5459
$$ y = [-62254, -114044, -94325, -30283, -18107, -49245, -51478, -24918, -10600, -53070, -53979, -44018, -150022, -144825, -60879, 78349, 47985, 6101, -51976, -127197, -98794, -30617, 15571, -26686, -120708, -63066, 38920, -14179, 21826, -6290, -75999, -64195, -87561, -151028, -150020, -61922, -13112, -69134, -77494, -24932, -37647, -73658, -129907, -81638, -96023, -97698, -113555, 20766, 90010, -19554, -92791, -82229, -41725, -150280, -137168, -85483, 3207, 27115, -45879, -40487, 87099, -15820, -86419, -66174, -118862, -2291, 30897, 31090, -18874, -46717, -30843, -101596, -175501, -144486, -103763, -46203, -41877, -31761, -33921, -55706, -53885, -69059, -80083, -80519, -73702, -119908, -76510, -23408, -61625, -66960, -49077, -7770, -115563, -89994, -19371, -79703, -82463, -37004]
1419c7004M7107p9369l7815k4190P1366N9918j6005j5137N7915o3729r316o4434
1407a10693K6174k3867R1576M6852j3772l03k6935k724l4307K4384P0832l4662
1395A2555l6527J4547j1782m4546k5046Q8993O4457q2786l3728K9539j8441J36549
1383I3784l3978r6401O3568K3782m0969Q950k8877j0796m774N038j97l6248k8431
1370h5549J26647m9945n8022O9673o491n8351k4450Q4358n1638J5520J1982p9219
1358a05485J51524R892K673j4364r81m0757O160K4278l7777m4353J01690L8830
1346I1330r6879J0236L1407m0345K9626L7221j34984J10843R8292r2874K9312
1335G3185j18844m5850M7874n103o941n7725Q4819O2349q1562J7394M6584n9867
$$ y = [-37004, 10103, -69266, -107081, -131271, -59905, 13, -15992, -31129, 26786, -36943, -46259, -110693, -84519, -108386, -16810, 30042, 16270, 15967, -10968, -13692, -47999, -23615, 47217, 12555, -23972, -9425, -21207, -65753, -90799, -1806, 62651, -20135, -53863, -24324, -42765, 93784, 59806, -36595, 26973, 50755, 9786, 18736, -10141, -20937, -25711, -20673, -20870, -57118, -85549, 41098, -8847, -66869, 2804, -3687, -62038, -86488, -2130, -53768, -38248, -26266, -105485, 46039, 55931, 58604, 44240, 43259, 2502, 8662, 32940, -4837, -49190, 52500, 91330, -5549, 4687, 36094, -4251, 25375, 62596, -72388, 38455, 136747, 43873, 73185, -45659, -91509, -43635, -48738, -55679, -113404, -28585, 33764, -47798, -30404, 16180, -43687]
1323d3687L6146k5436L6776J6910L8216j5684J7299l7803l857L2536j8344l3770
1311f98M7844n3955o3113J8303Q5398k0107o0034k1442j9861J01036j9421L9509
1299C3459m3979m3467l290L8259j2788P2489k9972j22547L7751k1633L0178J4208
1287e1332o702M7870o0737j417O2591K0505j9468J238K0403K1632n3444m3383
1275f2244P691k8519Q3116j3244K9650j7573P1936Q2373k5872q3217j2663M6417
1263G7851m829K1589m3519K900m4715M7038Q7395q6832J2495q879j22362J4245
1251d7623J17250j4404K7095K7658r9339r7274r607P1768N6708Q419j613k3801
1239A5237j1433l2152n0472L2549J33946n3542l8353R3386j14012L716k6977o837
$$ y = [-43687, -7541, -32977, 3799, 20709, 58925, 43241, 60540, 22737, 18880, 51416, 33072, -698, 47146, -6809, -69922, -51619, 33779, 13672, -46362, -67804, -87665, 13371, -6050, 33459, -10520, -53987, -57277, -19018, -31806, 40683, 10711, -111836, -74085, -95718, -65540, -51332, -58034, -10164, -70901, -72318, -9727, 10778, -8690, -7452, 12951, 34583, -18861, -62244, -54553, -83072, 44, -13200, 16450, -1123, 70813, 153186, 127314, 44097, 31434, 77851, 73022, 94611, 51092, 53992, 9277, 56315, 143710, 56878, 69373, 60494, -61868, -47623, 69627, 55223, 82318, 109976, 10637, -86637, -96244, -24476, 32232, 40651, 39038, 15237, 3804, -28348, -78820, -46271, 87675, 34133, -4220, 89166, -24846, -21130, -48107, -54944]
1227e4944J4307P0003m4369j2529R058L5287j3646q602N8002K7548j7082L9656
1215A02689j0022l3531j3505Q026J4246j9086n6034p7826J37256k5950m398q1903
1203f0038M1939Q7688K8820k944j35058K8205K4449J7219j48706M9894N8407N4372
1191D4247q8756q7522J23137Q145n9618Q8056j9769Q73k0905l7355O1710P840
1179B0083O2712m8328k0859m8994M4999l0312J0585K6062J1240k4330O1432k9467
1167C4823o7952k9537K6081k5423q4811J01921m2371J56874O5451l872l7644j65292
1155g1752J14470j9984j12717J7122J24758O538r1704l4927o961L7596j904q651
1143d8116N6654J2398M376J3823q6102Q3720k3520j6840L870j59741R1744N0160
$$ y = [-54944, -40637, 29366, -15003, -27532, -18474, 16813, 3167, -5435, 52567, 80115, 63033, 102689, 92667, 59136, 45631, 53657, 67903, 48817, -7217, -85043, 52213, 26263, 21865, -60038, -18099, 69589, 98409, 95465, -39593, -11388, 13061, 30280, -118426, -68532, -10125, 44247, -44509, -132031, -8894, -749, -60367, 27689, 7920, 8793, -12112, -49467, 12243, 20083, 82795, 34467, 13608, -35386, 9613, -20699, -10114, 15948, 27188, 2858, 64290, 34823, -33129, -62666, -36585, -62008, -146819, -44898, -87269, 69605, 135056, 131184, 93540, -71752, 42718, 22734, -89983, -72861, 51897, 58435, -33269, -68196, -75157, -37561, -39465, -48116, 8538, 20936, 25312, 39135, -46967, 36753, 13233, -3607, 263, -159478, -67734, -17574]
1131a7574J57356J9182p4470q9366l9970M2845k3982n7614L7609L6567M1199k2482
1119I300p665m4723J0235M4896p3382M0454K1178M8048Q3908r7904p218m1547
1107a4420o741o4387q2214J13539R9959j10775Q5306P8477o2242J80r8859r16
1095f3093L0251o3601o651O7180M20J1230K3675P1677j4359o6707p7208P7943
1083i243M5131k4117j41452O620j763L1977M9242J4630L0875J0955K2556K6034
1071F1445n2001o0006l6053N4026n1188N8765J59292R1364k34563m4990Q7650
1060C3741M5809O583O254o5599O271j9458o0320J68612j09611m1361R767J18J24886
1047A05692l1175j9561o6794p8079R0553N0813R806j33510k7223p6727Q2516O5794
$$ y = [-17574, 139782, 158964, 84494, -4872, -44842, -1997, -25979, -83593, -45984, -9417, 31782, 9300, 1635, -43088, -32853, 12043, -61339, -20885, 293, 48341, 132249, 34345, 27127, -14420, -21161, -85548, -167762, -54223, 45736, -65039, 20267, 98744, 36502, 36682, -62177, -63093, -32842, -96443, -103094, -35914, -35494, -24264, -589, 71088, 56729, -9978, -87186, -9243, 35888, 11771, -129681, -123061, -124824, -92847, -43605, -28975, 1900, 12855, 35411, 61445, 9444, -50562, -86615, -32589, -83777, -25012, 134280, 225644, -8919, -53909, 33741, 79550, 86133, 92387, 26788, 33059, 13601, -46719, 121893, 12282, -29079, -19312, -19194, 105692, 74517, 54956, -11838, -89917, 636, 51449, 61255, -72255, -99478, -176205, -93689, -27895]
1035b7895j50187l5292M3155P4320j4706L5663o2736O4748J05237j1641m6338
1024b5672m1975J9305Q167J30025n3141l9450M7310K8995r4965j4001o1688O5479
1012c1611J0457k0573N497n9978Q8810K4177p9271n4425K1109L5239l961K4443
1000d0087n8929n9420O1523j1987k2243O5225l5035N4893J13540r5545l8808O772
$$ y = [-27895, -178082, -213374, -170219, -95899, -110605, -74942, -137678, -72930, 32307, 20666, -25672, -67647, -48342, -40175, 89850, 36709, -2741, 44569, 73564, -21401, -35402, -97090, -31611, -21154, -41727, -36230, -96208, -7398, 16779, -62492, -116917, -95808, -60569, -64530, -40087, -99016, -158436, -96913, -108900, -131143, -65918, -100953, -46060, 67480, -28065, -66873, -60101]
$$ [...]
##END NTUPLES=NMR SPECTRUM
##END=
