##TITLE=1H_EC-3264(4-2)
 CDCl3
 8 sc, 
 11.11.2021
##JCAMPDX= 6.0         $$ Bruker NMR JCAMP-DX V2.0
##DATA TYPE= NMR SPECTRUM
##DATA CLASS= NTUPLES
##ORIGIN= UXNMR, Bruker Analytische Messtechnik GmbH
##OWNER= root
$$ XWIN-NMR		Version 3.5
$$ Thu Nov 11 10:22:58 2021 Russian Standard Time (UT+4h)  she@DPX200
##.OBSERVE FREQUENCY= 200.1313468511
##.OBSERVE NUCLEUS= ^1H
##.ACQUISITION MODE= SIMULTANEOUS
##.ACQUISITION SCHEME= undefined
##.AVERAGES= 8
##.DIGITISER RES= 18
##SPECTROMETER/DATA SYSTEM= spect
##.PULSE SEQUENCE= zg30
##.SOLVENT NAME= CDCl3
##.SHIFT REFERENCE= (INTERNAL, CDCl3, 0, 15.7238)
##AUDIT TRAIL= $$ (NUMBER, WHEN, WHO, WHERE, WHAT)
$$ ##TITLE= Audit trail, XWIN-NMR		Version 3.5
$$ ##JCAMPDX= 5.01
$$ ##ORIGIN= Bruker BioSpin GmbH
$$ ##OWNER= she
$$ F:/spectra/data/she/nmr/H-F/1/pdata/1/auditp.txt
$$ ##AUDIT TRAIL=  $$ (NUMBER, WHEN, WHO, WHERE, WHAT)
(   1,<2021-11-11 10:21:42.62 +0400>,<she>,<DPX200>,
      <created by zg, POWCHK disabled, PULCHK disabled
       configuration hash MD5:
       00 E9 B6 7A A2 85 ED C7 34 08 36 98 17 FE 4E 26
       data hash MD5: 16K
       5E 7C 44 D9 07 AB 3D 89 45 D1 D7 F8 84 E0 73 FC>)
(   2,<2021-11-11 10:21:45.01 +0400>,<she>,<DPX200>,
      <Start of raw data processing
       efp BC_mod = 2 LB = 0.24 FT_mod = 6 PKNL = 1 PHC0 = -15514.92 PHC1 = 18.60081 SI = 16K 
       data hash MD5: 16K
       B9 15 78 A1 B4 99 39 2C 66 AB 3E 82 D9 5D D0 BA>)
(   3,<2021-11-11 10:21:59.40 +0400>,<she>,<DPX200>,
      <pk PHC0 = 1.964166 PHC1 = -1.8 
       data hash MD5: 16K
       1C F9 98 EB 9F 77 BC F0 2C 23 EA 1E 9D 70 1D 73>)
(   4,<2021-11-11 10:22:02.37 +0400>,<she>,<DPX200>,
      <abs ABSG = 5 
       data hash MD5: 16K
       5A AF FF 4C B5 E8 FA A8 40 88 BC D1 7B 4C 57 55>)
$$ ##END=
$$ 
$$ hash MD5
$$ CE BB FE 0B 48 62 28 1A C8 D4 4B 9F 9F C7 CE 69
##$RELAX= 
##$RELAX= 
##$RELAX= 
##$RELAX= 
##$RELAX= 
##$RELAX= 
$$ Bruker specific parameters
$$ --------------------------
##$DU= <F:/spectra>
##$EXPNO= 1
##$NAME= <H-F>
##$PROCNO= 1
##$TYPE= <nmr>
##$USER= <she>
##$AMP= (0..31)
100 100 100 100 100 100 100 100 100 100 100 100 100 100 100 100 100 100 
100 100 100 100 100 100 100 100 100 100 100 100 100 100 
##$AQSEQ= 0
##$AQ_mod= 1
##$AUNM= <au_zg>
##$AUTOPOS= <>
##$BF1= 200.13
##$BF2= 200.13
##$BF3= 200.13
##$BF4= 200.13
##$BF5= 200.13
##$BF6= 200.13
##$BF7= 200.13
##$BF8= 200.13
##$BYTORDA= 1
##$CFDGTYP= 0
##$CFRGTYP= 5
##$CHEMSTR= <none>
##$CNST= (0..31)
1 1 145 1 1 1 1 1 1 1 1 1 1 1 1 1 1 1 1 1 1 1 1 1 1 1 1 1 1 1 1 1 
##$CPDPRG= <>
##$CPDPRG1= <>
##$CPDPRG2= <>
##$CPDPRG3= <>
##$CPDPRG4= <mlev>
##$CPDPRG5= <mlev>
##$CPDPRG6= <mlev>
##$CPDPRG7= <mlev>
##$CPDPRG8= <mlev>
##$CPDPRGB= <>
##$CPDPRGT= <>
##$D= (0..31)
0 1.2 0 0 0 0 0 0 0 0.06 0 0.03 0 0 0 0 0.0002 0 0 0 0 0 0 0 0 0 0 0 0 
0 0 0 
##$DATE= 1636611702
##$DBL= (0..7)
120 120 120 120 120 120 120 120 
##$DBP= (0..7)
150 150 150 150 150 150 150 150 
##$DBP07= 0
##$DBPNAM0= <>
##$DBPNAM1= <>
##$DBPNAM2= <>
##$DBPNAM3= <>
##$DBPNAM4= <>
$$ [...]
##$SUBNAM2= <"">
##$SUBNAM3= <"">
##$SUBNAM4= <"">
##$SUBNAM5= <"">
##$SUBNAM6= <"">
##$SUBNAM7= <"">
##$SUBNAM8= <"">
##$SUBNAM9= <"">
##$SW= 18.0517286264689
##$SWIBOX= (0..15)
0 0 2 0 0 0 0 0 0 0 0 0 0 0 0 0 
##$SW_h= 3612.71676300578
##$TD= 16384
##$TD0= 1
##$TE= 0
##$TE2= 300
##$TE3= 300
##$TEG= 300
##$TL= (0..7)
0 120 120 120 120 120 120 120 
##$TP= (0..7)
150 150 150 150 150 150 150 150 
##$TP07= 0
##$TPNAME0= <>
##$TPNAME1= <>
##$TPNAME2= <>
##$TPNAME3= <>
##$TPNAME4= <>
##$TPNAME5= <>
##$TPNAME6= <>
##$TPNAME7= <>
##$TPOAL= (0..7)
0.5 0.5 0.5 0.5 0.5 0.5 0.5 0.5 
##$TPOFFS= (0..7)
0 0 0 0 0 0 0 0 
##$TUNHIN= 0
##$TUNHOUT= 0
##$TUNXOUT= 0
##$USERA1= <user>
##$USERA2= <user>
##$USERA3= <user>
##$USERA4= <user>
##$USERA5= <user>
##$V9= 5
##$VALIST= <valist>
##$VCLIST= <CCCCCCCCCCCCCCC>
##$VD= 0
##$VDLIST= <DDDDDDDDDDDDDDD>
##$VPLIST= <PPPPPPPPPPPPPPP>
##$VTLIST= <TTTTTTTTTTTTTTT>
##$WBST= 1024
##$WBSW= 4
##$XGAIN= (0..3)
0 0 0 0 
##$XL= 0
##$YL= 0
##$YMAX_a= 191110
##$YMIN_a= -268367
##$ZGOPTNS= <>
##$ZL1= 120
##$ZL2= 120
##$ZL3= 120
##$ZL4= 120
##$ABSF1= 15.75681
##$ABSF2= -2.295039
##$ABSG= 5
##$ABSL= 3
##$ALPHA= 0
##$AQORDER= 0
##$ASSFAC= 0
##$ASSFACI= 0
##$ASSFACX= 0
##$ASSWID= 0
##$AUNMP= <proc_1d>
##$AZFE= 0.1
##$AZFW= 0.1
##$BCFW= 0
##$BC_mod= 2
##$BYTORDP= 0
##$COROFFS= 0
##$CY= -3
##$DATMOD= 1
##$DC= 0
##$DFILT= <>
##$DTYPP= 0
##$F1P= 0
##$F2P= 0
##$FCOR= 1
##$FTSIZE= 16384
##$FT_mod= 6
##$GAMMA= 0
##$GB= 0
##$INTBC= 1
##$INTSCL= 0
##$ISEN= 128
##$LB= 0.24
##$LEV0= 0
##$LPBIN= 0
##$MAXI= 10000
##$MC2= 0
##$MEAN= 0
##$ME_mod= 0
##$MI= 1.114404
##$NCOEF= 0
##$NC_proc= -7
##$NLEV= 6
##$NOISF1= 3.799351
##$NOISF2= 2.8
##$NSP= 0
##$NTH_PI= 0
##$NZP= 0
##$OFFSET= 15.72375
##$PC= 1
##$PHC0= -15512.96
##$PHC1= 16.80081
##$PH_mod= 1
##$PKNL= yes
##$PPARMOD= 0
##$PSCAL= 0
##$PSIGN= 0
##$REVERSE= no
##$SF= 200.130006415892
##$SI= 16384
##$SIGF1= 3
##$SIGF2= 2
##$SINO= 5.538805
##$SIOLD= 16384
##$SREGLST= <1H.CDCl3>
##$SSB= 0
##$STSI= 16384
##$STSR= 0
##$SW_p= 3612.71676300578
##$SYMM= 0
##$S_DEV= 0
##$TDeff= 16384
##$TDoff= 0
##$TI= <>
##$TILT= no
##$TM1= 0
##$TM2= 0
##$TOPLEV= 0
##$USERP1= <user>
##$USERP2= <user>
##$USERP3= <user>
##$USERP4= <user>
##$USERP5= <user>
##$WDW= 1
##$XDIM= 16384
##$YMAX_p= 437608105
##$YMIN_p= -2652468
$$ End of Bruker specific parameters
$$ ---------------------------------
##NTUPLES= NMR SPECTRUM
##VAR_NAME=  FREQUENCY,     SPECTRUM/REAL,   SPECTRUM/IMAG
##SYMBOL=    X,             R,               I
##VAR_TYPE=  INDEPENDENT,   DEPENDENT,       DEPENDENT
##VAR_FORM=  AFFN,          ASDF,            ASDF
##VAR_DIM=   16384,         16384,           16384
##UNITS=     HZ,            ARBITRARY UNITS, ARBITRARY UNITS
##FACTOR=    0.220516191357247, 1,           1
##FIRST=     3146.79421128494, 0,            0
##LAST=      -465.922551720837, 0,           0
##MIN=       -465.922551720837, -2652468,    0
##MAX=       3146.79421128494, 437608105,    0
$$ Real data points
##PAGE= N=1
##DATA TABLE= (X++(R..R)), XYDATA
$$ [...]
9255 19820070 21146779 22121355 23011329 23966416 25205214 25903105 26734135 27846223 28310809
9246 28310809 29119086 28418274 27982036 27549259 25971375 24207170 22350338 20955700 19314797
9237 19314797 17834400 16737011 16064901 15117629 14360080 13923647 13375606 12577918 12384659
9228 12384659 11683779 11612048 11355538 11408603 11104315 11068187 11195657 11332081 10581255 11457035
9218 11457035 11560778 11445046 11310718 11289392 11595660 11095643 11125262 11280643 11218963 10826632
9208 10826632 10825416 10999022 10532319 10358574 10375911 10185548 10053672 10003426 9559036 9374204
9198 9374204 9803980 9203312 9117059 8974244 8908671 8885659 8672203 8636614 8590211 8815561
9188 8815561 8698228 8986698 8691634 8770954 9501457 9341024 8814016 8545833 8813493 8737965
9178 8737965 7934993 7995818 8307527 8001273 7696394 7274405 7826630 7684115 7630415 7397775
9168 7397775 7498942 7665619 7092968 7164657 7206371 7360895 7046169 7122455 7224186 7343100
9158 7343100 7144424 6685304 6835190 7056356 6752636 6840170 6534899 6679958 7023353 6786697
9148 6786697 6943841 7106641 7304399 7371792 7309663 7386084 7545655 7412056 7465781 7367165
9138 7367165 7513243 7652673 7965441 7634697 7596917 7639163 7857893 7297049 7295546 7700217
9128 7700217 8046988 7688140 7543678 7592237 7777902 7988270 7922366 8237929 8555001 8580390
9118 8580390 8779459 9265193 8992450 9361679 9323473 9737231 10018260 10329523 10328427 10476551
9108 10476551 10853373 10913103 11371882 11436176 11924269 12220177 12501010 12898860 13494185 13784474
9098 13784474 14469935 15007900 15635021 16084280 16834527 17595301 18308897 18721984 19538356
9089 19538356 20964742 21992992 22363407 23756724 25308289 26550819 28644719 30429379
9081 30429379 32423535 35827057 38995948 42407937 46759797 52213135 56513101 60296402
9073 60296402 65156155 71655915 78574416 82878222 84396915 84730627 85680472 88005283
9065 88005283 92168559 94580199 93768420 88264900 80732731 73175526 66739663 62025907
9057 62025907 59364487 57629832 56995913 56108380 54209591 52008008 50636927 49676561 49115857
9048 49115857 50148583 51228251 53100184 55561968 58337986 62020405 66588705 72400246
9040 72400246 78081767 83911893 90536843 96676270 102402336 107070870 110484932 114539880
9032 114539880 120859595 128125437 130406992 130000982 128612727 126296947 122519890 116161376
9024 116161376 105890552 93768148 82836730 74554149 67771618 63066707 59286962 55792897
9016 55792897 53567127 51490078 49559844 46456893 44086570 41524937 39710081 37729054
9008 37729054 36889076 35999892 35038063 34284925 33830599 33895664 33678255 33310973 33383677 33589549
8998 33589549 33137219 33391517 33261100 33260444 33266279 33556359 33470602 33347270 33537962 33482800 33090029
8987 33090029 32645924 31869763 31448570 30722845 29855873 28876036 27753739 26999285 26159336
8978 26159336 25332155 24018131 23190904 22265366 21428006 20442660 19733708 19511772 18860141
8969 18860141 18337953 18017457 17594632 17244077 16638865 16069225 15562054 15138819 15077442 14813216
8959 14813216 14070126 13904711 14079529 13669037 12811131 13102567 12854803 12520472 12551518 12114839
8949 12114839 11685829 11637811 11511465 11061374 10777877 10790791 10714533 10763026 10009408 10332281
8939 10332281 10343111 9851691 9829037 9860893 9969597 9596408 9372577 9561377 9923610 9508909
8929 9508909 9777022 9794760 10015544 10078146 9833871 9464010 10084966 9908135 9831911 9995931
8919 9995931 10276154 10037493 9921144 10032313 10232747 10151656 10367278 10661262 10418997 10877700
8909 10877700 11038624 10634302 10934545 10967585 10866159 11163475 11189053 11506310 11731140 12054435
8899 12054435 12463958 12850001 13090865 13551168 14011213 14369400 14767327 15079371 15456240
8890 15456240 15954546 15893966 16153201 16976822 17278714 17555444 18301950 18331655 18561329 18701837
8880 18701837 19508017 19978025 20270260 21184287 21818323 22527415 22962939 23371277 24528465
8871 24528465 25233048 26226153 27128887 28114106 29691233 31429682 33225812 34949379 37286790
8862 37286790 39821256 42295332 44999526 48333421 52129233 55983471 60430421 64319899
8854 64319899 68020391 71815754 75018441 78612262 82146226 83437984 84714348 86029167
8846 86029167 86797217 84706395 79667483 75161460 71584651 68800410 67801214 67542458 67664927
8837 67664927 67472539 67096880 65857727 65697006 66697254 67480403 69503376 71782395 74892340
8828 74892340 78913220 82630337 87586602 93407347 98702269 104598540 110822313 118136633
8820 118136633 125740473 133190457 140383220 147760387 153845112 157815935 160557821 160362948
8812 160362948 156016261 148461695 137917966 128770424 121482581 116988341 112963570 106798711
8804 106798711 99750546 93375333 87603065 82908297 79335822 76649228 74226001 72665192
8796 72665192 72173697 71875953 72630695 73389832 75110135 77355979 79398778 82480634 85291488
8787 85291488 89415737 94396287 99361057 103728884 106897603 109038903 110719843 112520473
8779 112520473 114235524 115054831 114741498 111830939 106658738 99338553 90658698 82689932
8771 82689932 76126379 70443750 65875256 61994025 59117841 56629565 54193511 51875675
8763 51875675 49339142 47741390 46115881 44963011 44181841 43807121 43065348 42527151 41915710
8754 41915710 42610638 42406535 41993983 42113097 42923099 43392782 43504478 43964039 44513164
8745 44513164 44826397 44764488 43703845 43280191 42549047 41539519 41104259 40587980 40170171
8736 40170171 40083175 40129041 40224191 40676404 41368643 42185124 42801487 43712540 44907133 46533573
8726 46533573 48031796 50761796 53510525 57109973 61189731 66477299 72328521 79481312
8718 79481312 88330599 97891108 107633466 119987047 135727434 156162821 178489812 182757493
8710 182757493 163393763 137232053 115128781 99031018 87837475 79772596 75237065
8703 75237065 72384404 70586125 69261024 69658672 70583376 71372506 70940579 70389525 70686391
8694 70686391 71735607 73689412 74314900 72223832 68875568 65584317 63880223 63141542
8686 63141542 61305991 59033813 56424937 54307765 52529185 52238198 52112887 52574298 53317221
8677 53317221 53526733 54127349 54451366 55547534 56322883 57169021 58962682 60662121 62660593
8668 62660593 64465305 65295881 65259667 66628906 68787544 72000706 75802984 79470893 81777598
8659 81777598 82075846 79522414 75157460 68986314 62604557 57394476 53334832 50787030
8651 50787030 49699876 48356919 46998953 45834783 43551709 41605078 40610678 40106210
8643 40106210 39387491 39585071 39774200 40214623 40014131 39775638 40037904 40386513 40331417 40934396
8633 40934396 42124640 43984082 45313593 46350683 45716687 45807117 46526228 45653559 43500206
8624 43500206 40277953 38213471 35985293 33996195 32313384 30911677 28920497 27002930
8616 27002930 25367394 23791309 22867150 22505758 21530482 20259462 20350924 19969492 19563475
8607 19563475 18736316 18194696 18123100 17322468 16753108 16603905 16116381 15898156 15914269 15210281
8597 15210281 14812168 14487716 14438608 14119604 13376412 12682805 12098671 11926338 11376774 10315298
8587 10315298 9888446 9923407 9401687 8601239 8397310 8210444 7978521 8023975 7875962 7571461
8577 7571461 7434616 7653216 6970316 6450062 6432793 6514903 6233477 5796801 5293767 5515803
8567 5515803 5275884 4947545 4622110 4689906 4445326 4400817 4122885 3677760 4074049 3777209
8557 3777209 3414213 3148100 3439248 3377676 3106101 2634123 2826785 2979515 3112336 2996886
8547 2996886 2939229 3182028 2897772 3137053 3026095 2937498 3267911 2875332 2916658 2635016
8537 2635016 2872724 2791645 2309707 2187323 2289721 1918760 1973437 2202915 2150021 1534164
8527 1534164 1895120 2111910 1786209 1952830 1974190 2141567 1897334 1695107 1771046 1451260
8517 1451260 1433080 1258506 1297768 1813626 1603886 1129046 1338111 1288114 1544196 1355797
8507 1355797 1418077 1394726 1522672 1483651 1363361 1075063 1458305 1121195 640459 1031125
8497 1031125 1328193 1083712 496915 1011318 893752 1119480 523633 1000395 995429 873754
8487 873754 864010 1255635 1152546 1341268 1532493 1141491 1636996 1588411 1598091 1486009 1478639
8476 1478639 1501323 1072860 1067048 1232285 1349895 1038669 669286 1176768 1450884 1019005
8466 1019005 961410 1109688 1452040 1183401 964297 1191789 1362100 1280994 891591 643847
8456 643847 715985 767367 1186851 872563 1328308 1533348 1664259 1605719 1482176 1992080
8446 1992080 1671622 2045909 1597642 1493733 1548882 1250100 988745 997263 981439 671891
8436 671891 656868 449669 464321 203547 756661 911513 407289 414321 677378 923146
8426 923146 902078 1195744 652223 717776 971530 767740 336139 516095 793673 764615
8416 764615 356646 544018 1020704 349051 622610 415400 512304 542628 785414 592050
8406 592050 448456 548676 971594 406021 382679 498998 674743 579464 261974 897795
8396 897795 666744 714576 173941 226905 328041 295605 246478 185138 301628 199292 330181
8385 330181 378958 192037 422497 415377 44112 284981 187261 408590 512489 338646
8375 338646 427239 94702 483197 250737 400736 181975 275794 348638 278275 258227 337916
8364 337916 511923 277644 239474 180536 -177771 110984 -105222 -100731 -227299 -25504
8354 -25504 310729 187410 267411 373501 455817 302194 352492 46389 395030 229750
8344 229750 154334 -30183 -270307 -185449 -222043 -111538 -168723 -220503 143285 42816 -25006
8333 -25006 13163 496350 301336 72955 218255 -156450 253329 196594 -18301 -293887
8323 -293887 300380 157719 -66788 -206781 191748 147612 217598 373200 488786 219687
8313 219687 204098 248437 193747 617198 182398 -72693 366684 269195 -208379 -246621 323868
8302 323868 377857 -102803 -25136 39266 230660 -109608 -38825 -99123 139082 245324 250461
8291 250461 308711 580795 167324 392396 302014 637661 453615 -248637 263554 419386
8281 419386 291449 250316 431890 565136 -35968 264905 527804 461568 186716 529817
8271 529817 934078 598916 445059 927199 657299 487921 386123 561703 342516 103768
8261 103768 -11375 56098 392669 48881 -32701 279828 408320 297232 325834 607332
8251 607332 128409 -18871 459816 246734 128339 31740 539293 608979 390385 587037
8241 587037 291877 484205 870389 1118391 1101059 681922 1606128 1428153 1310954 1007280
8231 1007280 995381 986347 866889 211400 820297 829128 506904 455008 795611 984880 928192
8220 928192 872060 431347 1076576 1148649 927477 404040 590076 707003 389983 62478
8210 62478 134506 685885 -224786 -205600 150682 422037 55327 -24560 422173 1096593
8200 1096593 671992 787455 1154952 1620054 679352 2049130 2026123 4848750 3914323
8191 3914323 -2652468 -1207001 -1134584 -245028 -1050329 -1022088 -441147 -185693 -607585 -660583
8181 -660583 -480014 -379027 -539775 -25188 -421149 -206558 -103271 -217129 -23573 28113
8171 28113 411959 -25601 140261 67819 -43294 -81 81860 -137951 -267922 -122115
8161 -122115 -215326 -387610 -583 25274 -174208 -106249 150036 487618 441250 123516
8151 123516 283286 145454 211497 -511235 -210203 -193138 -598473 -778319 -714913 -582976
8141 -582976 -569513 -558250 -823882 -618102 -319071 -397858 -501650 -317853 -215524 76693
8131 76693 43816 -541765 -139840 -120796 -206357 -325804 -377264 -207828 -379021 -332266 -258612
8120 -258612 4845 132083 -126321 -29940 -311927 -82405 -60410 -321254 -302988 -452187
8110 -452187 -428343 -225620 -576521 -468301 -366755 -642005 -137119 -405011 -62990 -421686
8100 -421686 -508476 -113585 234936 -303458 -34044 -90633 -114074 311190 144771 234799
8090 234799 391293 181492 54088 383281 291614 74623 244257 269972 273336 -67660
8080 -67660 -66804 237057 -296580 -70033 -453057 -32694 -314785 -414711 -458644 -269767 -105180
8069 -105180 -218933 -415689 -320136 242451 271206 55983 33943 299246 169191 29659
8059 29659 -437542 -348113 -665517 -361770 -580066 -786967 -550141 -78481 -574101 -497307
8049 -497307 -167518 29202 -45777 -336594 33598 -38194 -305847 -99367 -67784 -305791
8039 -305791 -180346 -31274 -118654 -407601 -350325 -731953 -552396 -503065 -802821 -573154
8029 -573154 -460113 -631968 -378834 -608258 -330777 23566 135829 220013 522784 8142
8019 8142 515822 638333 239269 766419 583388 293482 614630 358182 382673 428452
8009 428452 96674 372447 82887 -31383 235301 326479 -123467 -491378 -438646 -625288
7999 -625288 -361008 -624816 -349209 -84027 -110471 -109751 -22469 -31794 133097 -237474 -226116
7988 -226116 -35007 -242169 -512119 -756307 -227249 -541430 -198282 80382 95908 299023
7978 299023 434802 199416 -80883 504461 377433 9001 -191208 -284966 -100243 -463648
7968 -463648 -872857 -818777 -440151 -730566 -1016454 -991264 -520642 -505684 -426992 -338614 11782
7957 11782 -87760 -194069 327268 80849 -143287 276236 55423 -346859 10183 -108556
7947 -108556 -416959 299395 -219714 -227018 -37779 -77098 1923 -17476 -21658 195074 500635
7936 500635 224610 -95852 183955 -71251 -48119 -151384 -154236 -191486 -303063 -278894 22784
7925 22784 -185435 -385629 -71572 -363486 -810203 -268246 -237582 -74692 -116479 -710337
7915 -710337 -638342 -521636 -644320 -777888 -622785 -631265 -262456 -449408 -462927 -511171 -165657
7904 -165657 -367425 -517141 -471024 -551980 -771201 -464407 -662835 -668653 -700093 -267114 -638908
7893 -638908 -1081561 -527931 -263568 -486485 -899879 -427969 -140415 -145199 -28442 -105594
7883 -105594 253589 32506 46857 259090 104244 64374 37109 -269374 -369514 -470721
7873 -470721 -197567 -376099 -652646 -394298 -327368 -467171 -259078 69350 -336992 -347166
7863 -347166 -369116 -499608 -504017 -214298 -318775 -762030 -724557 76836 -389612 -795280
7853 -795280 -594882 -651072 -685751 -765510 -862553 -384918 -52505 -291089 -147722 -104752 -260445
7842 -260445 15236 412204 112131 -187811 -497 472814 156010 -246511 35313 48257
7832 48257 -82252 -154908 -303060 -374197 -369728 -9488 -146605 -628691 -406075 -61243 -554221
7821 -554221 -838314 -827424 -674272 -386231 -1114328 -1268091 -524181 -702517 -691964 -389733
7811 -389733 -441075 -160083 -199862 -207707 -195396 -502971 -311882 -173380 243018 165115 -486371
7800 -486371 -645709 -973288 -1046725 -1029378 -807159 -570962 -472511 -683438 -197970 8735
7790 8735 -123637 -255012 -81954 -89165 -278329 -357535 -295224 -534139 -931758 -755213 -147273
7779 -147273 -311022 -336570 32968 328235 356267 -104075 -379828 -113681 350297 -635284
7769 -635284 -688873 -772494 -565104 -818343 -814640 -1071804 -976137 -708883 -807191 -904583 -404402
7758 -404402 -112380 -346019 -408394 -298564 -417226 -275743 -102542 -272831 -675721 -467000
7748 -467000 -288192 -395767 -524780 -31810 146550 -155228 208179 -220433 79721 -87167
7738 -87167 249669 -197431 -251699 -193579 -6126 -306145 -554338 -333348 -233104 -575709
7728 -575709 -591877 241959 -4312 -79781 -148307 -79125 -91602 -178803 -17585 37878 -192557
7717 -192557 27422 63529 -500724 -424174 -309607 -485683 -608605 -51950 86780 -56170
7707 -56170 -166497 340611 193142 -84962 -192241 -9804 137735 148269 -38341 -115466
7697 -115466 285986 -417975 -236048 -114831 -314818 -134655 -329971 -68583 -53134 -98867
7687 -98867 -351740 -246047 -424027 -342259 -296781 -595796 -134144 118920 -323234 -53542
7677 -53542 314670 -5546 -113783 265308 73537 -299067 -114841 -166635 -397031 101389
7667 101389 984 -312885 -509131 77007 -70131 -429983 -241497 -326819 -382758 -594520
7657 -594520 -352394 -432046 -135347 -154617 -408654 -246253 -41410 -294284 -418605 -577600
7647 -577600 -80 323006 -68403 54472 395756 -36865 -17909 106815 -32514 -126064
7637 -126064 -394329 -260627 58637 -650347 -393022 -131709 -243950 -622199 -570701 -370492
7627 -370492 -582754 -445905 -586952 -617227 -312696 -623679 -387381 -638481 -512691 -347309
7617 -347309 -517101 -121942 -202299 -37296 -139100 -240791 -215557 -323205 118061 -111108
7607 -111108 2896 207349 -431367 -497816 -348249 -234125 -347162 -592971 -247946 -371774
7597 -371774 -235214 51253 -94599 -411315 -78796 -215402 -10547 -649048 -82005 -120027
7587 -120027 -413198 -455999 -333704 -427186 -713619 -203490 -342097 -520299 -456319 -206533
7577 -206533 -452730 16630 -310310 -366905 -317358 -187575 -222304 -126398 -320294 85318
7567 85318 -421683 -162816 322536 -62592 -302907 253447 3572 -451352 -61382 -140155
7557 -140155 -221447 -499358 -582935 -142416 -481882 -595156 -87699 32862 -73159 -50911
7547 -50911 -56406 50418 158862 106101 22375 90520 105936 11419 -36210 -202137 -204651 -348622
7535 -348622 -277454 -485954 -574412 -292092 -691296 -337741 -45103 56961 -35595 -17140
7525 -17140 130573 133558 -28928 430866 111108 -121532 -365712 -115294 -321586 -567914
7515 -567914 -457512 -514069 -373813 -521998 -324808 -363027 -301023 -178213 -130107 47276
7505 47276 -75377 -165081 -106420 -361341 -276533 -45119 -305550 -401551 -411499 -364184 -305490
7494 -305490 -1024279 19725 123030 -404929 -280176 265964 55577 -504675 -156648 24821
7484 24821 44972 -499295 -139356 227897 -569860 -185442 188613 22749 -387500 15516
7474 15516 47429 4660 101427 -116378 140400 216394 143389 139102 744699 302482 760910
7463 760910 986476 743163 550355 574381 793294 471800 115413 432038 327060 174747
7453 174747 202105 -128979 -103614 -210484 80966 -281354 -471083 237064 -98172 -363858
7443 -363858 -254045 -275734 46539 -165747 -49317 282882 122148 14895 252096 207301
7433 207301 -14322 332911 61405 -48225 -165410 -111822 7456 -142412 -52651 -107465
7423 -107465 125984 -16079 103901 -365916 -207149 210839 25726 -360429 -199987 -224748
7413 -224748 -146335 -301463 -37381 -28809 86402 -549857 -355685 -4986 -86499 -538701
7403 -538701 -318780 108052 797 -125368 -21941 244894 142411 -66355 203230 177293
7393 177293 -195070 -142276 143380 -390133 -289525 -428222 -493224 -121160 -68851 -61981 -548285
7382 -548285 -285344 -456661 -152417 -367896 -103446 -237871 -351565 -144710 242103 -135132
7372 -135132 172828 83804 228620 -20205 -77253 -125164 -177527 88212 -230129 -255603 -202964
7361 -202964 113273 -427568 -536592 -196892 488639 -169156 -3055 134528 486054 -51276
7351 -51276 -182207 310746 388415 297286 -430332 -334007 -279412 -157365 7931 -259826 -314269
7340 -314269 175128 -798066 -261143 -366661 -99672 -394882 -618162 -104964 -22039 -621345
7330 -621345 -497037 -166766 -414942 -734617 -231730 -188868 -554683 -293954 -238995 -150310
7320 -150310 -290189 -662798 -574175 -456658 -458603 -457269 -94436 -31596 -459878 -381909 -164269
7309 -164269 -419758 -588157 -161958 168881 -427913 -610514 -73819 -122412 36222 36469
7299 36469 243790 265095 455394 525415 534265 452569 870172 371940 326223 553505 845233
7288 845233 702315 340359 612194 745639 158615 134928 493567 209766 -273209 -168306
7278 -168306 371938 74168 -273886 -417673 59838 -424921 -145832 -128689 -452022 -467860
7268 -467860 -111769 -295581 -603730 -417556 99132 -121809 186400 -250838 127608 59353
7258 59353 -275038 150437 -131249 22690 -39203 274650 64319 462063 164511 290108
7248 290108 591427 755842 1360 692145 863123 693282 742929 704311 881356 788039
7238 788039 470799 454208 383157 153481 297427 24120 -291003 50559 70783 -232196
7228 -232196 -132491 -175998 244420 293785 213133 48400 180398 187341 176773 402828 71667
7217 71667 342746 368088 443805 172655 451667 290448 918132 358560 520842 511067 651118
7206 651118 687771 450647 880901 790882 1063954 672836 534288 946115 684765 607309
7196 607309 1019290 552741 655205 1204587 748753 345246 966273 923639 912085 829855
7186 829855 875207 1152590 820845 920837 1482724 907613 757969 1308468 1266230 762876
7176 762876 994687 857956 1020352 696063 538432 725650 885382 657782 714723 736752
7166 736752 470664 821484 1230337 1089142 1672084 1346701 1522925 1449879 1634528 1647470
7156 1647470 1540785 1383593 1835634 2044451 1741640 1977176 2312021 2583124 2336735 2804482
7146 2804482 2707711 2689711 2895334 3239747 3407715 3397421 3554998 3763322 3745481 3026370
7136 3026370 3511392 3649570 3338924 3433427 3679226 3603491 3474819 3657637 3241171 3329731
7126 3329731 3448609 3345318 3361816 3525364 3174937 3539677 3369773 3298217 3511929 3747545
7116 3747545 4298394 4123554 4137248 5081018 4722898 4767296 5204003 5418504 4940087 5488151
7106 5488151 5743693 5656060 5916942 6544109 6689351 6709224 7700381 8232410 8822316 8850114
7096 8850114 9887326 10485817 11469345 11718446 12326119 12879385 13513148 14264522 15156460
7087 15156460 15894657 16841007 18295120 19757948 21296165 23042063 25588165 28388982
7079 28388982 31912961 35733151 40122113 45333337 51606435 58736067 66799102 76457546
7071 76457546 87171237 98413314 111720056 124110024 132063544 132669113 124621688 109206408
7063 109206408 91882724 75919868 62899398 53235840 45967119 40600640 36596055 33125271
7055 33125271 30041494 27217158 24816555 23153137 21435750 19018336 17845542 16712043
7047 16712043 15398997 14185256 13341744 13136414 12586440 11420346 11055142 10798860 10187127
7038 10187127 10024499 9784588 9046971 9207365 9183578 8703018 8257850 8215354 8562308 8246558
7028 8246558 7859610 7671696 7813135 7390610 7307083 6874081 6652248 6000417 5788375 5768665
7018 5768665 5560310 5092245 5156168 5196250 4974013 4509741 4380734 4509757 4303116 3623779
7008 3623779 3553836 3703245 3450311 3123855 3007262 2739292 3009718 2861090 2034720 2980188
6998 2980188 3078093 2814033 3153489 3450679 3471405 3351060 3825814 3913546 4035790 3620328
6988 3620328 3758538 3461800 3733678 3880003 4080633 3658932 4113423 4407810 3671527 3460282
6978 3460282 3622483 3272265 2868997 3152020 2677697 2977716 2720815 2418504 2595092 2362164
6968 2362164 2059788 1951085 1747129 1592927 1478648 1384199 1236170 1767877 1393114 1340096
6958 1340096 1891518 1649566 1807461 1489393 1301134 1802789 1471624 1184908 1329994 1305138
6948 1305138 1235866 992119 612608 1155423 1611113 883346 877752 1419180 1091664 1100164
6938 1100164 951586 1293161 1070973 953739 1459128 1383780 1199277 1616097 1584465 1484600
6928 1484600 1694096 1682147 1485321 1582133 1582935 1770310 1795761 1715979 1857036 1893978 1412478
6917 1412478 1768029 1776266 2052447 1826554 1954410 2122436 2401014 2561728 2660610 2799083
6907 2799083 2949153 2969737 3617594 4178989 4175417 4441474 5108771 5793530 5945199 6420899
6897 6420899 7098027 8131977 7916197 8214661 8694340 8542234 8312475 7829183 6846329
6888 6846329 6693431 5989806 5313866 4690901 4445002 4093451 4071251 3365400 3447341 3720021
6878 3720021 3491887 3409639 3472391 3242462 3118967 3084898 2657714 2891648 2587678 2580876
6868 2580876 2579872 2359865 1977071 1812309 2097647 1650233 1737951 1973720 1438282 1465946
6858 1465946 1528205 1370893 1228618 1113401 1158818 1218710 1075570 852849 826839 780983
6848 780983 1285963 1052331 591692 1012540 1252593 523729 836336 931794 927311 1060771
6838 1060771 810696 831297 655565 362832 809159 421024 152255 349953 302857 207576
6828 207576 -4410 141459 462252 285031 23722 -276783 68779 222974 381425 -241960
6818 -241960 -153200 -76862 -311614 -358497 -607679 -490027 -141915 -97091 -294992 386884
6808 386884 209295 419859 333072 483281 323900 315021 35385 762264 398554 232676
6798 232676 510165 214398 201495 227931 297809 747609 634454 651742 1004585 903248
6788 903248 713535 294710 328885 152508 7210 -149697 -431870 -394929 -702717 -374998
6778 -374998 -387769 -584731 -192623 -98071 -106896 -37860 57633 324231 427549 662838 780448
6767 780448 911529 933118 915461 829647 484860 801344 341441 411177 274264 54601
6757 54601 -148015 -145414 381466 -48664 78520 54192 -199082 -366234 40445 -309683
6747 -309683 -406050 -320420 -68550 -434556 -672590 -108888 -273086 -199928 -211067 -255714 -284997
6736 -284997 -120458 -276912 -491577 -433431 -78627 -237707 -488698 28135 -12647 -459478
6726 -459478 -190340 -59914 126319 -25300 143482 380974 97261 108233 176158 313727
6716 313727 55404 166907 463193 330758 466820 308324 531040 690466 634489 569413
6706 569413 613092 676651 831800 619590 307399 171372 606427 143086 -356756 202172
6696 202172 263288 -127373 -199340 -147295 -243938 209337 -367777 -104651 -259894 -503259
6686 -503259 -389621 -205708 -405481 7495 94972 -200815 3456 -47991 -48185 -27477 82982
6675 82982 -131257 -55295 -129541 213681 97957 198281 263794 623732 496292 462273 796890
6664 796890 728845 226092 535549 324986 365929 513101 -25858 293558 -263605 -16585
6654 -16585 -40018 136057 115064 154476 494073 139701 405318 362012 565519 539522 866735
6643 866735 1087173 789931 687023 848292 751349 548556 338014 312991 269414 440438
6633 440438 84286 -285835 -209201 36610 -128658 -203850 -133877 -145506 -41216 -107089 -318670
6622 -318670 -268542 -610359 -251820 -423979 -362601 -222433 -12007 24224 66246 29909 -29698
6611 -29698 362756 303604 196615 478062 704369 20915 672270 543902 717128 153655
6601 153655 247779 256396 305253 412814 467698 67592 -57379 299772 80307 -15475 85734
6590 85734 39007 -151174 345438 -77598 460312 896495 494769 91188 188838 430856
6580 430856 451968 84728 420091 -113671 83939 42466 -50450 31080 179474 497083
6570 497083 164126 483857 507328 616556 437134 1120648 882572 661815 594370 594476 40773
6559 40773 164491 65082 374804 -63323 60576 -39908 17537 -200593 -339803 -159376
6549 -159376 -156662 202587 76148 121667 -458059 -209817 239851 -303008 -276268 49289
6539 49289 -29910 -233362 29887 428620 124033 484196 321805 166738 289205 439717
6529 439717 165266 354402 67718 261402 -26729 -199679 -76731 -205636 -146640 -514439
6519 -514439 -288777 -165388 62999 145589 11943 17225 37425 -8270 -29140 -647660 -151779
6508 -151779 -7859 -444639 -550847 -472587 -43418 -362389 -432806 -322744 -327819 -247984 -178133
6497 -178133 -2872 -291382 332185 379288 -156262 234991 303936 -8465 267364 49607
6487 49607 351892 569924 87742 153005 277649 243650 275969 585140 87808 440793
6477 440793 305560 24753 292247 107553 -258321 -77522 63416 163301 164121 56065
6467 56065 173178 652362 679174 200509 234364 553006 489261 -111735 -301157 138620
6457 138620 -356849 -346310 -601799 -356661 -476515 -592008 -422116 -265977 -143533 6156
6447 6156 -61142 598054 239675 377764 199018 108775 284642 -549856 -407029 -376479 -363253
6436 -363253 -621976 -544307 -273603 -132040 -149522 -34073 -5510 -152594 288682 108657
6426 108657 -128216 -32156 -101093 -14038 -313316 -592101 -376755 -449592 -206314 -115852 -447781
6415 -447781 -39116 -77289 -31360 -553978 -47835 -264752 -129417 -38208 -299257 -287344
6405 -287344 -156528 -386894 -350108 -368459 -128340 -186558 -462100 4054 254462 166454
6395 166454 407710 477570 220442 278989 163403 -255501 -9796 -322414 -254597 -315486
6385 -315486 -624529 -230252 -437665 -471805 -441542 87721 172106 -204298 -40696 195559
6375 195559 196019 -97409 42193 -126074 -593518 -123050 -305766 -251704 -396080 -240936
6365 -240936 -333573 -238471 -387896 -126422 34319 -346260 15372 103982 244522 -114053
6355 -114053 60033 298464 -33952 -332273 132519 -18351 -495379 -638443 -55401 -365822
6345 -365822 54065 167229 -317055 -215040 94293 191154 -18662 71011 287026 92201
6335 92201 137937 15623 -6654 4344 -234583 -195557 -165957 158760 -302159 -20244 148979
6324 148979 59605 270435 601964 277064 326070 -286842 165907 459946 17989 -48511
6314 -48511 89885 9060 -264283 -123709 212108 252246 -154365 128500 233914 365933
6304 365933 -104393 162481 290621 225636 -56417 91108 126149 142924 483446 -162588
6294 -162588 221337 -31603 147018 145725 -140720 203598 231606 -142760 -465195 86784
6284 86784 -171586 110359 144744 -108331 8793 90796 76049 -340586 -221893 -335527
6274 -335527 -39426 -85692 -546665 -565223 -260837 -297189 -260296 -197648 -236494 -366166 -568173
6263 -568173 -237816 -113130 -848928 -558173 -61983 -194118 -511900 132340 -28505 -322878
6253 -322878 -753992 -647042 -338306 -501391 -487216 -913691 -307215 -167962 -555506 -801472
6243 -801472 -10780 -230223 -393821 -334464 -445802 34553 -247520 -308140 -260696 -72185
6233 -72185 -145371 -23562 -49461 -170088 135546 -387532 -394223 -181398 -216892 -403569 -21156
6222 -21156 -41928 19513 -232888 -317946 253970 -284242 -439535 -158072 -167980 14418 -413515
6211 -413515 -597907 -499996 267786 -236322 -359837 -29496 -308754 96525 136955 66795
6201 66795 -227798 -194317 -398935 -443264 -716320 -338237 -684260 -835824 -571144 -499824
6191 -499824 -610424 -591148 -303100 -498936 -451672 -162745 -126435 12534 118218 136399
6181 136399 283350 -71322 31436 42365 -82880 199063 -380492 -250337 -212367 25993
6171 25993 168841 -103157 85405 42259 328225 297079 364275 234697 443780 312290
6161 312290 473639 313748 378777 449074 834175 663445 679713 628814 389666 706302
6151 706302 616802 268805 -38736 448982 735663 238033 -106119 501844 686282 103113
6141 103113 -143419 661287 382085 -10733 437994 255548 401673 627485 847374 351969
6131 351969 352612 847110 586857 447100 468617 503274 172751 135515 -77954 -258864 99043
6120 99043 141063 68206 303685 333552 241352 202331 378623 732889 259214 323518 680273
6109 680273 355267 386260 57189 140385 499212 704976 331854 39790 688137 799665
6099 799665 192090 277106 367525 598785 153417 113223 649184 398106 18850 -64480
6089 -64480 201124 319404 301963 984063 570704 633568 491033 379515 597050 385438
6079 385438 585688 368875 245867 207209 250529 159577 64053 -98759 452141 -387895
6069 -387895 -365145 -459986 -266984 -350299 -127476 -338845 -311869 -46112 -232267 -230869 -169110
6058 -169110 -180350 -101092 -126947 -254001 -167997 -36199 253327 -68906 164735 600558
6048 600558 799714 148197 111336 323950 311406 458360 491015 232199 589434 714666
6038 714666 627398 506778 593059 508382 461990 141178 284258 158511 219987 -171622 22771
6027 22771 -341893 145179 -14189 208404 302398 -37575 202319 358612 1101 -82182
6017 -82182 54749 299913 253146 -310075 162144 339768 86182 58202 768718 344067
6007 344067 517219 386964 375071 520502 231187 570836 702482 377931 881384 611684
5997 611684 479887 611154 941091 487755 659685 1121957 1268653 645318 1222292 1525915
5987 1525915 1083217 832365 1290992 1241768 678242 880739 1176170 775865 562830 290165
5977 290165 598111 681828 603390 689206 475395 498223 269010 788612 725176 893379 565241
5966 565241 483119 650989 804466 621058 1051470 915301 795548 818948 706951 785527
5956 785527 1085936 1413095 1227719 1768789 1425171 1418271 1445031 1792745 1697565 1383940
5946 1383940 1495936 1828065 2081513 1409309 1752188 1744553 1507764 1170858 1734314 2237294
5936 2237294 1394914 1672657 2195811 2106414 1697645 1975052 1949125 1972209 1722760 2146197
5926 2146197 2462798 1960731 2150769 2439866 2698583 2437635 2796984 2518933 2657732 2680333
5916 2680333 2797606 2476857 2773907 2687689 2837128 2325617 2707594 2982370 3009911 2823463
5906 2823463 3115948 3320366 3012547 3225700 3506666 3720728 3763557 4015848 3923150 4525043
5896 4525043 4566237 4843335 4817534 4863632 4878730 4897492 5355459 4985115 5196184 5348717
5886 5348717 5250532 5524447 5334641 5576071 5565239 5497256 5604820 5928621 6040032 6396342
5876 6396342 6231904 6622668 6662714 7087620 6878513 7342207 7684232 7957038 8361835 8539007
5866 8539007 8846365 8950013 9140772 9359031 9478142 9718665 10186755 10574528 10697791 11199346
5856 11199346 11774189 12029182 12417784 13138824 13617983 14142032 15074962 15675762 16299015
5847 16299015 17435437 18417844 19509743 20600319 22635218 24585731 26102818 28338085
5839 28338085 30903621 33631245 36749703 40518689 44040742 48095378 52206784 56972027
5831 56972027 61937855 67292255 71454227 72525909 69698323 65626663 60712884 56478417
5823 56478417 53056828 51350902 49597652 48414628 48166865 48219700 48745919 49667823 51284552
5814 51284552 53221470 56730583 60609018 65286330 70569352 77258712 84195187 90661276
5806 90661276 96618525 103182290 111164261 120112560 129769887 137446720 139013135 132398670
5798 132398670 119599175 105149649 92374534 82549799 74474624 67882506 62835433 59230884
5790 59230884 56217285 53403531 51480359 49864452 49372662 48994046 49258719 49932650 51308661
5781 51308661 52841779 54906675 56705121 59142402 62094193 65285444 69280425 73990686
5773 73990686 78606076 81375234 80850379 75813078 68123985 60230175 53342809 47739761
5765 47739761 43281756 39454358 36794493 34695974 32789321 30770514 29184777 27719583
5757 27719583 26726077 25587640 24884607 24149075 23314869 22392876 21968403 21216844 20430084
5748 20430084 20348999 19616329 18823620 18621125 18062058 17269232 16784840 16174952 15409064 15275943
5738 15275943 14517495 14276579 14229137 13765752 13780359 13675224 13474535 13664345 13908016 13989166
5728 13989166 14316177 14130207 14064030 14190362 14219923 13412162 13044835 12797331 12411309 12163330
5718 12163330 11951270 12299159 12082440 11511568 11151773 10770911 10300462 9708839 9296500
5709 9296500 9232558 8732718 8584639 8537822 8235103 8203415 8472189 8312348 8095224 8364923
5699 8364923 8328578 8270240 8586646 9013427 8759854 8597068 8661832 8653183 8190670 8063873
5689 8063873 8484800 8509920 8489185 8358590 8459442 8407408 8319122 8180544 7755295 7933713
5679 7933713 8033663 7509313 7477418 7678509 7740955 7857782 8103605 8335341 8887498 9305742
5669 9305742 9426944 9526713 9929215 9550099 9531417 9652564 9213808 9762453 9456313 9249427
5659 9249427 9304779 9272265 9167778 8985531 8975577 9130841 9135494 9492461 9674931 10623780 10581818
5648 10581818 11070957 11445392 12406844 13040477 13719379 14526049 15112195 15175365 14911912 14855940
5638 14855940 14232875 13703382 12896890 12556923 11741534 11324797 10591397 10189681 9819535
5629 9819535 9542063 9224039 8770096 8742036 9156078 8996018 8830738 9082843 9417282 9544534
5619 9544534 9694406 10355754 10981122 11180731 11185130 11747803 11578729 11179301 11186667 10590565
5609 10590565 10076403 9808100 9126190 8572997 8481339 8533122 8436410 8136264 8347560 8517196
5599 8517196 8742213 8473099 8716736 8936951 8688583 8555241 8381621 8205201 8132954 7929292
5589 7929292 7629237 7621502 7568514 6724131 7038283 6912166 6868525 7002792 7093611 7281825
5579 7281825 7492037 7169790 7221502 7353148 7269986 7437536 7505798 7502298 8035582 7917602
5569 7917602 8022622 8296467 8727070 8966224 9631334 9886228 10410802 11564660 11567787 12591529
5559 12591529 13622277 14683072 15671856 16704683 16084875 14686244 12328722 10895264
5551 10895264 9489072 8632005 7975548 7758265 7255531 7139078 7163054 6596221 6384821
5542 6384821 6341132 6247347 6123025 6092776 5615221 6012622 5748498 5423143 5811752 6257769
5532 6257769 6308748 6116610 5940245 6679173 6596301 6519853 7196030 6885942 6641532 6301642
5522 6301642 6073491 5751105 5963872 6020030 5823153 5424909 5745164 6437510 6281614 5786276
5512 5786276 6089317 6413281 6641240 6449706 6302858 6658368 6433568 6131877 6400313 6326081
5502 6326081 6367767 6656149 6819423 7014295 7231699 7835843 7847014 7823590 8164020 8292685
5492 8292685 8283878 7943838 8524333 8126977 7999523 8188285 8278552 8437950 8205144 8365780
5482 8365780 8902377 9105620 9410045 9296697 9909945 10817867 10925604 10908779 11618172 12100985
5472 12100985 12668599 12810011 13217247 14122269 14823781 15145558 15435180 16340824 16174166
5463 16174166 16764491 16831224 17784508 18441742 19036854 20114674 21587033 22754546 24334494
5454 24334494 25833745 28310425 30285900 32921743 36149743 39563190 43167724 47700368
5446 47700368 52863745 58051142 63036006 67212400 69768210 69862776 66387067 61964307
5438 61964307 57525363 53079571 50482288 47920886 46437987 45390151 44434046 43997930
5430 43997930 44499014 44993677 45912827 47309365 49415612 52222125 55239860 59471995 63760398
5421 63760398 69415606 75850821 82581269 90557472 99394319 108242294 117354971 124205349
5413 124205349 126310711 122260374 113867397 103631312 93046507 84180865 76499037 70682551
5405 70682551 65590354 61847606 58433734 55070992 53493109 51871117 50522383 49921339
5397 49921339 49702206 50286922 50833760 52580855 54536825 56827078 59892200 62449147 65656279
5388 65656279 69267526 72637440 74931924 75201018 73436123 68728760 62674840 57086748
5380 57086748 51803225 47253331 43619389 40192053 37655786 35148549 33113586 31105108
5372 31105108 29283276 27538207 26245270 25223649 24229403 23294894 22545391 21726351 21248237
5363 21248237 20384655 20030281 19449936 18937938 18847200 18499167 18235376 17398089 17309224 17325437
5353 17325437 17057443 16343251 16540506 16213210 16160362 16380086 16272083 16445296 16170331 15965262
5343 15965262 16170346 16576255 16228086 16432650 16251829 15867252 15977811 15596085 15365045
5334 15365045 15116231 14624931 14478310 13969493 13691857 13740873 13689753 13379443 13656467 13457087
5324 13457087 13072014 12967779 13372553 13127156 13413253 13550484 13715983 13853539 13731108
5315 13731108 14297913 14698867 15285203 15294841 15760825 15849665 15946465 16494358 16196167 16249517
5305 16249517 16692504 16503864 15855510 15408374 15479885 15101619 14079996 13922875 14429306
5296 14429306 13791560 13287772 13170916 13463799 12911871 12450751 12470002 13117143 13000949 12824525
5286 12824525 12994118 13178529 13311263 13792096 14271179 14812724 15048658 15583981 15502489 15527194
5276 15527194 15471879 14955484 14203836 13523607 13299109 12674516 12192632 11888550 11620106 11149286
5266 11149286 10783338 10643907 10490392 10408332 10432386 10704464 10414477 10667794 10848942 11253077
5256 11253077 11404672 11824062 12663254 13139963 13579248 13810511 14475191 14375387 14386702 13475360
5246 13475360 13143645 12741832 12707932 12683543 12352380 12395937 12946173 12517150 12328557 12636497
5236 12636497 12229702 11630345 11065782 11022534 11286229 11001701 11072484 11512593 11477011 11598584
5226 11598584 12008450 11825163 12318617 12909766 12489765 12249961 12694101 12402657 12055598
5217 12055598 12566635 12358930 12047761 11848569 11755939 10897133 9923329 9774546 9478134 8791954
5207 8791954 8484421 8235526 7907584 7463073 7408496 6986590 6816900 6768001 6408782 6230616
5197 6230616 6605350 6926975 6346957 6295489 6653042 6762493 6594326 6610171 6573204 6656500
5187 6656500 6287365 5838556 5650205 4942119 5046053 5114381 4784076 4537722 4750050 4321931
5177 4321931 4542821 4694147 4418733 4465701 4355467 4468017 4223368 3988867 3553099 4202982
5167 4202982 3764838 3659383 3732526 3627952 3441120 3442387 3388610 3240136 3037449 3200895
5157 3200895 2855152 2653498 2879088 2764485 2562385 2355583 2766434 2302910 2575140 2714199
5147 2714199 2444104 2374409 2698003 2462205 3010895 2459863 2561250 2943055 2898255 2926025
5137 2926025 2763682 2352170 2874248 3143075 2402608 2676708 2812697 2820157 2553007 2719679
5127 2719679 2642452 2785050 2243288 2102780 2712348 2015937 2082049 2360922 2255260 1974077
5117 1974077 2320366 2339127 2115618 2000245 1749397 1899403 1975051 1942676 1385837 1642991
5107 1642991 1726771 1688670 1577018 1689084 1631705 1742096 1782125 1884285 2203494 1921238
5097 1921238 1976551 2236591 2171347 2179490 2470866 2403529 2799104 2258604 1869589 2274480
5087 2274480 2065860 2335119 1828698 1943104 2491551 2227240 1745901 2076203 1831489 1628961
5077 1628961 1424347 1820030 2025098 1648068 1984637 2324455 1803616 1646281 2374802 1945332
5067 1945332 1719710 2299912 2266894 1597238 2201086 1755528 1442295 1446300 1510004 1642678
5057 1642678 1134698 820005 1498314 1450247 1108096 1437731 998295 1500198 1372985 1421854
5047 1421854 1206140 1377252 1290040 1281359 1380302 1198416 1417949 1457649 1280946 1404633
5037 1404633 1064583 1467041 1803796 1358079 1209469 1430369 1247255 900012 1087711 1363466
5027 1363466 836864 621193 841695 584616 461647 565990 748882 684295 1254947 1415029
5017 1415029 1381147 1307668 1471472 1721104 1400301 1590654 1587517 1554221 1347112 1460571
5007 1460571 1626764 1480076 1369719 1298867 1023560 971687 1297721 1120371 1072996 584087
4997 584087 1073412 715115 632176 627055 583362 571689 911621 723427 572344 965095 1546889
4986 1546889 697623 800220 1352499 1256604 1001563 1063333 1522976 1288091 774603 1018606
4976 1018606 1022033 1260903 574557 685815 835636 683929 505777 228036 401198 295640
4966 295640 447920 477887 306942 468068 761215 855563 685403 765026 1141500 891294
4956 891294 856897 1026670 815764 1198860 1159641 1051155 1067443 1124761 1344568 1007775
4946 1007775 542511 815221 1491222 802316 1057695 1209519 1018998 828258 876951 1092810
4936 1092810 1433791 1052033 1091159 600509 1048308 1077833 910887 794876 1434631 1264713
4926 1264713 861387 1156808 1209577 851927 849779 861566 1063241 1275124 861517 528194
4916 528194 1071203 1105677 902027 570542 1100178 1040989 921898 806168 1140600 1073309
4906 1073309 937847 960906 1228782 1314623 1377472 1262698 1129343 1410582 1358543 1070314
4896 1070314 986464 1467986 984538 881056 919915 1592859 1528026 1219139 1322259 1719868
4886 1719868 1612641 1664543 1548732 1803860 1665882 2129881 1840719 1682709 1504652 1969107
4876 1969107 2228544 2074987 1908252 2290718 2355103 1751000 2047962 2304629 2269188 1994569
4866 1994569 2190990 2218549 2184314 1723595 2140692 1838469 1485590 2152435 2000306 1917619
4856 1917619 2045350 2365618 2165593 1987216 2480815 2944181 2610961 2348098 2870031 2863377
4846 2863377 3048804 2935880 2781619 3631928 3040025 3335261 3156281 3773986 3659399 3555194
4836 3555194 3751018 3376056 3353820 3249755 3711438 3594428 3569837 3727905 3721581 3962453
4826 3962453 4301406 3971893 4640209 4158261 4324159 4237145 4268813 4687162 4809208 4521752
4816 4521752 4301134 4720462 4537867 4670284 4407590 4847978 5346803 5080861 5125826 5564464
4806 5564464 5420100 5438675 5838743 5742144 6236725 6257789 5955467 6169985 6941511 6563048
4796 6563048 6823432 7591335 7986169 7846939 8254012 9619455 9953472 9951978 10721731 11360847
4786 11360847 11769090 12383332 13230090 14207150 14751786 15763607 16826099 17951988 19369007
4777 19369007 20817098 22509421 24648794 27677071 31043605 34574244 39061307 44137858
4769 44137858 50261096 57022772 65695702 75110500 86620284 100836488 115306997 123420317
4761 123420317 122244030 111797404 95377920 78395511 64112122 53914618 46687705
4754 46687705 41359313 36989268 34052875 30948513 28492701 25811582 23925292 22327792
4746 22327792 20474410 19131073 18601983 17629703 16236300 16036737 15826388 14846558 14733010
4737 14733010 14260101 14321482 14172515 13496886 13865632 13735264 13438435 13693435 14119641 13903914
4727 13903914 14251351 14865607 15035916 15075368 15638745 16120761 16626134 16277418 16979412 17657517
4717 17657517 17839417 18165500 18866385 19409305 20208384 21443699 22329739 24179172 26459719
4708 26459719 28215180 31364891 35323313 39565156 44708619 50093405 57284053 64658096
4700 64658096 73854229 85317165 98440158 110185230 117043619 117280542 111139555 99701326
4692 99701326 84106822 69181176 57640964 49345453 42520329 38015859 33842823 30995459
4684 30995459 28445766 26090512 23820883 22029741 20447606 18887512 17727389 16584976
4676 16584976 16347197 15314313 14459630 13512854 13265216 12563038 12373941 11431141 11276774
4667 11276774 11060962 10520603 9868733 9607351 9299112 8973809 8910731 8400092 8180435 8072210
4657 8072210 7757353 7637061 7634085 7229804 7084304 7319214 7171761 6813440 6258443 6234988
4647 6234988 6306611 5712166 6131617 6025574 5974014 5756428 5672151 5312743 5149785 5437711
4637 5437711 5231341 5061399 5024214 4934532 4940913 4835239 4882105 4528655 4173030 4260447 4599950
4626 4599950 4105958 3908728 4434609 4091786 3871013 3861000 4178089 3629250 3657046 3538984
4616 3538984 3555949 3000691 3061339 3576222 3263195 3168846 3139025 3234594 3562257 2973201
4606 2973201 3040107 3219546 3246988 3283286 3155340 3263165 3462258 3596785 3444556 2994773
4596 2994773 2775749 3395895 3064923 2914143 2495878 3141197 2783718 2768230 2802017 2491764
4586 2491764 2636675 2547238 2458499 2397691 2470511 2737068 2627308 2564809 2651190 2628573 2534967
4575 2534967 2126752 2764385 2587189 2348535 2516248 2709848 2691980 1910264 2403127 2657932
4565 2657932 2156903 2143251 2415427 2181581 1905583 1972589 2276373 2084613 2404850 2266870
4555 2266870 2261227 2086518 2026217 2299406 2026639 1897459 1638930 1710652 1954838 2099666
4545 2099666 1561934 1535976 1935438 1995768 1745327 2234769 2306422 2094111 2169648 1955947
4535 1955947 1988849 2152872 2132624 2379633 2135551 2243796 2085329 2244685 2002823 1865772
4525 1865772 2048657 1601530 2165235 2041874 2123540 1939914 2437191 2379596 2241883 2204211
4515 2204211 2342091 2279496 2365612 2361489 2315595 2114153 2164537 2594989 2495677 2080762 2081558
4504 2081558 2434525 2222487 2175050 2277056 2412790 2289337 2097380 2038525 2477659 1997049
4494 1997049 1725883 2035657 1884884 2021113 1851169 1811218 2173959 1769828 1969615 2300439
4484 2300439 2311200 2001098 1738144 2421900 2400123 1818759 1823384 2125619 2635748 2141445
4474 2141445 1728942 2190524 2142453 2197399 2330461 2014763 1801093 2168437 2330261 1873802
4464 1873802 2163275 2623394 2452787 2032323 2351395 2780302 2718235 2137726 2621236 2810941
4454 2810941 2785040 2749137 2957867 3255146 3466662 3434246 3986466 4262666 4878910 4668365
4444 4668365 4508944 4940734 5268603 4674962 4315032 4031854 3745129 3581012 2930357 2936692
4434 2936692 3189840 2801675 2697421 3021294 2692197 2815862 2650121 2803750 2903168 2734772
4424 2734772 2353509 2913014 2692613 2747143 2730377 2810363 2675647 2883854 2733535 2761369
4414 2761369 3227534 2830375 2606725 2609587 2801406 3083693 2820898 2603069 3088387 3105158
4404 3105158 2792824 2948708 3197368 3298818 2947706 2905320 3562235 3084594 3149780 3347670
4394 3347670 3376554 3504868 3316850 3834911 3818368 3429355 3778966 3873227 3745422 3869072
4384 3869072 3748840 3807708 3852588 3678601 3781097 3997133 3759236 3532945 3984921 3797334
4374 3797334 4107343 3644166 3728390 4082159 3969470 3688200 3365988 3635107 4041685 3801967
4364 3801967 3557534 3831913 3966439 3765512 3543548 3733496 3713938 3947299 3394223 4147285
4354 4147285 3941283 4073437 4273337 3961700 4296502 4090155 4209621 4277433 4406340 4710138
4344 4710138 4496044 4389527 4723746 4404378 4294639 4573053 4634980 4418190 4688172 4598096
4334 4598096 4463421 4847356 4616986 5056154 5149579 5182245 5390224 5406893 5696657 5781080
4324 5781080 5453124 5842532 5818532 5502661 5680398 6031877 5907331 5837637 5879635 5905572
4314 5905572 6150359 6254558 5816555 6110125 6448598 6348800 5925927 6127794 6315107 6057797
4304 6057797 6336259 6661315 6598427 6614201 6864982 6742169 7147689 7463430 7268597 7842207
4294 7842207 7815483 8052174 8111524 8371847 8496865 8438835 8737127 8989915 9331188 8977159
4284 8977159 9333362 9635443 9539769 9552628 9729229 10124830 10384487 10517514 10469210 10420232
4274 10420232 10175629 9793651 10028472 9674091 9826315 9868410 9830061 9751564 9968310 10035991
4264 10035991 10278467 10434904 10424769 10354818 10708590 11044760 11180197 11256695 10891573 11418494
4254 11418494 11213460 11354131 11813588 11862098 12112658 11761429 12135110 12212075 12626041 12693378
4244 12693378 12656544 13006737 13129408 13578149 13843783 13850170 14254051 14628071 14608813 14603332
4234 14603332 14920186 14697844 15046236 15128102 15378593 15505561 16107189 16125633 16619080 16570726
4224 16570726 16821376 17642177 17687582 17734613 17864282 18225640 18015799 18185237 18451037 17784174
4214 17784174 18213267 18477672 18349681 18250292 18308657 18619983 18323977 19253476 19685988 19742589
4204 19742589 20472003 21303260 21935937 21888213 22396198 23456624 23432434 23422274 23562903 24109633
4194 24109633 24756250 25270438 26086718 26967026 28191868 29498473 30957751 32786699 34767646
4185 34767646 36852081 38491310 40225520 42398315 44582127 46539707 48595562 51047870
4177 51047870 53893465 56537870 60073868 63698828 68089280 73255661 78632842 85323315
4169 85323315 93153028 102457849 113251922 126381643 141692779 159229003 180404352
4162 180404352 204918180 232364087 263844820 301853763 347281384 396571584 432959404
4155 432959404 437608105 405093899 349225812 290965667 243232401 206850702 180032504
4148 180032504 161103750 146364593 134644038 125165446 116491863 108921507 101617134 94510118
4140 94510118 87862477 82128775 77060557 72951756 69408710 66577101 65159378 62967914
4132 62967914 60573866 59156887 57549988 56382995 54965904 54036445 53351385 52800909 51836263
4123 51836263 52026491 52060077 52345452 52321783 52446510 52939053 53094451 52473164 52116559 50988162
4113 50988162 49019670 47313901 46322340 45350946 44423554 44589980 44596977 45667877 46840369
4104 46840369 48746112 50464728 52929470 55256288 56773300 56911750 56147380 54986104
4096 54986104 52375396 48472785 45265020 41411561 38716848 36572127 34507792 32888925
4088 32888925 31247805 30779117 29872376 29479989 28859457 29036617 28889636 28450249 28783278
4079 28783278 29034976 28985524 28921124 28481282 28550182 28701022 29047105 29198280 28876542 29261044
4069 29261044 28820255 28482719 27392237 27508425 26535938 25196457 24415522 23707595 22920698
4060 22920698 22024646 21457466 21602688 20790760 20117583 20129366 20162472 19747210 19472380 19665596
4050 19665596 19814209 20139413 19888744 19750479 19862949 19568173 19807686 19489448 19573096 19505312
4040 19505312 19276453 19142440 18941509 18495357 18299903 18400197 18177618 18223889 17980244 17692744
4030 17692744 18230784 18054536 17803106 17905149 17983918 17664338 17577110 17714507 17723901 18065261
4020 18065261 18017533 18340635 18645967 18433223 19044601 19341674 19696016 19543666 20434868 21304608
4010 21304608 21630257 21813321 22740940 23952633 24275442 25756236 27023460 27986237 28402374
4001 28402374 29030598 28454221 28611503 28382284 28361414 27962211 28276137 28874597 29472241 30227781
3991 30227781 31158946 32635419 34006137 35408607 37195649 38113540 38416504 37660255 36961862
3982 36961862 37124001 37212749 36921443 38073245 39014888 40307835 41903492 43452038 45330274
3973 45330274 46857616 48212333 49039346 49897481 51100273 52680898 53901231 55166087
3965 55166087 56802449 58686814 60034531 61229618 62256619 61600507 60413111 58499039
3957 58499039 56079293 54864061 54176591 53231592 52825540 52724509 52556267 52792556 53776644
3948 53776644 54982295 55648015 55148173 52637580 49945785 46881767 44459374 42006177
3940 42006177 39543404 37965550 36479916 35029151 33612456 32651314 31954037 31285854 30271270
3931 30271270 30369457 30264372 30042690 30470906 30944582 31434784 32101645 33295605 34642351
3922 34642351 35809249 37672381 40613433 43033833 45432185 47396034 48343800 47525231
3914 47525231 46373057 46092543 46286211 47708817 50553460 53977255 58173091 60376275
3906 60376275 58237464 52784197 47887187 43917929 41424864 38512312 35924191 33790799
3898 33790799 31383145 29060974 27969837 26576378 25377308 24614828 24008748 23570560 22617057
3889 22617057 22438594 21942397 21333525 21296831 21395582 20881850 20756379 21026358 21145680 20416161
3879 20416161 21101364 21318363 21402076 21333250 22131901 22630106 22646333 23413174 24078730 24820569
3869 24820569 25442756 26890904 28203509 28998240 29587829 30341318 30315364 29953244 29808636
3860 29808636 29597572 29529296 28675906 27975407 27505340 27309644 26843166 26808319 26573688 26952261
3850 26952261 27060171 27605575 28464865 28874048 30221873 32075011 33139893 34310501 36644370
3841 36644370 38928792 41464980 43623729 46393333 49252902 51071373 52534714 53559013
3833 53559013 54411957 54376006 54815141 54292927 52583645 51434176 49748310 48468575 46738822
3824 46738822 45866871 45817933 45801112 45507846 46992810 48882986 49731667 51695450 53301146
3815 53301146 54296499 55719967 57228753 59791385 62315002 64864497 68210927 72048670
3807 72048670 75626510 79055959 81123750 81939754 83122188 83602409 84347642 86128885 87191949
3798 87191949 89145495 90932393 92173512 94246808 97147616 99987289 103025501 106819412
3790 106819412 111461831 115999285 120385977 124547889 126457928 124635755 119306923 112654792
3782 112654792 104944030 98178084 93015926 88713243 85667985 83886422 81719032 80156416
3774 80156416 79325004 78852016 78733323 79381148 80499439 81138509 81369119 80515340 78735557
3765 78735557 75868646 72499535 68841902 65533978 62435195 60080485 57734579 55362915
3757 55362915 52707928 50080794 47731394 45202741 43767448 42037212 40683338 40102112
3749 40102112 39681705 39342757 39293473 39214318 39806323 39855614 40689461 41365604 41969345 42317307
3739 42317307 41689237 41454050 39844149 38955698 37578072 36314296 35233789 34052365 33003084
3730 33003084 31766452 30701985 29509690 28315496 27233615 25972999 25844295 25473247
3722 25473247 24540601 24145133 23616845 23518912 22913449 22865343 22354733 21964996 21929542 21862190
3712 21862190 21337119 21250755 20986637 21527560 20835198 20840792 21395381 21330281 20956722 20821593
3702 20821593 21204206 21164296 21736084 21771963 22531538 22685904 23329596 23462320 24135083 24521099
3692 24521099 25513750 26357394 26947717 28251593 29335648 30672325 31378714 32581151 33813719
3683 33813719 34419266 35370530 36221430 36996499 37954708 38541064 39179310 40207397 40518367
3674 40518367 40459314 40282522 39304534 38575769 37889087 37278751 37670688 37760406 37990246 38880940
3664 38880940 39824251 41292357 42673095 44415870 46748387 49317971 51629706 54257216
3656 54257216 57086675 59223284 61138716 63237113 65431593 68119812 70579791 72371499
3648 72371499 73261833 73224256 72216538 70249173 67984719 66350198 64446535 63737452 62668932
3639 62668932 62069493 61997399 62034252 61954789 61244062 61123994 61325285 61670604 62307957 63691567
3629 63691567 65992238 68002848 69428161 70306146 71082482 72049922 72492923 73472629 74783199
3620 74783199 75725128 76564140 77246373 77947819 78806950 79408256 79222021 79540633 80256979
3611 80256979 80328833 80052625 79312607 77364286 73946013 70559169 67188645 64358411 62112432
3602 62112432 60730245 59667313 58873123 58837321 58492307 57676023 57029314 56610064 56275159
3593 56275159 55986494 55722402 56278000 57220847 58585905 59980747 61551022 63376301 64219962
3584 64219962 64687705 64229458 63820522 63008912 61617565 58974690 57319053 55064953 52065292
3575 52065292 48594313 46382244 44253650 42155015 40651979 39133200 38495678 37650942
3567 37650942 36691483 35822600 35184551 35235289 34667346 33704177 33962004 34186413 33927576 33953561
3557 33953561 34213508 34393701 34219340 33697685 32945959 32436141 32137419 31319634 31021994
3548 31021994 30034846 28876356 27736017 26817280 25873197 24942512 24312972 23666685 23343778
3539 23343778 22923578 22639009 22164275 21389266 21260210 21135499 20495889 20348780 20271193 19750620
3529 19750620 19664042 19382524 19537520 19134945 18466900 18326502 18221323 17980709 17305819 17312648
3519 17312648 16862121 16848290 16692520 15949576 15875516 15613866 15171730 15655798 14852034 14772898
3509 14772898 14884718 14371775 14295371 13935916 13979718 13604278 13626235 13530128 13128227 13156464
3499 13156464 13161193 13168064 12445555 12571319 13140400 12847989 12286711 12353299 12436367 12075932
3489 12075932 12467497 11895350 11750061 11389048 11799806 11320134 11133686 10909610 11020887
3480 11020887 11169243 10758038 10367704 10398401 10257174 9969556 10011610 9860523 9576454 9582271
3470 9582271 9644040 9280905 9143193 9404715 9191236 9580163 9147866 9220558 9558112 9178640
3460 9178640 9318297 8907813 8808280 9276883 8742500 8708257 8801715 8405559 8740167 8591418
3450 8591418 8430461 8463004 8671518 8381573 8482462 9090756 8395151 8377557 8061354 8660966
3440 8660966 8573577 7722625 8392026 8092453 7780704 7338579 7923220 7837498 7849666 7303670
3430 7303670 8039316 7760795 7714165 7911023 7777369 7795891 8197143 8405603 8648417 8542306
3420 8542306 8734187 8889983 8724310 9157723 8612781 9045427 8729641 8693700 8609564 8469325
3410 8469325 8478206 8417467 8256611 8049497 8372498 8435541 8531636 8348924 8208004 8414477
3400 8414477 8695344 8709840 8878995 9178858 9167359 9203565 9087286 9763630 9886661 9587995
3390 9587995 9749367 10324717 10206438 9928956 10297448 10296107 10325899 10304192 10591178 10356292
3380 10356292 10212517 10656629 10417620 10084658 10260113 10726989 10513983 10245972 11090994
3371 11090994 11232705 11136903 11685917 11689999 11783591 12105115 12805578 12837863 13045247 13247441
3361 13247441 13606979 13493683 13233706 13089586 13094112 13220144 12858794 12968799 13081668 12902077
3351 12902077 12633963 12891871 12690000 12791976 12130072 12129627 11661841 11718132 11672386 11609123
3341 11609123 11593693 11673387 12009415 11970362 11793069 11848264 11564489 11733133 11215001 11391475
3331 11391475 11220154 11126877 11215483 10577569 10754872 10297400 10452365 10144516 9908905 9900622
3321 9900622 9984614 9631993 9359585 9510504 9835381 9202979 9164483 9146916 9307931 9337902
3311 9337902 8977442 9114345 9474287 8963695 8945518 8884060 8911372 8929377 8776195 8839982
3301 8839982 8528479 8353880 7949377 8196470 7877797 7652658 7981659 7769564 7675955 7968889
3291 7968889 7402437 7215761 7377979 7409666 7193216 7159264 7382892 7606473 7217363 6866407
3281 6866407 7746933 7524560 7344769 7336651 7442570 7252659 7242048 7385931 7351567 7423112
3271 7423112 7285019 7587481 7259672 7368367 7383431 6972081 7148134 7214031 6898926 6743602
3261 6743602 6877892 6889502 7154949 6807927 7081749 7133628 6963669 6706965 7076980 7082373
3251 7082373 6876978 6936132 6956640 6889648 6680890 6982793 7005815 6991003 7579449 7629520 7661250
3240 7661250 7685994 8118873 7782352 7518162 6953950 6942081 6313334 6081749 6210846 5721487
3230 5721487 5953032 5480396 5656985 5129059 5156379 5110992 5202824 4917390 5323951 5096303
3220 5096303 4816069 4961328 5400179 5149046 5350310 5394676 5698734 5791453 5929240 6281598
3210 6281598 6609739 7145995 7361417 7434008 7105340 6850512 6090441 5744569 5342131 5412570
3200 5412570 5365996 5025745 4562580 4916746 5207286 4895157 4206656 4629548 4642485 4135944
3190 4135944 4109413 4311764 4156935 4235591 4302711 4183401 4206109 4638009 4435248 4389803
3180 4389803 5060879 5420401 5433283 5583886 5857219 6223187 5755690 5146445 4911613 5064002
3170 5064002 4833124 4786144 4507172 4717730 4849105 4226060 4576727 4494574 4616328 4372786
3160 4372786 4075229 3767771 4227339 4068215 3801151 3937640 4165112 3500451 3893255 3723958
3150 3723958 4023198 3942792 4423977 4458147 4167634 4673383 4574298 4560524 4278252 4314636
3140 4314636 4446260 4263990 4230577 3994487 3878310 3829391 3801681 3684444 3639917 3875368
3130 3875368 3785537 3861208 4272481 3945375 4233068 3721085 4147715 4151474 3753428 3879630
3120 3879630 3900894 4185933 3723814 3547679 3703315 3877427 3673158 3363137 3529897 3654359
3110 3654359 3310261 3419273 3551381 3627326 3479974 3634840 3612097 3409902 3141072 3821667
3100 3821667 3455460 3151973 3363524 3722641 3084007 3347973 3167531 2984288 3121442 3067946
3090 3067946 3099157 3064518 3186677 3035857 2933076 2807005 2744444 2951832 2194799 2493088
3080 2493088 2675907 2511454 2945647 3214186 3055436 3016157 3097478 3002481 3024685 3092601
3070 3092601 3059013 3045113 2890885 2766191 2705158 2704385 2407361 2438459 2589160 2482807 2200887
3059 2200887 2057787 2549446 2602440 2485151 1955695 2443152 2664058 2016184 1899132 2053048
3049 2053048 2180905 1860812 1422741 1795968 2032607 1746910 1617496 1658347 1702366 1884300
3039 1884300 1621993 1706822 1629166 1318849 1724309 1565605 1338959 1800928 1699258 1629660
3029 1629660 1609060 1303242 1335150 1598324 986005 1256887 1580136 1599192 1159924 1243330
3019 1243330 1181895 1255248 1072021 749134 1081111 1062291 828024 833851 1341158 1154334
3009 1154334 818580 541289 1138405 1136730 637502 492069 1040347 1029094 716437 972529
2999 972529 863971 1078034 1112921 890151 1103318 1324881 993512 902380 1062244 1221590
2989 1221590 988398 804709 1207580 1296242 1138609 827113 830500 930664 783866 937033
2979 937033 883264 662294 897948 718520 669335 539747 468620 638370 659635 788536
2969 788536 1088563 995178 813042 1187948 1021017 803124 863952 866403 719944 371904
2959 371904 655264 670790 465930 352875 429949 736901 743446 683856 656192 513055 750988
2948 750988 839907 704066 1039977 816165 933614 816408 804285 577931 706297 621973
2938 621973 553357 878488 364304 534425 776701 580608 606915 649224 371152 388767
2928 388767 861739 303057 597630 621165 654384 931550 380808 286814 751867 736323
2918 736323 573149 887699 990291 911028 892709 560523 1542143 1160280 355277 1079024
2908 1079024 1050659 622271 370005 575651 426555 641006 570134 684605 581971 557780
2898 557780 800886 820178 879818 1250877 708140 526581 961580 731460 742813 550219
2888 550219 520866 763576 516295 611084 624151 430846 620997 819362 248676 582229
2878 582229 717806 642820 566436 518720 455596 628487 359250 418908 607957 632419 467563
2867 467563 336344 198137 366720 814767 350328 139304 57029 49259 285720 58675
2857 58675 -82179 232808 461117 113037 284142 742931 520953 642624 444118 843486
2847 843486 753326 376365 935405 884977 270243 58674 539175 110318 -218722 117820
2837 117820 355052 -5262 205761 356734 277749 694746 474679 559781 233212 836982
2827 836982 226468 114296 227004 667838 360051 -22965 207420 451918 612821 698133
2817 698133 385625 601893 652647 595823 563331 460314 410909 592399 791655 94262
2807 94262 205202 377787 436393 226502 -197499 -58420 353343 232735 113802 8168
2797 8168 168972 394010 660801 312260 720469 490351 772706 698176 269101 342129
2787 342129 293274 336133 -97927 240326 379747 -34211 170173 406406 141915 295054
2777 295054 387548 315421 363973 256591 558037 175273 297413 231369 9901 114839
2767 114839 147858 116282 203274 191749 167798 422423 -69990 157172 -136329 -12647 391767
2756 391767 2659 -402202 -177784 -171147 -261193 -640482 -538962 -185164 -476694 -623896
2746 -623896 64640 176758 -124089 147954 175574 93206 -420004 235510 114892 -160505
2736 -160505 -240801 -7767 -608807 -286536 -441124 -372523 -752997 -294082 -50430 -168360
2726 -168360 110004 119362 -226054 -473041 -113040 -421669 -240763 -431687 -345144 -529406
2716 -529406 -264666 -487634 -163091 14618 -132946 -377024 95038 -27244 -295141 -167579
2706 -167579 28817 -406001 -279571 -526618 -574852 -685415 -444665 -383515 -698443 -655735
2696 -655735 62718 -393175 -749800 -272594 -33423 244662 2265 219307 269364 699466
2686 699466 415792 109914 171336 549681 328025 172282 246485 347392 276495 83357
2676 83357 534918 239608 -37167 -117823 321979 150816 36423 197077 148910 -238866
2666 -238866 -132123 299762 46276 -208645 -135503 179548 -191060 -335478 -263972 216988
2656 216988 -163187 -356207 -233992 -133123 -108939 129776 -257281 -157932 62717 16424
2646 16424 -164826 -315499 -94551 130167 -79541 4285 358201 316904 174877 382343
2636 382343 437711 3145 389566 684244 412024 -19849 599663 847251 272566 377500
2626 377500 810900 686520 176474 633268 596921 380298 238573 422586 185111 9918
2616 9918 229340 91158 190453 -108845 -100407 229210 81142 175531 384626 338528 658017
2605 658017 498085 -97921 -17896 219027 -110083 -181376 -93458 -299884 -289619 -631806
2595 -631806 -513607 -310435 -668691 -444978 -119198 186259 57994 290433 99069 154003
2585 154003 306039 1966 -216422 -14344 -48483 -19214 -303973 -423039 -162769 28865
2575 28865 122835 -221988 84789 282646 65898 318438 279551 73862 -335404 -63865
2565 -63865 -340670 -484775 -369023 -482169 -484668 -363118 -343938 -261743 -288009 -361607 -331650
2554 -331650 -433225 -232783 111450 164326 -130525 229964 669429 107602 -198545 -254568
2544 -254568 39306 155935 -500080 -353185 59867 230408 -184916 5610 -153383 43588
2534 43588 -256964 -283114 -68931 249651 -79236 -244888 144649 167584 70869 306905
2524 306905 52395 395199 449546 340468 264200 482116 236887 357276 460776 36749
2514 36749 331244 574026 479668 210391 252655 667505 888287 85477 450970 502280
2504 502280 740465 147287 56232 269714 65107 -303588 -622334 -301487 -340949 -752927
2494 -752927 -580141 -514435 -5476 -4260 -334558 52943 551560 -109954 -262515 62131
2484 62131 89008 190156 -233342 -387988 -389797 67729 -365735 80017 167081 342293 -142548
2473 -142548 -247274 198862 345421 106259 -183109 212684 114337 61678 76636 -145852
2463 -145852 8013 -290095 -460956 -107537 -47560 -28536 -595462 -262510 48863 -109334
2453 -109334 -465656 -371973 -255565 -194294 -499635 -507809 -20065 -100754 -434236 -173628 185977
2442 185977 -120785 94598 150110 7812 -54797 -12154 -306018 -312462 -164989 -543672 -419631
2431 -419631 -252452 -306686 -466997 -662375 -461801 -259091 -515364 -435279 -313958 -379657
2421 -379657 -639396 -205953 -443995 -297968 -389409 -34487 98706 -265745 38959 553541
2411 553541 128410 123688 426310 269083 250422 35246 -47747 402266 266566 -333459
2401 -333459 -384776 -147177 91144 -29892 -248269 114074 159851 15792 86947 -189591
2391 -189591 -195095 -97278 -383052 -501596 124937 -76247 -178857 1593 554692 427079
2381 427079 548637 931162 510603 466319 1025301 537500 395465 353068 479752 399057
2371 399057 -65286 29693 344706 117388 -325364 -133774 48229 -5811 262881 75012
2361 75012 -48435 419297 172240 -9799 -353548 -250704 165068 -55168 -88416 181081
2351 181081 788661 226503 282545 97073 620566 906236 370132 399338 500965 426239
2341 426239 342856 500613 765662 201935 39112 361759 395159 -69077 -214849 481391
2331 481391 159870 -243434 -150737 151667 170969 -738016 -460735 -270064 -297702 -388754
2321 -388754 -691308 -172232 -195867 -111121 -469757 -608029 71786 56008 -8456 271173
2311 271173 411707 464078 168661 526430 277656 615085 129902 176544 411536 247297
2301 247297 291963 207064 289087 314682 245502 -61312 13416 97698 -374871 -322329 -240663
2290 -240663 -514464 -565687 -398258 -597912 -42842 -495727 -506852 -337693 191909 -176228
2280 -176228 -75289 246065 -86104 276888 230148 67189 128844 -183609 362230 80575
2270 80575 -277278 392251 240319 300225 662137 545183 19533 555061 442779 242558
2260 242558 620256 879702 619827 498230 414730 603700 114475 -226448 430992 119872
2250 119872 -314764 79211 -422614 -227128 -184350 88840 -289108 -48198 -239661 -201164
2240 -201164 -359602 -24474 177384 -11046 196828 246510 58634 -107373 -71196 -54972
2230 -54972 -157321 -161811 202560 197880 -50819 439614 750276 116194 -104819 515983 388584
2219 388584 225353 324320 285002 699336 415683 357602 631188 435380 544807 610577
2209 610577 299773 434225 526074 603643 757218 780000 764709 1272469 855066 796543 1133624
2198 1133624 1254838 1011914 1475544 1085361 1282692 1368268 1176159 1652968 1423577 1289237
2188 1289237 1321744 1374286 1611175 1513247 1465633 1816289 2022753 1710571 1647215 1790612
2178 1790612 1887702 1890257 1968540 1957174 1756625 1796112 1560287 1589804 1872907 2054171 1851975
2167 1851975 1839588 1890258 1752071 1938726 2044516 2120061 2226715 2536176 2789220 2708612
2157 2708612 2688819 2866055 3208915 3260858 3108250 2996404 3034733 3511768 3642541 3821416
2147 3821416 3852940 4479879 4733302 5358158 5829423 6188033 7058580 7271287 7587320 8091255
2137 8091255 8434960 8951055 9338937 10001840 10912189 11744012 13086004 14212689 15401166
2128 15401166 16756811 18405131 19554403 21297089 23431926 26258938 29727303 33711076
2120 33711076 38703651 45040485 52223540 59704646 68470600 80920851 97988520 113831537
2112 113831537 113137596 96676907 77657040 61633488 50116282 42601638 36774052 32470214
2104 32470214 29044780 26303224 23687171 21779200 20280337 18674445 17537049 16396373
2096 16396373 15286629 14025411 12618392 12068849 11230816 10380760 10415391 9619010 8932042
2087 8932042 8855710 8225206 7533508 7082434 6812127 6672833 6152955 6264934 6240215 6013904
2077 6013904 5763021 6204100 5944116 5623124 5802630 5933065 5664634 5404470 4751373 4767164
2067 4767164 4401028 4282317 3703014 3914780 4060399 3784668 4232260 4120645 3549517 3422455
2057 3422455 3997684 3687138 3505792 3815862 3523454 3053483 2755845 2653923 2497695 2063831
2047 2063831 2316159 1774491 1703031 1799628 2555160 1674468 1827998 2384574 2560456 2365294
2037 2365294 2256534 2294258 2235214 2153725 1742391 2115385 1793413 1622294 1852563 1779531
2027 1779531 1668029 1933450 1598029 2021666 1714037 1624244 1828411 1647109 1419148 1561599
2017 1561599 1158565 923275 1219388 1135139 913890 737002 1121639 1008223 881767 260527
2007 260527 1251341 1173430 826264 1245739 960990 1238256 1194399 942553 972990 817582
1997 817582 719689 774064 691009 657753 654325 544707 511034 449623 141305 130517 636276
1986 636276 478119 -82129 583353 672900 569768 145242 592555 897483 714731 626923
1976 626923 627017 588221 587939 771503 555252 371160 931097 696144 506077 155489 259161
1965 259161 130696 33589 -228117 409342 352679 -115670 180829 628077 333926 -69040
1955 -69040 325932 34481 196650 89166 215901 14715 316564 446960 -80675 -233419
1945 -233419 383240 444193 78950 60719 406242 635592 321768 -219897 300203 384614
1935 384614 114294 -121392 48480 200508 3753 -200011 -130905 79869 80052 160752 -88210
1924 -88210 14989 326779 -228984 -153255 63306 218354 -257115 -488350 -107755 27187
1914 27187 -185536 -344014 -170856 -164454 154241 222342 120823 -166811 43918 69598 -173402
1903 -173402 8646 58511 12452 -87913 79435 -171905 -244904 -59036 25970 -137018
1893 -137018 -454019 -522211 -12863 341170 18623 60197 459516 515916 129059 67136
1883 67136 191574 497710 146980 221346 387658 542125 455311 331326 -177187 524113
1873 524113 579065 35218 380559 424858 578756 242792 250394 406871 470051 330851 595223
1862 595223 267565 -215039 218538 261041 -162834 -146619 -44400 150945 132610 49321
1852 49321 204538 277863 582245 296513 92516 632914 621450 7412 348065 715035
1842 715035 796303 385882 2791 199321 67634 86508 63602 319752 28706 552578
1832 552578 593170 131368 435127 149592 463302 712073 210510 -122649 470898 836680
1822 836680 -118442 -170182 152122 402692 -57073 79869 165895 341094 338142 340531 441947
1811 441947 337740 98348 348279 261040 355152 671274 360943 587294 445824 -23108
1801 -23108 157803 146428 326952 10506 -455201 220079 505570 110604 180441 530243
1791 530243 250463 265239 378647 -107960 -6836 603611 504622 269722 -137902 1078610
1781 1078610 489344 193367 172020 366595 304354 111987 201091 -378408 19649 -84982
1771 -84982 -166625 -187558 -295424 -468581 -219296 -157740 -720084 -301708 -210608 178138 -90050
1760 -90050 -242478 210173 226807 -182957 -118804 -282949 243145 426177 -470229 -66878
1750 -66878 6368 -90982 -60217 73693 24859 -325205 41856 84800 -49127 -143480 -198668
1739 -198668 164632 -6236 -339273 -102603 -239486 189418 133929 -310799 -245751 108370
1729 108370 -110086 -348631 24630 76960 -204132 -347411 46582 144553 200654 219703
1719 219703 518521 89238 -288884 -111850 -271009 -439007 -283576 -599126 -847663 -482823
1709 -482823 -561815 -633163 -948455 -91799 -60434 -889381 -374535 -282664 -123789 -667368
1699 -667368 -356506 -20433 -210072 -50415 -221863 17198 10268 265701 148778 -143427
1689 -143427 281275 320805 282889 267966 362897 380379 303203 -129274 85347 -40848 493558
1678 493558 301766 454081 349055 257488 207993 -50597 -5435 25935 52956 -91861 -107721
1667 -107721 334334 -5928 103996 75159 51704 9811 -209343 44300 -230303 -307952
1657 -307952 110271 113218 136682 250537 323228 -227235 -126700 386295 37879 -429611
1647 -429611 -74851 33829 -252690 -587108 -582934 143007 -169520 71293 -116250 26146
1637 26146 10040 90730 193530 166187 404706 458752 79223 290541 157800 659269 142330
1626 142330 62149 551381 531285 125772 -223630 279644 364431 264033 208486 395370
1616 395370 187194 -136919 -92720 209241 6568 -136161 -143395 -565556 113495 -354752
1606 -354752 -297394 -609883 -211828 -281833 -403429 -122671 130809 431259 -193965 107547
1596 107547 60229 311723 35524 320235 12724 61063 72668 142173 343177 -271518
1586 -271518 -457028 429777 214807 70604 41414 46953 -226013 -238561 -40031 32947 77981
1575 77981 -124694 77152 -333064 -243637 125479 15844 -23831 177211 400669 519949
1565 519949 178848 -39407 154957 453766 -300798 52312 -333741 -244082 -258807 -458553
1555 -458553 -84284 -98419 76234 -155626 175818 -33385 390220 334112 -101008 67437
1545 67437 353997 -205811 -173908 -250114 -470176 -168517 -165809 -100762 111813 197505 45691
1534 45691 174390 -10110 201656 41574 356824 292762 114527 -69728 131556 -122994
1524 -122994 -298470 -43010 -507750 -319852 -256964 -249014 -338671 -235562 58971 -166269
1514 -166269 -56815 139237 364689 -12150 113970 -311615 -45971 157233 -408972 -558479
1504 -558479 -206360 -9342 -876170 -332755 190196 124359 -445228 -5242 192177 -117258
1494 -117258 -186290 -162046 -220661 -330529 13595 -473726 -457115 -46480 113818 -496498
1484 -496498 -498050 46530 -305941 -515648 -752832 -375364 -244246 -245557 -581462 -257511
1474 -257511 -148915 -380869 -347594 -112927 -440026 -436983 -677571 -474655 -370987 -427222
1464 -427222 -500277 -386582 -559056 -241391 -371221 -245822 -370794 -254021 -473961 -468240
1454 -468240 -251195 -621074 -207222 -468423 -210214 -218700 -257141 -416291 26435 -140615
1444 -140615 -281843 66901 421378 75999 436132 114063 -26192 73998 145896 -61938
1434 -61938 -148707 -488413 24019 -90665 -312965 -24405 26585 -135619 -190229 -214813 -67814
1423 -67814 234673 -95197 96650 15458 -538837 -66850 123980 -594826 -370753 -279476
1413 -279476 -557773 -233677 -303272 -354683 142551 -128088 39174 -139234 -222068 44670
1403 44670 163110 -243464 322641 18453 -380484 93172 316149 -133791 186750 106936
1393 106936 384239 315174 -204930 -54754 381688 -17371 133617 228546 247274 99478
1383 99478 208937 -82904 -309075 -341273 -129174 225282 -345729 -216511 -35660 -26820
1373 -26820 -437415 182597 125266 -168451 -39267 -42835 -390196 -449909 -279822 -8585 -453670
1362 -453670 -616898 -458584 -372886 -570375 -424065 -172104 -300999 -380226 -192735 -134314
1352 -134314 -41225 -177169 383917 347916 132631 -69730 332764 85321 3224 133765
1342 133765 -73581 -299617 81758 188587 -179743 -125051 71053 -107105 -511630 -227891
1332 -227891 -20531 -124485 44471 417564 58199 201608 280071 261480 234239 213523
1322 213523 405951 466484 -93863 190004 345948 281881 344919 230560 244279 451215
1312 451215 711552 265846 135277 579067 68737 -16773 2790 -188724 16136 -334315
1302 -334315 -208381 -321190 -281669 96110 376878 17142 356671 532071 112095 654100
1292 654100 431629 259049 503333 445878 686480 140970 -294395 215078 366862 -157661
1282 -157661 -267307 269979 32637 -76643 -58408 -380 116936 126521 535430 169606
1272 169606 -322544 404919 264832 -216567 -458421 -151681 45734 -467264 -320170 -161682
1262 -161682 -428736 -115183 -378963 -591588 -279651 -325337 -138298 -71098 63811 122168
1252 122168 527950 354731 428609 710819 -36866 22192 174808 153650 138832 1532
1242 1532 302019 325748 -278093 -380415 397863 76077 -676179 142454 127915 -351367
1232 -351367 -101672 -378385 14113 -177542 -2645 130354 55354 470386 427282 681309
1222 681309 149393 500793 783641 92102 310735 388874 119074 -88032 -476535 387300
1212 387300 -94618 -492312 -214932 308702 -34904 -142793 70428 -355545 -210518 119333
1202 119333 159684 226473 36309 366601 -50784 -139180 523769 -470466 -236378 -239551 -534715
1191 -534715 -233105 -503083 -363877 -230726 -590950 -345993 -287028 -323216 -318506 -187934
1181 -187934 -253532 -321738 -211634 -607995 -179007 -124898 -484894 -426130 -518265 -484912 -362094
1170 -362094 -406825 -271120 -506156 -208687 114423 499689 12699 -73220 171331 -53977
1160 -53977 109165 40827 178511 -251878 -99364 -45481 -288271 -443608 47583 -325658
1150 -325658 -582140 15177 -75030 -234682 -452010 -403419 -353412 -138142 -144605 -401325 114295
1139 114295 -580726 -465533 -383535 130704 103020 -138996 281743 237631 70618 13347
1129 13347 197271 92334 56134 -4298 131068 7795 154476 102408 -227181 -320890 -523003
1118 -523003 -231948 -576896 -421285 -344321 59021 -188034 -602007 78562 -107036 -433833
1108 -433833 -392391 -518742 -419597 -290591 -269235 -467118 -387745 -247316 -437633 -759847
1098 -759847 -667708 35877 -3422 -449657 363827 262898 38041 475306 325324 144454
1088 144454 285608 252741 400773 96942 220738 37415 -28547 -39369 -239548 -127799
1078 -127799 -168905 51894 94547 -78249 -372211 -279889 -40174 -35715 -166267 -424375 -12981
1067 -12981 150603 -729622 -295114 274664 -150844 12922 -163739 -94788 18376 -180096
1057 -180096 -101973 -50667 30363 62473 112954 -267869 -168977 243314 168938 -265407 342321
1046 342321 178874 137724 83526 310095 522623 153257 -206454 626118 327881 332637
1036 332637 275973 680965 299640 458679 240517 440690 782109 578498 126582 238723
1026 238723 501760 263710 425483 272816 303586 251017 165448 224801 247620 2549 -9363
1015 -9363 109807 -128634 122162 -37431 45978 67181 -132681 -87079 17757 161549 -219734
1004 -219734 108497 -147681 -474134 -160299 152864 -52534 -376574 -193887 -282429 -249204
994 -249204 -650902 -568302 -111119 -547329 -199515 -474223 -614770 -342171 -464533 -596153
984 -596153 -58848 328105 273469 -61284 17692 166538 723082 67146 -137341 157081
974 157081 -138851 -58149 -472707 -424738 -437320 -365654 -773302 -464742 -343346 -174060 -274788
963 -274788 -331130 63588 91345 -7984 -398688 255410 -232278 -242968 -501645 -198588 -218891
952 -218891 -360559 -83712 -109941 -35350 -68056 103186 332086 412333 361548 -9060 -128956
941 -128956 193044 -25138 -444748 54617 85776 -143387 -167203 213871 251364 483712
931 483712 525594 438346 782712 399304 698643 313749 54961 224145 195217 55760
921 55760 -424167 -353736 -73816 -110658 -361616 85169 182855 295782 252336 103323 287241
910 287241 730674 18729 37934 470611 828372 -141423 -193576 88988 314833 49136
900 49136 -106768 227543 170934 60689 94372 331504 76723 -200173 -58894 83353
890 83353 -55152 -179707 -181896 69820 -455738 -98370 -107397 -188610 -219264 -171293 113865
879 113865 -100226 -24082 -29605 -645140 -87340 -162590 -758691 -727545 -285045 -554339 -960216
868 -960216 -310501 396166 -27752 -229318 21071 885310 569289 208295 398889 502525
858 502525 399992 229061 39793 -14738 62872 -156656 3726 72520 243363 98656
848 98656 274488 173025 86386 -26633 -81212 34376 -215616 -177419 -135772 -44282 -271497
837 -271497 -182591 -426190 -307793 -18055 -77978 -164246 -18976 -161160 373791 24538
827 24538 16080 213904 155956 -245881 128126 -45656 -480998 -293653 277116 386610 -133742
816 -133742 -77669 605101 425535 227948 491603 259188 71466 82990 146002 -10027
806 -10027 -182856 165042 402085 -93155 -43208 -16869 58331 -543934 -109499 184749 -100357
795 -100357 129536 148797 -97306 -36067 112570 196040 367936 25004 311179 343726 79509
784 79509 137071 430703 313784 676975 414515 311537 630870 219734 437028 305064
774 305064 249267 519102 554248 41702 307640 406103 814624 306494 -115483 406542
764 406542 388892 262195 -261248 -160918 150338 -208815 -178885 156886 163608 -49452 294126
753 294126 364146 81822 234600 577073 79129 369904 484180 428980 332896 478707
743 478707 361853 274848 287952 303461 227074 89176 206955 -10236 -238119 -83025 -125636
732 -125636 -186098 -48282 -225297 -579990 52043 23973 -253617 8398 -134034 -177055
722 -177055 -102015 -51937 24772 162097 524518 390024 -266544 316984 384935 179240 256296
711 256296 493944 520816 193009 666413 283470 135729 279603 390103 -155127 -485846
701 -485846 -132374 27497 -73579 -340906 -329129 233002 259249 -117548 -77393 353699
691 353699 612908 -109846 -235237 99408 206433 2267 -378931 390659 300102 -87811
681 -87811 -90941 2859 136327 17204 231029 454052 640889 307186 -38228 136405 235130
670 235130 709382 53979 -238773 248696 284862 -314452 -149502 388687 243448 94003
660 94003 -118937 204206 409527 273074 20962 -169570 384236 248720 -157896 11950
650 11950 130779 -216247 -337434 -71420 72795 41239 -50320 477034 333943 626228
640 626228 634139 847221 568573 394351 -118635 169174 98139 -174886 -772362 -197016
630 -197016 -598244 -284227 -671527 -87418 -236304 128354 80664 -19330 -255552 164966
620 164966 -49152 -42584 58093 -260919 224877 359887 10290 -156072 494359 641183
610 641183 288725 144780 878774 993291 718955 156537 931266 708280 -32583 -381212
600 -381212 329637 244184 -72460 -402330 573740 387995 -137794 238569 697824 342220
590 342220 379855 370019 292777 388272 260795 -361922 -214776 -73990 -377959 -354635 -187134
579 -187134 -1049 -613265 -311225 -89143 -358498 -182220 -113240 -27675 -392158 -39984
569 -39984 -252925 -576942 -352784 -329818 -421474 -458277 -443524 -494842 -13274 39523 -75300
558 -75300 198564 411435 575851 183224 110094 636313 499335 -254527 -307751 -116252
548 -116252 -422346 -623346 -517334 -433987 -436494 -491986 -499261 -133123 -26388 364852 233969
537 233969 404398 250123 428414 237999 80728 411319 61713 330508 -55317 102265
527 102265 -85666 -140685 -140981 196452 100896 71858 191071 604883 96848 -161719 84406
516 84406 -53733 -235052 -53085 60147 -349437 -182187 112486 -247167 -476209 -254494
506 -254494 309257 -327924 -508374 -88409 -44307 -338549 -197101 69043 -230573 35073
496 35073 309270 -8850 -387057 -6390 80780 84291 -310065 -99388 -303334 -68257 -156190
485 -156190 -287868 -356880 -48501 392991 -244858 -308078 101979 284258 -49730 -154541
475 -154541 -324623 -186599 216754 -162464 7977 123590 -13664 -432797 190594 343103
465 343103 112875 -248173 -7438 -182331 -681481 9198 -308337 -148649 -19296 -19917
455 -19917 -173852 -284782 177556 247497 -112684 46264 340184 242569 89057 26145 279554
444 279554 55543 -56899 -169046 112887 178540 -127223 -90879 -24923 -96130 -346718 162546
433 162546 223029 7209 583370 497256 319803 -90956 383007 760185 251709 1269
423 1269 141815 194410 -90854 217697 284680 -138983 409145 161887 404807 561519 448533
412 448533 252303 503591 694826 778868 159915 221334 552876 481259 -158028 60098
402 60098 319358 219011 231464 -116700 461464 21877 242758 92876 329147 249180
392 249180 264363 70069 169710 506742 -43983 -132076 -399063 168907 320345 23522
382 23522 350080 354923 418542 259962 421947 368518 446690 183807 443834 122916 312535
371 312535 204448 280506 -134242 52401 326392 114705 146831 10744 211575 -119245
361 -119245 -153752 -311791 731 24975 89142 -379190 74795 -244677 -376094 -135139
351 -135139 -72372 -8139 -247111 -17373 179953 55013 85266 458677 -227223 301475
341 301475 212787 352305 -29990 100589 197823 376513 353087 -163606 89490 47872 204241
330 204241 -64059 -320713 65122 -26218 -431309 -182282 -8985 61615 -15408 97411
320 97411 20516 226558 154071 179479 387511 8079 115898 244504 141418 -60567 149477
309 149477 350865 138391 190207 -40625 -260034 -193044 -5057 -71640 73353 21271 -41025
298 -41025 -171638 522257 342076 311317 356291 304659 375616 -140922 -12573 -132738 -403195
287 -403195 -564996 -364320 -686400 -220268 156407 -306099 -62483 -8338 23208 178728
277 178728 -238872 -128645 -137725 -86003 -321431 -645471 -126039 -335288 -568822 -688975
267 -688975 -502647 -215637 -666158 -226785 187332 -68890 -248747 -220357 259753 413341
257 413341 32886 -324027 299330 52486 -45633 -20303 9529 -361986 -211297 -244956 -287311
246 -287311 189740 -284521 -90378 -34449 -144624 -180453 -281076 -73970 1647 98496 -215254
235 -215254 38967 440212 -120715 74517 236361 626482 233428 9787 509258 567345
225 567345 -142734 -213584 67409 118719 -153760 -288785 -175547 -302595 110259 -63794
215 -63794 122066 217932 147263 -146002 -149552 357684 156779 -110299 222896 919361 209453
204 209453 443007 444359 173375 42034 52367 334973 207944 43248 274868 559176
194 559176 182674 146790 157569 519242 -94051 51237 271522 -8038 -339840 -230039
184 -230039 24267 -225178 -397193 -278864 -233897 -329553 -196839 -656960 -616040 -511861
174 -511861 -361271 -712046 -322056 -8996 -258487 -47831 110489 656682 442017 282522
164 282522 295669 540489 298576 206627 461081 223920 2945 -224217 -122900 167843
154 167843 -140386 -298148 15353 173697 -154180 -90654 18769 -21431 -499380 -383265
144 -383265 -87809 -629124 -713764 -673758 -367023 -895867 -684216 -252979 -139610 -112055
134 -112055 -158713 -155490 -130009 259221 28378 -262661 83560 249390 -1107 -124590 -190550
123 -190550 -53838 -168026 49465 -206415 393730 267055 -3801 94392 102548 430370
113 430370 231261 99807 303231 397309 -80997 183089 453554 154869 30104 -191495
103 -191495 112411 239452 -230170 -451577 117358 -83811 -260476 -378710 -390331 -332954
93 -332954 -323781 -216920 -184964 -51836 -426475 -269881 -447355 -178671 -218253 -390243 -191046
82 -191046 -256876 -250802 -386993 -532393 -114478 -132370 -569034 -190047 -28782 -156541 -135968
71 -135968 -215991 123072 154956 405541 252883 221477 243962 489365 207705 -318308 -33132
60 -33132 -128399 -312140 -540839 -359995 -160982 -740364 -601758 -287416 -282617 -479162 -185224
49 -185224 -149236 -72616 -135522 -313564 -530262 -285151 -370111 -355542 -333768 -383900 -291898
38 -291898 -397831 -388211 -327759 -249717 -485127 -512306 -477048 -365580 -558798 -768784 -737457
27 -737457 -511421 -615152 -912599 -797904 -546925 -549653 -408748 -569990 -766012 -421692
17 -421692 -303009 -767627 -566755 -120751 -117694 -436557 -419266 -203122 -617866 -617374 -518622
6 -518622 -341281 -353898 -527414 -161733 -165599 -233865
0 -233865
$$ Imaginary data points
##PAGE= N=2
##DATA TABLE= (X++(I..I)), XYDATA
16383 -1700622 -1659533 -1579908 -1769380 -1598010 -1530260 -1515753 -1357631 -1396810 -1230257 -797814
16373 -797814 -1035898 -1024606 -775162 -655234 -501478 -690894 -614122 -527065 -773784 -652818
16363 -652818 -1067703 -1101552 -1130588 -855152 -1113439 -963333 -728032 -937967 -993727 -734362
16353 -734362 -784633 -752630 -504166 -405843 -665560 -1026113 -377393 -575766 -716770 -659039
16343 -659039 -470667 -633941 -577266 -175830 -335848 -459403 -28964 147453 -43793 -132094
16333 -132094 284008 156821 -13553 116725 242049 -219076 -212303 -127476 26059 -112129
16323 -112129 -271709 -47935 46388 127351 136763 71183 79445 354991 75048 174295 224368
16312 224368 219457 45842 270558 60188 179767 83395 277783 277390 451399 572438 804478
16301 804478 715423 1056397 952008 1002678 1220998 1046060 1045661 999178 1318379 874167 838170
16290 838170 990560 1062334 858336 1075611 876309 1108074 1109678 1424034 1387097 1632678
16280 1632678 1563461 1867910 1804867 1625455 1608661 1616064 1365118 1242297 1299443 1158003
16270 1158003 953387 1373773 1081440 1332407 1442579 1274909 1231092 1275781 1602016 1503541
16260 1503541 1276124 1548368 1770466 1621999 1851066 2037546 2016048 1999097 2384043 2200250
16250 2200250 2313950 2487498 2450829 2433728 2487842 2399337 2336351 2347814 2231947 2274493 2375670
16239 2375670 2159556 2149726 2265774 2273117 1982829 1895599 2584640 2550586 1926731 2203623
16229 2203623 2742207 2920563 2528088 2211727 3097687 2995250 2721901 2859080 2999294
16220 2999294 3116745 2957783 2794638 2387239 2971564 3205788 2577449 2508224 3050282 3157280
16210 3157280 2702702 2549423 3273649 2972130 2941195 2923010 2792184 2767482 2913974 2542780
16200 2542780 2639956 2642368 2651954 2206216 2296747 2231892 2549157 2144504 2431003 2624877 2672169
16189 2672169 2976072 2796675 2847089 2703330 3366517 3156533 3242009 3228018 3515498 3355938
16179 3355938 3390766 3328436 3536684 3099803 3199922 3135020 3134887 2937469 2978811 3004666 3135856
16168 3135856 3272581 3049927 2930241 2980348 3089947 3369035 3011590 3211772 3158205 3008258
16158 3008258 2759225 2754720 3006262 2669408 2835570 2951383 3053029 3010539 3210853 3211292
16148 3211292 3075469 3117630 3255181 2947753 2814931 2871568 3640588 2955319 2896860 3322448
16138 3322448 3551289 3024757 3131583 3124927 3286897 3088087 3467083 2976150 3135825 3218393
16128 3218393 3484052 3086540 3008062 3446871 3294549 3061070 3338189 3513230 3373490 3344733
16118 3344733 3133098 3379960 3475881 3364015 3133621 3663238 3180334 3206100 2918110 3332049
16108 3332049 3131507 3039892 2909017 3120126 3450135 3226716 3357662 3284586 4015025 3572478
16098 3572478 3365058 3426898 3731564 3578227 3172794 3551605 3742905 3586290 3222481 3479295
16088 3479295 3533235 3287311 3150191 3437308 3357981 3054563 2905488 3271493 2981133 2906367
16078 2906367 2512919 2728084 2567954 3014351 2723067 3115883 3412216 3270932 3337915 3366848
16068 3366848 3459763 3527571 3680898 3180801 3305658 3644536 3325252 2917419 2985394 3345695
16058 3345695 2738033 2654038 3005405 3194890 2480686 2856788 3087315 3170656 3077324 3166326
16048 3166326 3239907 3190711 3494819 3817640 3418151 3376670 3971311 3442572 3322929 3626888
16038 3626888 3610257 3610966 3483374 3259022 3372851 3432238 3081101 2855972 3203230 2960104
16028 2960104 3184462 2704898 2910861 2827494 2875402 2655398 3184739 3257815 2711119 3122498
16018 3122498 3356015 3336621 3137278 2837545 3277796 3476201 3152120 3497329 3823763 3247642
16008 3247642 2959935 3215947 3584618 3324087 3113566 3095255 3548777 3243189 3473364 3698930
15998 3698930 3363736 3782833 3692024 3475356 3563298 3583912 3773020 3687506 3233197 3465655
15988 3465655 3399294 3358789 3155687 3511068 3427983 3464186 3667071 3788330 3968263 3401191
15978 3401191 3636250 3830652 4052738 3843978 3655524 3909317 3964888 3788907 3586440 3675255
15968 3675255 3845068 3663924 2981038 2928201 3541373 3447488 3292332 3143017 3288213 3186661
15958 3186661 2782851 3126131 3115358 3291012 3070080 3190184 3328494 2966360 3250479 3279255
15948 3279255 3499977 3410370 3435570 3344795 3339984 3397527 3393503 3593756 3757398 3538467 3584060
15937 3584060 3401076 3309017 3325163 3273972 3363858 3560192 3284642 3604108 3656346 3277294
15927 3277294 3327287 3075688 3172237 3093631 3356555 3567206 3064373 3472389 3508677 3119367
15917 3119367 3225085 3445580 3769777 3092365 3171176 3806107 3743469 3506092 3333514 3438212
15907 3438212 3077238 3264133 3367142 3111515 3232248 3385192 3371722 3432907 3721651 3440641
15897 3440641 3664490 3454988 3776741 3799295 3786519 3771280 3759435 3601902 3726657 3517565
15887 3517565 3582308 3258712 3555356 3384772 3586275 3305722 3393136 3700666 3677940 3688249
15877 3688249 3679250 4143572 3908247 3971893 3395904 3858185 3619655 3796955 3539052 3645225
15867 3645225 3378025 3421422 3484915 3477641 3471559 3492176 3878302 3578323 3563211 3265654 3882580
15856 3882580 3607035 3377160 3471419 3737542 3587159 3388078 3195053 3486195 3540680 3253072
15846 3253072 3627527 3307287 3173661 3276830 3372107 3384117 3431256 3423913 3308430 3324861
15836 3324861 2899243 2943214 2919979 3198156 3257976 3078628 3103286 3499343 3390482 3319094
15826 3319094 3517123 3518064 3780502 3672770 3479447 3565457 3532810 3358007 3286469 3382272 3315123
15815 3315123 3438182 3317142 3053384 3253741 3177288 3219923 3188293 2897888 3041937 3464713
15805 3464713 3526024 3329674 3279549 3596162 3476027 3295438 2996924 3159089 2764700 2940435
15795 2940435 3176537 3202124 2971643 3300032 3409082 3398546 3409616 3508576 3611389 3331531
15785 3331531 3548921 3976380 3733749 3718562 3719826 3569455 3146898 3110823 3141160 3155856
15775 3155856 3243883 3385714 3338718 3162649 3271788 3417004 3301983 3260407 3449594 3773110
15765 3773110 3523480 3529859 3448507 3653963 3759380 3186692 3533021 3483270 3465710 3664039
15755 3664039 3321239 3549863 3494488 3437690 3792297 3249459 3541521 3721526 3465970 3205096
15745 3205096 3574519 2985971 3096307 3314933 3406499 3326576 3209662 3109588 3450716 3434838
15735 3434838 3355089 3529491 3231863 3561369 3312488 3179084 3298756 3138708 3367746 3195447
15725 3195447 2932701 2804492 2973634 3291713 3176837 2944954 3218449 3564273 3542468 3343282
15715 3343282 3511010 3548857 3720480 3622578 3449865 4005970 4200730 3796899 3846610 3880022
15705 3880022 4054680 3981671 3672378 3943726 3755114 4056860 4014929 3608813 3650668 3738516
15695 3738516 3979863 3806916 3460155 3750291 3920377 3818529 3780098 4015270 3688164 3633071
15685 3633071 3762971 3802954 3482517 3290778 3370970 3819076 3546633 3275993 3606938 3646624
15675 3646624 3412971 3528598 3335831 3600717 3625685 3620620 3441565 3282772 3606247 3394304
15665 3394304 3529685 3481549 3682967 3155754 3703275 3995437 3866041 4030515 3755413 3988734
15655 3988734 3952396 3701246 3963988 4196352 3981184 4105641 3855503 4050001 3958497 4100836
15645 4100836 4020332 3857076 3547489 3379840 3625751 3366221 3432876 3830696 3955466 3600013
15635 3600013 3592766 3604578 3589264 3542288 3344190 3439838 2993845 3250854 3248473 3421095 3365038
15624 3365038 2921521 3473941 3563463 3260815 3115029 3354920 3643463 3510745 3359192 3625500
15614 3625500 3580348 3757984 3607719 3542505 3743683 3996922 3671777 3643280 3771709 3955129
15604 3955129 3753035 3833645 3720353 3693896 3280745 3619704 3820348 3428404 3204510 3417422
15594 3417422 3524522 3236747 3660694 3667703 3506825 3618059 3609186 4011012 3650672 3807891
15584 3807891 4136788 3604235 3587935 3876445 3671533 3978901 3870901 3633822 3638932 3777341
15574 3777341 3758386 3654620 3422364 3855508 3997988 3746666 3649362 3925316 3974262 3378312
15564 3378312 3630361 3885991 4157259 3799276 3603469 3415429 3594448 3463765 3713644
15555 3713644 3644496 3798178 3629064 3823906 3668615 4008238 3787514 3757289 3846679 3718306
15545 3718306 3519127 3624454 3756513 3489334 3331289 3341390 3004325 3394775 3327634 3054749
15535 3054749 3543946 3438286 3482342 3746209 3642047 3556438 3642511 3212832 3412222 3306202
15525 3306202 3296987 3275005 3310586 3509051 3441229 3470255 3402645 3836257 3675641 3415469 3640758
15514 3640758 3483239 3738733 2876482 3465424 3436753 3253560 2910619 3244381 3326577 2848357
15504 2848357 2927916 3458934 3864301 3428486 3808632 3822834 4382208 3987905 3594082 3675477
15494 3675477 4255476 4094036 4006235 3369654 3749277 4058862 3297276 3121638 3481974 3691128
15484 3691128 3181899 3448164 3509293 3173887 3204536 3336595 3196669 3024616 2945773 3691670
15474 3691670 3271877 3109395 3765481 3607274 3782961 3327909 3317638 3534719 3697081 3374421
15464 3374421 3367535 3915361 3180600 3610820 3673515 3579031 3733261 4232288 4063288 3489597
15454 3489597 3901116 3881047 3737501 3342055 3557003 3899455 3426663 3712072 3953203 3870932
15444 3870932 3535650 3804207 3600307 3342371 3765642 3786471 4039731 3568825 3382245 4065874
15434 4065874 4160616 4056076 4054244 4030126 4128210 4041159 3823398 3718181 3920844 3556074
15424 3556074 3355106 3297111 3303910 3534508 3082960 3060994 3638099 3523691 3360652 3466595
15414 3466595 3557617 3476993 3326052 3467085 3738650 3819687 3583215 3314501 3831549 3930816
15404 3930816 3756361 3527002 3880130 4419553 3899161 4100486 3972849 4125484 3877796
15395 3877796 3857849 3657129 3808982 3853834 3852017 3485776 3534559 3896406 3707787 3488558
15385 3488558 3764831 3851414 3557952 3827713 3801428 3488441 3644466 4032183 3550779 3594844
15375 3594844 3515187 4155241 3347023 3167864 3827073 3720771 3195185 3739550 3758547 3656033
$$ [...]
##END NTUPLES=NMR SPECTRUM
##END=
