##TITLE=1H_EC-3263x
 DMSO
 8 sc, 
 8.06.2022
##JCAMPDX= 6.0         $$ Bruker NMR JCAMP-DX V2.0
##DATA TYPE= NMR SPECTRUM
##DATA CLASS= NTUPLES
##ORIGIN= UXNMR, Bruker Analytische Messtechnik GmbH
##OWNER= root
$$ XWIN-NMR		Version 3.5
$$ Wed Jun  8 14:44:04 2022 Russian Standard Time (UT+4h)  she@DPX200
##.OBSERVE FREQUENCY= 200.131
##.OBSERVE NUCLEUS= ^1H
##.ACQUISITION MODE= SIMULTANEOUS
##.ACQUISITION SCHEME= undefined
##.AVERAGES= 8
##.DIGITISER RES= 18
##SPECTROMETER/DATA SYSTEM= spect
##.PULSE SEQUENCE= zg30
##.SOLVENT NAME= DMSO
##.SHIFT REFERENCE= (INTERNAL, DMSO, 0, 16.1788)
##AUDIT TRAIL= $$ (NUMBER, WHEN, WHO, WHERE, WHAT)
$$ ##TITLE= Audit trail, XWIN-NMR		Version 3.5
$$ ##JCAMPDX= 5.01
$$ ##ORIGIN= Bruker BioSpin GmbH
$$ ##OWNER= she
$$ F:/spectra/data/she/nmr/H-F/1/pdata/1/auditp.txt
$$ ##AUDIT TRAIL=  $$ (NUMBER, WHEN, WHO, WHERE, WHAT)
(   1,<2022-06-08 14:43:11.51 +0400>,<she>,<DPX200>,
      <created by zg, POWCHK disabled, PULCHK disabled
       configuration hash MD5:
       00 E9 B6 7A A2 85 ED C7 34 08 36 98 17 FE 4E 26
       data hash MD5: 16K
       DC 91 05 47 A2 F0 B5 7D 27 D2 D5 20 31 9D 2A 89>)
(   2,<2022-06-08 14:43:13.98 +0400>,<she>,<DPX200>,
      <Start of raw data processing
       efp BC_mod = 2 LB = 0.24 FT_mod = 6 PKNL = 1 PHC0 = -18029.8 PHC1 = 16.60074 SI = 16K 
       data hash MD5: 16K
       5E C5 56 86 73 3F 7F 9A E6 67 0B 86 B2 18 77 3B>)
(   3,<2022-06-08 14:43:28.46 +0400>,<she>,<DPX200>,
      <pk PHC0 = -4.410986 PHC1 = -5.8 
       data hash MD5: 16K
       BD 4A 5A 89 65 ED 40 7D FC 64 11 A2 F5 8C 73 54>)
(   4,<2022-06-08 14:43:31.68 +0400>,<she>,<DPX200>,
      <abs ABSG = 5 
       data hash MD5: 16K
       2F 4A 81 08 D4 D5 D8 17 FC BD 65 CE 13 0B 05 05>)
$$ ##END=
$$ 
$$ hash MD5
$$ A3 BD 08 6F 15 44 F6 76 FD 6B 56 1C 28 F8 49 12
##$RELAX= 
##$RELAX= 
##$RELAX= 
##$RELAX= 
##$RELAX= 
##$RELAX= 
$$ Bruker specific parameters
$$ --------------------------
##$DU= <F:/spectra>
##$EXPNO= 1
##$NAME= <H-F>
##$PROCNO= 1
##$TYPE= <nmr>
##$USER= <she>
##$AMP= (0..31)
100 100 100 100 100 100 100 100 100 100 100 100 100 100 100 100 100 100 
100 100 100 100 100 100 100 100 100 100 100 100 100 100 
##$AQSEQ= 0
##$AQ_mod= 1
##$AUNM= <au_zg>
##$AUTOPOS= <>
##$BF1= 200.13
##$BF2= 200.13
##$BF3= 200.13
##$BF4= 200.13
##$BF5= 200.13
##$BF6= 200.13
##$BF7= 200.13
##$BF8= 200.13
##$BYTORDA= 1
##$CFDGTYP= 0
##$CFRGTYP= 5
##$CHEMSTR= <none>
##$CNST= (0..31)
1 1 145 1 1 1 1 1 1 1 1 1 1 1 1 1 1 1 1 1 1 1 1 1 1 1 1 1 1 1 1 1 
##$CPDPRG= <>
##$CPDPRG1= <>
##$CPDPRG2= <>
##$CPDPRG3= <>
##$CPDPRG4= <mlev>
##$CPDPRG5= <mlev>
##$CPDPRG6= <mlev>
##$CPDPRG7= <mlev>
##$CPDPRG8= <mlev>
##$CPDPRGB= <>
##$CPDPRGT= <>
##$D= (0..31)
0 1.2 0 0 0 0 0 0 0 0.06 0 0.03 0 0 0 0 0.0002 0 0 0 0 0 0 0 0 0 0 0 0 
0 0 0 
##$DATE= 1654684990
##$DBL= (0..7)
120 120 120 120 120 120 120 120 
##$DBP= (0..7)
150 150 150 150 150 150 150 150 
##$DBP07= 0
##$DBPNAM0= <>
##$DBPNAM1= <>
##$DBPNAM2= <>
##$DBPNAM3= <>
##$DBPNAM4= <>
##$DBPNAM5= <>
$$ [...]
##$SUBNAM2= <"">
##$SUBNAM3= <"">
##$SUBNAM4= <"">
##$SUBNAM5= <"">
##$SUBNAM6= <"">
##$SUBNAM7= <"">
##$SUBNAM8= <"">
##$SUBNAM9= <"">
##$SW= 18.0517599122864
##$SWIBOX= (0..15)
0 0 2 0 0 0 0 0 0 0 0 0 0 0 0 0 
##$SW_h= 3612.71676300578
##$TD= 16384
##$TD0= 1
##$TE= 0
##$TE2= 300
##$TE3= 300
##$TEG= 300
##$TL= (0..7)
0 120 120 120 120 120 120 120 
##$TP= (0..7)
150 150 150 150 150 150 150 150 
##$TP07= 0
##$TPNAME0= <>
##$TPNAME1= <>
##$TPNAME2= <>
##$TPNAME3= <>
##$TPNAME4= <>
##$TPNAME5= <>
##$TPNAME6= <>
##$TPNAME7= <>
##$TPOAL= (0..7)
0.5 0.5 0.5 0.5 0.5 0.5 0.5 0.5 
##$TPOFFS= (0..7)
0 0 0 0 0 0 0 0 
##$TUNHIN= 0
##$TUNHOUT= 0
##$TUNXOUT= 0
##$USERA1= <user>
##$USERA2= <user>
##$USERA3= <user>
##$USERA4= <user>
##$USERA5= <user>
##$V9= 5
##$VALIST= <valist>
##$VCLIST= <CCCCCCCCCCCCCCC>
##$VD= 0
##$VDLIST= <DDDDDDDDDDDDDDD>
##$VPLIST= <PPPPPPPPPPPPPPP>
##$VTLIST= <TTTTTTTTTTTTTTT>
##$WBST= 1024
##$WBSW= 4
##$XGAIN= (0..3)
0 0 0 0 
##$XL= 0
##$YL= 0
##$YMAX_a= 383183
##$YMIN_a= -523230
##$ZGOPTNS= <>
##$ZL1= 120
##$ZL2= 120
##$ZL3= 120
##$ZL4= 120
##$ABSF1= 16.17883
##$ABSF2= -1.87306
##$ABSG= 5
##$ABSL= 3
##$ALPHA= 0
##$AQORDER= 0
##$ASSFAC= 0
##$ASSFACI= 0
##$ASSFACX= 0
##$ASSWID= 0
##$AUNMP= <proc_1d>
##$AZFE= 0.1
##$AZFW= 0.1
##$BCFW= 0
##$BC_mod= 2
##$BYTORDP= 0
##$COROFFS= 0
##$CY= -3
##$DATMOD= 1
##$DC= 0
##$DFILT= <>
##$DTYPP= 0
##$F1P= 0
##$F2P= 0
##$FCOR= 1
##$FTSIZE= 16384
##$FT_mod= 6
##$GAMMA= 0
##$GB= 0
##$INTBC= 1
##$INTSCL= 0
##$ISEN= 128
##$LB= 0.24
##$LEV0= 0
##$LPBIN= 0
##$MAXI= 10000
##$MC2= 0
##$MEAN= 0
##$ME_mod= 0
##$MI= 1.114404
##$NCOEF= 0
##$NC_proc= -6
##$NLEV= 6
##$NOISF1= 3.799351
##$NOISF2= 2.8
##$NSP= 0
##$NTH_PI= 0
##$NZP= 0
##$OFFSET= 16.17883
##$PC= 1
##$PHC0= -18034.21
##$PHC1= 10.80074
##$PH_mod= 1
##$PKNL= yes
##$PPARMOD= 0
##$PSCAL= 0
##$PSIGN= 0
##$REVERSE= no
##$SF= 200.129568495393
##$SI= 16384
##$SIGF1= 3
##$SIGF2= 2
##$SINO= 5.538805
##$SIOLD= 16384
##$SREGLST= <1H.CDCl3>
##$SSB= 0
##$STSI= 16384
##$STSR= 0
##$SW_p= 3612.71676300579
##$SYMM= 0
##$S_DEV= 0
##$TDeff= 16384
##$TDoff= 0
##$TI= <>
##$TILT= no
##$TM1= 0
##$TM2= 0
##$TOPLEV= 0
##$USERP1= <user>
##$USERP2= <user>
##$USERP3= <user>
##$USERP4= <user>
##$USERP5= <user>
##$WDW= 1
##$XDIM= 16384
##$YMAX_p= 378842972
##$YMIN_p= -505523
$$ End of Bruker specific parameters
$$ ---------------------------------
##NTUPLES= NMR SPECTRUM
##VAR_NAME=  FREQUENCY,     SPECTRUM/REAL,   SPECTRUM/IMAG
##SYMBOL=    X,             R,               I
##VAR_TYPE=  INDEPENDENT,   DEPENDENT,       DEPENDENT
##VAR_FORM=  AFFN,          ASDF,            ASDF
##VAR_DIM=   16384,         16384,           16384
##UNITS=     HZ,            ARBITRARY UNITS, ARBITRARY UNITS
##FACTOR=    0.220516191357248, 1,           1
##FIRST=     3237.86210517882, 0,            0
##LAST=      -374.854657826971, 0,           0
##MIN=       -374.854657826971, -505523,     0
##MAX=       3237.86210517882, 378842972,    0
$$ Real data points
##PAGE= N=1
##DATA TABLE= (X++(R..R)), XYDATA
$$ [...]
11170A53444m5142j447J6961q0330m6482K876j4048o7586O6812J3250j0982N8508
$$ 153444 108302 106855 123816 43486 -2996 -120 -14168 -81754 -14942 -1692 -12674 45834
11158D5834n901p9565J1196l3316Q9263J39586K8418p4209J6574L8058n2523j09673
$$ 45834 39933 -39632 -28436 -61752 27511 167097 195515 121306 137880 175938 123415 13742
11146A3742P9822P0256o740j35658o1936N8938J18249m0053k0673j0333M2585
$$ 13742 93564 163820 157080 21422 -40514 18424 136673 96620 75947 65614 108199
11135A08199p2428o7484R7787o0609J4073q042J04307Q3058l1855p1801J8835
$$ 108199 35771 -31713 66074 5465 19538 11496 115803 198861 167006 95205 114040
11124A14040J3090j57861l753k5447O8245J04627l4212M8438L8661j03556m4450
$$ 114040 127130 -30731 -34484 -59931 8314 112941 78729 127167 165828 62272 17822
11113A7822p412j70M5533K4421m3885N4137P2644J0463m1957m6996n9730m2721
$$ 17822 10410 10240 55773 80194 36309 90446 163090 173553 131596 84600 24870 -17851
11101a7851J05446m5973j048Q88J7395j0978R9880P4839n4452k1402M4659J02566
$$ -17851 87595 41622 40574 41462 58857 47879 147759 222598 168146 146744 191403 293969
11089B93969r900n9537R1854r0351K7599l8934j4575l6947J9647m2470K825m6071
$$ 293969 284069 224532 316386 226035 253634 214700 200125 163178 182825 140355 143180 97109
11077I7109o791J9967p5822l8248m5258J5880J10501R812l6619O1164k9008L2456
$$ 97109 90318 110285 34463 -3785 -49043 -33163 77338 87150 50531 111695 82687 115143
11065A15143L2292M440j5717J1116l8366M1426L8151o4210n3471m7739K9234M1285
$$ 115143 147435 151875 136158 147274 108908 150334 188485 124275 70804 23065 52299 93584
11053I3584o164N0187n1649j6456N7257K4409k4466K3017Q674l8663L8968k668
$$ 93584 87420 137607 85958 69502 126759 151168 126702 149719 158393 119730 158698 156030
11041A56030l4904l10k4095K5077P158r643k1243j1587J9841j773L2693O3346
$$ 156030 121126 120816 96721 121798 128956 119313 98070 86483 106324 104551 137244 200590
11029B00590Q2197j19307M8189l9867L174M0104Q5532n7611o3021Q8461J03904
$$ 200590 282787 163480 211669 171802 174976 215080 300612 243001 179980 268441 372345
11018C72345J16789p1396n9658p2184L2088L4689m98l3186O7414m0390p4469N427
$$ 372345 489134 417738 358080 285896 317984 352673 352175 318989 386403 346013 271544 276971
11006B76971K9903N809J00345j1160m1880K5720k7985p6475M2435p5840j9438
$$ 276971 306874 312683 413028 401868 359988 385708 357723 281248 323683 247843 228405
10995B28405J8965l6926K3049Q9457O7845j6099m9068L9450m2182M2473p3067
$$ 228405 247370 210444 233493 322950 390795 374696 325628 365078 322896 365369 292302
10984B92302M3255N3909K6026K3082n3044L5070n6803m55P0292m8955p6732J29453
$$ 292302 335557 389466 415492 438574 385530 420600 363797 363342 433634 384679 307947 437400
10972D37400k7164J560K8622m0457k6227j0796L2598M5398m4055k4582P0097k1063
$$ 437400 410236 411796 440418 399961 373734 362938 395536 440934 396879 372297 442394 421331
10960D21331m8375n3559k553R3056o6152q1910N6889m779J00058o4364p6275p4662
$$ 421331 372956 319397 316844 409900 343748 261838 318727 313948 414006 349642 273367 198705
10948A98705l5598R607N8566L4910m6817O7039L5213k4894n2389J46933j21764
$$ 198705 163107 172714 231280 266190 219373 286412 321625 296731 244342 391275 269511
10937B69511l9226K3685j0673J5630k1741R5917m7738o2965K8593O3499r3621
$$ 269511 230285 253970 243297 258927 237186 333103 285365 222400 250993 314492 220871
10926B20871j3609N7772j2040r4460Q4249M5620J01021j20030l4799P8306k1357
$$ 220871 207262 265034 252994 158534 242783 288403 389424 269394 234595 312901 291544
10915B91544P4482L764J6761k1772O2643m8386j41714j08213O1008O9743Q2794
$$ 291544 366026 369790 386551 364779 427422 379036 237322 129109 190117 259860 342654
10904C42654l0463K4230M9967l4167l5074M0701L2077q6669K0120J01632o8016
$$ 342654 312191 336421 386388 352221 317147 357848 389925 303256 323376 425008 356992
10893C56992l2150q257n591L9499O7866N6946M0337r0850N2189n1955o024M8052
$$ 356992 324842 316585 310994 350493 418359 475305 515642 424792 476981 425026 419002 467054
10881D67054l2047n729j3051M1620K873J0053L9431N6684J6605j13028p1006P231
$$ 467054 435007 429278 416227 457847 460720 470773 510204 566888 583493 470465 399459 406690
10869D06690M422O4484O2047K7755M9976q5749J6912r4107L2025L8062M2541P8859
$$ 406690 411112 475596 537643 565398 615374 529625 546537 452430 484455 522517 565058 643917
10857F43917l4424l5213N7592K8838j1108J3231R2580K2550k6326J16980M4021
$$ 643917 609493 574280 631872 660710 649602 662833 755413 777963 751637 868617 912638
10846I12638j17595n6015J42547l9718j56876P4475J26237n0876K4033J49884
$$ 912638 795043 739028 881575 841857 684981 759456 885693 834817 858850 1008734
10836A008734j03900Q8607J5322n6026m5200m0272L3058J5160M6373m4552M9812
$$ 1008734 904834 993441 1008763 952737 907537 867265 900323 915483 961856 917304 967116
10825I67116J48934J2776r934J680N2505J70464j11607j1532j1057n092M6836
$$ 967116 1116050 1128826 1118892 1120572 1173077 1343541 1231934 1220402 1209345 1204253 1251089
10814A251089P533p1443J80095K1119p9877N430M2389n0297J01918l5482m8258
$$ 1251089 1258622 1187179 1367274 1388393 1308516 1313946 1356335 1306038 1407956 1372474 1324216
10803A324216M7650O0758J3993N1908N1253n082Q656N9977o3484o5461N2901j2323
$$ 1324216 1371866 1432624 1446617 1498525 1549778 1544696 1553352 1613329 1549845 1484384 1537285 1524962
10791A524962n9503J2932K4412N0603k3309O0016m2207m1951J4910N5732L4987
$$ 1524962 1465459 1478391 1502803 1553406 1530097 1590113 1547906 1505955 1520865 1576597 1611584
10780A611584L1473J3473J4364k3383L4596M8469J6471j0165L1316J12374o3600
$$ 1611584 1643057 1656530 1670894 1647511 1682107 1730576 1747047 1736882 1768198 1880572 1816972
10769A816972p0624O6577O9412J12189K0781J2271P4294Q5910n0876q6339R2386
$$ 1816972 1746348 1812925 1882337 1994526 2015307 2027578 2101872 2187782 2136906 2050567 2142953
10758B142953J09490O4059j00473R8115k1989j9996k2240j259l9909L0630J18873
$$ 2142953 2252443 2316502 2216029 2314144 2292155 2272159 2249919 2248660 2208751 2239381 2358254
10747B358254M0581J0297N3115k5226J5467J7618r5016M2429M6729O1491M8202
$$ 2358254 2398835 2409132 2462247 2437021 2452488 2470106 2375090 2417519 2464248 2525739 2573941
10736B573941p8509R154J4788J43664N0492j1011M6280M0849J0313M0651M9886
$$ 2573941 2495432 2504586 2519374 2663038 2713530 2702519 2748799 2789648 2799961 2840612 2890498
10725B890498J07146J09455N1125L6449j5286K4471J10439R8427R2957R3711J36603
$$ 2890498 2997644 3107099 3158224 3194673 3179387 3203858 3314297 3412724 3505681 3599392 3735995
10714C735995k0559P0383K3011J20279j2500l6691J96707P4145J0643m9197L9694
$$ 3735995 3715436 3785819 3808830 3929109 3916609 3879918 4076625 4150770 4161413 4112216 4151910
10703D151910Q7049P9963Q1833N7574l734J47451J62429J7603J14452M8850Q6790
$$ 4151910 4238959 4318922 4400755 4458329 4454595 4602046 4764475 4782078 4896530 4945380 5032170
10692E032170K36971J35148Q9547O6427L9744J92079J42549J69234K35429J18086
$$ 5032170 5269141 5404289 5493836 5560263 5600007 5792086 5934635 6103869 6339298 6457384
10682F457384J67150J42628K54922K06878J97480K24298K66943K33240L46798
$$ 6457384 6624534 6767162 7022084 7228962 7426442 7650740 7917683 8150923 8497721
10673H497721K81579K91714K86904K90623N03713L28277L04908M21442M47141
$$ 8497721 8779300 9071014 9357918 9648541 10152254 10480531 10785439 11206881 11654022
10664A1654022N87254N66234M95161N71633N27089O02906P11914P36529R16028
$$ 11654022 12241276 12807510 13302671 13874304 14401393 15004299 15716213 16452742 17368770
10655A7368770J040759J043309J048903J135942J349264J568292J624637J617936
$$ 17368770 18409529 19452838 20501741 21637683 22986947 24555239 26179876 27797812
10647B7797812J801510J830609J899549J897077J781608J461414J447122J140420
$$ 27797812 29599322 31429931 33329480 35226557 37008165 38469579 39916701 41057121
10639D1057121Q77760O94069L98525L8033o05851q80012j181415j439382j434556
$$ 41057121 41934881 42628950 43027475 43065508 42459657 41579645 40398230 38958848 37524292
10630C7524292j361303j120484q10348p66022o38995o26971m12230l23414j15326
$$ 37524292 36162989 35042505 34232157 33466135 32827140 32200169 31787939 31464525 31349199
10621C1349199J0825K38607M66551N30620P95069J054244J160900J400111J568065
$$ 31349199 31360024 31598631 32065182 32595802 33390871 34445115 35606015 37006126 38574191
10612C8574191J702387K013568J935895K077027J997810K018768J830620J628217
$$ 38574191 40276578 42290146 44226041 46303068 48300878 50319646 52150266 53778483
10604E3778483J361792J243827N96882k61710o31769j238023j918033k599716
$$ 53778483 55140275 56384102 56980984 56719274 56087505 54849482 52931449 50331733
10596E0331733l071831l292265l166054l057506k918496k492418k164560j963219
$$ 50331733 47259902 43967637 40801583 37744077 34825581 32333163 30168603 28205384
10588B8205384j708552j619764j461313j377308j241251j122788j101708r08891
$$ 28205384 26496832 24877068 23415755 22038447 20797196 19674408 18572700 17663809
10580A7663809q37209p84259p28652o23721n35680n86500m89049l52516m24342
$$ 17663809 16826600 16042341 15313689 14689968 14154288 13567788 13078739 12726223 12301881
10571A2301881m02809k39872k54998k74740k55652j97865k69290j96510j16153
$$ 12301881 11899072 11659200 11404202 11129462 10873810 10675945 10406655 10210145 10093992
10562A0093992j36106j13811l3463q5482l9034j39181j08633j29116j30878j23554
$$ 10093992 9957886 9844075 9810612 9725130 9686096 9546915 9438282 9309166 9178288 9054734
10552I054734j6040n3776q2357j79769p6260K4070l4273l5673k611j19471M5796
$$ 9054734 9038694 8984918 8902561 8722792 8646532 8670602 8636329 8600656 8598045 8478574 8524370
10541H524370M1348Q4985p7117M874K7672N447J16872j4858J56334k2145P1400
$$ 8524370 8565718 8650703 8573586 8578460 8606132 8611579 8728451 8713593 8869927 8847782 8919182
10530H919182P0778J27795J17505J74806J57333P3993O0916J01970J45305R8172
$$ 8919182 8989960 9117755 9235260 9410066 9567399 9641392 9702308 9804278 9949583 10047755
10520A0047755J18427n221P6515O4016o3661P2425J82760J19232O9587J7929J68171
$$ 10047755 10166182 10160961 10237476 10301492 10237831 10310256 10493016 10612248 10681835 10699764 10867935
10509A0867935K04354J84336J59651L08107K80175J92695L34895L55471L59432
$$ 10867935 11072289 11256625 11416276 11724383 12004558 12197253 12532148 12887619 13247051
10500A3247051L85034N66917N45377N85610N86134P09248P81744Q85382R07282
$$ 13247051 13632085 14199002 14744379 15329989 15916123 16625371 17407115 18292497 19199779
10491A9199779J122387J128570J205993J398415J402863J469005J493931J358178
$$ 19199779 20322166 21450736 22656729 24055144 25458007 26927012 28420943 29779121
10483B9779121J182910J019710P66959K80294l3624n03790p52572r07153r36666
$$ 29779121 30962031 31981741 32748700 33028994 32995370 32491580 31739008 30831855 29895189
10474B9895189q01005o58400n91674m58838l33279k68888k84697j74702o4687
$$ 29895189 29094184 28435784 27844110 27385272 27051993 26783105 26498408 26323706 26259019
10465B6259019K7114J64557L93070O24857O53193R68939J130588J244054J357736
$$ 26259019 26286133 26450690 26843760 27468617 28121810 29090749 30221337 31465391 32823127
10456C2823127J492666J644344J843692K170408K272263K226231K095197J809969
$$ 32823127 34315793 35960137 37803829 39974237 42246500 44472731 46567928 48377897
10448D8377897J508722J007348L34882l10694r29894j393131j708031j850065
$$ 48377897 49886619 50893967 51228849 50918155 49988261 48595130 46887099 45037034
10440D5037034j984483j942905j923438j930952j776631j791974j628774j352822
$$ 45037034 43052551 41109646 39186208 37255256 35478625 33686651 32057877 30705055
10432C0705055j321605j193326q92845o79766o48728l32391l97358k35236m270
$$ 30705055 29383450 28190124 27297279 26617513 25968785 25636394 25239036 25003800 24999530
10423B4999530R4565K16889M17777N29169N53606P23182P64298P03416P75490
$$ 24999530 25094095 25310984 25728761 26257930 26811536 27534718 28299016 29002432 29777922
10414B9777922P23601O03607N03733L17314O0586m88623q93227j278667j495768
$$ 29777922 30501523 31105130 31608863 31926177 31986763 31498140 30604913 29326246 27830478
10405B7830478j666902j632115j602795j426430j232852j027967j044502q62279
$$ 27830478 26163576 24531461 22928666 21502236 20269384 19241417 18196915 17334636
10397A7334636p56166p84148p84616p20336o20206n77357o48103m10949m79233
$$ 17334636 16578470 15794322 15009706 14289370 13669164 13091807 12443704 12032755 11553522
10388A1553522m22637m16693m33458k89377k95748l09640j27628k55290k57496
$$ 11553522 11130885 10714192 10280734 9991357 9695609 9385969 9258341 9003051 8745555
10379H745555j58569k34396k79185k56180j41914j05410j59171k44637j73126
$$ 8745555 8586986 8352590 8073405 7817225 7675311 7569901 7410730 7166093 6992967
10370F992967j68546n174j9240k07100o0380j04315k14601J2909o1923j41036
$$ 6992967 6824421 6819247 6800007 6592907 6532527 6428212 6213611 6226520 6164597 6023561
10360F023561j35089M1461r1184q2805N1209j26347J3081r8280o4438k9262k02758
$$ 6023561 5888472 5929933 5838749 5755944 5807153 5680806 5693887 5595607 5531169 5501907 5299149
10349E299149O1478N4295q6341k4340m2041O3633r3538J7185P1863L3653R6042
$$ 5299149 5360627 5414922 5328581 5304241 5262200 5325833 5232295 5249480 5321343 5354996 5451038
10338E451038n5461r806N6750M5889M3234J03487J31581R2421J53024O3089P7658
$$ 5451038 5395577 5385771 5442521 5488410 5531644 5635131 5766712 5859133 6012157 6075246 6152904
10327F152904P7960J51030J46086N6232K41099K00361J79612K00451K82757K48405
$$ 6152904 6230864 6381894 6527980 6584212 6825311 7025672 7205284 7405735 7688492 7936897
10317G936897L48329L59792L23613L52659N91797M58544N40661P78616P43188
$$ 7936897 8285226 8645018 8968631 9321290 9913087 10371631 10912292 11690908 12434096
10308A2434096Q84904R11618R34284R43830R15845R44756O74321N49201N96586
$$ 12434096 13319000 14230618 15164902 16108732 17024577 17969333 18643654 19192855 19789441
10299A9789441L65307O7401o1084k80904n45368m54680m71458n76734o72497o93128
$$ 19789441 20154748 20222149 20161065 19880161 19334793 18880113 18408655 17831921 17159424 16466296
10289A6466296o84382n35732m62834l11196o9144q5759J5332J47406K21602K38595
$$ 16466296 15781914 15246182 14783348 14472152 14403008 14317249 14332581 14479987 14701589 14940184
10279A4940184M14340M99295N98891P56732P92400P48806Q72620Q44744P98826
$$ 14940184 15354524 15853819 16452710 17209442 18001842 18750648 19623268 20468012 21266838
10270B1266838R72629J017966P94775N83214L76149J27979m06795p40929j046248
$$ 21266838 22239467 23257433 24052208 24635422 25011571 25139550 24732755 23991826 22945578
10261B2945578j253650j213865j213885j086876r42416q92949q06920q80704p53318
$$ 22945578 21691928 20478063 19264178 18177302 17234886 16341937 15535017 14654313 13900995
10252A3900995n84107o39345m88003m63158l28560k91011l17852j05789n0919
$$ 13900995 13316888 12677543 12189540 11726382 11397822 11106811 10788959 10683170 10632251
10243A0632251M7524M7180J23752N3232R2283K87427J30422J89408J75848J04483
$$ 10632251 10679775 10726955 10850707 10903939 10996222 11283649 11414071 11603479 11779327 11883810
10233A1883810J4839j60042l85552l35374m29377m09915m07197n29515n22597
$$ 11883810 11898649 11738607 11353055 11017681 10588304 10178389 9771192 9241677 8719080
10224H719080m22950m83335n78229m50724m31968m13138k35297l29173k48454
$$ 8719080 8296130 7812795 7234566 6783842 6351874 5938736 5703439 5374266 5125812
10215E125812k67292l08703j90057k60716j28475q4108j90544j28035l9790n0210
$$ 5125812 4858520 4549817 4359760 4099044 3970569 3886461 3695917 3567882 3528092 3477882
10205C477882j32446j10589k00851r1238r2273o2857J0805q1730j46168l4247
$$ 3477882 3345436 3234847 3033996 2942758 2850485 2787628 2798433 2716703 2570535 2536288
10195B536288j55207l6430p5289m9250J0431j40470J8325K7563p6560n4059j6164
$$ 2536288 2381081 2344651 2269362 2220112 2230543 2090073 2108398 2135961 2059401 2005342 1989178
10184A989178p4164k0210j4730K9921j47232j17740q3819j9662J03646n1113l4921
$$ 1989178 1915014 1894804 1880074 1909995 1762763 1645023 1561204 1541542 1645188 1594075 1559154
10173A559154q4003n3587r2905L5521k0320l7174j550m5547J4963o9714N6473
$$ 1559154 1475151 1421564 1328659 1364180 1343860 1306686 1305136 1259589 1274552 1204838 1261311
10162A261311q4480L0281l7722m9243J5091q20m4592n1956q1639O4178p6606r0998
$$ 1261311 1176831 1207112 1169390 1120147 1135238 1134418 1089826 1037870 956231 1020409 943803 852805
10150H52805Q779L4066Q1580o2497p3185J02080j03171j41660P0515K1017o4207
$$ 852805 861584 895650 977230 914733 841548 943628 840457 698797 769312 790329 726122
10139G26122m7907l9226n673K072j7763l9220l053J19348k460p7612K0188p2505
$$ 726122 678215 638989 633316 635388 617625 578405 575352 694700 692240 614628 634816 562311
10127E62311L6949j20592N5104l3530P9416N4224k2998J2709k0247J7265j0339
$$ 562311 599260 478668 533772 500242 579658 633882 610884 623593 603346 620611 610272
10116F10272P4894j61270k3020P2454M2385p4979q4093j3802O0943J22694l9675
$$ 610272 685166 523896 500876 573330 615715 540736 456643 442841 503784 626478 586803
10105E86803r0737P9950j0746l0785q7788l9065j7443L2241Q2964p2268j34531
$$ 586803 496066 576016 565270 534485 446697 407632 390189 422430 505394 433126 298595
10094B98595L8313k5417P9543N2135J4680q4360M4395M970p922n1531N9577M905
$$ 298595 336908 311491 391034 443169 457849 373489 417884 422854 414932 363401 422978 427883
10082D27883M6679o9281j6389p596P991r619k1294J2574L0243J02442k6323n2777
$$ 427883 474562 405281 388892 381296 389287 379668 358374 370948 401191 503633 477310 424533
10070D24533L2127m162p8366l3580r9887J15271L2066j02440k9714j3439M7763
$$ 424533 456660 452498 374132 340552 240665 355936 388002 285562 255848 242409 290172
10059B90172j7426p778N8881j4156m0366o9459n8416R5948P989l5987k4355L9203
$$ 290172 272746 264968 323849 309693 269327 199868 141452 237400 245389 209402 185047 224250
10047B24250k051j0306m534j8204p88p7710N307l2330R5898J2P4869o4378j441
$$ 224250 222199 211893 207359 189155 188367 110657 115964 83634 179532 179544 254413 190035 188594
10034A88594M6233m0211r3012L3585L9707n4655k3607k1164j01454N9997J51383
$$ 188594 234827 194616 101604 135189 174896 120241 96634 75470 -25984 34013 185396
10023A85396j07833j6189R819j40835M6245J46708M2000j06145l1133l9198K6975
$$ 185396 77563 61374 71193 -69642 -23397 123311 165311 59166 28033 -11165 15810
10012A5810J14655P9322p1143n0781K6801j8299N1480j34328m1996m0212J8320
$$ 15810 130465 209787 138644 87863 114664 96365 147845 13517 -28479 -68691 -50371
10001e0371N5035R864M1397q1275K3083J7721K2606j4738o2082L284j4820Q3505
$$ -50371 4664 14528 55925 -25350 -2267 15454 38060 23322 -38760 -35476 -50296 33209
9989C3209j9514M553o548Q4678j0111k5794N9876j03370n9459L1307K0692l3841
$$ 33209 13695 18248 11700 96378 86267 60473 120349 16979 -42480 -11173 9519 -24322
9977b4322k6526L430M3834j4590K9720J712k3544q7535O5463J08810L1460n0753
$$ -24322 -50848 -47418 -3584 -18174 11546 13258 -10286 -97821 -32358 76452 107912 57159
9965E7159j3480m0515k9588J5629j2742n342o6149J21676J30289O3071j0619j68539
$$ 57159 43679 3164 -26424 -10795 -23537 -28879 -95028 26648 156937 220008 209389 40850
9953D0850L0573j71108K4591l8589k1767J30888N8703m494q9332J7300J12996
$$ 40850 71423 -99685 -75094 -113683 -135450 -4562 54141 49647 -39685 -22385 90611
9942I0611k1201Q4255n0449j06844O459q0119n0400l8696Q2320O2345P7827l4145
$$ 90611 69410 153665 103216 -3628 2831 -77288 -127688 -166384 -84064 -21719 56108 21963
9930B1963O4426j16113L1850O5051J0504R538n8651l5339o1310O5347L3383J3482
$$ 21963 86389 -29724 2126 67177 77681 87219 28568 -6771 -68081 -2734 30649 44131
9918D4131o7539l394Q8780k1025M948o1584J6284m048Q5354q197q659J7466j2257
$$ 44131 -23408 -26802 61978 40953 45901 -15683 601 -3447 81907 73710 65051 82517 70260
9905G0260O0535j4968o1716l7915o890J2091O2720k4417o5023J8424M1707r1113
$$ 70260 130795 115827 54111 16196 9306 21397 84117 59700 -5323 13101 54808 -36305
9893c6305J2808L1617j3847Q3835j16891r1394M8328O5405L4864K1361n088J9780
$$ -36305 -23497 8120 -5727 78108 -38783 -130177 -81849 -16444 18420 39781 34693 54473
9881E4473n7325M2227R240p9307j8286k2319k7285o512K05918o236q3325L1061
$$ 54473 -2852 39375 48615 -30692 -48978 -71297 -98582 -105094 100824 94588 11263 42324
9869D2324J4471L3160o1192L3172j9105L2858j11768N9039N6798P55j06229k4558
$$ 42324 56795 89955 28763 61935 42830 75688 -36080 22959 79757 80512 -25717 -50275
9857e0275K5035K5060k0078l3842l1870m9559M0581n8247J4154Q5636K6352k787
$$ -50275 -25240 -180 -20258 -54100 -85970 -135529 -94948 -153195 -139041 -53405 -27053 -29840
9845b9840m4112P8492o5978l1301o0198Q6848K548j63920J41436j0408p965j0225
$$ -29840 -73952 4540 -61438 -92739 -152937 -66089 -63541 -227461 -86025 -96433 -104398 -114623
9833a14623j0957j8412j4475l0026J13720j0885k210q826K4755n7815o3273L1440
$$ -114623 -125580 -143992 -158467 -188493 -74773 -85658 -87868 -96694 -71939 -129754 -193027 -161587
9821a61587m8719M4311Q7914j5897n5897P227N7998q781k3766r3508M7957J24529
$$ -161587 -210306 -165995 -78081 -93978 -149875 -142648 -84650 -93431 -117197 -210705 -162748 -38219
9809c8219q7295k2218N6553j1668R2133J00598l0659n9528O0648J499q5076P628
$$ -38219 -125514 -147732 -91179 -102847 -10714 89884 59225 -303 60345 61844 -23232 -15604
9797a5604J0793j83173K2118O2185k0292Q2468K6211n777n2039N150O559k1350
$$ -15604 -4811 -187984 -165866 -103681 -123973 -41505 -15294 -21071 -73110 -67960 -61401 -82751
9785h2751P3524J8114m9732L8682Q7773j04979j04113O7955N6473l5547L1326
$$ -82751 -9227 8887 -40845 -2163 85610 -19369 -123482 -55527 946 -34601 -3275
9774c275l8879q4647p6122J63303j7337J8515L9140p4740J168o07m1213P2694
$$ -3275 -42154 -126801 -202923 -39620 -56957 -38442 698 -74042 -72874 -73481 -114694 -42000
9762d2000m7660K4453n0845J4987L5266P3351l388p0379M2806k6327q153m1411
$$ -42000 -89660 -65207 -116052 -101065 -65799 7552 4164 -66215 -23409 -49736 -57889 -99300
9750i9300q2452o0554J90573q042J5301O7692j140q4987o7530J07106r9498P7369
$$ -99300 -181752 -242306 -51733 -59775 -44474 23218 22078 -62909 -130439 -23333 -122831 -45462
9738d5462l003l2437L1488j0033m8606q0875M6684k024J8874Q5917L5352o3526
$$ -45462 -48465 -80902 -49414 -59447 -108053 -188928 -142244 -144268 -125394 -39477 -4125 -67651
9726f7651q0271J0759R8777j4542j7610l1968L4961o6704M4069n985M2845K6683
$$ -67651 -147922 -137163 -38386 -52928 -70538 -102506 -67545 -134249 -90180 -96165 -53320 -26637
9714b6637J25577k5888M5642n9322p5169l5059p8575L6629M7645j719q8663N1635
$$ -26637 98940 73052 118694 59372 -15797 -50856 -129431 -92802 -45157 -46876 -135539 -83904
9702h3904J10874p635q5688n4R6930q2338L1854K070q0932q669Q0155n2380M9217
$$ -83904 26970 19335 -66353 -66407 30523 -51815 -19961 -17891 -98823 -107492 -27337 -79717 -30500
9689c0500o3453K5428n693r1259r908l1942J11131N339K1534o778m05N190P1273
$$ -30500 -93953 -68525 -74218 -165477 -175385 -207327 -96196 -90857 -69323 -76101 -76506 -71316 -43
9676d3m5249k0798q3939k4383P6956k7929J2290R758R9874r1081j5076L8193n4818
$$ -43 -45292 -66090 -150029 -174412 -97456 -125385 -113095 -103337 -3463 -94544 -109620 -71427 -126245
9663a26245j7272N5888N8151q9532n1801O9200j6629k6350K9615j8866l968J0067
$$ -126245 -143517 -87629 -29478 -119010 -170811 -101611 -118240 -144590 -114975 -133841 -137809 -127742
9651a27742m6p608q512J0755j10566J7909J7540N0170J77401j0968j4379L5983
$$ -127742 -127788 -135396 -143908 -133153 -243719 -225810 -208270 -158100 19301 8333 -6046 29937
9639B9937o6370l4012P2587l0511J8006k3672P9125l0018j01628k6498O7151N7945
$$ 29937 -36433 -70445 2142 -28369 -10363 -34035 45090 15072 -86556 -113054 -45903 12042
9627A2042j22707o7067M8487l6722J09397J8731m6093L562m9547L9731M0924n4394
$$ 12042 -110665 -177732 -129245 -165967 -56570 -37839 -83932 -80370 -129917 -90186 -49262 -103656
9615a03656O4128n9061j30737M276M8058J28044m8733J9910N5879l1042K0469
$$ -103656 -39528 -98589 -229326 -225050 -176992 -48948 -97681 -77771 -21892 -52934 -32465
9604c2465o1636k9968P4351l7681j4752k0815n5194N2734n7249P0055m0924l3193
$$ -32465 -94101 -124069 -49718 -87399 -102151 -122966 -178160 -125426 -182675 -112620 -153544 -186737
9592a86737J20779J04792j06047m9895o7111n1307M2942O8626m745l6970P4135
$$ -186737 -65958 38834 -67213 -117108 -184219 -235526 -192584 -123958 -128703 -165673 -91538
9581i1538J8629O4359R946k7692N6362o9073J4448m4361r4085J07858J4751Q742
$$ -91538 -72909 -8550 1396 -26296 30066 -39007 -24559 -68920 -163005 -55147 -40396 -31654
9569c1654j45409M5605Q4533k5952K1782j59960L6844M3426P5195J25303L1548
$$ -31654 -177063 -131458 -46925 -72877 -51095 -211055 -174211 -130785 -55590 69713 101261
9558A01261j05947l1195O870m5420L5521Q745l4127l8167o0089M2237M2720J529
$$ 101261 -4686 -35881 -29011 -74431 -38910 -30165 -64292 -102459 -162548 -120311 -77591 -76062
9546g6062O0384n6119J4158M839R513o2595M5908J24427j53692l2187L137o8745
$$ -76062 -15678 -71797 -57639 -52800 -43287 -105882 -59974 64453 -89239 -121426 -118289 -187034
9534a87034L7240P6700l4943j1269J44067Q1914n3637q4342M8635p1203k3756
$$ -187034 -149794 -73094 -108037 -119306 24761 106675 53038 -31304 17331 -53872 -77628
9523g7628Q6827O936l4490k673J0617N472M5865p1000l622L0231L9301j9692j29559
$$ -77628 9199 16135 -18355 -21028 -10411 -4939 40926 -30074 -33696 -3465 35836 16144 -113415
9510a13415J12026o3987o1378L5168j923J6464K4101l8830O8746k8284j36953
$$ -113415 -1389 -65376 -126754 -91586 -93509 -77045 -52944 -91774 -23028 -51312 -188265
9499a88265N7356N6829j8314N954M2736n9203l8460J18004L5571k4617o2388K4003
$$ -188265 -130909 -74080 -92394 -86440 -43704 -102907 -141367 -23363 12208 -12409 -74797 -50794
9487e0794L3204P0454k3712j08880Q4673L599o1023k5394j05094Q9543j8991P3455
$$ -50794 -17590 52864 29152 -79728 4945 8544 -52479 -77873 -182967 -93424 -112415 -38960
9475c8960L4795o5925J28355k8064m0365O7483j2852k7314L2128o9424k0308k902
$$ -38960 -4165 -70090 58265 30201 -10164 57319 44467 17153 49281 -20143 -40451 -43353
9463d3353r3761l9041O9291j8735P1256J6509M0152l1806o0994k7472O8697N3478
$$ -43353 -137114 -176155 -106864 -125599 -54343 -37834 2318 -29488 -90482 -117954 -49257 4221
9451D221m7203k0508m1483J2332M6563N2764l8133P8550o8796L2333J0501r5859
$$ 4221 -42982 -63490 -104973 -92641 -46078 6686 -31447 47103 -21693 10640 21141 -74718
9439g4718l3593M911K6393J10033M7623j00595n1733k4214K2753k5608m5931Q0805
$$ -74718 -108311 -103400 -77007 33026 80649 -19946 -71679 -95893 -73140 -98748 -144679 -63874
9427f3874O6887j6868j0553m6304J3509j72M1334n6008M7893q479l0795m3392
$$ -63874 3013 -13855 -24408 -70712 -57203 -57375 -16041 -72049 -24156 -32635 -63430 -106822
9415a06822Q1088Q2182l9275J7620L1925n5924L0842j6017j1191q3107l3548K7500
$$ -106822 -25734 56448 17173 34793 66718 10794 41636 25619 14428 -68679 -102227 -74727
9403g4727J17140k3157m0305J02653K6003L5648j54151j723j8445k9418R1333
$$ -74727 42413 19256 -21049 81604 107607 143255 -10896 -12619 -31064 -60482 30851
9392C0851n973M6928k9836q1082Q7293k4324l1968Q8848R703m2667j2275k9281
$$ 30851 24878 71806 41970 -39112 48181 23857 -8111 80737 90440 47773 35498 6217
9380F217N1350r4993K9495J7179l2065q1815J17276Q1057p4328L1212O5338m2284
$$ 6217 57567 -37426 -7931 9248 -22817 -104632 12644 93701 19373 50585 115923 73639
9368G3639o0558p0296J3741N7153O221p1534k8151P6761O7602n976Q6194k9948
$$ 73639 13081 -57215 -43474 13679 19900 -51634 -79785 -3024 64578 58602 144796 114848
9356A14848p7507l1134J4273Q7344m4299l298j4455j1140M9035k5043l4433k6372
$$ 114848 37341 6207 20480 107824 63525 60227 45772 34632 83667 58624 24191 -2181
9344b181J2629N8615o7170M6152Q6313j3067m1477Q4389o6568o4738J57843J3888
$$ -2181 10448 69063 1893 48045 134358 121291 79814 164203 97635 32897 190740 204628
9332B04628j04546o1057N3959J29191l4821o884L5030m2630j0373K8435l9837
$$ 204628 100082 39025 92984 222175 187354 180470 215500 172870 162497 190932 151095
9321A51095L5378k4810r626o7194p41j3773R8104k2600p9496N2213l9932Q024
$$ 151095 186473 161663 152037 84843 84102 70329 168433 145833 66337 118550 78618 86642
9309H6642M942m1842k1615n1696J04898n1013k4920n9392j3843J1693R4272L8748
$$ 86642 91584 49742 28127 -23569 81329 30316 5396 -53996 -67839 -56146 38126 76874
9297G6874R43M5247L7277j5982K9020l0461j37573m6434M9881K3031Q029N0456
$$ 76874 77817 123064 160341 144359 173379 142918 5345 -41089 8792 31823 39852 90308
9285I0308P672o5904o3301P4098K0771K1682n5775j7244o0310J8856J26565L0115
$$ 90308 97980 32076 -31225 42873 63644 85326 29551 12307 -48003 -29147 97418 127533
9273A27533n9742j05777m1084O1373q36J0984J6981n0232l7714J45591m4235k0899
$$ 127533 67791 -37986 -79070 -17697 -18533 -7549 9432 -40800 -78514 67077 22842 1943
9261A943N8171L2947j40818l012J5782N4668M7578j6071J078L6649L2428L9646
$$ 1943 60114 93061 -47757 -50769 -34987 19681 67259 51188 52266 88915 121343 160989
9249A60989j0742p5707l0746m744J3050j5221L229m0802o621J81300M5635q4331
$$ 160989 150247 74540 43794 39050 52100 36879 40108 -694 -7315 173985 219620 135289
9237A35289n7299o3970j6206K9147M1559N3818J0464l996j29676l5525J02331
$$ 135289 77990 14020 -2186 26961 68520 122338 132802 128806 -870 -36395 65936
9226F5936K6598k589j7930l0646O3374Q082j1314P769l7940o2069Q8078L5635
$$ 65936 92534 89945 72015 41369 104743 112825 101511 109280 71340 9271 97349 132984
9214A32984Q820p4815p789P7505j1745m463k8560Q4150n7178m9550l9950L3680
$$ 132984 141804 66989 59200 136705 124960 120497 91937 176087 118909 69359 29409 63089
9202F3089M3984k0500K2756O8412r7438L8755r385l1833j0646L463J83913m3826
$$ 63089 107073 86573 109329 177741 80303 119058 109673 77840 67194 70657 254570 210744
9190B10744o3856R7911m6975r0057l1056L8819L03r853K7228q469R1836L8791
$$ 210744 146888 244799 197824 107767 76711 115530 115833 105980 133208 124739 216575 255366
9178B55366J293n6397O5623j50162l5242P3589L4279p2329K7813J6874j04585
$$ 255366 256659 200262 265885 115723 80481 154070 188349 116020 143833 160707 56122
9167E6122J01411j16797K6716N6891J3640O0169p4447j5799j0960j02059M4529
$$ 56122 157533 40736 67452 124343 137983 198152 123705 107906 96946 -5113 39416
9156C9416J24876K6410k2982j85q9869k9295J26568J0299j29723N8104k220O8329
$$ 39416 164292 190702 167720 167535 77666 48371 174939 185238 55515 113619 111399 179728
9144A79728q8895O8284l9240K4904N2814n2082k6295k2851J40383j1756J5917
$$ 179728 90833 159117 119877 144781 197595 145513 119218 96367 236750 224994 240911
9133B40911l4820n9791P5611j1799m7145l26q5126J11413Q918P26J25172O463
$$ 240911 206091 146300 221911 210112 162967 162641 77515 188928 197846 198572 323744 330207
9121C30207l9525n7366O0131K2092L0261m1319K9052L3481m3479O6119K6030m2850
$$ 330207 290682 233316 293447 315539 345800 304481 333533 367014 323535 389654 415684 372834
9109C72834k5888m0558l3888K3624J9312j4334M308K4782k4027o8350M784O5820
$$ 372834 346946 306388 272500 296124 315436 301102 305410 330192 306165 237815 242599 308419
9097C08419k0357l7065N8554J19250R6560K7449L6424j01188o6597K6490Q576
$$ 308419 288062 250997 309551 428801 525361 552810 589234 488046 421449 447939 456515
9086D56515O9039O3156m5216j7891M7706J3205k5326K1522m4233l1138K9685P8973
$$ 456515 525554 588710 543494 525603 573309 586514 561188 582710 538477 507339 537024 615997
9074F15997M9520k9146P6278r7870l218L8980j9340R0913m997k5771L3774k4879
$$ 615997 665517 636371 712649 614779 611561 650541 631201 722114 717117 691346 725120 700241
9062G00241m8937j6985L1151L2762L585m1888K9070Q0685j1168l3924j3601j19128
$$ 700241 651304 634319 665470 698232 701817 659929 688999 769684 758516 724592 710991 591863
9050E91863M9871K2432n3023K2020P0790L4069l2759M7417P405l0714J9864K6149
$$ 591863 641734 664166 611143 633163 703953 738022 705263 752680 760085 729371 749235 775384
9038G75384N8253K3485l641q8953R2988J3646L3818k6132J36802k4091m0909N5102
$$ 775384 833637 857122 853481 764528 857516 871162 904980 878848 1015650 991559 950650 1005752
9026A005752N0302o6899J2629J11448L6470N1928j54760R4912L6565p2271M0316
$$ 1005752 1056054 989155 1001784 1113232 1149702 1201630 1046870 1141782 1178347 1106076 1146392
9015A146392P5171R1499n6238L3966J19424J5587N2655m958O2377O9009R6409
$$ 1146392 1221563 1313062 1256824 1290790 1410214 1425801 1478456 1473498 1535875 1604884 1701293
9004A701293L4013L464R4098J28206J01921L0547J7775R4160L3284P1874J35377
$$ 1701293 1735306 1738770 1832868 1961074 2062995 2093542 2111317 2205477 2238761 2310635 2446012
8993B446012J94806Q1668j8344M6753L5547J16169Q4615k0312J17707K30963J76263
$$ 2446012 2640818 2722486 2704142 2750895 2786442 2902611 2987226 2966914 3084621 3315584 3491847
8982C491847J91879K16399J36031L03456J13162K03185K85639J37103K91809K33250
$$ 3491847 3683726 3900125 4036156 4339612 4452774 4655959 4941598 5078701 5370510 5603760
8972E603760N5445J07019o6249J7813l1098L556k2641J560K7845P700J16966J3926
$$ 5603760 5659205 5766224 5699975 5717788 5686690 5690246 5667605 5669165 5697010 5704710 5821676 5835602
8960E835602K32967J32680J50061J23727K43027J47058K90406K19170K17905L30961
$$ 5835602 6068569 6201249 6351310 6475037 6718064 6865122 7155528 7374698 7592603 7923564
8950G923564L52160M06010N54655N89671M90052N83431O51150O41640O77908R90442
$$ 7923564 8275724 8681734 9236389 9826060 10316112 10899543 11550693 12192333 12870241 13860683
8940A3860683J080264J025592J151745J454467J664709J822495K046477K287927
$$ 13860683 14940947 15966539 17118284 18572751 20237460 22059955 24106432 26394359
8932B6394359K473741K964023L278486L495246L394923L231678K646471J817247
$$ 26394359 28868100 31832123 35110609 38605855 42000778 45232456 47878927 49696174
8924D9696174N00989j021084k379909l368481l666499l712122l492136l139772
$$ 49696174 50197163 49176079 46796170 43427689 39761190 36049068 32556932 29417160
8916B9417160k781661k390873j885506j717477j524704j369011j147096j024705
$$ 29417160 26635499 24244626 22359120 20641643 19116939 17747928 16600832 15576127
8908A5576127r94084q49763p93796q34717o81688o13432o93414n91400o81115
$$ 15576127 14582043 13732280 12938484 12103767 11422079 10808647 10115233 9523833 8842718
8899H842718m70903m21830l85781k86298k77397l57946k74059l57489l19635j46238
$$ 8842718 8371815 7949985 7564204 7277906 7000509 6642563 6368504 6011015 5691380 5545142
8889E545142k46749k11075j83734j19025k68613r7448r9168j73321r8370j87678
$$ 5545142 5298393 5087318 4903584 4784559 4515946 4418498 4319330 4146009 4047639 3859961
8879C859961j71146j17195j46370k743l6069k24340j81761j15379J20960q7565
$$ 3859961 3688815 3571620 3425250 3422507 3386438 3162098 2980337 2864958 2985918 2898353
8869B898353K8427J0845j03676r8925o3477l3473j42186j08396q4036P0166m1015
$$ 2898353 2926780 2937625 2833949 2735024 2671547 2638074 2495888 2387492 2303456 2373622 2332607
8858B332607J8711l5726n4902j9703j8088j39159q5684n5021q519j00639k4427
$$ 2332607 2351318 2315592 2260690 2240987 2222899 2083740 1998056 1943035 1934516 1833877 1809450
8847A809450j3940n0903p0123j2796K2051o1901m6232q2577o1049n4070j5351
$$ 1809450 1795510 1744607 1674484 1661688 1683739 1621838 1575606 1493029 1431980 1377910 1362559
8836A362559M1839m4227l1417P1913l0162j0727k7087j17372q9057L2839p6455
$$ 1362559 1404398 1360171 1328754 1400667 1370505 1359778 1332691 1215319 1126262 1159101 1082646
8825A082646k454q7213j12346l7267r754J10630O8113j5368r6926p5523m7471
$$ 1082646 1080192 992979 880633 843366 833612 944242 1012355 996987 900061 824538 777067
8814G77067P2844O3908p2965j06226R371N7694J6516k6506m751p8304l456q305
$$ 777067 849911 913819 840854 734628 743999 801693 818209 791703 786952 708648 705192 696887
8802F96887P1596K0678K479r31j97233l4763N4198P0023N4687m7154p3624m3624
$$ 696887 768483 789161 791640 790709 593476 558713 612911 682934 737621 690467 616843 573219
8790E73219j3494K0562K7280p562J3779j196r0770M5645j9907m3916K404O4021
$$ 573219 559725 580287 607567 600005 613784 612588 521818 567463 547556 503640 506044 570065
8778E70065P2983q5893q0366L0069J05293k4219k5504p010M1324n9707j01022
$$ 570065 643048 557155 476789 506858 612151 587932 562428 555418 596742 537035 436013
8767D36013n1586L0174K7763m6926R3574j4863K174p2577p552L126k8355M7779
$$ 436013 384427 414601 442364 395438 489012 474149 476323 403746 396194 399320 370965 418744
8755D18744o1340L9135M0625m3332k0493R099O7291J879p0514q9516L289L8788
$$ 418744 357404 396539 437164 393832 373339 382438 449729 451608 381094 291578 294867 333655
8743C33655L2175k9864K7546Q8965m4395k5938M9996k6405m1517P7661M6747J4089
$$ 333655 365830 335966 363512 452477 408082 382144 432140 405735 364218 441879 488626 502715
8731E02715M6759j38903o6795k4189r019j2569j7085J03983Q294n6457O3507o5896
$$ 502715 549474 410571 343776 319587 310568 297999 280914 384897 393191 336734 400241 334345
8719C34345O537P9599L4335j4887J0933n8124j07617N5335m3429p9915J7655P8822
$$ 334345 340882 420481 454816 439929 450862 392738 285121 340456 297027 217112 234767 313589
8707C13589N8077m3411j3516k2918K5689k9427q0547r0044J23624J24227o3103
$$ 313589 371666 328255 314739 291821 317510 288083 207536 117492 241116 365343 302240
8696C02240K2550P6408j0759J4249k2885n2710R418k8983j2900k1048L1564Q6779
$$ 302240 324790 401198 390439 404688 381803 329093 338511 309528 296628 275580 307144 393923
8684C93923K1808j34837O5948o4636N837l7171P7427K0453J4042K2307J3199L7931
$$ 393923 415731 280894 346842 282206 288043 250872 328299 348752 362794 385101 398300 436231
8672D36231n0218m5782P326l9212q8216k4294J31203R6037k3322o4360l800J6822
$$ 436231 386013 340231 347557 308345 220129 195835 327038 423075 399753 335393 331593 348415
8660C48415L0743J9859m7017J8214O6207r7802k01j3499k8385J9338r658o9118
$$ 348415 379158 399017 352000 370214 436421 338619 338418 324919 296534 315872 306214 237096
8648B37096Q2292J07840r8878R2965Q8103r6834o7289k3734M8390q1057k3767
$$ 237096 319388 427228 328350 421315 509418 412584 345295 321561 369951 288894 265127
8637B65127O2950K133n1996q8394P0215O1879k1530r342k1618n3168k4995N7676
$$ 265127 328077 330210 278214 189820 260035 321914 300384 291042 269424 216256 191261 248937
8625B48937R7466m902J9152k2336J5565l068k6823J899L0674r4362J14500k1675
$$ 248937 346403 341501 360653 338317 353882 350814 323991 325890 356564 262202 376702 355027
8613C55027l5377L3876j12060l0553O9937P4753k4486j925J69230q5281O5429
$$ 355027 319650 353526 241466 210913 280850 355603 331117 329192 498422 413141 478570
8602D78570M8538m7083o0965l6052M8523o063L390n49j4410j8610J1600q38m7207
$$ 478570 527108 480025 419060 383008 431531 425468 428858 428309 413899 395289 406889 406051 358844
8589C58844K7133J3292N3572k3961R589k0345M0938P5583n0916p4531r816N1111
$$ 358844 385977 399269 452841 428880 438469 418124 459062 534645 483729 409198 399382 450493
8577D50493L9678r5765m5720K7514j16014O8726L64606n2949q5514m9485j7677
$$ 450493 490171 394406 348686 376200 260186 328912 693518 640569 555055 505570 487893
8566D87893R6919j01261r3243q0667J08639k7511Q1425k4771K4520j00090L5138
$$ 487893 584812 483551 390308 309641 418280 390769 472194 447423 471943 371853 406991
8555D06991P8127r1045P3397L5924L5207k9839o9502R2921l8181k7073j8123J8714
$$ 406991 485118 394073 467470 503394 538601 508762 439260 532181 494000 466927 448804 467518
8543D67518m9446J0469K7443L4544j643r970R1547k27696J11865k330K4052k630
$$ 467518 418072 428541 455984 490528 488885 478915 570462 342766 454631 452301 476353 473723
8531D73723p1630l379N3168J37207J7447L3065J7682l4551n3387J40398j645j5166
$$ 473723 402093 398714 451882 589089 606536 639601 657283 622732 569345 709743 708098 692932
8519F92932J1870j5941j26221K7578J1077O3023Q058k742o6316r0043M2906N9546
$$ 692932 704802 688861 562640 590218 601295 664318 672376 669634 603318 513275 556181 615727
8507F15727j6024M3943q4832o7088p145o5681J39991K765J5109J2938j462N0722
$$ 615727 599703 643646 558814 491726 484581 418900 558891 561656 576765 589703 588241 638963
8495F38963o2471R9471j01522l9850J05609j9212n0639M3890K7695j435K509k2207
$$ 638963 576492 675963 574441 534591 640200 620988 570349 614239 641934 640499 643008 620801
8483F20801K5726J0896P7410m139l3511n8192J1498l5468P7579O282l8815M6464
$$ 620801 646527 657423 734833 730694 697183 638991 650489 615021 692600 698882 660067 706531
8471G06531J8940l6032l1809M4700k6424P820k806m2478L6718M3372J1385j18892
$$ 706531 725471 689439 657630 702330 675906 683726 680920 638442 675160 718532 729917 611025
8459F11025J43J28468O7687j3200q2667P0297n2261J2713K4187J9384o7034r766
$$ 611025 611168 739636 807323 794123 711456 781753 729492 742205 766392 785776 718742 708976
8447G08976L1345M4891l1154J0729j334O439O5979j52452m2604P2999N86n4804
$$ 708976 740321 785212 754058 764787 763453 769892 835871 683419 640815 713814 714400 659596
8435F59596P3985P0926r3808l9111J11419J7166L7824m1540R306J9986m3661L5249
$$ 659596 733581 804507 710699 671588 783007 800173 837997 796457 805763 825749 782088 817337
8423H17337Q4246p304j4410m3045q1884k8908J9578o065J44761J7129P160m6236
$$ 817337 901583 894279 879869 836824 754940 726032 745610 739545 884306 901435 908595 862359
8411H62359J5424L4348o117J10599L1647n7686L278K2333J104l1664O2061j6613
$$ 862359 877783 912131 906014 1016613 1048260 990574 993852 1016185 1017289 985625 1047686 1031073
8399A031073q3906N1742M5915j5978K9841J8155R0201n6250o9037m9971N4084
$$ 1031073 947167 998909 1044824 1028846 1058687 1076842 1167043 1110793 1041756 991785 1045869
8388A045869j8876J5828m3457j6637O7930J879J1843P4079Q2063K9070K9558J4375
$$ 1045869 1026993 1042821 999364 982727 1050657 1052536 1064379 1138458 1220521 1249591 1279149 1293524
8376A293524o8884q1144J33169Q7658j35141l8005m0K1316N8412P4124J0224p143
$$ 1293524 1224640 1143496 1276665 1364323 1229182 1191177 1191137 1212453 1270865 1344989 1355213 1348070
8364A348070l3349O4761n902n3635M7071n5205J06091M0516M9175k5680p3982
$$ 1348070 1314721 1379482 1373580 1319945 1367016 1311811 1417902 1458418 1507593 1481913 1407931
8353A407931m6827N0674r624Q4189j7549J4530M0485J29663n8024M4628j7486
$$ 1407931 1361104 1411778 1402154 1486343 1468794 1483324 1523809 1653472 1595448 1640076 1622590
8342A622590k5987J8137o2092K276M1782k0921N0071K6882L8202M8149P6843k6755
$$ 1622590 1596603 1614740 1552648 1554924 1596706 1575785 1625856 1652738 1690940 1739089 1815932 1789177
8330A789177r5623N8927K8617N855q3665J97971J17401j91127K9377M5454J8982
$$ 1789177 1693554 1752481 1781098 1786953 1703288 1901259 2018660 1827533 1856910 1902364 1921346
8319A921346L0467L6562J2438r735J37802r380l1916M9806J4050P1571M1550N7121
$$ 1921346 1951813 1988375 2000813 1991078 2128880 2119500 2087584 2137390 2151440 2223011 2264561 2321682
8307B321682n0917J34318K637q3639M3494K2609M9725J4180P2446k9086M7574
$$ 2321682 2270765 2405083 2407720 2324081 2367575 2390184 2439909 2454089 2526535 2497449 2545023
8296B545023P2427N8345k9662o5524J08L9377K2631q7M5094N285K3345L9302N0390
$$ 2545023 2617450 2675795 2646133 2580609 2580717 2620094 2642725 2642638 2687732 2693017 2716362 2755664 2806054
8283B806054J03449p9419j3214L3255O1382J68211l3547l6573R112j1831P9609
$$ 2806054 2909503 2830084 2816870 2850125 2911507 3079718 3046171 3009598 3018710 3006879 3086488
8272C086488n6242J02613J12837p5716J951M2465O4949M4878m9898R1979J50871
$$ 3086488 3030246 3132859 3245696 3169980 3171931 3214396 3279345 3324223 3274325 3366304 3517175
8261C517175M9551J5012J5106R4665O4731P100P4228m0722n7511R0555P9740J15463
$$ 3517175 3566726 3581738 3596844 3691509 3756240 3763340 3837568 3796846 3739335 3829890 3909630 4025093
8249D025093M4025K1726M571P5687J11722M3550K4943N2458J59018M3802n8515
$$ 4025093 4069118 4090844 4095415 4171102 4282824 4326374 4351317 4403775 4562793 4606595 4548080
8238D548080k6635J01690j0366o7946R6803J61647K6130p3941O1602O6656J44783
$$ 4548080 4521445 4623135 4612769 4544823 4641626 4803273 4829403 4755462 4817064 4883720 5028503
8227E028503L4583O3608Q6806J0376J54603L1721J56696L7333J07152P6392K1731
$$ 5028503 5063086 5126694 5213500 5223876 5378479 5410200 5566896 5604229 5711381 5787773 5809504
8216E809504P5419J85613Q5046P9861J59169j0985J33608K20170R5890M541K0848
$$ 5809504 5884923 6070536 6155582 6235443 6394612 6383627 6517235 6737405 6833295 6837836 6858684
8205F858684P1164J06626J33586J76918N3210O5123J06200J14357M6727J85138
$$ 6858684 6929848 7036474 7170060 7346978 7400188 7465311 7571511 7685868 7732595 7917733
8195G917733J61729N7759M763O73106L24076j80256M5636L2785K69218J47870
$$ 7917733 8079462 8137221 8141984 8815090 9139166 8958910 9004546 9037331 9306549 9454419
8185I454419J07126J12173K28414K18690N3118K19877K14460J57424K56923J68504
$$ 9454419 9561545 9673718 9902132 10120822 10173940 10393817 10608277 10765701 11022624 11191128
8175A1191128K78213L21785R6549J63766K79573K45087J89034L05145K60980J92476
$$ 11191128 11469341 11791126 11887675 12051441 12331014 12576101 12765135 13070280 13331260 13523736
8165A3523736K43470L04386K74947K01455L79572L13893L75597K21855L18539
$$ 13523736 13767206 14071592 14346539 14547994 14927566 15241459 15617056 15838911 16157450
8156A6157450N01494L87069K96164L02103L71058N21489L56609L12142N08170
$$ 16157450 16658944 17046013 17342177 17644280 18015338 18536827 18893436 19205578 19713748
8147A9713748O56623M11169N97997M83469M64371N44791O81191O84144O05590
$$ 19713748 20370371 20781540 21379537 21863006 22327377 22872168 23553359 24237503 24843093
8138B4843093P53334M26654O30963P34222P76272N60411O74644Q19831P95508
$$ 24843093 25596427 26023081 26654044 27388266 28164538 28724949 29399593 30219424 31014932
8129C1014932P86788P41560Q52568R61060J002084Q84596Q02944J148427J175645
$$ 31014932 31801720 32543280 33395848 34356908 35358992 36243588 37046532 38194959 39370604
8120C9370604J108939J101902J184146J259801J220956J301328J385365J501937
$$ 39370604 40479543 41581445 42765591 44025392 45246348 46547676 47933041 49434978
8112D9434978J474589J593610J583167J730875J784883J955117J991345K039949
$$ 49434978 50909567 52503177 54086344 55817219 57602102 59557219 61548564 63588513
8104F3588513K203799K319477K423719K500825K715217K779958L105628L173806
$$ 63588513 65792312 68111789 70535508 73036333 75751550 78531508 81637136 84810942
8096H4810942L349606L587738L869258M084679M458810M635323M859344N364790
$$ 84810942 88160548 91748286 95617544 99702223 104161033 108796356 113655700 119020490
8088A19020490N781541O211872O592752O947612P476699Q078073Q701737R294063
$$ 119020490 124802031 131013903 137606655 144554267 152030966 160109039 168810776 178104839
8080A78104839J0001550J0779344J1533427J2274326J3068384J3637352J4383218
$$ 178104839 188106389 198885733 210419160 222693486 235761870 249399222 263782440
8073B63782440J5071019J5378290J5479535J5125114J4322825J3025671J1106170
$$ 263782440 278853459 294231749 309711284 324836398 339159223 352184894 363291064
8066C63291064Q444490N354724J752694j814963n569050q813061j1522420j3634033
$$ 363291064 371735554 377090278 378842972 377028009 371458959 362645898 351123478 337489445
8058C37489445j5238880j6043774j6133441j6076742j5742996j5024253j4122604
$$ 337489445 322250565 306206791 290073350 273996608 258253612 243229359 229106755
8051B29106755j3258739j2451058j1681269j0701040j0147048r380094q545708
$$ 229106755 215848016 203396958 191715689 181014649 170867601 161487507 152941799
8044A52941799p930428p338095o893027o353604n828273n442036n068894m908074
$$ 152941799 145011371 137673276 130780249 124426645 118598372 113156336 108087442 103179368
8036A03179368m458130m194064l887498l623043l605544l282629l057908k954616
$$ 103179368 98721238 94527174 90639676 87016633 83411089 80128460 77070552 74115936
8028G4115936k766102k692869k477365k351814k230051k103781k128858j876710
$$ 74115936 71349834 68656965 66179600 63827786 61597735 59493954 57365096 55488386
8020E5488386j787622j749939j714870j712692j528094j475056j421294j411966
$$ 55488386 53700764 51950825 50235955 48523263 46995169 45520113 44098819 42686853
8012D2686853j293028j322547j265488j107833j069609j008091j145890r35124
$$ 42686853 41393825 40071278 38805790 37697957 36628348 35620257 34474367 33539243
8004C3539243q57342r61491q81677r36381p78170p51278q41933p03306p27341
$$ 33539243 32681901 31720410 30838733 29902352 29124182 28372904 27530971 26827665 26100324
7995B6100324n24923n02412p74990o67979m90806n54466m86326m81205n46034
$$ 26100324 25575401 25072989 24297999 23630020 23139214 22584748 22098422 21617217 21071183
7986B1071183n58142n21720m48106m10226l52478m49095m72695l09218l49231
$$ 21071183 20513041 19991321 19543215 19132989 18780511 18331416 17858721 17549503 17200272
7977A7200272l53655l99956m37288k87328l43367l05573m36355k25011j75904
$$ 17200272 16846617 16446661 16009373 15722045 15378678 15073105 14636750 14411739 14235835
7968A4235835l23581j68862m78503m10078k67643p9161k33607k92667k63618j99681
$$ 14235835 13912254 13743392 13264889 12854811 12587168 12508007 12274400 11981733 11718115 11518434
7958A1518434k26926j73149j78903k04219k86894j97577j53891q9509j31536q2771
$$ 11518434 11291508 11118359 10939456 10735237 10448343 10250766 10096875 10007366 9875830 9793059
7948I793059k14096k43546j32658j20285j45678j60230j12067k09669j23682j14397
$$ 9793059 9578963 9335417 9202759 9082474 8936796 8776566 8664499 8454830 8331148 8216751
7938H216751p1921r7441j90843j31791j24067j69745o5076r5049r6954o1252q4370
$$ 8216751 8144830 8047389 7856546 7724755 7600688 7430943 7365867 7270818 7173864 7112612 7028242
7927G028242j31457j02998j16338n2055j23959j26535j12087j06823o8471r7700
$$ 7028242 6896785 6793787 6677449 6625394 6501435 6374900 6262813 6155990 6087519 5989819
7917E989819j92223r8524J21253p7020j57925n2111q2090j05748m9983M2405j34144
$$ 5989819 5797596 5699072 5820325 5743305 5585380 5533269 5451179 5345431 5295448 5337853 5203709
7906E203709q2653L728j32503r8412l3240j53566q8622K7823M6169o3181j35354
$$ 5203709 5121056 5124784 4992281 4893869 4860629 4707063 4618441 4646264 4692433 4629252 4493898
7895D493898j78481k07775o9565p992q158N2521r1228o7853p4938m4813m9284
$$ 4493898 4315417 4107642 4038077 4030085 4021927 4074448 3983220 3915367 3840429 3795616 3746332
7884C746332k01331K7628l6526o7381k1994m3305l1939r0303j2674q1559O0896
$$ 3746332 3545001 3572629 3536103 3468722 3446728 3403423 3371484 3281181 3268507 3186948 3247844
7873C247844o5369k4420O9913j43605o0437Q1846j16464j36397J4313k5923o2702
$$ 3247844 3182475 3158055 3227968 3084363 3023926 3105772 2989308 2852911 2867224 2841301 2778599
7862B778599M5661j09114r0585k4310K682q1151k8380M5253l4878K3261k9073
$$ 2778599 2824260 2715146 2624561 2600251 2602933 2521782 2493402 2538655 2503777 2527038 2497965
7851B497965p8246j2763o9604m0006L0922p1822J8151p1645n6740n3755l2471
$$ 2497965 2419719 2406956 2337352 2297346 2328268 2256446 2274597 2202952 2146212 2092457 2059986
7840B059986o208j14866K1269O1936Q303q7258j4669R943l6069j3583l6155P0536
$$ 2059986 2053778 1938912 1960181 2022117 2030420 1943162 1928493 1938436 1902367 1888784 1852629 1923165
7828A923165L1685J0087p1549j27810J2914j41126O7940Q2578j68152m6789m7960
$$ 1923165 1954850 1964937 1893388 1765578 1778492 1637366 1705306 1787884 1619732 1572943 1524983
7817A524983O5571o409L4421j22695M5243O9440j83501O5591l3530K9862Q5196
$$ 1524983 1590554 1584145 1618566 1495871 1541114 1610554 1427053 1492644 1459114 1488976 1574172
7806A574172p4156P7167M6235p4774k2536j13379m8834m1148R3244J7592o1392
$$ 1574172 1500016 1577183 1623418 1548644 1526108 1412729 1363895 1322747 1415991 1433583 1372191
7795A372191j07989R464J0847m222J1887L6734P5320j09010L4614l0624R608m5424
$$ 1372191 1264202 1273666 1284513 1280291 1292178 1328912 1404232 1295222 1329836 1299212 1308820 1263396
7783A263396l3691L2980M4214k7598k3650J28983K9551k00453k8918m499K0743
$$ 1263396 1229705 1262685 1306899 1279301 1255651 1384634 1414185 1213732 1184814 1180315 1201058
7772A201058L7701o7028k5963M7329j647J2855K697j4996N2218L5323j96239k2871
$$ 1201058 1238759 1171731 1145768 1193097 1191450 1204305 1207002 1192006 1244224 1279547 1083308 1060437
7760A060437M1907m187j38925M9034J48933j6628J1383k5592o4324K4745L3207
$$ 1060437 1102344 1098157 959232 1008266 1157199 1140571 1151954 1126362 1062038 1086783 1119990
7749A119990j4265K4244R2564m2852n2646j6493j23819M9279J05969p2887j35174
$$ 1119990 1105725 1129969 1222533 1179681 1127035 1110542 986723 1036002 1141971 1069084 933910
7738I33910J8402L2276j8587M24O6619j18884P9839l5178n1839n1779R2575J9848
$$ 933910 952312 984588 966001 966425 1033044 914160 993999 958821 906982 855203 947778 967626
7726I67626q8568Q8994q289n1587Q7853m8806q6749R4987J2702j2172K2915K3208
$$ 967626 879058 968052 959763 908176 996029 947223 860474 955461 968163 955991 978906 1002114
7714A002114q2951M8571M3136O1704n5817k2602k40N0636j26503j6016r9129k3306
$$ 1002114 919163 967734 1010870 1072574 1016757 994155 993915 1044551 918048 902032 802903 779597
7702G79597O1762l7220M1028p1187o7699N2808o2644L5233O5011p3581j6949l5877
$$ 779597 841359 804139 845167 773980 706281 759089 696445 731678 796689 723108 706159 670282
7690F70282M6860l989l056k959J44228j1507R171J9539q4687j01669J20789j23995
$$ 670282 717142 713153 710097 707138 851366 839859 849030 868569 783882 682213 803002 679007
7678F79007l4002k1105M3776J19079K7082J6616j00731K1045p0432n4350P795
$$ 679007 645005 623900 667676 786755 813837 830453 729722 750767 680335 625985 633780
7667F33780P9422K8529m9521K7982q1865m7122Q1937k0242k3487J7027L9146k3274
$$ 633780 713202 741731 692210 720192 638327 591205 673142 652900 629413 646440 685586 662312
7655F62312n3034M4373N4240J0653l1368N288L2194M1935n0139n3654j585j04530
$$ 662312 609278 653651 707891 718544 687176 692464 724658 766593 716454 662800 661215 556685
7643E56685L6475Q3811R440J9014J3805n8625m596M7156k9016k1452Q681J11495
$$ 556685 593160 676971 686411 705425 719230 660605 656009 703165 674149 652697 661378 772873
7631G72873j2538J0333M1172j206j4200J2215o2657l592J73481K8949p5143O596
$$ 772873 760335 770668 811840 810634 796434 808649 745992 742400 915881 944830 869687 876283
7619H76283K8647p8231m728L5452k0368J4328K2560J221N0996M5049k4664n6916
$$ 876283 904930 826699 821971 857423 837055 851383 873943 875164 926160 971209 946545 889629
7607H89629l2499J9272P9254M282K8472m6742j03452J22774M1941m9859p7029
$$ 889629 857130 876402 955656 959938 988410 941668 838216 960990 1002931 953072 876043
7596H76043Q2229J1049J913n291o2263L722N7962N5594n3501n3530J2569j34M7332
$$ 876043 958272 969321 971234 965943 903680 907402 965364 1020958 967457 913927 926496 926362 973694
7583I73694L7925o2310L6573L6322M1434N7129n0690j3307J66446P45m5191K0131
$$ 973694 1011619 949309 985882 1022204 1063638 1120767 1070077 1056770 1223216 1223961 1178770 1198901
7571A198901N3982J442n286n4546M1721O4895k6329J7791J27242P53k333L0297
$$ 1198901 1252883 1254325 1249039 1194493 1236214 1301109 1274780 1292571 1419813 1420566 1418233 1448530
7559A448530r4949O4870j7207l7739J34855m9196K1245j1847r7440O7525R088
$$ 1448530 1353581 1418451 1401244 1363505 1498360 1449164 1470409 1458562 1361122 1428647 1437735
7548A437735o352J42639n412o7258O5818N1299K0340m6857L5018R0561M5340M4770
$$ 1437735 1431383 1574022 1568610 1501352 1567170 1618469 1638809 1591952 1626970 1717531 1762871 1807641
7536A807641j7062O3986P0464M8534O1076O9430K7840J51141J2060p3185L1107
$$ 1807641 1790579 1854565 1925029 1973563 2034639 2104069 2131909 2283050 2295110 2221925 2253032
7525B253032p9405M9042J04840N3876Q6449K5578P3114Q8741n2048O3109R1993
$$ 2253032 2173627 2222669 2327509 2381385 2467834 2493412 2566526 2655267 2603219 2666328 2758321
7514B758321M4233M2821J39328l7662j00938J80785Q3903K01957Q3356J18606
$$ 2758321 2802554 2845375 2984703 2947041 2846103 3026888 3110791 3312748 3396104 3514710
7504C514710J13365K071O953P9786J12931Q9152J52954P9279J97267J46897J19617
$$ 3514710 3628075 3630146 3637099 3716885 3829816 3918968 4071922 4151201 4348468 4495365 4614982
7493D614982O9122J76468M6850K8876J48718J80292J72715J54231J73849K38807
$$ 4614982 4684104 4860572 4907422 4936298 5085016 5265308 5438023 5592254 5766103 6004910
7483F004910K16529K04749J66592L00144J44635J91423K85320K43682K24949L27150
$$ 6004910 6221439 6426188 6592780 6892924 7037559 7228982 7514302 7757984 7982933 8310083
7473H310083L62686K50902L48603N18438M89837M04949M81697L71425N58893N09424
$$ 8310083 8672769 8923671 9272274 9790712 10280549 10685498 11167195 11538620 12097513 12606937
7463A2606937O88128O68925P55691Q50699Q02039P96708R01134R31462R42933
$$ 12606937 13295065 13963990 14719681 15570380 16372419 17169127 18070261 19001723 19944656
7454A9944656R28086R30886J007127Q90141Q44192Q22519O22136M25794L55966
$$ 19944656 20872742 21803628 22810755 23700896 24545088 25367607 25989743 26415537 26771503
7445B6771503K39142K54337J00269J10957J57688J12743J37505K29289J96900
$$ 26771503 27010645 27264982 27365251 27476208 27633896 27746639 27884144 28113433 28310333
7436B8310333M08125N46050N58883N86931P75337R52025J105200J137050J106001
$$ 28310333 28718458 29264508 29823391 30410322 31185659 32137684 33242884 34379934 35485935
7427C5485935J278352J384752J419546J297784J119549J172454P55163L89627
$$ 35485935 36764287 38149039 39568585 40866369 41985918 43158372 43913535 44303162
7419D4303162K12758l98453q16017r15636j099454j365614j390815j384662j220200
$$ 44303162 44515920 44117467 43301450 42385814 41286360 39920746 38529931 37145269 35925069
7410C5925069j270223j120285j065414r31697q03567p11398n40911n84948m52984
$$ 35925069 34654846 33534561 32469147 31537450 30733883 30022485 29481574 28896626 28443642
7401B8443642m35865k00783j08614j18399m2582l908r7697q0601k32833l35255
$$ 28443642 28007777 27806994 27698380 27579981 27537399 27533491 27435794 27355193 27122360 26787105
7391B6787105l63053n20369o77333p60936p82307j016927j055030j034832r80461
$$ 26787105 26424052 25903683 25226350 24465414 23683107 22666180 21611150 20576318 19595857
7382A9595857j014140r27384r38646q83030p64535o61313o44624o62853o16270
$$ 19595857 18581717 17654333 16715687 15832657 15068122 14406809 13762185 13099332 12483062
7373A2483062n88189n41048n89021n48540l70049m62633m02160l29420l85975
$$ 12483062 11894873 11353825 10764804 10216264 9846215 9383582 8981422 8652002 8266027
7364H266027k82386k67664l05219k88949j64219k16676k45058l11316j57410p8944
$$ 8266027 7983641 7715977 7410758 7121809 6957590 6740914 6495856 6184540 6027130 5948186
7354E948186j87704k29099k14229j35983r8603j64137j72347j19049o9079o5055
$$ 5948186 5760482 5531383 5317154 5181171 5082568 4918431 4746084 4627035 4557956 4492901
7344D492901j29597j53108j89568j13803j15149r1259m3301m4830k4103r3526
$$ 4492901 4363304 4210196 4020628 3906825 3791676 3700417 3657116 3612286 3588183 3494657
7334C494657k1981j27999q7337k00871k6541O55j4153j49983l6709J22911j07462
$$ 3494657 3472676 3344677 3257340 3056469 3029928 3030583 3016430 2866447 2829738 2952649 2845187
7323B845187j11536j31435J6447J5859n1464p6911j52835J376K4622j22486K0608
$$ 2845187 2733651 2602216 2618663 2634522 2583058 2506147 2353312 2354688 2379310 2256824 2277432
7312B277432N1192L9988q0911j30800M264L3939o4161n7789l9323j7385n9471
$$ 2277432 2328624 2368612 2287701 2156901 2161165 2195104 2130943 2073154 2033831 2016446 1956975
7301A956975j02017L8218K5141k336p9810j6863l936l6040L9211L0263q3933l1187
$$ 1956975 1854958 1893176 1918317 1915981 1836171 1819308 1815372 1779332 1818543 1848806 1764873 1733686
7289A733686k3497j26880p4641R6139Q8056j46542k1718l7883L6873o3088O83
$$ 1733686 1710189 1583309 1508668 1604807 1692863 1546321 1524603 1486720 1523593 1460505 1461188
7278A461188o0809P366O166L742r1470j9747P1534M950j84881N945n6662J01043
$$ 1461188 1400379 1407745 1413911 1417653 1326183 1306436 1377970 1382920 1198039 1203984 1147322 1248365
7266A248365l3066p8577q1669K4518j4728o1168l5035K6605K0386P5134J07841
$$ 1248365 1215299 1136722 1055053 1079571 1064843 1003675 968640 995245 1015631 1090765 1198606
7255A198606j02180q006r0718R4850j93j03524n8502P4177o7651n081r0434N2179
$$ 1198606 1096426 1088420 997702 1092552 1092359 988835 930333 1004510 936859 931778 841344 893523
7243H93523k5048j2473O8368j8734j3609m8992j14315L0987K0870r7617L3032
$$ 893523 868475 856002 924370 905636 892027 843035 728720 759707 780577 682960 715992
7232G15992K3460O3854K2127K9505p5126o0987Q7258j4944n7984j56191O3941
$$ 715992 739452 803306 825433 854938 779812 718825 806083 791139 733155 576964 640905
7221F40905K6180K8084J08355M6030m3672q2899l0323J03092P6822n3411j34912
$$ 640905 667085 695169 803524 849554 805882 722983 692660 795752 872574 819163 684251
7210F84251M3060k8277o5670K2157p0164K0014O5159l9994P9336L5582o9236l5598
$$ 684251 727311 699034 633364 655521 585357 605371 670530 630536 709872 745454 676218 640620
7198F40620Q9936L8683m1410p5945P4323J8809o4476J5999l6074p3575R065M5618
$$ 640620 730556 769239 727829 651884 726207 745016 680540 696539 660465 586890 595955 641573
7186F41573K3974o530o7094J1307L9250K5969o7254k7782J21267l6468n8475n8979
$$ 641573 665547 659017 591923 603230 642480 668449 601195 573413 694680 658212 599737 540758
7174E40758M0787M7723M0865N2056k9545O5950j60126O685j9396J1231o9603M4750
$$ 540758 581545 629268 670133 722189 692644 758594 598468 605153 585757 596988 527385 572135
7162E72135N5708J7512o7955q4246p615j1466J17873j0208q794K6226p2038K9712
$$ 572135 627843 645355 577400 493154 485539 474073 591946 581738 572944 599170 527132 556844
7150E56844N5001j22205k4504M9666J04394K2450j10313K5174M2097j1442K7703
$$ 556844 611845 489640 465136 514802 619196 641646 531333 556507 598604 587162 614865
7139F14865m7906k0737l5432J28334Q2468k07136m0811J14140O3168p4991K1590
$$ 614865 566959 546222 510790 639124 721592 514456 473645 587785 650953 575962 597552
7128E97552o90p1950K3900J4074L6209p3640l9750Q6235M958n8673K364K8376
$$ 597552 596862 524912 548812 562886 599095 525455 485705 571940 576898 518225 520589 548965
7116E48965P3778q209Q0662L2103n7829p1086k7253n7089O314P6149J884K1753
$$ 548965 622743 614534 695196 727299 669470 598384 571131 514042 520356 596505 598389 620142
7104F20142p4815j01909O9703Q7985Q4288l8776p4615o7701j22257J41765j9504
$$ 620142 545327 443418 513121 601106 685394 646618 572003 504302 382045 523810 504306
7093E04306l2792R0209L7281L8931R439r8358M1279Q4032J1863l4156P1590m4696
$$ 504306 471514 561723 599004 637935 647374 549016 590295 674327 686190 652034 723624 678928
7081F78928K2284j2913j5054j30890l1340Q9384L1334J7681q4339l0060J04816
$$ 678928 701212 688299 673245 542355 511015 600399 631733 649414 565075 535015 639831
7070F39831Q4098o7243r3738o3441P0071P1816o9634P2727N4246l8500k6179j427
$$ 639831 723929 656686 562948 499507 569578 641394 571760 644487 698733 660233 634054 632627
7058F32627o1457M7971L3947n5726J54794j7780k6586K0591Q164n0236J3984q1358
$$ 632627 571170 619141 653088 597362 752156 734376 707790 728381 736545 686309 700293 618935
7046F18935R552N8677k9897N7335j0625J09226n0163o264l6126Q2563M6704M142
$$ 618935 628487 687164 657267 714602 703977 813203 763040 756776 720650 803213 849917 854059
7034H54059n5847j08310L0879N219L4439N398N2585n8003J10132N8043M878l5880
$$ 854059 798212 689902 720781 726000 760439 765837 818422 760419 870551 928594 933472 897592
7022H97592J1239L6123k8305j8154O4669J01664R2202L3181k6528m909P7035m806
$$ 897592 908831 944954 916649 898495 963164 1064828 1157030 1190211 1163683 1158774 1235809 1231003
7010A231003K1134O8377J2460M4006J04810J43208J28162K3520P7062J67008J23147
$$ 1231003 1252137 1320514 1332974 1376980 1481790 1624998 1753160 1776680 1853742 2020750 2143897
6999B143897J06763J20243l6659K898r8276m641L9710J3313p3579k3891j33141
$$ 2143897 2250660 2370903 2334244 2337142 2238866 2234225 2273935 2287248 2213669 2189778 2056637
6988B056637j4010j3309K4923M7883N9695M3111O204R2265O722M8617J87916J37630
$$ 2056637 2042627 2029318 2054241 2102124 2161819 2204930 2211134 2303399 2310121 2358738 2546654 2684284
6976B684284P1060K57237J38093Q5515J59236J56160J52713J59407o4819N7911
$$ 2684284 2755344 3012581 3150674 3236189 3395425 3551585 3704298 3863705 3798886 3856797
6966C856797p2377j30836k08216r1707j77926k33070p0409p8631N317j65914j99558
$$ 3856797 3784420 3653584 3445368 3353661 3175735 2942665 2872256 2793625 2798942 2633028 2433470
6955B433470J2308J0784k7840k3109j22955k9114J05217j15437p888o0972L5237
$$ 2433470 2445778 2456562 2428722 2405613 2282658 2253544 2358761 2243324 2235436 2174464 2209701
6944B209701P2449J48534j51380P1496K02908j09688M6915j4946p1519j69304
$$ 2209701 2282150 2430684 2279304 2350800 2553708 2444020 2490935 2475989 2404470 2235166
6934B235166j04904j30332q9593p0492j08539j42334j5905o2235J3379j06642
$$ 2235166 2130262 1999930 1910337 1839845 1731306 1588972 1573067 1510832 1524211 1417569
6924A417569j34086N935n9253K7815j21950j77641o057O9236K8014p8785n599
$$ 1417569 1283483 1289418 1230165 1257980 1136030 958389 952332 1021568 1049582 970797 965198
6913I65198L269q5401p7737r1175J2113n1811q1427J00130J9343M3692l3391L7329
$$ 965198 968467 883066 805329 714154 726267 674456 593029 693159 712502 756194 722803 760132
6901G60132j7281q7023K8446j39762k1620q787o5031J25311M5347K1167m6959
$$ 760132 742851 655828 684274 544512 522892 514105 449074 574385 619732 640899 593940
6890E93940p2702L4269O8928J1834r8876q013L2699J0457o9511N356P2313l8662
$$ 593940 521238 555507 624435 636269 537393 529380 562079 572536 503025 508381 580694 542032
6878E42032l4757r9934P6430M0253p6790j9625J9535L005P4464n910r7043P1785
$$ 542032 507275 407341 483771 524024 447234 427609 447144 450149 524613 518703 421660 493445
6866D93445M6715K609j05035o7672j8431N2744O4258j7474p5723J182O440Q7261
$$ 493445 540160 542769 437734 370062 351631 404375 468633 451159 375436 376618 383058 470319
6854D70319M8827j6163O1472l636n9206L096k1414j43291J77819K2137l4266l8028
$$ 470319 519146 502983 564455 560819 501613 504709 483295 340004 517823 539960 505694 467666
6842D67666m7493J24607r0146q1606M3636J2554l8497K261k4599K5128M5345j29021
$$ 467666 420173 544780 454634 373028 416664 429218 390721 392982 368383 393511 438856 309835
6830C09835n4323J24772O8678q070N8734K3847j01936j17709R7083M5658r3526
$$ 309835 255512 380284 448962 440892 499626 523473 421537 303828 400911 446569 353043
6819C53043L2717Q123k941p7550j3526J09464O5867q0951k7315K9717P7609j9071
$$ 353043 385760 393883 390942 313392 299866 409330 475197 394246 366931 396648 474257 455186
6807D55186l5895N7628R1219P418m5957J0785o2363l9145L8966M2753P4422n1186
$$ 455186 419291 476919 568138 575556 529599 540384 478021 438876 477842 520595 595017 543831
6795E43831L5325k8486r1328N9837O862J1558J4191l1522J44224L4604O7955j8025
$$ 543831 579156 550670 459342 519179 526041 537599 551790 520268 664492 699096 767051 749026
6783G49026m7288O9471j3579J122L90j15P3083J23438M7064J2040O8445Q0859
$$ 749026 701738 771209 757630 758752 759142 759027 832110 955548 1002612 1014652 1083097 1163956
6771A163956p6690j6288n7362L8971P3880L309r0431J42277R8307n6966K1101
$$ 1163956 1087266 1070978 1013616 1052587 1126467 1129776 1039345 1181622 1279929 1222963 1244064
6760A244064j0559O549m4315J22191Q5990n3548J9559k8174N5653J36486L6663
$$ 1244064 1233505 1240054 1195739 1317930 1403920 1350372 1369931 1341757 1397410 1533896 1570559
6749A570559Q5015p8588N2496J10385O0313P1080l0153l8701o4542q6620j21000
$$ 1570559 1655574 1576986 1629482 1739867 1800180 1871260 1841107 1802406 1737864 1651244 1530244
6738A530244O7568o7215p4838p00l7707q0687p0488Q7854j4402K5727Q5349M6295
$$ 1530244 1597812 1530597 1455759 1455059 1417352 1336665 1266177 1354031 1339629 1365356 1450705 1497000
6726A497000n7019m175J4736j56257M0511O7259R4870m3023M8605j8459o4534
$$ 1497000 1439981 1435806 1450542 1294285 1334796 1402055 1496925 1453902 1502507 1484048 1419514
6715A419514K9872l9598n7305m714n1109l4935Q0049N486l8970L303j35701m3902
$$ 1419514 1449386 1409788 1352483 1347769 1296660 1261725 1341774 1347260 1308290 1311593 1175892 1131990
6703A131990M5977n9853L6174p5170N3532J9154j7447q246N872j621r6963P0439
$$ 1131990 1177967 1118114 1154288 1079118 1132650 1151804 1134357 1126111 1131983 1130362 1033399 1103838
6691A103838P5703P3795M3862j36347q6375K074M1302O034m5086Q79N143N46M3970
$$ 1103838 1179541 1253336 1297198 1160851 1074476 1076550 1117852 1123886 1078800 1079679 1084822 1085368 1129338
6678A129338k013n6923k8053j7541N4983N0844n4629j5708n2949j8469P6396Q3
$$ 1129338 1127325 1070402 1042349 1024808 1079791 1130635 1076006 1060298 1007349 988880 1065276 1065359
6666A065359O1185j9900l5378o5826l1456J3607J31458p2360o6289J6520k7017
$$ 1065359 1126544 1106644 1071266 1005440 973984 987591 1119049 1046689 980400 996920 969903
6655I69903q7642J14781j2978R7294P9138l0296j22130l0566J8981j11259K1544
$$ 969903 882261 997042 984064 1081358 1160496 1130200 1008070 977504 996485 885226 906770
6644I06770K9920o7562r367K4123j8495P6675p4485l5413O9011K3600j24816k4391
$$ 906770 936690 869128 859761 883884 865389 942064 867579 832166 901177 924777 799961 775570
6632G75570o5235J19368O792J9492n5502j4386o8847N4489N2605n0045p1009L5254
$$ 775570 710335 829703 836495 855987 800485 786099 717252 771741 824346 774301 703292 738546
6620G38546o33P1444m4093l1733l2125K0977k6476l6609M4815O2044K1440o1105
$$ 738546 737913 809357 765264 733531 701406 722383 695907 659298 704113 766157 787597 726492
6608G26492k0404J7527N707Q2496n0648L9584l3685L2690q8753j5487p624q4507
$$ 726492 706088 723615 729322 811818 761170 800754 767069 799759 711006 695519 687895 603388
6596F03388R6838K774l2028l4372J6829m9063K6439M805N7176p1449l7708p3797
$$ 603388 700226 703000 670972 636600 653429 604366 630805 635610 692786 621337 583629 509832
6584E09832p4400M325N8706k2662M2736J24113k4316r117m3756N3032n5392p9599
$$ 509832 435432 439757 498463 475801 518537 642650 618334 609217 565461 618493 563101 483502
6572D83502j6590N1273R2139p4699J8927n0912q1382J26314L1281j03694J23545
$$ 483502 466912 518185 610324 535625 554552 503640 422258 548572 579853 476159 599704
6561E99704j7621L1110j2520O1291N3756o3572n906J22903M5978n7295r4090j1019
$$ 599704 582083 613193 600673 661964 715720 652148 646242 769145 815123 757828 663738 652719
6549F52719P4059m4826j2531M3055r2990k4194q7115P380M2478J4376P7163q463
$$ 652719 726778 681952 669421 712476 619486 595292 508177 515557 558035 572411 649574 641111
6537F41111p6119M6308J28861k2577m1540N4337j08986j4150N4851k5855j472
$$ 641111 564992 611300 740161 717584 676044 730381 621395 607245 662096 636241 634769
6526F34769M2764q3611k720P8272J9843j27847M6919O127L4937q1216J17124J01742
$$ 634769 677533 593922 591202 669474 689317 561470 608389 614516 649453 568237 685361 787103
6514G87103j95939m3704l1646K9734R999J6781m1811J19184n7565j6372k2200
$$ 787103 591164 547460 515814 545548 555547 572328 530517 649701 592136 575764 553564
6503E53564Q5656K9759j8478L7944L0501K1897m8717m8806o7850Q1910k8811L446
$$ 553564 639220 668979 650501 688445 718946 740843 692126 643320 575470 657380 628569 632015
6491F32015j26187P7333J19330o1911M7786J305K7609R385j1758p6537L9241M4402
$$ 632015 505828 583161 702491 640580 688366 689671 717280 726665 714907 638370 677611 722013
6479G22013p832K6383K8939m3859k2316J6961N8450o2630m2527n2505P3825O5783
$$ 722013 714181 740564 769503 725644 703328 720289 778739 716109 673582 621077 694902 760685
6467G60685l8049o518L3233j64425j22063J60626Q9966K5148m586M353l0655k4246
$$ 760685 722636 716118 749351 584926 462863 623489 713455 738603 734017 738370 707715 683469
6455F83469R590l9938p1397N1406J6213M3880L1628O1274O0668m7264k5775j0207
$$ 683469 693059 653121 581724 633130 649343 693223 724851 786125 846793 799529 773754 763547
6443G63547m8519j9469K934P649r18K6846K6587K4612o262o1517L7787q675J02962
$$ 763547 715028 695559 698493 706142 705224 732070 758657 783269 777007 715490 753277 744602 847564
6430H47564j30136k8291J4980R3944M3861q861j1689Q9167r2696j99J09570o3947
$$ 847564 717428 689137 704117 798061 841922 833061 821372 910539 817843 817644 927214 863267
6418H63267J03205o6487o7206k5519J7933J01248J14614P630k7295j6872o8981
$$ 863267 966472 899985 832779 807260 825193 926441 1041055 1048685 1021390 1004518 935537
6407I35537J4218P775j0109J18557n6436o5300Q7516k5941q2066K8444N1962Q8751
$$ 935537 949755 957530 947421 1065978 1009542 944242 1031758 1005817 923751 952195 1004157 1092908
6395A092908k0074p2959N7532J21092k441r4056L0412J1159p5471l4055R8490
$$ 1092908 1072834 999875 1057407 1178499 1176058 1082002 1112414 1123573 1048102 1014047 1112537
6384A112537O2330N74q248K2699L3852P2895p8781N0459N5324m3922l7775J9534
$$ 1112537 1174867 1175441 1167193 1189892 1223744 1296639 1217858 1268317 1323641 1279719 1241944 1261478
6372A261478L3154m924O8581J4691L6076p3016O2767p806Q6926L5813p5025N9654
$$ 1261478 1294632 1289708 1358289 1372980 1409056 1336040 1398807 1391001 1477927 1513740 1438715 1498369
6360A498369L2127Q0548L7901P3522o6847N2736O4802o2932J4324q3356J05330
$$ 1498369 1530496 1611044 1648945 1722467 1655620 1708356 1773158 1710226 1724550 1641194 1746524
6349A746524M7797P7742M7231r514n8414j3460N5056M6809N5905J12384K5059
$$ 1746524 1794321 1872063 1919294 1909780 1851366 1837906 1892962 1939771 1995676 2108060 2133119
6338B133119N2626M6903k2904k4932Q6917J7490p387M1557R9727O4249m3530P878
$$ 2133119 2185745 2232648 2209744 2184812 2271729 2289219 2281832 2323389 2423116 2487365 2443835 2451713
6326B451713J38443Q1043J4487L9844N5708J1485J08001Q2200J10791J8241M368
$$ 2451713 2590156 2671199 2685686 2725530 2781238 2792723 2900724 2982924 3093715 3111956 3116324
6315C116324J71923M0827J39345J7422r864L494J6105M3498J77385M9485K04271
$$ 3116324 3288247 3329074 3468419 3485841 3475977 3479471 3495576 3539074 3716459 3765944 3970215
6304C970215Q7557j0461R7198J83595J53505R8219O1031J12341J55030J78245
$$ 3970215 4057772 4047311 4144509 4328104 4481609 4579828 4640859 4753200 4908230 5086475
6294E086475K13458K6082N2494J76073K12969K34518K52808J84855K50965J24963
$$ 5086475 5299933 5326015 5378509 5554582 5767551 6002069 6254877 6439732 6690697 6815660
6284F815660J07862K88390K83443J77420J58463L18572L04142L55897K73347K41318
$$ 6815660 6923522 7211912 7495355 7672775 7831238 8149810 8453952 8809849 9083196 9324514
6274I324514L25576K08833K26656K34598K40252K99059L31891L05419K85311K81239
$$ 9324514 9650090 9858923 10085579 10320177 10560429 10859488 11191379 11496798 11782109 12063348
6264A2063348K65141J91675K59289L25624L78780K25139L28372L27593K47633
$$ 12063348 12328489 12520164 12779453 13105077 13483857 13708996 14037368 14364961 14612594
6255A4612594L07151L22524L57190L83520L93191K71360L25421K88409L45194
$$ 14612594 14919745 15242269 15599459 15982979 16376170 16647530 16972951 17261360 17606554
6246A7606554M32932K67911L32318J42785L43801L14520N08370L50504L20001
$$ 17606554 18039486 18307397 18639715 18782500 19126301 19440821 19949191 20299695 20619696
6237B0619696L51231K86321L82245M14282L19446L33951L66360M48845L34765
$$ 20619696 20970927 21257248 21639493 22053775 22373221 22707172 23073532 23522377 23857142
6228B3857142P7062M00251K65765K61246K78962J87206K19958J65130K5698J33616
$$ 23857142 23934204 24334455 24600220 24861466 25140428 25327634 25547592 25712722 25738420 25872036
6218B5872036J27946J94111N7848N7635J13302R8182K682J69925J6234P454J1611
$$ 25872036 25999982 26194093 26251941 26309576 26422878 26521060 26523742 26693667 26709901 26717355 26728966
6207B6728966O8435m6757J9977J96774p523j20406j3190n529J2356k5141M7624
$$ 26728966 26797401 26750644 26770621 26967395 26959872 26839466 26826276 26820747 26833103 26807962 26855586
6196B6855586j32626j36555p4360N1550R759k83694n8038j19121o3578j90450
$$ 26855586 26722960 26586405 26512045 26563595 26573354 26289660 26231622 26112501 26048923 25858473
6186B5858473j83840j29951k25396k58018k69304k37777k45786l33264l65235
$$ 25858473 25674633 25544682 25319286 25061268 24791964 24554187 24308401 23975137 23609902
6177B3609902l09381k72936k60107l88021m07735l86735k19665l64660l71942
$$ 23609902 23300521 23027585 22767478 22379457 21971722 21584987 21365322 21000662 20628720
6168B0628720l43606l50436m22751l21432l31807l47102l92924k84658k41828
$$ 20628720 20285114 19934678 19511927 19190495 18858688 18511586 18118662 17834004 17592176
6159A7592176l59164m63681k91409k84812l09502k26311m49713k97118k51921
$$ 17592176 17233012 16769331 16477922 16193110 15883608 15657297 15207584 14910466 14658545
6150A4658545k54447l33421k39532l00296l18683k89885k86327l07385j90408
$$ 14658545 14404098 14070677 13831145 13530849 13212166 12922281 12635954 12328569 12138161
6141A2138161k84343l61058k36505k87449l31897j70082l11664l38949k24682
$$ 12138161 11853818 11492760 11256255 10968806 10636909 10466827 10155163 9816214 9591532
6132I591532k43721l55785k40804k56423k56965k54394k91388k02166k33061l08954
$$ 9591532 9347811 8992026 8751222 8494799 8237834 7983440 7692052 7489886 7256825 6947871
6122F947871j50145j71114k59811j76873j68714j74002j15890j11794j01566j33121
$$ 6947871 6797726 6626612 6366801 6189928 6021214 5847212 5731322 5619528 5517962 5384841
6112E384841k13571o9165q0395j32452n1915j80163j73009n6210l8856m8694j23926
$$ 5384841 5171270 5102105 5021710 4889258 4837343 4657180 4484171 4427961 4389105 4340411 4216485
6101D216485j42701L9626j74637q5778m8973J0974j05981j36585k6824j21373
$$ 4216485 4073784 4113410 3938773 3852995 3804022 3814996 3709015 3572430 3545606 3424233
6091C424233Q2654L2810k20166l9127M2018O784j59636m3911O9409j20822K9831
$$ 3424233 3506887 3539697 3319531 3280404 3322422 3329206 3169570 3125659 3195068 3074246 3104077
6080C104077m7790r406k465r2458m1581k9539j25614k6603J4290M2168q7186l6063
$$ 3104077 3056287 3046881 3044416 2951958 2910377 2880838 2755224 2728621 2742911 2785079 2697893 2661830
6068B661830j3302n8269L3772O3241q4234o2268R372k8587K042M9882P2658p1551
$$ 2661830 2648528 2590259 2624031 2687272 2603038 2540770 2550142 2521555 2523597 2573479 2646137 2574586
6056B574586q6943M9765q90n3837N2236P168j03583k1767P1119Q7495j0262q8044
$$ 2574586 2487643 2537408 2536518 2482681 2534917 2542085 2438502 2416735 2487854 2575349 2565087 2477043
6044B477043p1244L5051K8790o0580O227M1510M5670m7487r5283R3284O6248O8705
$$ 2477043 2405799 2440850 2469640 2409060 2415287 2456797 2502467 2454980 2359697 2452981 2519229 2587934
6032B587934K8641l8571Q0701P4193p3298N6828l8686J03288m2796j01319l1621
$$ 2587934 2616575 2578004 2658705 2732898 2659600 2716428 2677742 2781030 2738234 2636915 2605294
6021B605294Q1082K03493j5077M0686Q3408R826K6256Q9199Q4837K7024O8913
$$ 2605294 2686376 2889869 2874792 2915478 2998886 3008712 3034968 3124167 3209004 3236028 3304941
6010C304941J81985O0118O6166M168j2637m0681J86273J93078L2419K3638P6815
$$ 3304941 3486926 3547044 3613210 3617378 3604741 3564060 3750333 3943411 3975830 3999468 4076283
5999D076283J19334Q4628J62348J09458J34109J16829R1728K06756J11583J00195
$$ 4076283 4195617 4280245 4442593 4552051 4686160 4802989 4894717 5101473 5213056 5313251
5989E313251J77296J78283J28045K50131J66647J77720K36304K43680L90323M42414
$$ 5313251 5490547 5668830 5796875 6047006 6213653 6391373 6627677 6871357 7261680 7704094
5979G704094M60710M37135M71385N09499N38855O45329O86874P52326Q76670R04788
$$ 7704094 8164804 8601939 9073324 9582823 10121678 10767007 11453881 12206207 13082877 13987665
5969A3987665Q57572Q41246P87738Q12662R57750Q19154Q48249R11883Q60491
$$ 13987665 14845237 15686483 16474221 17286883 18244633 19063787 19912036 20823919 21684410
5960B1684410P58670O49012M68499M15899M29032M03555M20108K77590J40298
$$ 21684410 22443080 23092092 23560591 23976490 24405522 24809077 25229185 25506775 25647073
5951B5647073l5035l77389n40834m86343n60456n33407m56228n63606o50302q71256
$$ 25647073 25612038 25234649 24693815 24207472 23647016 23113609 22657381 22093775 21443473 20572217
5941B0572217q61518r64931r41610q75273p22484o47389p69725p98305p55918
$$ 20572217 19710699 18745768 17804158 16928885 16206401 15559012 14789287 13990982 13235064
5932A3235064p43031p65982q68901o59897n36809n93974m17911m32891m19590
$$ 13235064 12492033 11726051 10857150 10197253 9660444 9066470 8648559 8215668 7796078
5923G796078k68869l95761l46209j59682k22126k04109k14059j83948j37855j09211
$$ 7796078 7527209 7131448 6785239 6625557 6403431 6199322 5985263 5801315 5663460 5554249
5913E554249j60311j86985k4412q6428o8116n4868o6427j7676j10631r6284q6930
$$ 5554249 5393938 5206953 5182541 5096113 5027997 4973129 4906702 4889026 4778395 4682111 4595181
5902D595181K3659q1452K3575K0287L1372n9337o8016j44081m8104j4474q7125
$$ 4595181 4618840 4537388 4560963 4581250 4612622 4553285 4485269 4341188 4293084 4278610 4191485
5891D191485K1497n6105j09161P126l6966L830L1899r0952L7595j32957m6811
$$ 4191485 4212982 4156877 4047716 4054842 4017876 4021706 4053605 3962653 4000248 3867291 3820480
5880C820480J31091N22m9174O9262M997m7658m0565j25644N7500O788L075j44600
$$ 3820480 3951571 3952093 3902919 3972181 3977178 3929520 3888955 3763311 3820811 3827599 3830674 3686074
5868C686074k2786L5305j6858N3108m8183q8876K5537R7600k7868m7732n3764
$$ 3686074 3663288 3698593 3681735 3734843 3686660 3597784 3623321 3720921 3693053 3645321 3591557
5857C591557R182J10635p724n9842R8424J46647k6367O1034Q8780J21491J04986
$$ 3591557 3600739 3711374 3703650 3643808 3742232 3888879 3862512 3923546 4012326 4133817 4238803
5846D238803j8041J06908j12774o8857L4633k0824p8973L7534q1762j7227P9209
$$ 4238803 4220762 4327670 4214896 4146039 4180672 4159848 4080875 4118409 4036647 4019420 4098629
5835D098629r5182j9203J4051l2862p5170J4402L8569N5444o3597k4807n3462
$$ 4098629 4003447 3984244 3998295 3965433 3890263 3904665 3943234 3998678 3935081 3910274 3856812
5824C856812k6923M462J8807m4658M0839o6558L344M017J7676j16935j02821J9061
$$ 3856812 3829889 3834351 3853158 3808500 3849339 3782781 3786125 3790142 3807818 3690883 3588062 3607123
5812C607123J5535J1044k8486j8425J21283R161k5708J13864q7341m0581J32046
$$ 3607123 3622658 3633702 3605216 3586791 3708074 3717235 3691527 3805391 3718050 3677469 3809515
5801C809515J01125L881N3851M7286M8865R1952J00407l6064J13076J24640J87480
$$ 3809515 3910640 3914521 3968372 4015658 4064523 4156475 4256882 4220818 4333894 4458534 4646014
5790D646014r0450N4330J03537J61749R1471Q8565K58005K22660N9667J93262
$$ 4646014 4555564 4609894 4713431 4875180 4966651 5055216 5313221 5535881 5595548 5788810
5780E788810K06605J67404L14118L26769K98542L70806M39722M28048L68113N19369
$$ 5788810 5995415 6162819 6476937 6803706 7102248 7473054 7912776 8340824 8708937 9228306
5770I228306M34573K90857K00572R7414k3904j00092l35431l18987l39605l99394
$$ 9228306 9662879 9953736 10154308 10251722 10227818 10127726 9792295 9473308 9133703 8734309
5760H734309k90814k74591j60227j77185j80240q8519q2477L062J4534O8271k2801
$$ 8734309 8443495 8168904 8008677 7831492 7651252 7562733 7480256 7483318 7497852 7566123 7543322
5749G543322j37755R277J4014l1232M4865J200m4825m7213J9930Q1665N0598J6274
$$ 7543322 7405567 7414844 7428858 7397626 7442491 7443691 7398866 7351653 7371583 7453248 7503846 7520120
5737G520120R8670O2670L7336R8611J3076N3747J18186q700L6731K29329M1089
$$ 7520120 7618790 7681460 7718796 7817407 7830483 7884230 8002416 7993716 8030447 8259776 8300865
5726H300865J66042Q8525M3440J6254J35823K22965K36006J32475Q5805J88421
$$ 8300865 8466907 8555432 8598872 8615126 8750949 8973914 9209920 9342395 9428200 9616621
5716I616621J98704J27469K17855J37831J12158K70926K55656K16280J85867K46028
$$ 9616621 9815325 9942794 10160649 10298480 10410638 10681564 10937220 11153500 11339367 11585395
5706A1585395K88612L08668L70180K64038K51856L09310L84263K52707M05761
$$ 11585395 11874007 12182675 12552855 12816893 13068749 13378059 13762322 14015029 14420790
5697A4420790L45706M38884L32006L53223L37079M04398L60994L90917N38003
$$ 14420790 14766496 15205380 15537386 15890609 16227688 16632086 16993080 17383997 17922000
5688A7922000L50830L99801N23505N32007O19038P20749P06626P04551P50656
$$ 17922000 18272830 18672631 19196136 19728143 20347181 21067930 21774556 22479107 23229763
5679B3229763P76663Q44933Q43857Q59833J051663J347167J215783J388592J397741
$$ 23229763 24006426 24851359 25695216 26555049 27606712 28953879 30169662 31558254 32955995
5670C2955995J491437J842831J765709K001359K190201K354918K550329K864905
$$ 32955995 34447432 36290263 38055972 40057331 42247532 44602450 47152779 50017684
5662E0017684L070182L459835L721030M268286M694999N172178N823072O586766
$$ 50017684 53087866 56547701 60268731 64537017 69232016 74404194 80227266 86814032
5654H6814032P274575Q055611Q829904R287025R359988Q969460Q081818O188389
$$ 86814032 94088607 102144218 110974122 120261147 129621135 138590595 146672413 152860802
5646A52860802L297287k41727l843117o707925q566181r202728q876114q230916
$$ 152860802 156158089 155916362 152073245 145365320 136799139 127596411 118720297 110489381
5638A10489381p329356o438409n730246m922366m270974l843160l398153l000420
$$ 110489381 103160025 96721616 90991370 86069004 81798030 77954870 74556717 71556297
5630G1556297k802179k331663k121158j943845j656467j511754j452515j391311
$$ 71556297 68754118 66422455 64301297 62357452 60700985 59189231 57736716 56345405
5622E6345405j127802r86115r79514r38246q96601p59565o71330p48709p95948
$$ 56345405 55217603 54231488 53251974 52313728 51417127 50657562 49986232 49237523 48441575
5613D8441575q78336q68811o79714p56624o33607o17183o81685o72069n75363
$$ 48441575 47563239 46694428 46014714 45258090 44624483 44007300 43325615 42653546 42078183
5604D2078183o09946p45331n79915n89261o35066n92607o47017n13391n24597
$$ 42078183 41468237 40722906 40142991 39553730 38918664 38326057 37679040 37165649 36641052
5595C6641052m52549n21029m35013k82971m34196l13667l20620j02556q1513q4990
$$ 36641052 36188503 35667474 35232461 34949490 34515294 34201627 33881007 33778451 33696938 33611948
5585C3611948M8042J64446K31183K14599L92570N41891O40394Q06771J023752
$$ 33611948 33659990 33824436 34055619 34270218 34662788 35204679 35845073 36651844 37675596
5576C7675596J133197J351616J615086J954820K224157K621173L106348L537978
$$ 37675596 38808793 40160409 41775495 43730315 45954472 48575645 51681993 55219971
5568E5219971M205488N102201O393374P500565Q185509Q546167Q734155Q421116
$$ 55219971 59425459 64527660 70921034 78421599 86607108 95153275 103887430 112308546
5560A12308546O851019L067880k916928q528888j0817473j1133652j0505411q862575
$$ 112308546 119159565 122227445 119310517 110781629 99964156 88830504 78325093 69462518
5552F9462518p240722n853713m986710m268507l764455l345815k716866k605124
$$ 69462518 62221796 56368083 51381373 47112866 43348411 40002596 37285730 34680606
5544C4680606k121534j786922j708642j618919j479603j269298j087481j094340
$$ 34680606 32559072 30772150 29063508 27444589 25964986 24695688 23608207 22513867
5536B2513867q63191q50338q21931p73646o20426o44152p14920n63971m61317
$$ 22513867 21650676 20800338 19978407 19204761 18584335 17940183 17225263 16661292 16199975
5527A6199975l70210m48065m13514l20581l43364m75211m71180m05380l96078
$$ 16199975 15829765 15381700 14968186 14647605 14304241 13829030 13357850 12952470 12556392
5518A2556392l55869k59883m03335l16223j80120k61575k28501j42850k50489
$$ 12556392 12200523 11940640 11537305 11221082 11040962 10779387 10550886 10408036 10157547
5509A0157547l62003k64663q9706j69991j96002j64075j59998k08790j58717j51818
$$ 10157547 9795544 9530881 9441175 9271184 9075182 8911107 8751109 8542319 8383602 8231784
5499H231784j71460j77260j29124o1212m5273j95364j23222j67297q8120j51538
$$ 8231784 8060324 7883064 7753940 7692728 7647455 7452091 7328869 7161572 7073452 6921914
5489F921914n100q3590j24572p7005J6290q3128m1324m0518l9162j58666r7234
$$ 6921914 6916814 6833224 6708652 6631647 6647937 6564809 6523485 6482967 6443805 6285139 6187905
5478F187905r568l7207k43523n2967j5041j0081r3831r2597j4569j51355j9381
$$ 6187905 6178337 6141130 5897607 5844640 5829599 5819518 5725687 5633090 5618521 5467166 5447785
5467E447785q2858M1053p2806j8909p6254L3697q9152q1221k9149L8520j36685
$$ 5447785 5364927 5405980 5333174 5314265 5238011 5271708 5182556 5101335 5072186 5110706 4974021
5456D974021k7634l2158O9743K4633M2259P713j07954j41172j8929k1813o8131
$$ 4974021 4946387 4914229 4983972 5008605 5050864 5058577 4950623 4809451 4790522 4768709 4700578
5445D700578M0461Q7677L1960L8427J01306k3933k02657k6293J10750M1222m2852
$$ 4700578 4741039 4828716 4860676 4899103 5000409 4976476 4773819 4747526 4858276 4899498 4856646
5434D856646J2500L7096r2594L0716M1399J04217j9549N4094M3116m0091k7372
$$ 4856646 4869146 4906242 4813648 4844364 4885763 4989980 4970431 5024525 5067641 5027550 5000178
5423E000178Q9871L6444q3328P1475N8538n530o2831J36296J61233n3618l1489
$$ 5000178 5090049 5126493 5043165 5114640 5173178 5167648 5104817 5241113 5402346 5348728 5317239
5412E317239N1245m581K4319J32055J69047J11616L7887Q4493l5849j2929O4363
$$ 5317239 5368484 5363903 5388222 5520277 5689324 5800940 5838827 5923320 5887471 5874542 5938905
5401E938905Q7444J45115j02965K1843J01304m1350O3440R8003J12753k3242J26809
$$ 5938905 6026349 6171464 6068499 6090342 6191646 6150296 6213736 6311739 6424492 6401250 6528059
5390F528059J94948o778P3898O5886J39452J48948P3496K3921Q9288J45356J01879
$$ 6528059 6723007 6716229 6790127 6856013 6995465 7144413 7217909 7241830 7331118 7476474 7578353
5379G578353J33573J02884J76272J62783K8228N1277K58046K11803J35167K07754
$$ 7578353 7711926 7814810 7991082 8153865 8182093 8233370 8491416 8703219 8838386 9046140
5369I046140K02502J55059J37019J64503J90174J81838J99103K11710L32831K86056
$$ 9046140 9248642 9403701 9540720 9705223 9895397 10077235 10276338 10488048 10820879 11106935
5359A1106935J53478K44611K32187K70795K66267K68580J96284K63982K58922
$$ 11106935 11260413 11505024 11737211 12008006 12274273 12542853 12739137 13003119 13262041
5350A3262041K33736L14244L39723L36419L49018K85372L01810K97049L71844
$$ 13262041 13495777 13810021 14149744 14486163 14835181 15120553 15422363 15719412 16091256
5341A6091256M15933M08256M35900M72987L83621K27126L91131M43307M68561
$$ 16091256 16507189 16915445 17351345 17824332 18207953 18435079 18826210 19269517 19738078
5332A9738078M48054K97988L57813M43892M21833M71890M36661N63170N24441
$$ 19738078 20186132 20484120 20841933 21285825 21707658 22179548 22616209 23179379 23703820
5323B3703820N27656N86609O92297O48764P41449P37277Q09882Q17419R38136
$$ 23703820 24231476 24818085 25510382 26159146 26900595 27637872 28447754 29265173 30203309
5314C0203309Q87977J026227R16333J021504R82855Q69034R70339J045933R26938
$$ 30203309 31091286 32117513 33033846 34055350 35038205 35907239 36877578 37923511 38850449
5305C8850449Q26074P88947P07734Q31171P03619O81279P07136O40864P42729
$$ 38850449 39676523 40465470 41173204 42004375 42707994 43389273 44096409 44737273 45480002
5296D5480002P70978P51766P71159R18597R92266R44062J055469J213221J291843
$$ 45480002 46250980 47002746 47773905 48692502 49684768 50628830 51684299 52897520 54189363
5287E4189363J378072J421019J372485J576908J544374J829635J828968J825238
$$ 54189363 55567435 56988454 58360939 59937847 61482221 63311856 65140824 66966062
5279F6966062J710733J900750J882495J886753J958180J784439J884942J906429
$$ 66966062 68676795 70577545 72460040 74346793 76304973 78089412 79974354 81880783
5271H1880783J828737J707064J786710J846753J758812J738002J643357J558483
$$ 81880783 83709520 85416584 87203294 89050047 90808859 92546861 94190218 95748701
5263I5748701J469971J485396J317580J049670R92939Q52199P07631N96648M69841
$$ 95748701 97218672 98704068 100021648 101071318 102064257 102916456 103624087 104220735 104690576
5254A04690576L97360J78636J11377O6984N1062j55524j91934l08924m64780o35823
$$ 104690576 105087936 105266572 105377949 105444933 105495995 105340471 105148537 104839613 104374833 103739010
5244A03739010p92598r19061j176924j313004j520440j572368j680898j881799
$$ 103739010 102946412 102027351 100850427 99537423 98016983 96444615 94763717 92881918
5236I2881918j921543j909088k131921k187622k069598k074066k094391k013274
$$ 92881918 90960375 89051287 86919366 84731744 82662146 80588080 78493689 76480415
5228G6480415j931369j935799j830918j711134j531075j576408j437717j157408
$$ 76480415 74549046 72613247 70782329 69071195 67540120 65963712 64525995 63368587
5220F3368587j215870j062547j087802j067932r33449q35061q16923p29597o44364
$$ 63368587 62152717 61090170 60002368 58934436 58000987 57165926 56349003 55619406 54975042
5211E4975042p32026o84902p51842p55669p98550p79203q16010r09680q63671
$$ 54975042 54243016 53558114 52806272 52050603 51252053 50472850 49656840 48747160 47883489
5202D7883489r38156r41144q72267q58556r32859q87348j000488q31297p76714
$$ 47883489 46945333 46004189 45131922 44273366 43340507 42453159 41452671 40621374 39844660
5193C9844660q27159p35833p51270r05100o84051o38694n34300o50783n82276
$$ 39844660 39017501 38281668 37530398 36625298 35941247 35302553 34768253 34117470 33535194
5184C3535194m10247n21039m85329n32496m99407m81669l25423l96395l34860
$$ 33535194 33124947 32603908 32118579 31586083 31086676 30605007 30279584 29883189 29548329
5175B9548329k96116l41950l26593j93592l87508k68751j94540k51420k77235
$$ 29548329 29252213 28910263 28583670 28390078 28002570 27733819 27539279 27287859 27010624
5166B7010624l06792k96888j80774j74399k82538k23078j39464k21995j57792
$$ 27010624 26703832 26406944 26226170 26051771 25769233 25546155 25406691 25184696 25026904
5157B5026904j24682p6800j28361n8064N3529m6282O9995L4018J53070J78066
$$ 25026904 24902222 24825422 24697061 24638997 24692526 24646244 24716239 24750257 24903327 25081393
5147B5081393P0811K06747K41044J62653K65597L34575M28036L56174L38685L34278
$$ 25081393 25152204 25358951 25599995 25762648 26028245 26362820 26790856 27147030 27485715 27819993
5137B7819993M06133K72944K28999M07685J94527J15693J63141J42928J82832
$$ 27819993 28226126 28499070 28728069 29135754 29330281 29445974 29609115 29752043 29934875
5128B9934875R83M4532J82878J19525P0166J19368J37627L05547L66630K06140
$$ 29934875 29935858 29980390 30163268 30282793 30352959 30472327 30609954 30915501 31282131 31488271
5118C1488271N25276N16004N25841N13120M93497O90929O61268P84769Q99759
$$ 31488271 32013547 32529551 33055392 33568512 34062009 34752938 35414206 36198975 37098734
5109C7098734R32541R53797J107089J225813J373707J298041J362278J574475
$$ 37098734 38031275 38985072 40092161 41317974 42691681 43989722 45352000 46926475
5101D6926475J789801J782463K031037K066585K159426K429879K562252K603989
$$ 46926475 48716276 50498739 52529776 54596361 56755787 59185666 61747918 64351907
5093F4351907K747028K884802L018399L116317L188172L269355L219968L130337
$$ 64351907 67098935 69983737 73002136 76118453 79306625 82575980 85795948 88926285
$$ [...]
##END NTUPLES=NMR SPECTRUM
##END=
