##TITLE=1H_EC-3263(3)
 CDCl3,8 sc, 
 24.9.2021
##JCAMPDX= 6.0         $$ Bruker NMR JCAMP-DX V2.0
##DATA TYPE= NMR SPECTRUM
##DATA CLASS= NTUPLES
##ORIGIN= UXNMR, Bruker Analytische Messtechnik GmbH
##OWNER= root
$$ XWIN-NMR		Version 3.5
$$ Fri Sep 24 09:53:51 2021 Russian Standard Time (UT+4h)  she@DPX200
##.OBSERVE FREQUENCY= 200.1314
##.OBSERVE NUCLEUS= ^1H
##.ACQUISITION MODE= SIMULTANEOUS
##.ACQUISITION SCHEME= undefined
##.AVERAGES= 8
##.DIGITISER RES= 18
##SPECTROMETER/DATA SYSTEM= spect
##.PULSE SEQUENCE= zg30
##.SOLVENT NAME= CDCl3
##.SHIFT REFERENCE= (INTERNAL, CDCl3, 0, 16.979)
##AUDIT TRAIL= $$ (NUMBER, WHEN, WHO, WHERE, WHAT)
$$ ##TITLE= Audit trail, XWIN-NMR		Version 3.5
$$ ##JCAMPDX= 5.01
$$ ##ORIGIN= Bruker BioSpin GmbH
$$ ##OWNER= she
$$ F:/spectra/data/she/nmr/H-F/1/pdata/1/auditp.txt
$$ ##AUDIT TRAIL=  $$ (NUMBER, WHEN, WHO, WHERE, WHAT)
(   1,<2021-09-24 09:52:29.95 +0400>,<she>,<DPX200>,
      <created by zg, POWCHK disabled, PULCHK disabled
       configuration hash MD5:
       00 E9 B6 7A A2 85 ED C7 34 08 36 98 17 FE 4E 26
       data hash MD5: 16K
       83 5C 7C 78 46 B6 56 16 9C 2B F5 77 7C FF C0 65>)
(   2,<2021-09-24 09:52:33.07 +0400>,<she>,<DPX200>,
      <Start of raw data processing
       efp BC_mod = 2 LB = 0.24 FT_mod = 6 PKNL = 1 PHC0 = -14076.38 PHC1 = 12.00088 SI = 16K 
       data hash MD5: 16K
       4C BA F2 44 A9 C4 E9 51 7C C4 50 90 69 4B 0A 34>)
(   3,<2021-09-24 09:52:53.93 +0400>,<she>,<DPX200>,
      <pk PHC0 = -0.9500826 PHC1 = 1.2 
       data hash MD5: 16K
       A4 6A 75 DB 5A FD CE AC E5 04 A5 0E F9 2C D2 8F>)
(   4,<2021-09-24 09:52:57.25 +0400>,<she>,<DPX200>,
      <abs ABSG = 5 
       data hash MD5: 16K
       EB 7C B1 A9 27 8A 65 15 E1 B0 02 73 79 1F 97 FE>)
$$ ##END=
$$ 
$$ hash MD5
$$ 9B 76 78 4C B1 77 1A A0 39 C6 B7 86 6E EC 31 24
##$RELAX= 
##$RELAX= 
##$RELAX= 
##$RELAX= 
##$RELAX= 
##$RELAX= 
$$ Bruker specific parameters
$$ --------------------------
##$DU= <F:/spectra>
##$EXPNO= 1
##$NAME= <H-F>
##$PROCNO= 1
##$TYPE= <nmr>
##$USER= <she>
##$AMP= (0..31)
100 100 100 100 100 100 100 100 100 100 100 100 100 100 100 100 100 100 
100 100 100 100 100 100 100 100 100 100 100 100 100 100 
##$AQSEQ= 0
##$AQ_mod= 1
##$AUNM= <au_zg>
##$AUTOPOS= <>
##$BF1= 200.13
##$BF2= 200.13
##$BF3= 200.13
##$BF4= 200.13
##$BF5= 200.13
##$BF6= 200.13
##$BF7= 200.13
##$BF8= 200.13
##$BYTORDA= 1
##$CFDGTYP= 0
##$CFRGTYP= 5
##$CHEMSTR= <none>
##$CNST= (0..31)
1 1 145 1 1 1 1 1 1 1 1 1 1 1 1 1 1 1 1 1 1 1 1 1 1 1 1 1 1 1 1 1 
##$CPDPRG= <>
##$CPDPRG1= <>
##$CPDPRG2= <>
##$CPDPRG3= <>
##$CPDPRG4= <mlev>
##$CPDPRG5= <mlev>
##$CPDPRG6= <mlev>
##$CPDPRG7= <mlev>
##$CPDPRG8= <mlev>
##$CPDPRGB= <>
##$CPDPRGT= <>
##$D= (0..31)
0 1.2 0 0 0 0 0 0 0 0.06 0 0.03 0 0 0 0 0.0002 0 0 0 0 0 0 0 0 0 0 0 0 
0 0 0 
##$DATE= 1632462749
##$DBL= (0..7)
120 120 120 120 120 120 120 120 
##$DBP= (0..7)
150 150 150 150 150 150 150 150 
##$DBP07= 0
##$DBPNAM0= <>
##$DBPNAM1= <>
##$DBPNAM2= <>
##$DBPNAM3= <>
##$DBPNAM4= <>
$$ [...]
##$SUBNAM3= <"">
##$SUBNAM4= <"">
##$SUBNAM5= <"">
##$SUBNAM6= <"">
##$SUBNAM7= <"">
##$SUBNAM8= <"">
##$SUBNAM9= <"">
##$SW= 20.0188988654967
##$SWIBOX= (0..15)
0 0 2 0 0 0 0 0 0 0 0 0 0 0 0 0 
##$SW_h= 4006.41025641026
##$TD= 16384
##$TD0= 1
##$TE= 0
##$TE2= 300
##$TE3= 300
##$TEG= 300
##$TL= (0..7)
0 120 120 120 120 120 120 120 
##$TP= (0..7)
150 150 150 150 150 150 150 150 
##$TP07= 0
##$TPNAME0= <>
##$TPNAME1= <>
##$TPNAME2= <>
##$TPNAME3= <>
##$TPNAME4= <>
##$TPNAME5= <>
##$TPNAME6= <>
##$TPNAME7= <>
##$TPOAL= (0..7)
0.5 0.5 0.5 0.5 0.5 0.5 0.5 0.5 
##$TPOFFS= (0..7)
0 0 0 0 0 0 0 0 
##$TUNHIN= 0
##$TUNHOUT= 0
##$TUNXOUT= 0
##$USERA1= <user>
##$USERA2= <user>
##$USERA3= <user>
##$USERA4= <user>
##$USERA5= <user>
##$V9= 5
##$VALIST= <valist>
##$VCLIST= <CCCCCCCCCCCCCCC>
##$VD= 0
##$VDLIST= <DDDDDDDDDDDDDDD>
##$VPLIST= <PPPPPPPPPPPPPPP>
##$VTLIST= <TTTTTTTTTTTTTTT>
##$WBST= 1024
##$WBSW= 4
##$XGAIN= (0..3)
0 0 0 0 
##$XL= 0
##$YL= 0
##$YMAX_a= 259073
##$YMIN_a= -368037
##$ZGOPTNS= <>
##$ZL1= 120
##$ZL2= 120
##$ZL3= 120
##$ZL4= 120
##$ABSF1= 16.97659
##$ABSF2= -3.04245
##$ABSG= 5
##$ABSL= 3
##$ALPHA= 0
##$AQORDER= 0
##$ASSFAC= 0
##$ASSFACI= 0
##$ASSFACX= 0
##$ASSWID= 0
##$AUNMP= <proc_1d>
##$AZFE= 0.1
##$AZFW= 0.1
##$BCFW= 0
##$BC_mod= 2
##$BYTORDP= 0
##$COROFFS= 0
##$CY= -3
##$DATMOD= 1
##$DC= 0
##$DFILT= <>
##$DTYPP= 0
##$F1P= 0
##$F2P= 0
##$FCOR= 1
##$FTSIZE= 16384
##$FT_mod= 6
##$GAMMA= 0
##$GB= 0
##$INTBC= 1
##$INTSCL= 1.334414e-10
##$ISEN= 128
##$LB= 0.24
##$LEV0= 0
##$LPBIN= 0
##$MAXI= 10000
##$MC2= 0
##$MEAN= 0
##$ME_mod= 0
##$MI= 1.114404
##$NCOEF= 0
##$NC_proc= -7
##$NLEV= 6
##$NOISF1= 3.799351
##$NOISF2= 2.8
##$NSP= 0
##$NTH_PI= 0
##$NZP= 0
##$OFFSET= 16.97904
##$PC= 1
##$PHC0= -14077.33
##$PHC1= 13.20088
##$PH_mod= 1
##$PKNL= yes
##$PPARMOD= 0
##$PSCAL= 0
##$PSIGN= 0
##$REVERSE= no
##$SF= 200.130005189921
##$SI= 16384
##$SIGF1= 3
##$SIGF2= 2
##$SINO= 5.538805
##$SIOLD= 16384
##$SREGLST= <1H.CDCl3>
##$SSB= 0
##$STSI= 16384
##$STSR= 0
##$SW_p= 4006.41025641027
##$SYMM= 0
##$S_DEV= 0
##$TDeff= 16384
##$TDoff= 0
##$TI= <>
##$TILT= no
##$TM1= 0
##$TM2= 0
##$TOPLEV= 0
##$USERP1= <user>
##$USERP2= <user>
##$USERP3= <user>
##$USERP4= <user>
##$USERP5= <user>
##$WDW= 1
##$XDIM= 16384
##$YMAX_p= 444602619
##$YMIN_p= -641423
$$ End of Bruker specific parameters
$$ ---------------------------------
##NTUPLES= NMR SPECTRUM
##VAR_NAME=  FREQUENCY,     SPECTRUM/REAL,   SPECTRUM/IMAG
##SYMBOL=    X,             R,               I
##VAR_TYPE=  INDEPENDENT,   DEPENDENT,       DEPENDENT
##VAR_FORM=  AFFN,          ASDF,            ASDF
##VAR_DIM=   16384,         16384,           16384
##UNITS=     HZ,            ARBITRARY UNITS, ARBITRARY UNITS
##FACTOR=    0.244546801953871, 1,           1
##FIRST=     3398.01539251365, 0,            0
##LAST=      -608.394863896624, 0,           0
##MIN=       -608.394863896624, -641423,     0
##MAX=       3398.01539251365, 444602619,    0
$$ Real data points
##PAGE= N=1
##DATA TABLE= (X++(R..R)), XYDATA
$$ [...]
8290 2655640 2682525 2788198 2599836 2360219 2339839 2412974 2153023 2210029 2122217 1975755
8280 1975755 1986539 1825132 1754407 1826409 1851472 1847696 1732136 1800864 1633306 1514874 1684560
8269 1684560 1634049 1405757 1575899 1719747 1399449 1458452 1536611 1504635 1484001 1452359 1429340
8258 1429340 1401999 1100110 1183156 1096253 1229219 1188996 1025457 1129710 1272111 1135383
8248 1135383 1096264 953752 1130456 1142375 1084702 983658 1028176 1065984 1092114 995895 930599
8237 930599 937970 781859 926954 830813 791131 750830 941790 1010309 941859 912816 810800
8226 810800 633051 852849 652880 557844 601896 525292 672048 713644 605336 799825
8216 799825 726654 746310 729090 738927 919606 757737 774212 847696 834436 786358 567707
8205 567707 514671 411622 264685 279033 226585 500619 389530 450204 356091 248880 64089
8194 64089 -39972 -188622 1230915 1185242 355454 483313 445302 518476 485627 422785 190104
8183 190104 427171 312209 334873 213071 470225 746687 473271 211702 229066 164617
8173 164617 188056 217642 211018 185374 341965 420901 421859 411596 341194 187514 247177 525875
8161 525875 533345 393504 249787 122174 51648 187689 133070 243049 148347 -31101 7568
8150 7568 20633 216317 233729 139652 213698 308643 309465 184562 132912 67580 -20535 20091
8138 20091 188732 138187 26577 11189 36854 90865 -97003 79523 183731 99647 239376
8127 239376 86455 156864 34091 -8566 15993 -60676 45206 129981 38064 82569 -63708
8116 -63708 -39675 169457 252163 160980 70939 -55192 -112717 110917 246791 133780 21563
8105 21563 264244 256483 157902 61313 14900 111365 107382 186630 90894 165776 105167 161787
8093 161787 344718 -42095 202831 196377 -32134 70262 110536 61393 103287 -123864 115201
8082 115201 229092 162681 128620 360592 157662 28336 -28894 -155107 -63671 53905
8072 53905 222255 206589 240260 271339 378224 429155 350331 301537 203611 10117 245626
8061 245626 336312 250664 178593 80674 35252 187470 468591 290997 185886 226500 173411
8050 173411 48186 44961 183088 283228 116806 16193 -37684 -131131 -4301 -6383 61109
8039 61109 -156235 -108025 -168678 198528 422995 40949 -133234 -68279 -49468 -53868 110147
8028 110147 161831 72823 13951 124201 111011 -24964 -134525 -86253 89724 102170 299756
8017 299756 254190 231659 448306 554663 653793 647844 467916 532737 502779 411184 174022
8006 174022 121687 229639 341866 417019 329279 330295 215416 121011 88489 195923 188148
7995 188148 34313 111355 322062 263670 255634 140730 -71355 -153995 -332572 -265234 18509
7984 18509 60198 -26886 -72344 45189 -214232 -196652 -118141 50685 -3212 -8865 -23290
7973 -23290 -238712 -176663 -173362 -197905 -244679 -44116 -46467 -178364 -106188 1757 -92119
7962 -92119 -43492 -85120 -335348 -61349 -131130 -12317 -131263 -333297 -149877 84562
7952 84562 203848 148784 -42443 75675 -78418 -194891 -117925 -118547 -207248 -296052 -26895
7941 -26895 -58833 -174547 -166127 43487 -201417 -108967 -81032 -352324 -346832 -172234 -115961
7930 -115961 -171143 -1222 -133792 -199749 -163309 -189223 -155349 -72972 67724 -270631 -513114
7919 -513114 -268168 -238901 -389126 -266650 -41049 100281 20837 -7922 21467 -4057 -393667
7908 -393667 -369203 -79674 43583 -140867 44656 -192330 -436008 -159131 -122719 -189485
7898 -189485 -13152 -195651 -173400 14798 -51028 -96135 142996 46623 71694 50669 -205472
7887 -205472 -129505 -204692 -95705 -230690 -26685 -82541 -135415 -53386 -23056 102960 -108517
7876 -108517 -171257 -38710 -41783 -214752 -179995 -269661 -53879 212334 -32902 -69064 5654
7865 5654 19105 28519 -160218 -277911 -277608 -88330 40101 -130262 25656 245932 185369
7854 185369 -112365 -173482 -164495 -91242 35153 -13748 -222516 133376 -33649 531917 558590
7843 558590 54215 69626 -38052 59766 -75913 30858 448 -110122 31809 -102551
7833 -102551 -276282 -198627 -167800 -25358 -263233 -284362 -203128 -86357 -96029 -276096 -135899
7822 -135899 -178516 -359505 -490485 -310103 -111031 -147966 8678 78477 -74747 -68776 66572
7811 66572 84246 -50907 60049 24366 -132252 -149673 -120989 -79209 89609 201864 133010
7800 133010 -89558 -135202 -80778 -312678 -237275 -201441 -201291 56015 24377 -129745 -70624
7789 -70624 -111617 -217048 -165302 -188709 -58206 -77625 -241399 -121606 131029 -42656 -221164
7778 -221164 -102842 -18414 -175256 -433633 -226413 -222182 -240851 -125531 -212685 -309833 -24203
7767 -24203 63148 79262 119906 -25043 -60969 -11959 -87229 -189416 -40566 47036 -54020
7756 -54020 -138131 -85183 -123661 -203192 -197239 -105460 -363143 -63911 -204840 -107989 248318
7745 248318 200374 140272 -197833 -145094 -62042 81083 40564 49312 20212 -48573 -284918
7734 -284918 -347695 -149252 -202842 -357065 -69316 25857 147135 63556 -219966 -322295
7724 -322295 -279500 -182555 -263236 -62523 40101 43278 119853 8918 62411 8761 -1692
7713 -1692 -2454 -135474 -270836 -227626 -144605 -276245 -353637 -106242 -56138 -369642 -481479
7702 -481479 -641423 -632172 -389103 -396723 -182458 27216 -51566 -148952 -185002 -227377 14537
7691 14537 99598 18790 95418 -126475 -44038 -112701 -28624 -59961 -25898 167391 9372
7680 9372 87559 -116579 -203465 -182752 -227892 33029 -229055 -123285 189737 41208 -20554
7669 -20554 -275413 -121890 16741 104799 42039 -11779 89630 -59285 -106965 -33037 95594
7658 95594 -190847 -227077 -46335 -278797 -390519 -129831 21680 -200253 -409900 -402613
7648 -402613 -439851 -127236 -5375 -79867 -61716 50914 -141536 -197517 -111146 -153423 -215172
7637 -215172 -219917 -86880 146171 76368 -61687 -59929 -109683 -20451 -99796 -144432 -221300
7626 -221300 -9092 -28459 -93365 -139453 -25952 117412 206873 207045 54934 -164403 -290282
7615 -290282 -131640 -145751 -123872 -79683 -86467 -104144 -131258 -135253 -62931 -62544 -233876 -252926
7603 -252926 -99490 -62992 -232555 -104918 -675 -34629 -44801 -126351 142138 12359
7593 12359 -149693 -169246 -255845 -188316 -143179 -200066 -163537 -27857 -125773 -63076 -108288
7582 -108288 -226351 -252727 -56962 47954 132949 -183637 -153005 -138083 -361505 -235126
7572 -235126 -48204 142984 -94438 43142 -51004 -65576 -13589 -179730 -237953 -37308
7562 -37308 263898 -84971 -15965 -31111 -222231 -234139 -323552 -176855 -350512 -222507 -41342
7551 -41342 35822 -319226 -384438 -244033 -213635 -114812 -43376 -117498 -247696 -246386 -46995
7540 -46995 -126460 -100086 114919 -236901 -45062 -308289 -157826 -100493 -238773 -173515 -275514
7529 -275514 -67988 -161636 -376212 -184852 -47042 170777 46367 -123252 -65390 -341913
7519 -341913 -84913 69295 80754 -68955 -122922 -222550 -383577 -264606 -335302 -290665 -197509
7508 -197509 -195042 -233692 -137072 4438 -46594 236472 -60323 -149550 -136302 -66744 65889
7497 65889 117451 65125 70063 98332 -21224 32273 54317 -73428 -77129 -71155 -35851 -64504
7485 -64504 -316904 -251288 -33076 137780 71031 -185665 -228283 -2276 93859 36121 -39140
7474 -39140 -137944 161865 245501 -168983 -274236 -217335 -232462 -247992 -37515 -142573 26788
7463 26788 54831 -94389 -192314 -45101 -170757 -287159 -5744 -16393 17284 52372 -196543
7452 -196543 -46816 42561 114347 76100 83433 -32743 -85927 -233151 -51987 106819 61695
7441 61695 74349 104353 93408 -27139 -1632 130879 22083 -78582 97238 -198890 -6945
7430 -6945 47841 -135859 -63119 -5533 -263671 -82657 -108320 -142026 -22695 -10315 83968
7419 83968 97343 -241691 -346263 -286882 -166081 -27767 -36466 -52249 35073 -76179 -150406
7408 -150406 112549 120052 142715 -39788 -121721 124839 -111435 -38952 137148 -16083 -109448
7397 -109448 -94515 26498 35287 64179 56598 -1139 151611 218430 -86823 -175553 -56121
7386 -56121 172873 111469 404635 292395 101332 -30916 102802 148728 159603 116565 -12833
7375 -12833 109318 126341 126443 -88539 50424 45645 184146 281062 49945 310692 168485
7364 168485 51404 -24768 135524 156255 28937 31491 66278 179909 152787 51510 -129307
7353 -129307 -76631 2657 -53878 -70608 92010 26680 -62843 -32157 -195321 -285101 -144422
7342 -144422 -156195 -70594 106868 150183 218824 335053 1567 -23535 226482 470513 295433
7331 295433 297770 284241 315673 390328 389542 349391 385467 346406 548616 563588 392827 547365
7319 547365 499057 145774 64488 126394 37802 133124 150532 157842 147965 -68425 -122446 -50371
7307 -50371 167814 90955 -14167 174883 232821 116721 2258 24333 -202195 -135696 20382
7296 20382 -36071 -5634 2321 -98825 -51963 89149 159094 73914 -138087 83649 101089
7285 101089 25841 -41650 16430 -25041 131520 192965 149648 402840 -40779 -103184 145682
7274 145682 55415 -40795 -227024 -241191 -5383 -38251 139502 143626 59429 -24365 -107889
7263 -107889 -101646 23635 -52624 -168774 -171305 -140342 -36756 33599 -40287 -107486 6115
7252 6115 60517 -94357 -387789 -281311 -231212 -22305 110924 17066 176045 100555 -91238
7241 -91238 -365760 -113249 -33069 -149412 -186049 -278049 -270726 64199 17916 28635 99109
7230 99109 -177496 31399 -147835 -159735 9136 59626 138837 144362 46107 -77628 -115065
7219 -115065 -218362 -174302 -70914 -110305 -59204 81932 94773 55741 372314 384083 392738
7208 392738 273926 -174984 -137718 37522 177987 185008 98424 85776 176869 237679 122673
7197 122673 -50569 230742 131504 145448 -171937 -182120 184699 117300 4065 -289279
7187 -289279 -159576 194224 -17107 8031 -134855 -12918 115054 10801 64714 111333
7177 111333 -106910 -32953 264326 54037 2638 79981 201552 106531 163970 20791 17990
7166 17990 14740 177507 11163 -111440 -3371 -101666 88672 105647 154903 186998 117719
7155 117719 226089 -89120 -227122 74748 158456 64557 172064 163009 50822 -70895
7145 -70895 6430 65719 380243 430110 369988 301101 294358 180395 100030 175474 189418 232708
7133 232708 148634 225920 285431 132887 94579 367330 325240 136815 71188 160470 243303
7122 243303 288620 169833 195651 4401 -25287 148952 241434 316927 755362 579031 505817
7111 505817 848797 652756 550777 470077 275162 234463 295500 335422 344883 301552 430157
7100 430157 517864 329546 212608 361684 397461 391438 348714 464234 324792 217179 632115
7089 632115 616623 363074 643274 588139 538528 767432 748520 356354 611655 462344
7079 462344 501024 611858 527116 484177 542049 463158 362972 560463 492828 560725 578938
7068 578938 603933 429032 206934 523085 534269 286282 341860 551674 657996 711280
7058 711280 1002466 909159 870619 921394 841553 850820 809324 687289 495377 537282 654734
7047 654734 830789 932021 1070326 1178529 1223948 1088589 970843 1228700 1255484 1242926
7037 1242926 1420986 1392953 1149000 1284855 1397903 1554014 1621667 1628976 1578160 1438477
7027 1438477 1736891 1956462 1737585 1887902 1820684 1837986 2041894 2273668 2215029 2391428
7017 2391428 2312216 2234959 2248772 2550799 2625097 2523110 2800432 2883396 2739149 2833005 2842730
7006 2842730 2924342 3088714 3126998 3502147 3801564 3849431 3742205 3849966 4051716 4631911
6996 4631911 4875466 5215385 5351036 5484312 5835780 6387648 6680084 6781809 7104923 7764960
6986 7764960 8375884 8821683 9382949 10105847 10981279 11741207 12991240 14412191 16291380
6977 16291380 18188177 20476273 23183018 26459516 30183144 34409285 39446585 45575395
6969 45575395 52950329 61615413 70447394 77659945 80288284 77106327 68903480 58211546
6961 58211546 47863108 39289909 32898683 28033547 24598253 21810829 19512522 17633897
6953 17633897 15860966 14505676 13363853 12254086 11366099 10594273 9959612 9210467 8275018
6944 8275018 7646556 7439067 7195540 6818463 6382128 6262184 6087429 6188628 5924087 5688953
6934 5688953 5582292 5407590 5285957 5113066 4923278 5126536 5236730 5014029 4681227 4405618
6924 4405618 4229682 4021929 3976050 3828652 3873286 3801341 3575141 3379468 3469103 3360837
6914 3360837 3333323 3543737 3341627 3266265 3187485 3177381 3212229 3292340 3240057 3243881 2953860
6903 2953860 2810709 2800670 2754595 2646720 2685324 2727748 2421872 2323881 2328437 2132555 2061975
6892 2061975 2202998 2249201 2205576 1755715 1625707 1881752 1810453 1789158 1689417 1727575 1606708
6881 1606708 1472558 1562031 1550673 1499072 1374787 1408489 1270596 1182869 1388977 1429427 1482710
6870 1482710 1269288 1142345 936854 1075709 1074727 828689 1038399 1064026 1035867 870679
6860 870679 919503 735006 459792 530112 655264 782823 933215 734995 759963 903000
6850 903000 584405 473833 362362 522355 587438 439424 405292 473515 543553 485618 500173
6839 500173 376365 348039 191530 60835 174739 472750 326975 368612 487070 310909
6829 310909 136545 346944 410339 275106 321487 354295 389516 379022 281061 322139 291538
6818 291538 320935 329709 238366 252245 402416 474141 296476 317542 290897 32865 72623
6807 72623 284095 245776 233091 242367 220546 251483 381797 376392 337996 145849 198294 298408
6795 298408 449793 388630 229452 230344 121200 353025 259658 384586 347921 67994 -166317
6784 -166317 -47800 382854 326777 183948 319042 405871 328104 305475 265976 110693 -37424
6773 -37424 12143 -43801 105570 111189 147525 121304 73006 190268 235289 265710 118422
6762 118422 202481 225770 305531 224516 87929 103949 97032 -198513 906 238036 260491
6751 260491 165327 127204 166990 383124 510845 304051 311961 44414 243521 545917 220617
6740 220617 137978 268722 313479 152733 -46773 -212731 -62554 -81439 -287946 -217460
6730 -217460 -36612 96865 231409 508346 278149 285293 235859 121359 120511 205027 196719
6719 196719 237432 198631 76278 64728 140003 281085 303495 260447 130949 181040 262511
6708 262511 163549 425208 328039 131970 176963 -7820 72616 234643 520899 334280
6698 334280 195245 187071 328878 454766 289721 282766 63173 149331 184429 360148 391097
6687 391097 359746 55172 17633 195978 102747 -119891 -185163 -329028 -177411 50466
6677 50466 198208 161433 169712 243999 141846 204127 281605 512052 250424 278148 292736
6666 292736 121140 157336 -46177 56696 190011 302932 88946 -50483 140562 119741
6656 119741 145542 77830 71229 237159 414590 283224 216920 267458 251609 28513 -16426
6645 -16426 -63515 -18648 73056 371775 416573 224850 112023 184558 123695 46133 41397
6634 41397 195756 209610 241035 135023 149986 339954 418646 536695 387942 486899 581252
6623 581252 554009 333060 264887 226306 203783 65686 9647 44010 147001 168194 115342
6612 115342 2692 117257 222965 457279 542296 427298 347886 661693 632805 581562
6602 581562 743114 666285 705249 637139 663184 380598 470700 612794 137854 195289 177360
6591 177360 -79847 -45029 4935 191351 213744 424551 342802 115267 308638 191048
6581 191048 -88172 299502 240057 39628 36413 166842 252359 10713 -150173 89452
6571 89452 150433 155847 183995 189157 267117 280744 183022 128603 111337 107181 65619 -48489
6559 -48489 -142605 109956 142234 235290 97664 -89856 92560 -59557 -44307 168540 11324
6548 11324 42956 36052 14048 30126 258680 237094 163642 74045 137104 122018 -76739 195411
6536 195411 50125 206295 65646 168179 151563 191653 217392 152669 265364 276338 249913
6525 249913 312165 253617 113522 328314 247574 155781 279211 235097 49933 205587 274765
6514 274765 311320 234126 79818 166140 288204 329803 170628 244978 212748 236057 59843
6503 59843 54324 154596 154710 63417 129786 146791 47431 193123 121111 166263 350360 -44436
6491 -44436 -32590 354910 258315 259742 244764 324217 326447 221972 334529 212419 210598 131445
6479 131445 293276 312463 306707 216369 228349 341706 305125 262726 188751 268856 327765
6468 327765 234142 50381 127748 259722 330783 156848 97471 -30474 -192544 -289033 -48862
6457 -48862 1335 147572 240619 162198 -39213 85494 169504 50150 -53166 190061 348245
6446 348245 374065 578951 521764 496461 312722 58992 -53121 104135 30484 172327
6436 172327 98646 132129 145119 214102 31360 484382 502550 247119 163219 163940 268852
6425 268852 216989 192470 386830 325678 188516 209467 109933 -6969 -152332 -224540 -198799
6414 -198799 -67892 -142332 -58078 38437 144385 130543 335785 133286 288150 413211
6404 413211 344973 119285 256025 51460 186895 210840 251786 388469 162272 -51113
6394 -51113 -97459 -28886 -48982 7689 79536 163465 205131 9759 186728 60966 95318
6383 95318 17892 -25029 163276 143607 148972 116042 174098 166632 91182 32697 167162 303508
6371 303508 145371 -46056 -240 -176730 -83286 -193907 90043 584792 446035 286301
6361 286301 209448 351163 541406 392220 150633 276015 426699 385082 418550 278790
6351 278790 201418 170833 72759 73057 312793 345042 255959 -98117 186706 422818 389484
6340 389484 137614 388373 308567 143299 254431 137606 54887 50114 53694 221219 329537
6329 329537 153659 395334 491730 170962 150783 390828 490751 615256 408179 248561
6319 248561 226953 248732 191780 208175 351137 178894 -88025 -24326 32401 178074 191254
6308 191254 213261 275773 317439 302217 334251 337332 277450 293329 320608 312953 249733 239213
6296 239213 222304 382044 270334 228327 515877 323271 443352 410063 307840 330737
6286 330737 133971 124833 207462 368226 257683 238607 256270 505109 474711 387853 438238
6275 438238 509794 352214 375363 441846 372042 233169 96537 341151 473872 603193
6265 603193 532193 374712 266741 92041 154641 -127388 -62378 260565 213554 304070 569133
6254 569133 468164 325473 422813 415759 431683 390851 524523 564364 313232 268552 255976
6243 255976 196268 352284 209874 95290 305422 392382 518177 586739 507490 178785
6233 178785 199193 316929 369311 495684 378352 596382 596193 520656 389696 392644 636118
6222 636118 615994 500808 399232 29074 80455 134309 413995 427621 390526 342182 116903
6211 116903 364885 458249 416728 492792 453656 261919 262820 323498 361783 786447 870460
6200 870460 641151 250713 289799 350349 364865 423871 559083 516472 317535 276199 435476
6189 435476 445942 344851 322725 153183 325051 268052 333713 458882 868256 812805 584718
6178 584718 361837 408691 621713 311456 390007 482646 754130 458010 436435 597357
6168 597357 468837 363217 321112 517128 567142 412894 340591 315485 387795 253552 98461
6157 98461 180514 366494 611074 674989 669955 406896 300088 494361 494525 295281 391285
6146 391285 473556 681415 608794 541052 697588 716039 783547 772241 586654 642602 958070
6135 958070 860564 754427 785926 530504 641022 772571 811565 603680 528221 636239
6125 636239 704833 531980 697442 653427 691451 536642 582265 645005 683821 882971 844406
6114 844406 768377 690148 834918 785488 672886 791087 650451 747583 918773 920749 826150
6103 826150 682723 884202 1257663 781588 640179 658723 579773 853893 1162947 1047562
6093 1047562 1250823 1088943 1104794 1014174 871876 993890 1006642 997870 889870 705373
6083 705373 518749 778280 714524 929891 855223 761138 697324 940848 1016556 1150146 922895
6072 922895 801045 634373 925911 927682 928215 987106 1016975 1038174 910991 879181 1017791
6061 1017791 867846 1026245 1041040 1036907 743580 642545 1007909 1230085 1240837 1028858
6051 1028858 1178789 1183513 1346357 1203898 1007945 905704 710055 923603 1108806 1093927
6041 1093927 928940 1009033 968900 878536 949336 839654 1056484 1154321 890898 916581 1013682
6030 1013682 920979 958574 952575 1120404 1126639 1063949 1054002 1109531 1200635 1212859 1207221 965732
6018 965732 978557 1067145 1092448 1315508 1330998 1218468 895591 946909 1070754 1064043 1189429
6007 1189429 1305429 1101381 1153374 1257497 1107766 1152268 1054502 1162978 1350630 1076186
5997 1076186 1018596 1208275 1435123 1253075 1175266 1299837 1334101 1234949 1054243 1222963
5987 1222963 1137464 1518564 1556647 1551853 1520202 1438097 1713946 1802014 1936721 1589706 1220485
5976 1220485 1573920 1720470 1617742 1593037 1776723 1561993 1487091 1519207 1636086 1787157
5966 1787157 1892516 1642560 1560187 1634605 1600970 1748507 1686344 1472636 1652497 1823654
5956 1823654 1900611 2160830 2094233 1976296 1884598 2022373 1969917 2039917 1818870 1892481 1874717
5945 1874717 1911201 1768687 1917755 1920778 1801071 1866206 1701286 1769138 1982051 2128021
5935 2128021 2116955 1983738 1894801 2089792 2242563 2172082 2174496 2160861 1962738 2046913 2161782
5924 2161782 2372246 2391199 2392319 2541900 2351022 2466465 2277548 2465618 2414401 2518781
5914 2518781 2821687 2959104 2974143 3039636 2867231 2825862 2909035 2958099 2993310 3009106 2875655
5903 2875655 2839957 3038768 3054142 3411272 3477585 3360071 3412990 3468462 3533756 3473348 3205125
5892 3205125 3365352 3644837 3708403 3788614 3984982 4228044 4413552 4507836 4560167 4514966
5882 4514966 4400759 4782845 4945701 4839985 4746311 4831218 4957015 5025582 5398651 5566654
5872 5566654 5712724 5690048 6080109 6379015 6519578 6724904 6753237 6924004 7027887 7542215
5862 7542215 7651159 7922856 8314918 8664389 9250640 9729528 10216752 10525710 11122741 11812058
5852 11812058 12710361 13379684 14481140 15583968 16765204 17973320 19134211 19987743 20435357
5843 20435357 20408622 20596643 20739661 21199114 21953151 23064793 24282762 25804813 27625577
5834 27625577 29721278 32041109 34940963 38243737 41456065 44596126 47056220 48439904
5826 48439904 49244701 49737848 49435646 48288142 47275927 46148841 45751921 45072797 43849165
5817 43849165 42622710 41275840 40261167 39830408 39878919 40386243 41353518 43144635 45630445
5808 45630445 48388476 51817826 55727178 60068472 64587746 68423000 70249202 69268382
5800 69268382 65807997 60962245 55959070 51424481 47424461 44769401 42553612 40692094
5792 40692094 39003098 37221769 35401040 33891086 32549878 32002856 31585343 31151081 31338248
5783 31338248 31870241 32526500 33635053 35048844 36643935 37884400 39205611 39718348 39041619
5774 39041619 37768492 35207166 32120360 29362999 26611578 24343649 22647998 21143896
5766 21143896 19877710 18764169 17976382 17280506 16294420 15690418 15047786 14472984 14047931
5757 14047931 13735968 13406073 13444283 13042556 13108430 13053047 13014928 13015732 12975979 12958755 12762972
5746 12762972 12412616 12043223 11819738 11437250 10987635 10478730 10266271 10092598 9987140
5737 9987140 9849545 9736929 9485376 9512804 9437765 9337799 9299352 9286482 9375832 9529664 9769619
5726 9769619 9797261 9749273 9579388 9414757 9415785 9262612 8922133 8768181 8896520 8585601
5716 8585601 8508939 8493180 8228752 8084483 7885535 7912404 7569326 7622524 7761789 7582547
5706 7582547 7699191 7623369 7600102 7801604 8225443 8098348 8026677 7853005 7820761 7751538
5696 7751538 7497677 7329109 7177395 7174935 7079664 7005825 7247285 7265040 7183929 7092179 7244204
5685 7244204 7241105 7065889 6883554 7060122 7165567 7248366 7211339 7237585 7054243 7213678
5675 7213678 7460310 7423324 7347778 7469740 7571947 7359084 7257779 7542630 7420160 7280400
5665 7280400 7333033 7377726 7694169 7719743 7590876 7703175 7534556 7500051 7823045 7887083
5655 7887083 8103068 8239655 8111206 7940049 8149411 8262668 8576186 8525711 8404360 8447437
5645 8447437 8430015 8752911 9033445 8967787 8927631 8970405 9048594 8940885 9034224 9040935 9384291
5634 9384291 9463115 9556903 9582509 9890183 10059319 10145542 10055521 10323948 10682202 11024978
5624 11024978 10871968 10687444 11196358 11381172 11430247 11425007 11865114 11730375 11639736 11876205
5614 11876205 12353942 12738824 13033155 13583341 14108340 14635700 15352414 16105394 17247911
5605 17247911 18520307 20043279 22185353 24514433 26043257 25803361 24007217 21750657
5597 21750657 19349728 17568539 16547088 15781368 15385832 15110746 14880300 14659197 14556484
5588 14556484 14239138 14115677 14181581 14054565 14032924 14145967 14224430 14281846 14423322 14659619
5578 14659619 14788682 14912137 15132626 15677041 15830191 15828907 15593139 15583508 15420497 15236897
5568 15236897 15176256 15130824 15178554 15049038 15192584 15276053 15576422 15740007 15906047 16076587
5558 16076587 16208999 15905668 15887892 16188369 16214288 16403853 16565634 16584209 16852846 17138976
5548 17138976 17328026 17266409 17245305 17304607 17483571 17595707 17815948 17924419 18167939 18350986
5538 18350986 18535951 18906434 18920800 19116019 19456039 19765590 19700311 19739230 19840206 20077334
5528 20077334 20296460 20184477 20468153 20727056 20922122 20959416 20830539 20830309 20970541 20982509
5518 20982509 21009824 21154093 21190330 21112625 21347848 21328470 21481118 21598200 21505475 21906099
5508 21906099 22065810 22193505 22279507 22320322 22432949 22642439 22776859 22789332 23214908 23211110
5498 23211110 23494646 23537300 23498791 23696088 24007705 23919449 23782895 23703471 23972466 24099465
5488 24099465 24072646 24631714 24868421 25065518 25485013 25892740 26331361 26792351 27168791 27329549
5478 27329549 27219430 27102799 26615669 26421198 25958633 25728603 25381694 25402110 25133791 25188622
5468 25188622 25297342 25471048 25731372 25780641 25861057 26231032 26611733 27172834 27497339 28142769
5458 28142769 28956378 29623969 30531924 31023792 30474852 29605395 28250955 26976635 26119890
5449 26119890 24863333 24170579 23716002 23224106 22707015 22616639 22450806 22060968 22024330 21872470
5439 21872470 21688999 21777644 21738617 21903587 22142452 22154464 22426807 22895456 23365182 23360522
5429 23360522 23290287 23259336 22390977 21431284 20502537 19682992 18949081 18592153 18219456 17862249
5419 17862249 17572541 17254293 17243098 17069400 16838538 16478350 16379152 16149364 15893028 15790883
5409 15790883 15472270 15443040 15561943 15259016 14953723 14719334 14627496 14580542 14361240 14198472
5399 14198472 13982749 13878499 13762699 13591224 13585480 13537590 13553698 13466023 13292508 13460419
5389 13460419 13359269 13414382 13376188 12935788 12977791 12922100 12697548 12780098 12469325 12600997
5379 12600997 12436631 12212103 11755390 11589965 11357311 11218211 11218304 11250645 11173471 10900920
5369 10900920 11033127 10989941 10765960 10784966 10843159 10845652 10682402 10733676 10678267 10633682 10803670
5358 10803670 10358981 10314763 10510048 10159180 9983939 9917895 9747612 9614575 9584527 9475689
5348 9475689 9324480 9096079 8862315 8826952 8840565 8889800 8833042 8750735 8648487 8605899 8644085
5337 8644085 8814123 8737551 8771626 8682052 8571398 8660888 8614061 8445874 8390025 8227854 8385737
5326 8385737 8470516 8437786 8483217 8463118 8439585 8429612 8478126 8425144 8572323 8705676 9396196
5315 9396196 9713738 9716801 9536884 9296352 9251206 8829849 8921443 9025706 9051670 9211267
5305 9211267 9626732 9883833 9704104 9407003 9007691 8866501 8888053 8610856 8641914 8670075
5295 8670075 8499134 8536534 8442920 8300374 8129480 7946383 8089354 8064664 7881805 8122342
5285 8122342 8123270 8225456 8302060 8570053 8882828 8874707 8878468 9154280 9491685 9866149 9804369
5274 9804369 9611174 9318757 8713073 8491532 8284236 7967295 7823653 7970843 7868434 7818714
5264 7818714 7809985 7806056 7936518 8012000 8261068 8498438 8518165 8675255 8860100 8916923 8742533
5253 8742533 9071481 9326629 9555119 9608366 9495031 8885282 8452481 7967711 7547604 7450202
5243 7450202 7253947 6776411 6360536 6299597 6300648 5848127 5981461 5978082 5722639 5621447
5233 5621447 5579650 5713068 5757973 5457698 5297805 5292220 5188246 5153789 5069221 5014676 5124791
5222 5124791 5062347 4983024 5065109 4699203 4545137 4463758 4463953 4410498 4088760 4087570 4069579
5211 4069579 3920471 4029887 3773459 3707407 3836637 3860664 3644317 3730731 3570756 3599789
5201 3599789 3566568 3473374 3450903 3584485 3606975 3499379 3364858 3259013 3539937 3479650
5191 3479650 3149164 3230269 3370088 3291203 3221367 3282803 3434747 3534144 3302429 3144896
5181 3144896 3114976 3178342 3036194 2946348 3104406 3142887 2983550 3036970 3227757 3121037
5171 3121037 3327916 3363913 3161980 3192801 3407591 3239521 3269057 3256884 3256633 3329498 3044764
5160 3044764 2947096 2833676 3052130 2822561 2675985 2598944 2618828 2373932 2266603 2324846
5150 2324846 2518007 2456259 2425333 2138718 2016430 2176002 2304308 2150534 2100045 2030135
5140 2030135 2212773 2040083 2060583 2006110 1750380 1796997 2056137 2137405 1976700 2158059
5130 2158059 2027626 2153099 1942180 1986231 1955474 1844105 1705854 1862389 1800344 1671058
5120 1671058 1799845 1935122 1795511 1925614 1956598 1978057 1841255 1970573 1857959 1687151
5110 1687151 1804367 1956426 2017177 1834042 1627636 1594004 1697121 1786507 1801775 1657452
5100 1657452 1539218 1857892 1731610 1660072 1589129 1480295 1468498 1507547 1734017 1786922
5090 1786922 1777774 1819611 1705538 1752636 1823016 1793050 1790325 1578778 1599574 1546484 1581414
5079 1581414 1665051 1423879 1629085 1621638 1377880 1495553 1430812 1321191 1264821 1271648 1310631
5068 1310631 1264553 1229630 1311085 1382571 1549830 1564704 1323082 1393407 1548861 1342041 1392396
5057 1392396 1422440 1252061 1064754 1270782 1503364 1413054 1224569 1482710 1613341 1205861
5047 1205861 1082619 1294143 1493788 1424851 1351767 1112947 1193474 1235061 1326650 1362830 1352832
5036 1352832 1509131 1438810 1343695 1344197 1349984 1486503 1426500 1476947 1501786 1428262 1426511 1411630
5024 1411630 1570919 1512793 1711131 1721134 2056433 1897095 1919351 1837776 1660768 1668835 1482603
5013 1482603 1459975 1321820 1285754 1375880 1333760 1359601 1315122 1156695 1306031 1334614 1362535
5002 1362535 1467487 1516921 1332970 1171405 1401745 1463958 1378904 1341960 1542819 1841697
4992 1841697 1661095 1586667 1440253 1346535 1426370 1413360 1454634 1454660 1583201 1633890 1389119
4981 1389119 1476558 1678778 1621557 1559729 1538212 1473161 1709049 1886804 1962271 2187267 2240617
4970 2240617 2143061 2299396 2471221 2818130 2919871 3062659 3634987 4075199 4531055 5054987
4960 5054987 5291280 4897528 4113790 3559332 3522181 3080515 2655329 2463425 2026322 1659431
4950 1659431 1841450 1629808 1566338 1801958 1796642 1682183 1720532 1686128 1897493 1678287
4940 1678287 1583455 1544047 1664754 1989790 1756729 1768740 1702604 1872271 1782110 1616244
4930 1616244 1551474 1729131 1740292 1569327 1957629 1820126 1715194 1667924 1603232 1818531
4920 1818531 1670996 1843026 1678506 1767463 1785425 1673812 1658558 1719721 1742286 2000900
4910 2000900 1958010 1997671 2115109 2099338 2223738 2235862 2227788 2118281 1820776 1847568 1863779
4899 1863779 1798044 1738845 1857668 2047799 1801362 1819554 1714495 1822741 1970163 1921303
4889 1921303 1691520 1689146 1825650 1623417 1629260 1642115 1520628 1447208 1700206 1900152 1858182
4878 1858182 1779984 2010870 2031704 1613801 1759929 1980993 1781542 1624894 1726771 1627970
4868 1627970 1730944 1939670 1859030 2037589 1983032 1807141 2039514 2034487 2117437 2050549 2059055
4857 2059055 2144810 2160383 2197149 2423915 2668087 2602069 2432936 2704937 2644129 2779699
4847 2779699 2964499 2915592 2835714 3110015 3237471 3210367 3088256 3185800 3117065 2991692
4837 2991692 3113693 3241617 3218368 3125738 3018266 3203797 3168008 2977645 3226992 3389378
4827 3389378 3302958 3221157 3375879 3534100 3719873 3608020 3686394 3783185 4071722 4060656
4817 4060656 4021280 4230030 4313373 4501019 4726634 4748602 4871539 5027315 5102846 5380732
4807 5380732 5433183 5365958 5359364 5781070 5842913 5778088 6150025 6055883 6258228 6325730 6418442
4796 6418442 6534256 6508874 6702346 6952771 7050499 7331919 7436276 7812231 8009816 8475830
4786 8475830 8666177 8848640 9102124 9251217 9611587 10070707 10404242 10712630 10867816 11398211
4776 11398211 11781520 12262956 12822764 13176588 13768836 14521159 15129709 15953616 16900050
4767 16900050 17727618 18843602 20140078 21626068 22711069 23869383 25427361 27251916
4759 27251916 29720944 32659627 35674319 39257288 43350669 47814793 52914769 59054531
4751 59054531 65785977 73574952 83219742 94193675 106472496 117710287 123048056 117255625
4743 117255625 104063766 89551435 76325331 66096872 58572288 53347522 49081262
4736 49081262 45886426 43558398 41919132 40242054 38790331 37580161 36653857 35579816
4728 35579816 34534731 33527900 32756563 31982440 31399797 30684176 29879546 29412627 28946991
4719 28946991 28568189 28305594 27917142 27699451 27522387 27775165 27917290 28376743 28684438
4710 28684438 28696704 28762406 28879727 29261100 29472513 29652987 30005826 30568407 30877858 31376479
4700 31376479 32128824 33082626 33895441 34826391 35553712 35892292 35805957 35311835 34469967 33321426
4690 33321426 32507675 31258722 30045416 29379222 28848728 28436959 28145100 27926535 28025288
4681 28025288 28053488 28249060 28778265 29252254 30150071 30978044 32088655 33157004 34215182
4672 34215182 35454734 37067034 38497636 39720767 41115965 42139042 43064261 43273480
4664 43273480 43207308 42812867 42050185 41210489 39914235 38702637 37344625 36086503 34991743
4655 34991743 33333206 31759103 30484752 29267723 27980872 27288401 26324604 25596898 25032736
4646 25032736 24633424 24717349 24885316 24948807 25555811 25948118 26631371 27596095 28568253 29468758
4636 29468758 30192452 31279575 31618238 31944141 31805782 30874419 29369404 27566397 25848109
4627 25848109 24011574 22212751 20310937 18754215 17392153 16213503 15181524 14303612
4619 14303612 13471909 12736562 12287300 11680954 11179816 10446224 10140174 10048907 9869106 9509589
4609 9509589 9212681 9177941 8915629 8777622 8908281 8692713 8571425 8602384 8624742 8292809
4599 8292809 8105723 7623295 7279312 6829001 6648387 6466498 6613495 6215827 6168416 5942379
4589 5942379 5673684 5678604 5570536 5396999 5136795 5029677 5033572 5024003 4807389 4692041 4566779
4578 4566779 4562075 4586604 4651325 4617173 4564443 4641424 4451833 4377039 4226660 4267595 4310462
4567 4310462 4193128 4082849 3818934 3945106 3854918 3934836 3909386 3603134 3383063 3564874
4557 3564874 3699639 3677904 3518601 3212434 3242475 3235169 3293184 3515515 3065390 3315487
4547 3315487 3443822 3443371 3503945 3463050 3322434 3518985 3363547 3145631 3133270 3395445 3388346
4536 3388346 3205176 3249680 3171825 3163560 3109770 3427734 3448088 3107734 3032041 3430182 3440244
4525 3440244 3386248 3117648 3116169 3250183 3290276 3295510 3340464 3190515 3340086 3710181 3824860
4514 3824860 3760946 3969594 3944697 3867018 3645252 3430231 3577713 3645870 3799951 3638502
4504 3638502 3675645 3726952 3544458 3389663 3441137 3439874 3714509 3516608 3458518 3493514 3623719
4493 3623719 3514847 3584938 3517366 3609054 3977446 3975329 3744183 3950283 4023804 4018476 3937197
4482 3937197 3913166 4113823 4023905 4089259 4058383 3914439 3915852 3884188 4021544 4156987 4600047
4471 4600047 4511158 4577539 4619019 4682868 4606826 4691549 4562195 4289640 4297453 4310063 4376188
4460 4376188 4381036 4513143 4446261 4168713 4185065 4269530 4056273 4188126 4164641 3965775 4037795
4449 4037795 4376117 4465851 4626839 4522645 4601060 4715610 4921353 5051517 5043626 4970833
4439 4970833 5096989 5230968 5244936 5529496 5689597 5570753 5876564 5933308 5897009 5937973
4429 5937973 6146734 6310813 6445627 6413516 6477702 6564963 6711505 6548469 6539495 6889217
4419 6889217 7361251 7526048 7907123 7789572 7948798 8431724 8411467 8429197 8774939 8770126
4409 8770126 8803556 8641456 8776955 9012798 9157684 9628685 9552781 9588655 9526290 9770371
4399 9770371 10202516 10298704 10625935 10713297 10776641 10910448 11123468 11312825 11558543 11716359
4389 11716359 11917961 12460146 12368852 12567306 12699946 13038302 13155047 13557179 14045967 14410546
4379 14410546 14813018 15257146 15941722 16767620 17451899 18369143 19303511 20195177 21181024
4370 21181024 21946789 23044520 24253796 25252120 26509208 28073310 29643285 31606324
4362 31606324 33897390 36120194 38642124 41779862 45256562 49504415 54414607 60314424
4354 60314424 67466235 75482479 84679229 95737348 108938936 124348140 141828000 161170303
4346 161170303 180205577 197808836 214522618 229508415 235458194 226317683 203285657
4339 203285657 173224678 145091650 121908810 104282117 90938127 81054991 73459849
4332 73459849 66958683 61688950 57201931 53387701 50155723 47295581 44664179 42181249
4324 42181249 40120118 37813220 36051061 34439784 33099741 31579249 30707945 30066210
4316 30066210 29277409 28611255 28089899 27846874 27606376 27700226 27819237 27871857 27891909 27899512
4306 27899512 27568190 27652606 27590692 27151884 26902600 26943566 26650078 26115364 25628965 25298977
4296 25298977 25522462 25523456 25723289 26487506 27031429 27477656 28291098 28650306 28960652 29378306
4286 29378306 29524876 29455099 29410739 29049767 29102701 29419270 29760502 30098433 30436927 30861611
4276 30861611 30961833 31201486 31292623 31574534 31978269 32776396 33549757 34255308 35272919
4267 35272919 36366919 37171518 38130368 38873634 39393902 39749541 39973054 39996690 40319172
4258 40319172 40616911 41030588 41487150 42048622 42433337 43134113 43587902 43420650 43466114 43039068
4248 43039068 42364908 41704803 41248387 41038885 41014203 40735495 40818204 41204791 41448252 41836120
4238 41836120 41925706 41588465 41084914 40597674 39718894 38901084 38089594 37466312 36899316 36782887
4228 36782887 36648273 36596308 36396855 36131771 35724137 34777369 33671381 32238201 31288047
4219 31288047 30269860 29302919 28456789 27992891 27792378 27553569 27238738 26934229 26492567
4210 26492567 25710664 24505998 23132563 21948955 21051484 20365740 19567392 18946233 18484305
4201 18484305 17843848 17131710 16793735 16461393 15937980 15288309 14570503 14036824 13567010
4192 13567010 12936645 12714861 12314300 12223751 11900588 11796847 11923139 11592905 11350036 11106192
4182 11106192 11124882 11062347 11386858 11412377 11593287 11584044 11905233 12171108 12519556 12796922
4172 12796922 12537740 11941211 11588076 11229742 11174842 11080181 10842321 10536424 10225638 10117116
4162 10117116 10174452 10390309 10486765 10826270 11145083 11349146 11910835 12148460 11940341 11470375
4152 11470375 11005541 10145354 9436125 8973843 8828648 8679994 8330240 8226989 8301325 8360158
4142 8360158 8475453 8580866 8349050 8656403 8958200 9141922 9049975 9020353 9028553 9032576 8977297
4131 8977297 8909478 8927624 9210743 9544951 9876824 10413660 10652871 10639306 10080382 9068584
4121 9068584 8063368 7364947 6794314 6359467 6351349 6048891 5858595 5716890 5261133 5234564
4111 5234564 5457891 5549259 5404491 5179424 5386113 5050715 4962312 4980784 5050205 5172960
4101 5172960 4937720 4798981 4757417 4935239 5179556 5120329 5235631 5150684 5075480 4980718
4091 4980718 5051072 4901615 5047353 5349734 5457636 5531352 5612941 5573000 5754144 5866898
4081 5866898 5775325 5839211 5909119 5892249 5936091 5901471 5819608 5692319 5754959 5883955 6073599
4070 6073599 5994000 6402732 6631895 6783216 6809042 6705331 6964550 6893546 6877902 6807193
4060 6807193 6815544 6813506 7288687 7411358 7408595 7260850 7373414 7690181 8064258 8185131 8123437
4049 8123437 8280598 8495638 8612056 8799280 9083722 9109095 9139551 9740340 9847869 10056298
4039 10056298 10377142 10498203 10685758 11228077 11550548 11655557 12427884 13022692 13357189
4030 13357189 14087981 14410496 14826412 15183948 15419492 15538038 15712841 16217409 16492320
4021 16492320 16719595 17143252 17665994 18260156 18769474 19262846 19630232 20284089 21043158
4012 21043158 21729624 22164380 23038780 24028290 24713885 25930792 27027052 28360823 29321680
4003 29321680 30362560 31382765 31841832 32066519 32272581 32227340 32083761 32039654 31936354
3994 31936354 32009103 32322351 32515634 32533638 32969455 33479238 33683317 34074470 34530023 35014731
3984 35014731 35465389 35941688 36838305 37652311 38139875 39051689 39846618 40780337 41654749
3975 41654749 42086395 42882739 43444300 43855059 44006009 44130187 43921314 43645571 43417546
3966 43417546 43145050 42825363 42659723 42059549 41484693 41130427 40484240 39999053 39487376
3957 39487376 39235846 39034142 38775352 38849092 38946278 38935312 39155871 39693614 39631233 39984743
3947 39984743 40696853 40997217 41392641 41863745 41929322 42114680 42299488 41839078 41276227 40342189
3937 40342189 39300511 38264095 37525250 36936168 36334818 35738360 35412062 35165328 35010514
3928 35010514 34736344 34439830 34241348 34222159 34134303 33980857 34140402 34426057 34619146 34858822
3918 34858822 35221831 35629829 35999745 36705007 36920234 36771151 36663799 36351216 36175279
3909 36175279 36269674 36152577 35925103 36033143 36110762 36110046 36317879 36252012 36246034 36261186 36104760
3898 36104760 36112408 36112929 35840405 35852524 36043429 36339007 36736855 37347144 37562064 38049936
3888 38049936 39018539 39728446 40543953 41399261 42000153 42670552 42997198 43079221 43295502 43406759
3878 43406759 43706236 43801819 43448228 43363693 43128368 42804024 42605195 42616961 42455616 42402721
3868 42402721 42688626 43007766 43168827 43518447 44265433 45053629 46030936 46797975 48133648
3859 48133648 49448912 50738201 52080395 53401275 54838365 56182965 57152512 58124465
3851 58124465 59004997 59880692 60332433 60374273 60574803 60530573 60106892 59944988 59751044 59418048
3841 59418048 59142148 59181047 59227917 59288325 59375098 59304918 59360492 59462176 59435507 59218184 59160613
3830 59160613 58739061 58022296 57941057 57656638 57752705 57586757 57374331 58124630 58817546 59532037
3820 59532037 60170170 60585469 61299937 62226329 62925468 63921293 64840755 66057029 67301504
3811 67301504 68860762 70551477 72443792 74616490 77121136 80206603 82799949 85314056
3803 85314056 88020896 90380965 92262803 93572511 94398501 94626930 94770705 94809058 94683995
3794 94683995 94406202 93818602 93955520 93776346 93364513 93085435 92679095 91767166 90423640
3785 90423640 88839225 86576732 83864256 81099034 78304253 75482850 72489958 69794430
3777 69794430 66841736 64344292 62315798 60606966 58599263 56651109 54896430 53519997
3769 53519997 52509113 51510321 50655395 49744314 49175751 48664045 47986288 47298985 47117030
3760 47117030 46683444 46534940 46701415 46714423 46586682 46584622 46701485 46814524 46974344 47127897
3750 47127897 47282879 47572609 47986747 48459108 48769010 49020283 49078922 49490633 49701972 49458973
3740 49458973 49472307 48835963 48509669 48503330 48324879 48337149 48434556 48888784 49454691 49998194
3730 49998194 50874701 51694829 52627324 53593184 54630500 55566165 56472632 57343611 58491764
3721 58491764 59880099 61036514 62945986 64494643 66064343 67948940 69952842 71928715
3713 71928715 74253426 76540164 78458326 80473929 82865425 85086414 87495048 90093015
3705 90093015 92625654 95582490 98227540 100449878 102718438 104426783 105321586 105756325
3697 105756325 105630585 105125421 104701868 104298972 104417677 105252250 106360856 107309889 108390977
3688 108390977 109371845 109650928 109422225 108640471 107203658 104882675 102361978 99538238 96625002
3679 96625002 94139023 91839569 89817220 87914345 86392543 85166914 84486691 83895869
3671 83895869 83514600 83566059 83394649 83152491 83463600 83582474 83671666 83649657 83725309 83650097
3661 83650097 83208883 82972922 82631478 82367589 82012873 81811274 81487959 81463390 81589190 81656047
3651 81656047 81854210 82228356 82205032 82668537 82875425 82914952 82998825 82762604 82441510 82417964
3641 82417964 82408092 82374793 82924379 83382732 84384514 85811997 87550547 89389346 91915878
3632 91915878 95180148 98636767 102279125 106063265 110232322 114184990 117864631 120809290
3624 120809290 123388008 125465598 126930953 128091859 128551650 128721975 128503409 128075514 127778861
3615 127778861 127610830 127246047 127060491 126921891 126861509 126255523 125617469 125118899 124196984
3606 124196984 122834620 120834243 118686093 116114966 113541896 110561715 107289296 104469881
3598 104469881 101395004 98505306 95947529 93520544 91837442 90465018 89046391 88256007
3590 88256007 87574248 87582988 87826883 87803459 88454961 89383779 90625349 91762056 93242582
3581 93242582 95011591 96912676 98875645 101135424 103740796 106834600 110065891 114420139
3573 114420139 118843571 123679413 129447203 135364755 141750193 148064453 154921954 161665557
3565 161665557 168010933 174193351 179900087 185196738 190070313 194464897 198516009 202425121
3557 202425121 206062821 209224093 212125432 214382809 216094862 217195105 217825738 218068425
3549 218068425 218158364 218230607 218913094 220484237 222915404 225974641 229743074 234042601 238316514
3540 238316514 242406748 245579475 248048544 249339910 249765668 249397778 248279755 247214138
3532 247214138 245875031 244425880 242858059 240810996 238549903 235468879 231848915 227505500
3524 227505500 222364884 216413321 209596119 202643066 195111789 187112162 178770393 170097080
3516 170097080 161597545 152955830 144826617 137054597 129334921 121892802 114995806 108339789
3508 108339789 102110101 96586271 91224902 86637704 82370960 78382443 75333573 72450519
3500 72450519 70122351 67779751 65631947 64071207 62852403 61615125 60395772 59421526
3492 59421526 58452698 57515633 56421967 55530653 54841024 54159556 53859169 53837610 54425277
3483 54425277 55484926 56303676 55755438 53819960 51811740 50084865 49163574 48540244 48253128
3474 48253128 47889219 48024855 48043495 48010485 47896890 48072070 48043112 48107951 48066012 48031927
3464 48031927 48153677 47995199 47926635 48060680 48080251 48296160 48738049 49240612 48685936 46549840
3454 46549840 44161700 41839051 40306273 39392764 38623979 38106956 38304713 38290938 38726848
3445 38726848 39165842 39613078 40271563 40975539 42052202 43328334 44914215 46479589 48427944
3436 48427944 49818348 49771128 49266339 48915363 48482848 48823603 49337833 50458943 51929818
3427 51929818 53670307 55555456 57873163 60573857 63382426 66453050 70065869 74202795
3419 74202795 78570583 82767529 87556025 92209072 96642548 101335609 105600803 109375656
3411 109375656 111727411 112528967 111519948 109733879 107470534 104628076 101581970 98291179
3403 98291179 94935304 91649090 89101202 87132230 85195951 84140148 83953038 84234460
3395 84234460 85551720 87143009 89232548 91244713 93127582 95323355 96886365 98118115
3387 98118115 98899195 98575086 97484189 95664980 92726260 89089039 84791176 79901256
3379 79901256 74487512 69353439 64033339 58902803 54344905 50293097 46644947 43491987
3371 43491987 40732993 38400970 36465088 34688605 32730449 31497404 30520715 29419270
3363 29419270 28395457 27865771 26995376 26242906 25702271 25356737 24906535 24383604 23874244
3354 23874244 23430628 23003542 22793220 22342667 21917747 21247035 20749249 20507103 20254784
3345 20254784 20015185 19555110 19208372 18926489 18822665 18640857 18292759 18094790 17888946
3336 17888946 18047931 17858982 17551957 17271428 16724722 16487125 16374336 15981764 15792941
3327 15792941 15416230 15044868 14956982 14581609 14335793 13945278 13725382 13571638 13337013 13351869
3317 13351869 13318538 13277888 13174733 12883992 12871858 12777884 12978657 13197819 13117426 13010062
3307 13010062 13161363 12929127 12992518 12932736 12685965 12488277 12314718 12125386 12203443 12004315
3297 12004315 12199379 12020975 11693292 11637420 11827983 11979008 11932611 11895900 11767393 11739349
3287 11739349 11921397 11854994 11899902 11802739 11876428 11826513 12000151 12116807 12290811 12379496
3277 12379496 12413255 12406769 12554700 12739015 12922204 13040033 13063962 13037272 13144695 13576015
3267 13576015 13885807 14025093 14126656 14500419 14640857 14916530 15294898 15498199 15675646
3258 15675646 15967013 16546185 16851551 17110048 17764954 18194946 18710004 18921745 19484519
3249 19484519 20184558 21044180 21616892 22003703 22285338 22793577 22966807 23497000 24117570
3240 24117570 24749115 25267503 25832345 26610235 27326838 27965051 28561623 29146705 29941687
3231 29941687 30915131 32010159 32969746 33690737 34850749 36175273 37465184 38825077 40180970
3222 40180970 41583258 43437046 45045468 46616586 48423897 50187601 52095115 54402202
3214 54402202 56617448 58951335 61639407 64528000 67452379 70706284 74689963 78686047
3206 78686047 83277452 88940460 94881197 101720663 109500589 118583656 128877014 140957088
3198 140957088 154560602 169917538 187781010 207739767 229734187 253715864 280754293
3191 280754293 310813872 342509422 373653357 400594037 422207234 437836775 444602619
3184 444602619 439509500 424080054 402862806 381251389 363094813 350688071 345728293
3177 345728293 348762521 359933825 378069410 400792767 420056399 422999879 400668210
3170 400668210 359311323 311958021 267430083 230574764 202274981 180795919 163794031
3163 163794031 149855408 137844196 127321876 117831381 109125205 102008624 95417686 89725372
3155 89725372 84557985 79967591 75855539 72112955 68783976 65642763 62710311 60193610
3147 60193610 57563987 55293307 53206573 51091359 48929289 47154904 45775130 44246285
3139 44246285 42824729 41531330 40197168 38862826 37795340 36503728 35214880 34082017
3131 34082017 33123442 32255290 31197717 30163979 29289032 28863342 28283952 27377266 26502819
3122 26502819 25632009 25150297 24456787 23887973 23424932 22869908 22440622 22003983 21293254
3113 21293254 20814603 20570371 20038768 19378624 19070471 18463360 18082301 17319156 16886083
3104 16886083 16769636 16376177 15884527 15370054 15000264 14678134 14464795 14209173 13708701
3095 13708701 13301303 12896869 12789577 12457889 12250496 11950236 11652897 11466904 11017197
3086 11017197 10752771 10783689 10544237 10202849 9843076 9602754 9534074 9193950 9037248 8843669
3076 8843669 8815456 8541916 8173861 8215220 8119582 7861503 7563175 7075557 7104076 7100886 7139400
3065 7139400 6874535 6882372 6888616 6705711 6545276 6386283 6274815 6242122 6041532 5848319
3055 5848319 5730593 5677135 5657413 5639730 5522278 5414945 5447943 5310436 5144648 5148517 4867522
3044 4867522 4797545 4651954 4887415 4824309 4486412 4564005 4279813 4292185 4329339 4118698
3034 4118698 3987653 4103634 3972388 4084512 4096014 3898302 3921338 3667908 3627961 3470831
3024 3470831 3452822 3342593 3280667 3370440 3207804 3270651 3065654 3207660 3003440 2995316 2949757
3013 2949757 2912183 2864191 2861470 2823924 2898444 3150251 3188488 3106297 2962959 2682754 2778647
3002 2778647 2812933 2569247 2793349 2828874 2797884 2800244 2471204 2413926 2531674 2504179 2386530
2991 2386530 2316446 2510740 2478810 2457491 2616357 2515174 2649697 2527201 2571092 2654896
2981 2654896 2431175 2404898 2312142 2436661 2336757 2069894 2289266 2516736 2308673 2127015
2971 2127015 2120404 2029224 2026656 2250000 2137193 2248047 2179357 2133798 2253165 2012132 2035442
2960 2035442 2147863 2011890 1898699 1846447 1816332 1727525 2038357 2105334 2169851 2137530 2133811
2949 2133811 2142021 2011205 2065443 2273556 2511461 2454172 2347332 2343906 2415185 2347885 2483075
2938 2483075 2579696 2810174 2855539 2957132 3023422 3191388 3334112 3319593 3438322 3436862 3472883
2927 3472883 3313397 3431412 3478907 3330905 3066418 3143664 3247345 3333060 3442308 3560032
2917 3560032 3652239 3383272 3089593 2755496 2486293 2520311 2507017 2301689 2188740 1930658
2907 1930658 2022983 1914057 1925659 1712049 1516661 1472411 1460329 1314114 1503576 1822510
2897 1822510 1507469 1211001 1252672 1325697 998548 1139292 1300243 1483797 1361613 1496936
2887 1496936 1437606 1317713 1240851 1288321 1102090 1101097 1236742 1163652 1133354 1126086 1061090
2876 1061090 1097850 1083759 1156460 1213791 1121029 1265282 1197819 1003226 694391 827496 783502
2865 783502 987737 1100068 932900 767993 644142 918780 1130583 976487 805423 610798
2855 610798 881794 937693 848544 829431 713270 666048 734641 796628 860228 722596 723848
2844 723848 752452 752951 642212 559037 664377 514859 691142 607739 701202 872737 760464
2833 760464 745895 633936 677342 743477 498409 575534 463703 596393 532097 671444 523769
2822 523769 428507 671289 699694 596340 531533 698213 828140 837124 595913 785199 831999
2811 831999 595618 407957 587085 519813 461736 655964 550162 630315 630239 677339 273810
2800 273810 291828 443460 527005 413108 539124 677345 564598 684121 503070 586160
2790 586160 544242 454452 449371 639003 619890 282056 230240 415910 374197 289313 356330
2779 356330 473194 130156 306697 450709 497763 492492 410674 326099 308582 168481 107212
2768 107212 211664 719616 396625 272766 195848 270499 332380 491173 487653 505224 345269
2757 345269 344142 411633 409231 457584 498613 552496 567968 539027 405375 672129 470393
2746 470393 224775 303149 538927 558722 669073 669237 546616 637169 559429 501220 569846
2735 569846 670623 750804 703889 1112350 1162659 1041482 957906 1034039 974177 1132719 909737
2724 909737 789594 608939 681399 825475 719521 543266 640642 583153 663316 438076
2714 438076 298097 609522 651687 645574 614669 300347 380896 311326 247854 472249 551892
2703 551892 604367 543279 536640 655112 687634 380802 392119 367920 684871 652848 357518
2692 357518 808603 726399 466162 558923 359985 524558 731424 457415 564977 694098
2682 694098 604303 550603 507730 809645 647926 583552 628061 472961 616562 633174 643906
2671 643906 763856 614672 527721 419951 427577 465147 486258 674276 503032 198791 372157
2660 372157 659337 544278 649174 774312 521658 284108 536375 541073 733935 777279
2650 777279 557773 498241 612100 482231 516776 364008 117438 261647 441503 649190
2640 649190 741038 790056 953866 930838 733919 678620 756033 560951 435967 375316 481578
2629 481578 840506 749238 804549 534507 442667 528585 572821 619008 888712 792218 761361
2618 761361 852590 720077 616531 522436 576178 577928 595767 551163 734237 761960 751760
2607 751760 753959 553291 527090 695634 831290 750664 805420 703916 701830 834317 935647
2596 935647 909802 888736 882868 958957 802464 910823 853933 733487 833371 846212 881871
2585 881871 1051361 1302347 1172805 1070889 1147824 1175469 1273423 1391120 1184330 1000146
2575 1000146 867801 1123932 1268773 1193807 1280708 1456151 1614561 1456064 1551347 1785835
2565 1785835 1929512 1835829 1765631 1836439 1893368 1955585 2017575 2001454 2292215 2232934 2490953
2554 2490953 2486087 2369810 2572079 2496939 2325467 2790355 3008706 3135832 3172757 3111559
2544 3111559 3307258 3430046 3388407 3765197 3588640 3700633 4085548 4136367 3972246 4068183
2534 4068183 4306053 4281058 4350084 4331690 4750298 4773595 4878302 5179050 5316562 5529590
2524 5529590 5682082 6086064 6191144 6418254 6775009 7274927 7737981 8001916 8615079 9101215
2514 9101215 9685105 10006246 10599343 11375024 12144941 12956968 13833899 14963170 16189291
2505 16189291 17422232 19224625 21375036 23717902 25977100 28401177 31521394 35429318
2497 35429318 40136530 45925850 52051409 59779972 69520907 82169487 96919653 115926648
2489 115926648 136860169 147106736 131579093 107855219 85925362 67018091 54806228
2482 54806228 45909551 39945216 34964189 31590424 28885383 26789323 25029808 23574530
2474 23574530 22197123 20431004 18589237 17097373 15581435 14721374 13585442 12650153
2466 12650153 11683452 11427106 10761057 10232117 9541382 9186381 8837888 8553204 8404763
2457 8404763 7957683 7882054 7742687 7548705 7423705 6884164 6592593 6341951 5993880 5824936
2447 5824936 5580268 5333593 5240205 5029572 4938243 4934086 4916184 4731335 4417993 4155358
2437 4155358 4071919 3772088 3756865 3589178 3632017 3566307 3733680 3580333 3331505 3040096
2427 3040096 3094927 2952871 2922582 2866063 2629212 2981712 2988781 2758854 2691408 2466022 2480459
2416 2480459 2681180 2785842 2619536 2343697 2216356 2216246 2017398 1959235 1853961 1938574
2406 1938574 1836528 1818544 1700626 1383209 1467386 1605759 1551478 1567519 1750837 1636332
2396 1636332 1486453 1600680 1444023 1246087 1304528 1406533 1560587 1191454 1283389 1212308
2386 1212308 1329358 1275845 1379817 1195318 1286418 1351601 1142110 938910 945737 1115189
2376 1115189 1052004 730277 930655 952770 756908 787708 859574 777908 797548 993606 994233
2365 994233 929173 955608 994712 838216 854368 642883 642978 635557 762827 914067 835855 640777
2353 640777 619141 827887 553634 506745 534296 602520 489504 426654 469514 611705 632877
2342 632877 563054 473569 714924 654594 541125 645862 525608 388836 509750 665184
2332 665184 537307 652120 689578 599658 718552 879836 538520 498734 336429 408997
2322 408997 343031 499775 320164 305792 353267 485711 371323 277603 453734 390048 471757
2311 471757 593672 678597 508528 518785 571508 522914 281199 262882 366547 426620 289492
2300 289492 307244 534995 253867 99325 33063 119211 392481 270055 298775 294638 237674
2289 237674 379886 481497 466209 452858 452231 249939 232773 452619 422082 287351 137418
2278 137418 3391 17145 296692 331378 416576 236783 575432 285527 219799 167900 229040
2267 229040 318270 276448 442198 386475 345610 394673 517140 542285 444055 223521 377234
2256 377234 762457 760745 501324 528706 536573 576471 594959 709026 569043 791373 906288
2245 906288 976909 881038 687503 465874 671824 571255 273608 144837 298196 491849
2235 491849 542875 411922 218265 337271 581561 647773 434530 268517 188011 385568
2225 385568 232176 196977 198578 329491 295856 9155 127665 46842 102588 232848 384299
2214 384299 431315 429159 224184 228735 219561 135153 330960 293505 184088 -2984 76060
2203 76060 26091 160601 -3638 -85127 85324 263917 204571 281650 345792 76234 -88215
2192 -88215 -104148 -151132 -159220 62802 -54762 -214263 -92756 23225 -97538 -112872 -56359
2181 -56359 130635 82693 45694 142104 96486 235107 112257 118608 233045 244783 297676
2170 297676 214374 297219 66320 95906 156738 226014 187290 83806 222079 250711 147899
2159 147899 -139170 -98152 50917 197299 221790 130078 356651 271343 -150783 -103643 102185
2148 102185 76859 299660 322769 109482 41557 140001 318589 225447 246806 224586 317032
2137 317032 324522 173975 289737 426426 277302 63383 253101 223372 78455 -204176
2127 -204176 -282989 -238111 -96655 -99243 40949 130357 -188871 -41828 19958 47459 -9932
2116 -9932 145879 336668 235099 351339 79003 126088 188247 116851 199463 246780 35193
2105 35193 115881 71950 134854 143972 6642 40485 143844 162527 223426 261899 283178 199911
2093 199911 37719 173663 -25546 289741 366063 407982 -36473 -210194 -195689 -150158
2083 -150158 -127944 -7789 142506 -107727 9268 53170 -139866 144545 253852 -37861
2073 -37861 -200839 -50871 107213 -146824 -187554 -16324 -40619 60571 6733 86884 141862
2062 141862 175981 164465 109836 -103489 113642 41980 205106 229551 85240 96748 115216
2051 115216 61342 -23534 181304 178969 135935 49995 191377 82294 43230 219241 111419
2040 111419 -108325 -34418 -113144 -54909 282887 438209 143876 139137 25849 101944 250732
2029 250732 235400 92155 24870 -4128 88828 161615 73071 186060 46980 57042 162743
2018 162743 149245 212684 350137 92799 -254297 -164570 -5958 222700 314965 285835 101692
2007 101692 -48537 118679 255116 222446 140244 217847 38910 -21133 126181 248729
1997 248729 214318 -63590 195211 346677 20990 -147419 40614 182575 392365 274176
1987 274176 -61221 53341 143773 -92170 73368 -22620 105625 265811 261635 186009 158480
1976 158480 -9003 126660 9497 -66753 130032 141493 -44887 -93840 55621 -198803
1966 -198803 -140241 255485 84728 40561 77943 -100784 -379397 -369216 -148857 -183888 110132
1955 110132 158792 313108 137628 -69718 52226 395680 250157 47471 -91560 -91077
1945 -91077 -101046 -35498 -2736 -35909 159088 -14075 33271 143114 41872 5167 -223220
1934 -223220 -171884 -6235 238538 36836 -245646 -254784 -201007 -4118 284209 200491 156435
1923 156435 125795 408441 329077 194219 45169 104130 21141 -22685 -12086 -108657 -73182
1912 -73182 -23750 158588 9227 170330 7918 38620 108311 77855 284773 227097 -109240
1901 -109240 40831 -74045 -181405 2225 101207 38999 69491 140941 114141 56773 26821
1890 26821 56973 -9530 -49892 -54811 -170200 -251782 -224771 -35298 -106130 -94868 9982
1879 9982 152208 55753 -226272 -231750 -225785 -249502 -90796 -144048 -62520 63333 -152679
1868 -152679 37119 -117750 -205086 -90613 -141379 -110379 99997 -7558 -59059 -49978 -345729
1857 -345729 -288601 -318561 -102238 -23489 -97944 -66162 -37905 111173 130506 -11333 -67976
1846 -67976 46638 65234 -18850 -53897 -3480 269168 176097 -20540 11341 -59248 -3110
1835 -3110 195296 29414 114737 82214 -48085 -24411 -6923 105711 88026 -8645 227017
1824 227017 320406 394272 218689 35866 127384 117201 97492 -51912 -48149 -54159 221541
1813 221541 -22723 -43663 93850 302176 186423 350074 337200 189521 129098 -38544
1803 -38544 78604 -246558 -537105 -186815 118962 323989 256810 139613 163486 483112
1793 483112 197555 11579 -7996 97012 -75310 -234822 -296835 -379283 -177251 -178609 -178095
1782 -178095 -282653 92851 122681 217495 98269 -59754 -134908 -30395 -188131 -147511
1772 -147511 -175821 -300018 -78910 -297933 -152612 -81241 111971 178240 26355 -44845
1762 -44845 -126480 -453114 -361566 -153184 33352 28372 -126322 32980 123319 -1725 -11062
1751 -11062 94665 16274 -641 -103781 60687 -31845 64280 -33355 -68328 -125193 -116995
1740 -116995 -20158 373465 257071 162358 104097 53313 180409 96358 -160468 -137368 -33483
1729 -33483 -105399 -48843 50743 90752 238248 208138 77507 280029 258923 152808 244184
1718 244184 131304 40713 174526 -33099 -327088 -425308 -222898 -9459 -154434 -70627
1708 -70627 20360 -90307 30831 -107426 -194452 -221606 -182642 -203957 -232154 -239202 -311800
1697 -311800 -163848 -125804 -52794 21449 25940 -142149 -190480 69632 157403 121871 -87404
1686 -87404 -168143 -60088 -201126 -186771 116775 40609 50988 177734 241289 -87405 -20608
1675 -20608 48320 -30691 14533 141792 289999 8218 92135 124891 164321 143371 174966
1664 174966 -11287 -166326 106684 -112506 -220392 30737 57713 101982 46745 116406
1654 116406 33258 46731 131741 315099 132915 -111244 58698 -79776 -276115 9206
1644 9206 174803 51096 144126 197741 287417 -49041 -21114 -51816 -93928 -89658 -233981
1633 -233981 -288208 -76776 89913 97313 -69380 -75571 -43843 127970 38965 -38338 20287
1622 20287 196896 1616 -122725 -71035 -123603 -92866 111792 250089 -77875 -77260 55956
1611 55956 154522 131920 -72878 -12091 -90776 109219 119349 -81475 172131 265085 97246
1600 97246 52368 99482 106021 74310 158994 59954 22465 175600 114511 45152 -103640 -71074
1588 -71074 -135128 -56297 -172832 -256925 -96048 -1490 105753 300266 279072 176984 54007
1577 54007 39061 161785 38379 116485 203435 145439 237467 -140005 -317946 9206 -60403
1566 -60403 -100274 163205 14557 97878 -2166 -29960 12650 -42942 51983 -65597 82947
1555 82947 -96676 8613 191137 239301 284931 47118 -68909 -288421 -414797 -529776
1545 -529776 -222657 -216332 91555 137440 325549 182349 185476 353600 259843 -140023 -262903
1534 -262903 -85812 -7309 -53480 -215480 -72928 -184984 15823 -58293 10284 113317
1524 113317 -43955 -251359 -86532 -17392 -58661 -246078 -198420 81253 52828 -26499 -13793
1513 -13793 132468 161100 129505 66818 -121233 -37979 157780 -19820 -60429 7657 209303
1502 209303 299448 157173 198653 143457 116894 45900 67555 83177 33484 195461 37549
1491 37549 -238172 9036 82093 19956 111879 11020 57001 338 22731 33563 78565
1480 78565 -180091 -353725 -262315 -77203 24730 -56581 140077 125497 -153239 -266983
1470 -266983 152042 73929 63887 -196886 -5399 16255 -56520 -26152 -34667 -134563 -110240
1459 -110240 26500 -44638 59280 -23890 25899 8384 89837 27447 -64973 -412006 -235425
1448 -235425 -205689 -6100 84109 6467 19147 -65355 -31992 -89725 -245279 -149063 19065
1437 19065 -100546 -123857 64378 62426 -182571 15446 -4308 252390 104947 -104632 7474
1426 7474 6373 -135944 22119 -131305 -229750 -378925 -109143 -37612 -73665 92886 8466
1415 8466 203819 218192 174862 67978 188496 110826 152317 256433 105848 64741 66402
1404 66402 99843 -174488 -118772 9406 147506 71758 -109527 -60697 -78738 66190 -531
1393 -531 -193734 -135517 -101247 87184 153971 150817 156592 55651 128203 50216 193735 184968
1381 184968 137792 -72297 -55013 72386 -75746 -18625 -16915 -24773 162316 214703 112940
1370 112940 53127 42132 -145951 -73439 110703 42733 -45677 -14487 -4495 187907 108811
1359 108811 28538 220095 301237 178232 80258 -18247 -98900 -16774 82793 180226 115331
1348 115331 -250813 -33245 -48038 -164881 -96030 -144477 -196880 -18580 -113827 -208195 -373306
1337 -373306 -264078 -276418 -154819 50910 -159971 -202607 -22110 -44717 -54518 -68345 -127076
1326 -127076 -42318 11365 97853 145761 47560 -28391 -88863 -195224 -278695 -160427 -53485
1315 -53485 -109351 -80384 -136287 82557 81377 128747 -148507 -254264 -35626 50857 142146
1304 142146 205381 82393 54323 128547 117822 138979 302421 81857 -39581 -55123 -152796
1293 -152796 75142 48877 -141477 -9223 -109163 -1789 45289 -122653 -152774 -180244 51077
1282 51077 -11660 -114462 -100236 -8032 -48915 36687 26921 182448 162324 -46928 -46000 -52593
1270 -52593 -29573 -253036 -283328 -251324 -162028 -141227 78386 -25683 -125169 -194626 22994
1259 22994 267027 137101 34101 178763 44263 71303 -97802 -48386 -163560 -76140
1249 -76140 36651 20769 50232 -66454 123575 107503 146918 75469 -74394 -5877 54204
1238 54204 77268 -224981 15156 142001 -24276 154722 165643 -14478 -82809 -59605 -12883
1227 -12883 -102372 -111052 -23428 -258668 -325946 -97386 90501 -170415 41065 -20669 -118230
1216 -118230 -56360 -66263 230227 199532 -7720 74785 31108 -36463 -180016 -141928 -183248
1205 -183248 -244143 -84030 -45741 -119837 3628 4875 -150800 -160750 67868 211521 176472
1194 176472 132308 57667 188795 200228 19157 28376 -87202 80337 232587 -29485 -117185
1183 -117185 -114439 -232552 -83662 -61808 -129865 -225664 -150845 -138624 -162150 -236640 10707
1172 10707 117361 121474 63209 78155 -309289 -135247 -67650 -99685 91240 -92178 -80112
1161 -80112 56317 230606 22879 -62718 173718 141897 93033 10127 -53565 -148820 -326462
1150 -326462 -169646 -98666 -181173 -45034 1563 7540 18002 -93380 -110223 -341701 -223930
1139 -223930 -8783 -215750 -123393 116660 24002 53941 -235635 -56725 -96582 23351
1129 23351 259151 -97636 -182547 -134583 -360309 -184026 -52307 -157673 -129647 145314
1119 145314 146655 211481 209242 25435 -216390 -69344 2008 2742 27119 -175607 -200499 -51847
1107 -51847 -85430 -297751 -118369 -77518 62334 116027 -25014 -224631 -306487 -107704 -152065
1096 -152065 -86989 -122500 -28445 -57168 56026 131109 147689 -80688 -261393 -116004 -77461
1085 -77461 -66355 -196709 6493 53955 -57085 5336 130058 197817 86580 107768 38856
1074 38856 94738 69201 -111234 42513 38920 -45442 -35814 -37275 -36332 -107921 64607 262925
1062 262925 -19374 -114972 -47464 -18463 126693 274594 187039 87707 147542 230996 310727
1051 310727 386027 386999 223617 96317 56198 178064 98923 -85719 90326 108823 137675
1040 137675 116365 151679 21353 -130570 59462 169474 97606 318162 110774 71927
1030 71927 148925 8080 -16252 -107862 -276661 -233732 -9803 4472 -150899 78252 67215
1019 67215 55286 -117870 -206368 -277351 18593 96189 53749 -55745 -102041 57871 922
1008 922 119976 -71660 -153589 -47174 88108 -74682 3394 -191112 -229955 -210434 -111661
997 -111661 -90378 -263327 -300121 -135586 -20110 -11835 -44905 -47224 78021 119741 111230 -41894
985 -41894 -42192 -91644 -59336 -190974 70252 7808 -204032 94502 44875 -18524 -71814 46482
973 46482 82214 -76543 -85563 -69712 -211019 -125475 -7556 42685 31132 38634 107460 143227
961 143227 67152 59183 94116 161332 85053 -22807 -52948 -110709 -491 235400 108989
950 108989 63497 -10648 121944 193542 131646 253549 201467 -22794 -126004 -49184 84669
939 84669 39657 206723 198694 17322 200222 54866 -124239 -266645 -293374 -441370 -390616
928 -390616 -275938 -214048 -39406 -199524 -216060 212122 258046 16330 86269 184895 117021
917 117021 179301 -22961 -62330 -153177 -180302 -124304 102376 97209 15886 171100 94178
906 94178 55812 -72064 97554 -780 -56054 -44014 31160 48073 -25864 34259 -9044 -34228
894 -34228 168049 -45530 41479 32653 -41741 -258555 -133933 -156319 -256390 -131472 -206406
883 -206406 -207464 -191056 -107311 -102595 -48169 16564 -153446 -130810 -135396 -25497 6448 -178502
871 -178502 -113266 -241736 -32305 -159862 -183094 -125556 44249 34832 33772 277956 -8572
860 -8572 -85927 -61685 46242 23125 -47098 -48672 -97992 221182 168199 324953 137096 23134
848 23134 130290 110178 -147370 -19333 -16100 85283 40522 283620 173799 146732 161643
837 161643 28624 72628 -84126 -44663 -182086 -269001 -193489 -111410 -311244 -132617 51272
826 51272 38270 177748 35248 19514 160943 230326 -77590 -237671 75063 122534 -156364
815 -156364 -110179 -76706 19716 43885 -154168 -134582 -133365 -18115 -176964 -51842 89247
804 89247 53461 -26785 215588 60272 -232879 -165632 49548 -143488 -165628 -21822 -56402
793 -56402 13689 69375 35669 -156205 -178803 90181 84548 173469 209846 201018 108793 70612
781 70612 154802 151319 7956 7307 -245916 -156320 -67326 -35608 -30624 33050 5449 -42106
769 -42106 -506 -108993 -99093 183382 225391 36775 -91716 -177246 -231817 -178551 -44671
758 -44671 -224710 -135305 63786 136871 -7414 -33795 -91901 -82322 -212033 -44289 141949
747 141949 8258 -73177 -23177 -186867 153029 3694 -25591 57322 -67437 -31819 5538
736 5538 -13670 -125248 8184 15096 84354 222639 40594 -54452 44091 24190 -80898
725 -80898 -31592 253243 171561 249264 24443 -131906 -127210 30720 -325325 -203139 193514
714 193514 -67850 -119382 144852 167467 3794 159542 107119 56566 -171044 -87680 49939
703 49939 -87906 150492 73944 12251 97541 136979 109527 -182904 -114313 -5478 49600
692 49600 -105747 45829 88983 75447 5465 -147028 -37781 -169585 -77143 -180735 -302925
681 -302925 118909 37535 -26994 -118334 -199294 -277022 -372237 -164864 15015 -51004 29208
670 29208 65071 197080 178272 321075 138309 -143783 116408 -9696 45119 37502 -58177
659 -58177 37230 23399 85395 391854 310499 167200 -6957 -27676 -506243 -159600 30665
648 30665 24928 209110 -6159 -92206 -16609 -11108 -116394 -106311 -29571 25133 29932 -122254
636 -122254 -101041 -138850 -144162 126666 -49434 -45329 -38887 184223 36904 62368 140472 224677
624 224677 87877 -88290 -83670 -13722 -116440 -67447 -149350 -436403 -254045 87391 -182455
613 -182455 -137559 42198 -53836 -52144 -81872 -50102 -12877 -81763 -197393 -90161 -267302
602 -267302 17707 273715 90029 -84695 -58867 -262703 -92157 298138 215910 279921
592 279921 143025 253400 136980 -1918 138187 161727 62004 -157802 -109980 33971
582 33971 93836 177240 85496 -13725 -35387 107745 189806 292858 225759 -170574 -79083
571 -79083 113714 239090 75707 47274 -100861 36863 160668 164313 -57611 -58477 -189200
560 -189200 -108517 -88971 -68890 -115128 -66336 87796 222528 38070 -98893 33845 109865
549 109865 -12971 -61774 47907 -143602 -164710 16089 167354 342832 205765 112724
539 112724 -34952 -33233 -97919 -13685 179093 193902 152185 -8037 -24376 -95751 105075
528 105075 64310 3838 15126 36025 80071 156451 -154114 -154183 -109221 -91522 31063 87976
516 87976 -71345 161372 77731 156580 21914 56728 332892 200857 -45047 -223196 -289056
505 -289056 -89619 -9507 100936 48382 -22114 144312 90324 -109435 35419 1401 -186599
494 -186599 -387285 -163657 66325 52915 30964 -45466 -40937 7143 -24115 -83800 -6373
483 -6373 202433 91749 15991 -134625 -341798 -84378 -41772 -185587 -50976 90964 141911
472 141911 243023 280509 216450 -53227 7478 7272 155430 -123724 -94392 -195973 25860
461 25860 233250 288896 155348 -44219 -124387 -39792 54664 68326 -153354 -110709 -18046
450 -18046 -158772 -159739 -179111 -74080 -128363 -64515 -25608 -50249 -20493 34539 -89361 -228020
438 -228020 -126487 -217271 -366740 -199634 -54352 26529 58325 11629 -125515 -167118 33277
427 33277 -102936 -136727 109284 -96615 -119476 -168406 -309787 -27805 -44092 -71607 -102949
416 -102949 -214836 -315115 -96033 151705 142307 205940 27103 -126602 -190286 -71246 -228027
405 -228027 -43249 -67913 -141003 73269 59640 -34887 -33113 115604 202826 162623 121935
394 121935 -87640 -167829 -59359 -121762 -245751 -176342 47050 27426 -31830 -220509 -201271
383 -201271 -116697 -50927 183772 -42888 -384598 -173165 124278 144266 76338 127160 219273
372 219273 27734 -112667 172362 164578 70035 31199 -207440 -329039 -15349 -73952 -42103
361 -42103 13541 -82940 -109903 -337432 -258698 94552 178478 101160 233091 92980 -190442
350 -190442 -244942 -161700 -71751 108225 -145628 -43547 139023 72677 124529 33657 -142608
339 -142608 -194616 -409032 -388322 -279936 -109055 -97217 -185644 -26162 -46334 38203 173729
328 173729 122374 -36699 -111982 -40674 -200658 -338468 -189252 -17933 40900 -39134 -152407
317 -152407 -97130 222079 121521 143277 29699 22203 68969 -45078 -132547 -269600 -216030
306 -216030 -73422 -2391 -14446 140209 61259 86510 -160756 -126928 -117292 -153911 8301
295 8301 -35200 166856 81265 -124588 -6036 135850 -11325 -237357 -19487 108156 122790
284 122790 81460 -158968 -212597 -55034 -46253 -204518 -106876 -180685 -242240 -76346 128990
273 128990 128590 96987 -5129 -257430 -402665 -164707 52923 154546 115205 -14464 -138068
262 -138068 -161798 181692 188994 -31435 -147874 -220646 -106869 -95530 -28883 245243 266270
251 266270 -5134 -51585 -63390 -94996 -118479 -159920 -60300 -15109 -99124 -155631 -301982
240 -301982 -215037 -370704 -25126 278480 160406 134356 -98230 -246024 -326196 -34653
230 -34653 31766 -143890 -126140 -262777 -341314 -138885 31870 86086 193537 -89323 -302278
219 -302278 -209446 -240027 -165555 93563 190381 117193 54309 119685 67239 -144383 70176
208 70176 -138424 -271107 -159941 -72711 -177286 -92908 121993 124377 172386 108540 -96545
197 -96545 -179793 11060 -60219 -149618 -90097 -317720 -156316 -2427 -83329 -24309 160082
186 160082 -65852 64755 40414 -69519 -121366 -209701 -101985 -158558 -105170 -297676 -251531
175 -251531 -23640 -5973 -29987 110398 -137057 -50291 50675 7208 -103262 120718 88162
164 88162 -19150 -21083 -50526 186008 202546 85398 56935 -40818 -30605 126252 16322
153 16322 60857 -18659 -250677 -62300 81765 67782 -39945 23466 -60186 -178577 -137995
142 -137995 14019 59997 -198459 -24779 37592 32005 -183700 -247289 -158893 -15929 -121370
131 -121370 -7515 57217 5207 -156663 -289068 -171582 -39790 119922 -114910 -148423
121 -148423 -152416 -21393 133822 -96099 -71932 -33167 -195882 -211387 -171139 10324 77480
110 77480 -4293 168243 2905 -33171 116798 -16930 -109679 -88160 -227657 -27983 -150222
99 -150222 -150729 86096 71409 -71701 -155793 -239555 -173058 -35672 -183914 -83755 -92906 -118605
87 -118605 -136296 -183421 -124342 -108290 -139415 13027 -85029 -3084 53147 -44176 113284 78151
75 78151 -62467 74745 38984 -69106 -229354 -217246 -191368 -303707 -268971 -107414 70938
64 70938 32203 -110665 -960 26644 104667 23323 -45727 34906 -91553 -135468 -243227
53 -243227 -201779 -3339 -81476 -70315 55989 50690 37707 191972 76401 54625 104474
42 104474 114210 14898 -122270 -69393 -38557 -120470 -85529 -121561 -99785 -115048 -37112 -204103
30 -204103 -85716 -45429 -164209 -177119 -326607 -77611 -109739 -144659 -147638 -108517 -127550
19 -127550 -235992 -55565 -6578 -96362 90117 20481 -5718 -18836 140804 185199 -45297
8 -45297 -126220 -99268 69562 114806 -89213 -165526 -113019 -199273
0 -199273
$$ Imaginary data points
##PAGE= N=2
##DATA TABLE= (X++(I..I)), XYDATA
16383 -2624786 -2675915 -2656369 -2802271 -2702709 -2565318 -2604046 -2559101 -2626249 -2528787 -2412670 -2335003
16372 -2335003 -2288221 -2268016 -2189440 -2142510 -2150641 -2163990 -1966440 -1938148 -2070896 -2075794 -1893180
16361 -1893180 -1893052 -1855782 -1815043 -1834185 -1711703 -1728410 -1740810 -1631821 -1579440 -1635545 -1613929
16350 -1613929 -1483667 -1452395 -1435902 -1411848 -1419139 -1216781 -1255732 -1291583 -1268380 -1118639 -1156998
16339 -1156998 -1157874 -1080311 -1012742 -1112056 -1096036 -953163 -877841 -936268 -835315 -751515 -836964
16328 -836964 -650808 -660135 -587927 -581349 -463405 -430441 -343750 -304888 -395237 -343689 -345483 -344521
16316 -344521 -362950 -104881 -26779 -88686 -43753 51578 105582 149124 156402 213706 2765
16305 2765 152518 205673 377757 407858 191463 336644 328539 438578 250036 236991 371724
16294 371724 403048 480692 550714 614012 676178 727517 821435 755771 806945 681737 736900
16283 736900 837203 782069 929834 907597 1038025 1044116 1015361 1093617 1242682 1217118 1153835
16272 1153835 1042366 1125412 1195794 1107602 1418540 1339321 1268627 1358457 1521612 1514503 1363951
16261 1363951 1520400 1448741 1568622 1606072 1383158 1550794 1494718 1573160 1633226 1560828
16251 1560828 1667537 1697840 1796396 1834449 1852238 1593180 1715405 1918489 1965964 1827635
16241 1827635 1852921 2021491 1937756 1812085 2037124 2203637 2054666 1896735 2100669 2211783
16231 2211783 2226945 2387658 2270781 2317209 2145616 2147421 2136074 2132698 2119599 2253346 2226293
16220 2226293 2304389 2284350 2125598 2356386 2400436 2292960 2275264 2345924 2382613 2686326
16210 2686326 2584163 2689332 2797233 2861988 2732665 2557092 2572750 2526852 2498475 2484812
16200 2484812 2636513 2613140 2563463 2679309 2728139 2618085 2722096 2638442 2902264 2899576
16190 2899576 2834779 3118111 3036087 2976352 2934524 2867728 2744163 2766293 2600933 2839693
16180 2839693 2982702 2712475 2749667 2689915 3066100 2893220 2893618 2974253 2891744 2685538 2729003
16169 2729003 2991808 2793359 2791879 2751918 2921208 3041458 3118709 3027439 3078595 3191174
16159 3191174 2987964 3130075 3087323 2972665 3012870 2925820 2898771 2901470 2854375 2958273 2958458
16148 2958458 3075474 3233822 3343981 3237889 3163469 3266717 3241652 3063586 3077173 3227233
16138 3227233 3065252 3104666 3325412 3352680 3448632 3162212 3084990 2977697 3094972 3111787
16128 3111787 3135801 3133840 3477128 3314982 3265618 3363710 3046305 3192466 2943181 3113352
16118 3113352 3240673 3544752 3438388 3194062 3064532 3478998 3490384 3515548 3385376 3509401
16108 3509401 3633214 3680900 3663606 3861514 3609145 3371465 3457862 3393326 3256215 3235725
16098 3235725 3414076 3508347 3204634 3340527 3343730 3304033 3347383 3290092 3358179 3382642 3389372
16087 3389372 3149207 3108880 3296799 3459848 3285933 3265377 3342854 3546403 3326780 3320723
16077 3320723 3202930 3496408 3496526 3557554 3588764 3535863 3622150 3526751 3377938 3387156 3287100
16066 3287100 3393122 3502677 3396617 3331521 3626176 3602511 3477200 3455918 3557949 3534868
16056 3534868 3317038 3278244 3318922 3295654 3381652 3521555 3565421 3472737 3427186 3602095 3514923
16045 3514923 3266115 3189147 3301611 3386092 3491366 3330676 3383740 3292412 3209321 3304704
16035 3304704 3138686 3361963 3539666 3492664 3521403 3438943 3585320 3490605 3377376 3329455
16025 3329455 3605569 3608715 3649492 3558027 3565520 3491047 3433409 3520900 3080901 3012696 3483962
16014 3483962 3542999 3437159 3271215 3444534 3535347 3369714 3354162 3295507 3475380 3434132
16004 3434132 3299351 3356376 3540766 3443911 3369717 3208923 3395568 3490420 3575523 3738816
15994 3738816 3618952 3476455 3408866 3543403 3715573 3637013 3460355 3483125 3586072 3587283
15984 3587283 3570057 3402360 3382674 3496860 3553988 3361743 3374735 3518707 3452352 3388806
15974 3388806 3411193 3452323 3270227 3391598 3623664 3485154 3442255 3752900 3613342 3583094
15964 3583094 3628214 3628665 3517367 3465927 3438793 3562464 3430579 3403669 3433018 3349542 3636703
15953 3636703 3697771 3379034 3061117 3064375 3202900 3612121 3489141 3470937 3644283 3592747
15943 3592747 3344568 3431416 3457806 3384686 3642372 3624493 3565232 3590702 3547123 3851834 3805576
15932 3805576 3628461 3703161 3562681 3511597 3588033 3460191 3479321 3626392 3564527 3497853
15922 3497853 3397285 3636398 3708255 3377394 3447333 3463710 3409554 3536227 3314757 3420052
15912 3420052 3604781 3583080 3668031 3781300 3850906 3729427 3731653 3554228 3423422 3588199
15902 3588199 3475725 3329417 3316590 3287820 3263469 3325393 3520624 3575861 3475743 3446191
15892 3446191 3352827 3501810 3407270 3436713 3410233 3455919 3504920 3484898 3746438 3782945 3675436
15881 3675436 3701857 3542985 3640039 3582062 3528338 3586906 3579222 3455878 3364797 3347734 3408994
15870 3408994 3516100 3373499 3423561 3346437 3397595 3416070 3377417 3464127 3579447 3669271 3581054
15859 3581054 3325384 3569203 3754031 3728798 3641521 3344738 3214766 3512075 3587470 3678709
15849 3678709 3569755 3528093 3645378 3588464 3734589 3615216 3406763 3401788 3723535 3959382
15839 3959382 3696508 3595817 3677855 3716676 3625371 3455671 3232372 3212461 3231692 3415878
15829 3415878 3549690 3549730 3375909 3211027 3211580 3406528 3360438 3375970 3538816 3631422 3597743
15818 3597743 3517452 3489129 3524368 3743392 3502997 3457592 3345718 3447608 3507367 3746656
15808 3746656 3578057 3370984 3274558 3305259 3363478 3356913 3351485 3300557 3532524 3343960 3433810
15797 3433810 3601819 3678581 3549524 3596777 3656848 3572831 3434946 3580942 3534951 3577987
15787 3577987 3458271 3424664 3557748 3411619 3450089 3629538 3627087 3683746 3932670 3886307
15777 3886307 3978979 3868790 3665682 3578005 3982735 3684219 3640349 3653129 3808200 3742770
15767 3742770 3615338 3615713 3664583 3652893 3474784 3635774 3747658 3789834 3597767 3669176 3769374
15756 3769374 3795886 3631641 3432382 3525897 3629227 3640331 3564222 3716611 3686674 3552676
15746 3552676 3552722 3579804 3695257 3518193 3512292 3544616 3726065 3712639 3440898 3406801 3509025
15735 3509025 3619732 3488216 3535550 3543051 3455680 3586424 3616146 3747598 3520158 3485070
15725 3485070 3557885 3614304 3690725 3550026 3552336 3777253 3923641 3677100 3590674 3761024
15715 3761024 3662147 3535877 3329178 3563191 3821766 3602889 3339922 3342232 3461129 3559383
15705 3559383 3850776 3704558 3699034 3575377 3512347 3645865 3805123 3724457 3553214 3675475
15695 3675475 3512823 3599958 3714565 3657480 3474964 3451268 3498692 3582202 3514107 3664663
15685 3664663 3779280 3641589 3509546 3736778 3674013 3918345 3856490 3648534 3569413 3564092
15675 3564092 3550390 3485671 3660102 3610869 3498030 3471935 3614432 3526779 3606809 3770287
15665 3770287 3802401 3789738 3795186 3454722 3536092 3528712 3679474 3313018 3555825 3819490 3593515
15654 3593515 3664161 3634755 3438862 3293507 3621117 3712778 3442798 3460254 3523083 3435964
15644 3435964 3539694 3422825 3290674 3528900 3534470 3281112 3531701 3664400 3720419 3568053
15634 3568053 3709216 3787835 3630760 3535341 3489289 3608192 3413119 3480240 3486034 3593148
15624 3593148 3782570 3711047 3733548 3689427 3728757 3831624 3669152 3701145 3769706 3685543 3878682
15613 3878682 3800710 3779788 3707548 3792317 3597174 3646439 3780203 3705480 3565537 3486767 3540488
15602 3540488 3695280 3755173 3755666 3775773 3512604 3601956 3538889 3465827 3495193 3558439 3398852
15591 3398852 3561112 3635028 3661153 3795823 3594733 3558079 3752389 3855803 3804453 3746328
15581 3746328 3713619 3674952 3742470 3728488 3633689 3716342 3821794 3734482 3753126 3721975 3808681
15570 3808681 3570854 3453385 3616480 3513318 3679979 3680858 3533467 3696703 3621783 3597419
15560 3597419 3599197 3692676 3742393 3677897 3905625 4099080 3968482 3813117 3744871 3732103 3679321
15549 3679321 3490518 3486724 3681477 3570673 3431379 3321942 3369234 3573583 3739384 3620602
15539 3620602 3458827 3476731 3558628 3689034 3610824 3697012 3965329 3892441 3889068 3930123 3402899
15528 3402899 3616439 3588705 3719108 3882327 3793498 3562784 3805319 3826408 3644285 3588785
15518 3588785 3634664 3532924 3479682 3651136 3465398 3485752 3369860 3610783 3689631 3599815
15508 3599815 3445590 3603988 3767010 3856269 3812740 3698860 3716166 3528922 3500915 3613086
15498 3613086 3640351 3592851 3831153 3908751 3671385 3655149 3860945 3634629 3507910 3379722
15488 3379722 3189675 3443393 3643177 3767220 3477213 3556529 3516598 3520151 3694404 3738594
15478 3738594 3525545 3471973 3558171 3518277 3541287 3462754 3362535 3510732 3625711 3616836 3845697
15467 3845697 3901059 3801336 3550337 3741169 3841431 3900357 3709120 3500276 3590319 3593818
15457 3593818 3661818 3697188 3440956 3395953 3566999 3340800 3341096 3715127 3866832 3596760
15447 3596760 3546602 3611662 3577074 3550401 3439872 3791798 3876416 3771049 3576281 3748352
15437 3748352 3805720 3620129 3525749 3548198 3648765 3738033 3766691 3830891 3712901 3711760 3590560
15426 3590560 3532918 3577813 3522244 3471593 3339746 3518849 3771376 3971557 3796532 3648718
15416 3648718 3753491 3633550 3676593 3611037 3598759 3755543 3514620 3329396 3349779 3669032
15406 3669032 3585673 3761866 3562245 3561901 3695731 3819265 3807984 3850984 3832302 3707123 3724388
15395 3724388 3667183 3722248 3627873 3539093 3716502 3771365 3804957 3967320 3988399 3749539 3720588
15384 3720588 3702866 3797165 3849714 3687477 3589728 3624332 3711188 3672457 3722919 3479426 3654740
15373 3654740 3957900 4056610 3888759 3606082 3617274 3678131 3688952 3521144 3580586 3566718
15363 3566718 3425502 3521846 3696550 3590267 3649864 3730907 3688537 3611879 3539989 3554845 3459107
15352 3459107 3412210 3635040 3833928 3638600 3508682 3537709 3802852 3868500 3798883 4040417
15342 4040417 3808321 3891427 4039974 3981785 4063845 3870301 3895021 3729827 3779999 3706993
15332 3706993 3474111 3270106 3319317 3413173 3433247 3624922 3730842 3556439 3718130 3720218
15322 3720218 3645915 3481620 3596273 3796724 3646514 3585338 3453520 3550218 3945491 3932415
15312 3932415 3865232 3547796 3577420 3863560 3809221 3805961 3688384 3823782 3801398 3727468 3599722
15301 3599722 3702727 3871213 3761492 3741809 3628930 3637832 3835152 3793144 3679392 3585472
15291 3585472 3537268 3595090 3654061 3571617 3654083 3550250 3315878 3559239 3668947 3453255
15281 3453255 3578816 3839991 3905330 3835443 4132340 3982238 3712699 3931814 4040552 3857481
15271 3857481 3709242 3631357 3628049 3454610 3589203 3748283 3737688 3950622 3843431 3864322
15261 3864322 3915749 3892071 3844971 3836997 3902950 3817849 3601259 3811121 3855713 3630064 3641592
15250 3641592 3567800 3593685 3549787 3611276 3673229 3532070 3787918 3887205 3891612 3917825 3964511
15239 3964511 3941931 3845067 3838194 3774902 3928329 3877862 3888984 3851486 3821032 3538456 3450953
15228 3450953 3510187 3520320 3658816 3759149 3860422 4030809 3880162 3816530 3891407 3904462
15218 3904462 3733573 3526943 3706234 3909386 4035052 3869244 3861029 3654906 3740847 3731207
15208 3731207 3730111 3693550 3772278 3855180 3688104 3849198 3812484 3955620 3806166 3665435
15198 3665435 3805068 3622742 3604521 3705040 3638424 3639311 3505603 3515177 3713372 3734191 3670065
15187 3670065 3572622 3744495 3786395 3680150 3520382 3803294 3757360 3828510 3613571 3637759
15177 3637759 3616651 3668956 3769061 3833644 3680249 3715381 3672651 3541586 3777411 3682351
15167 3682351 3620687 3510206 3671715 3758163 3620500 3794920 3870992 3568833 3738578 3755929
15157 3755929 3809409 3622759 3571243 3639929 3660652 3973502 3881243 3564464 3436353 3481142
15147 3481142 3643881 3656312 3851201 3816712 3743407 3593366 3687993 3699319 3745870 3859487
15137 3859487 3854928 3863589 3807956 3792971 3612596 3571290 3509819 3542583 3621649 3897512 3992437
15126 3992437 3743444 3957411 3956114 3748145 3607929 3699641 3645290 3725788 3716035 3838638 3788254
15115 3788254 3692445 3544888 3664449 3874230 3914097 3946139 3796848 3786991 3748795 3584048
15105 3584048 3723999 3680095 3702870 3665045 3588693 3690115 3666879 3674004 3692469 3719954 3652577
15094 3652577 3541378 3705827 3805049 3831455 3638950 3766572 3746556 3828640 3834349 3672614
15084 3672614 3746036 3652435 3593176 3451552 3721110 3549049 3719589 3838737 4023072 3948686
15074 3948686 3870305 3827837 3835026 3902769 3789149 3688706 3662614 3777527 3765130 3810764 3857963
15063 3857963 3841173 3923601 3837896 3916737 3701396 3726422 3697039 3727289 3888618 4047466 3818349
15052 3818349 3967521 3880865 3771155 3727908 3789715 3718684 3722807 3864065 3683344 3973610
15042 3973610 3881443 3826664 3778367 3928455 3646125 3561257 3614967 3710073 3845463 3875771 3908899
15031 3908899 3813234 3784559 3783456 3804267 3932682 3875179 3770153 3956925 4061240 3984060 3849590
15020 3849590 4015111 3866922 3790153 3748183 3608479 3608751 3532871 3781655 3623241 3724062
15010 3724062 3832751 3534986 3790997 3613635 3787986 4136925 4167875 4014835 4095509 4007325
15000 4007325 4198923 4132808 3833370 3927713 3964696 4130732 3997605 3671491 3636122 3704867
14990 3704867 3819400 3701530 3612671 3950200 3832287 3902588 3727281 3727217 3799241 4004798 3869994
14979 3869994 3688606 3551519 3335430 3513471 3441639 3663660 3949816 3952315 3868740 3897281
14969 3897281 3783724 3733264 3976684 3902043 3789338 3828431 3788523 3858538 3870119 3745552
14959 3745552 3928225 3952067 3806611 3920677 3783588 3857676 3935493 3893274 3890854 3861911 4255995
14948 4255995 3881180 3723692 3855192 3775826 3841251 3956987 3870740 3713416 3688052 3790685
14938 3790685 4008820 4038094 3885422 3872358 3741941 3761551 3607412 3747685 4006722 4150631
14928 4150631 3913494 3795470 3765603 3855323 3835225 3844266 3809834 3782341 4166803 4061230 4086839
14917 4086839 4024363 3915989 3848016 3833719 3755260 3485815 3774532 4030197 3827826 3899210
14907 3899210 3784519 3681686 3819321 3799636 3868417 3879135 4040396 4122385 4010635 3853436
14897 3853436 3926626 4119457 4011370 3840740 4027876 3976582 3683446 3960821 3843473 3806817
14887 3806817 3635990 3946967 3739068 3663052 3854453 3672736 4003956 3990346 4120116 3942260
14877 3942260 3817244 3922767 4235260 4103138 3860295 4028466 3755183 3807426 3857330 3845484
14867 3845484 3790060 3642091 3760298 3771133 3598948 3674558 4076051 4077110 3973279 3906572
14857 3906572 4038978 4102554 4070726 4061413 3818472 4056641 4226731 4153464 4125395 3955564
14847 3955564 4020311 3899640 3858955 4095656 3940082 4012235 3913857 3993452 3972192 3961877 3831449
14836 3831449 3814109 3817478 3879067 3840583 3955656 3847208 3791243 3934414 3902201 3921031 4136650
14825 4136650 3781900 3650186 4051139 3890581 3660088 3838929 3966659 3727617 3921303
14816 3921303 4052177 4022295 3995609 3939888 3968852 3942803 3896417 3986862 3880772 3983949 3832739
14805 3832739 3858441 3947374 3912383 4127096 3986506 3861754 3734950 4010438 3910803 3869673
14795 3869673 3918508 3917059 3951444 3784763 3694179 3700229 3669900 4025364 3989544 4019262 4135417
14784 4135417 3874243 4002389 4062721 3864997 3853896 3941256 3768185 3989153 4116364 3773875
14774 3773875 3902870 3867600 3964071 4048507 3857611 4038777 3825654 3917442 3901732 3802986
14764 3802986 3775895 4061776 3912009 4012660 3967310 3854156 3725383 3816077 3817734 3791193
14754 3791193 3824488 3751065 3762474 3866715 3826949 3766378 3903794 3985223 3999153 4037969 3760839
14743 3760839 3736077 3791386 3690799 3682036 3902579 3981384 3766681 3733687 3880359 3902186 3785370
14732 3785370 3806213 3658655 3561791 3681594 3654911 3797381 4013502 3770122 3839615 3910515
14722 3910515 3999543 3890449 3782657 3932469 4075577 4080329 4035744 4122016 3930049 3747654
14712 3747654 3592199 3806038 4060144 3967069 3976938 3946747 3970985 3877276 4137480 4324626
14702 4324626 3947941 4018164 4057870 4033026 3951856 4121318 3945047 3962863 4008469 3907723
14692 3907723 3968167 3923032 3886495 4146076 4116715 4001226 3942668 4002708 4089282 3958763 3938284
14681 3938284 3933808 3868864 3925949 3849945 3607313 3713298 3833202 4128373 4076515 3970977
14671 3970977 4027033 3952252 3889265 4074302 3958420 3911922 3938837 4303997 4145992 4028393
14661 4028393 3910328 3973759 3795251 3780209 3824834 3954408 3973468 3913338 3946209 4073680
14651 4073680 4123325 4121227 4046942 3938625 3954267 4003658 4087477 4083350 3961693 4028178 4003099
14640 4003099 3971885 4136313 3986762 3970060 4002148 3857999 3891222 3882950 3771279 4026101
14630 4026101 4088804 3933135 4011001 4069339 4089457 4124390 4077153 3954284 3903708 4073049 4155416
14619 4155416 4214897 3967038 3699836 3721168 3821234 4018034 3842155 3784484 3983920 4069663
14609 4069663 4080813 4066265 3794847 3831737 4193182 4057712 3931179 3954584 3691291 3799569
14599 3799569 3850439 4037790 4257187 4124507 4177898 4303624 4112363 4007872 4038067 3983233
14589 3983233 3979584 3835280 3872333 4047950 3987611 3879801 4068899 4063431 3935271 4074325
14579 4074325 4133243 4048867 4001379 3971389 3915758 3931818 3912795 3941297 4011626 3998220 4169197
14568 4169197 3972737 4127302 4263463 4042932 4020032 4114491 4110525 4270778 4011309 4093126
14558 4093126 3890241 3777987 3775919 3916224 3887986 3914811 3948058 4129318 4117965 3890376
14548 3890376 3855325 3952502 4057676 4080123 3978410 3853244 3862794 3940083 4114081 4016764 4167339
14537 4167339 4252586 4059173 4046068 4160132 4211958 4130604 4248396 3971191 3952688 3904400
14527 3904400 3987539 4129551 3985678 4107528 4089496 4122953 3990790 4072050 4189061 3988399
14517 3988399 3909074 3878746 3733716 3818279 4026978 4109913 3972357 3987170 4176773 4144580
14507 4144580 4203667 3898974 3952728 4128556 4188506 4292002 4025240 3916159 3931298 4259102
14497 4259102 4151572 3962879 3834624 3808575 3948196 3971463 3856147 3597332 3809527 4020048
14487 4020048 3878407 3932030 3965376 4234809 4201713 4078439 3888666 4021667 3904938 4060905
14477 4060905 4172832 3966318 4207000 4310951 4247450 4113063 3980206 4049140 4035923 4075108
14467 4075108 3959141 4100594 4126855 4003326 4009591 4070291 4055602 3819650 3727016 3904715
14457 3904715 4011588 3998578 3905525 4057080 4152442 4164595 4126121 3922133 3892870 3949664 3901253
14446 3901253 3893949 3977932 4218003 4208365 4234538 4069379 3981219 4031486 4097229 3984584 4108034
14435 4108034 4145598 3811712 3826455 4101542 4336390 4322302 4230106 4204457 4207991 4116108 4108061
14424 4108061 4120740 4037784 3973832 4277628 4180636 4103864 4246249 4425845 4298480 4253415
14414 4253415 4364506 4318822 4264871 4236906 4171860 4073368 4151142 3978730 4124393 4096245 3987232
14403 3987232 3893558 3692265 4083305 4236587 4121232 3874960 4224152 4084153 3853381 3856164
14393 3856164 4107782 4022209 4100277 4049733 3922752 3963393 4065562 4140490 4121679 4098979 4015335
14382 4015335 4089023 3982846 3897516 4046168 3929909 3949745 3995291 4066533 4095136 3969049
14372 3969049 4262463 4360695 4352693 4410326 4201449 4117992 4290918 4127478 4098403 4061700 4041584
14361 4041584 3962900 4311437 4203282 4155406 4148696 3906553 4072321 3991243 3889362 4018540
14351 4018540 4267159 4344991 4309973 4229470 4060793 4068823 4244873 4439760 4439087 4413854 4196831
14340 4196831 4018057 4081635 3939489 3953164 4070142 4284597 4282807 4218144 3958087 3901527
14330 3901527 4110331 4106912 4187952 3980929 3929698 4196847 4333085 4203509 4133617 4221166
14320 4221166 4028434 3990923 4230513 4149147 3855629 4048840 4136087 4079750 4154586 4101244
14310 4101244 4327067 4207867 4259647 4164722 4135959 4022617 4013493 4086493 4039897 4058236 4093598
14299 4093598 3944161 4022377 4263579 4286448 4189728 3987100 3947943 3942346 3934684 3952023 4241069
14288 4241069 4209486 4206950 4132100 4368640 4268260 4175294 4223755 4227651 4167785 3971758 3891477
14277 3891477 4016050 4225389 4161958 4083899 4160135 4114874 4237411 4163910 4054940 4190643
14267 4190643 4317500 4270753 4105309 4058380 3994915 3989968 3959259 3949023 4156396 4040828 4227068
14256 4227068 4150210 4077680 3767268 3832925 4078045 4035116 4245208 3942716 4092483 4107156
14246 4107156 4177084 3913783 3958738 4118782 4182223 4117428 4385788 4382232 4131571 4089059 4324186
$$ [...]
##END NTUPLES=NMR SPECTRUM
##END=
