##TITLE=1H_EC-3263(2)
 CDCl3,8 sc, 
 24.9.2021
##JCAMPDX= 6.0         $$ Bruker NMR JCAMP-DX V2.0
##DATA TYPE= NMR SPECTRUM
##DATA CLASS= NTUPLES
##ORIGIN= UXNMR, Bruker Analytische Messtechnik GmbH
##OWNER= root
$$ XWIN-NMR		Version 3.5
$$ Fri Sep 24 09:47:45 2021 Russian Standard Time (UT+4h)  she@DPX200
##.OBSERVE FREQUENCY= 200.1314
##.OBSERVE NUCLEUS= ^1H
##.ACQUISITION MODE= SIMULTANEOUS
##.ACQUISITION SCHEME= undefined
##.AVERAGES= 8
##.DIGITISER RES= 18
##SPECTROMETER/DATA SYSTEM= spect
##.PULSE SEQUENCE= zg30
##.SOLVENT NAME= CDCl3
##.SHIFT REFERENCE= (INTERNAL, CDCl3, 0, 16.9766)
##AUDIT TRAIL= $$ (NUMBER, WHEN, WHO, WHERE, WHAT)
$$ ##TITLE= Audit trail, XWIN-NMR		Version 3.5
$$ ##JCAMPDX= 5.01
$$ ##ORIGIN= Bruker BioSpin GmbH
$$ ##OWNER= she
$$ F:/spectra/data/she/nmr/H-F/1/pdata/1/auditp.txt
$$ ##AUDIT TRAIL=  $$ (NUMBER, WHEN, WHO, WHERE, WHAT)
(   1,<2021-09-24 09:46:29.35 +0400>,<she>,<DPX200>,
      <created by zg, POWCHK disabled, PULCHK disabled
       configuration hash MD5:
       00 E9 B6 7A A2 85 ED C7 34 08 36 98 17 FE 4E 26
       data hash MD5: 16K
       43 0A 94 0A 41 A1 68 4B 8A A7 B2 1F C7 9D 02 6E>)
(   2,<2021-09-24 09:46:31.95 +0400>,<she>,<DPX200>,
      <Start of raw data processing
       efp BC_mod = 2 LB = 0.24 FT_mod = 6 PKNL = 1 PHC0 = -14077.66 PHC1 = 14.00088 SI = 16K 
       data hash MD5: 16K
       30 63 72 C1 35 8D 93 DA 82 0D 34 CB D9 DC 99 68>)
(   3,<2021-09-24 09:46:49.82 +0400>,<she>,<DPX200>,
      <pk PHC0 = 1.279151 PHC1 = -2 
       data hash MD5: 16K
       91 2E D5 36 EA 23 40 87 4F 19 44 2F EF 50 07 F5>)
(   4,<2021-09-24 09:46:53.40 +0400>,<she>,<DPX200>,
      <abs ABSG = 5 
       data hash MD5: 16K
       08 1F CC 7E 97 E8 8F EB 29 28 87 BE 07 79 B2 75>)
$$ ##END=
$$ 
$$ hash MD5
$$ 82 20 A4 17 65 76 82 C3 C6 B3 17 07 0A AC 29 E8
##$RELAX= 
##$RELAX= 
##$RELAX= 
##$RELAX= 
##$RELAX= 
##$RELAX= 
$$ Bruker specific parameters
$$ --------------------------
##$DU= <F:/spectra>
##$EXPNO= 1
##$NAME= <H-F>
##$PROCNO= 1
##$TYPE= <nmr>
##$USER= <she>
##$AMP= (0..31)
100 100 100 100 100 100 100 100 100 100 100 100 100 100 100 100 100 100 
100 100 100 100 100 100 100 100 100 100 100 100 100 100 
##$AQSEQ= 0
##$AQ_mod= 1
##$AUNM= <au_zg>
##$AUTOPOS= <>
##$BF1= 200.13
##$BF2= 200.13
##$BF3= 200.13
##$BF4= 200.13
##$BF5= 200.13
##$BF6= 200.13
##$BF7= 200.13
##$BF8= 200.13
##$BYTORDA= 1
##$CFDGTYP= 0
##$CFRGTYP= 5
##$CHEMSTR= <none>
##$CNST= (0..31)
1 1 145 1 1 1 1 1 1 1 1 1 1 1 1 1 1 1 1 1 1 1 1 1 1 1 1 1 1 1 1 1 
##$CPDPRG= <>
##$CPDPRG1= <>
##$CPDPRG2= <>
##$CPDPRG3= <>
##$CPDPRG4= <mlev>
##$CPDPRG5= <mlev>
##$CPDPRG6= <mlev>
##$CPDPRG7= <mlev>
##$CPDPRG8= <mlev>
##$CPDPRGB= <>
##$CPDPRGT= <>
##$D= (0..31)
0 1.2 0 0 0 0 0 0 0 0.06 0 0.03 0 0 0 0 0.0002 0 0 0 0 0 0 0 0 0 0 0 0 
0 0 0 
##$DATE= 1632462388
##$DBL= (0..7)
120 120 120 120 120 120 120 120 
##$DBP= (0..7)
150 150 150 150 150 150 150 150 
##$DBP07= 0
##$DBPNAM0= <>
##$DBPNAM1= <>
##$DBPNAM2= <>
##$DBPNAM3= <>
##$DBPNAM4= <>
##$DBPNAM5= <>
$$ [...]
##$SUBNAM3= <"">
##$SUBNAM4= <"">
##$SUBNAM5= <"">
##$SUBNAM6= <"">
##$SUBNAM7= <"">
##$SUBNAM8= <"">
##$SUBNAM9= <"">
##$SW= 20.0188988654967
##$SWIBOX= (0..15)
0 0 2 0 0 0 0 0 0 0 0 0 0 0 0 0 
##$SW_h= 4006.41025641026
##$TD= 16384
##$TD0= 1
##$TE= 0
##$TE2= 300
##$TE3= 300
##$TEG= 300
##$TL= (0..7)
0 120 120 120 120 120 120 120 
##$TP= (0..7)
150 150 150 150 150 150 150 150 
##$TP07= 0
##$TPNAME0= <>
##$TPNAME1= <>
##$TPNAME2= <>
##$TPNAME3= <>
##$TPNAME4= <>
##$TPNAME5= <>
##$TPNAME6= <>
##$TPNAME7= <>
##$TPOAL= (0..7)
0.5 0.5 0.5 0.5 0.5 0.5 0.5 0.5 
##$TPOFFS= (0..7)
0 0 0 0 0 0 0 0 
##$TUNHIN= 0
##$TUNHOUT= 0
##$TUNXOUT= 0
##$USERA1= <user>
##$USERA2= <user>
##$USERA3= <user>
##$USERA4= <user>
##$USERA5= <user>
##$V9= 5
##$VALIST= <valist>
##$VCLIST= <CCCCCCCCCCCCCCC>
##$VD= 0
##$VDLIST= <DDDDDDDDDDDDDDD>
##$VPLIST= <PPPPPPPPPPPPPPP>
##$VTLIST= <TTTTTTTTTTTTTTT>
##$WBST= 1024
##$WBSW= 4
##$XGAIN= (0..3)
0 0 0 0 
##$XL= 0
##$YL= 0
##$YMAX_a= 327873
##$YMIN_a= -486902
##$ZGOPTNS= <>
##$ZL1= 120
##$ZL2= 120
##$ZL3= 120
##$ZL4= 120
##$ABSF1= 16.97538
##$ABSF2= -3.043659
##$ABSG= 5
##$ABSL= 3
##$ALPHA= 0
##$AQORDER= 0
##$ASSFAC= 0
##$ASSFACI= 0
##$ASSFACX= 0
##$ASSWID= 0
##$AUNMP= <proc_1d>
##$AZFE= 0.1
##$AZFW= 0.1
##$BCFW= 0
##$BC_mod= 2
##$BYTORDP= 0
##$COROFFS= 0
##$CY= -3
##$DATMOD= 1
##$DC= 0
##$DFILT= <>
##$DTYPP= 0
##$F1P= 0
##$F2P= 0
##$FCOR= 1
##$FTSIZE= 16384
##$FT_mod= 6
##$GAMMA= 0
##$GB= 0
##$INTBC= 1
##$INTSCL= 1.334414e-10
##$ISEN= 128
##$LB= 0.24
##$LEV0= 0
##$LPBIN= 0
##$MAXI= 10000
##$MC2= 0
##$MEAN= 0
##$ME_mod= 0
##$MI= 1.114404
##$NCOEF= 0
##$NC_proc= -6
##$NLEV= 6
##$NOISF1= 3.799351
##$NOISF2= 2.8
##$NSP= 0
##$NTH_PI= 0
##$NZP= 0
##$OFFSET= 16.97659
##$PC= 1
##$PHC0= -14076.38
##$PHC1= 12.00088
##$PH_mod= 1
##$PKNL= yes
##$PPARMOD= 0
##$PSCAL= 0
##$PSIGN= 0
##$REVERSE= no
##$SF= 200.130005679976
##$SI= 16384
##$SIGF1= 3
##$SIGF2= 2
##$SINO= 5.538805
##$SIOLD= 16384
##$SREGLST= <1H.CDCl3>
##$SSB= 0
##$STSI= 16384
##$STSR= 0
##$SW_p= 4006.41025641027
##$SYMM= 0
##$S_DEV= 0
##$TDeff= 16384
##$TDoff= 0
##$TI= <>
##$TILT= no
##$TM1= 0
##$TM2= 0
##$TOPLEV= 0
##$USERP1= <user>
##$USERP2= <user>
##$USERP3= <user>
##$USERP4= <user>
##$USERP5= <user>
##$WDW= 1
##$XDIM= 16384
##$YMAX_p= 289103654
##$YMIN_p= -293601
$$ End of Bruker specific parameters
$$ ---------------------------------
##NTUPLES= NMR SPECTRUM
##VAR_NAME=  FREQUENCY,     SPECTRUM/REAL,   SPECTRUM/IMAG
##SYMBOL=    X,             R,               I
##VAR_TYPE=  INDEPENDENT,   DEPENDENT,       DEPENDENT
##VAR_FORM=  AFFN,          ASDF,            ASDF
##VAR_DIM=   16384,         16384,           16384
##UNITS=     HZ,            ARBITRARY UNITS, ARBITRARY UNITS
##FACTOR=    0.244546801953871, 1,           1
##FIRST=     3397.52489359917, 0,            0
##LAST=      -608.885362811105, 0,           0
##MIN=       -608.885362811105, -293601,     0
##MAX=       3397.52489359917, 289103654,    0
$$ Real data points
##PAGE= N=1
##DATA TABLE= (X++(R..R)), XYDATA
$$ [...]
6033A226472M4054R0163n1008J8553j51071L7189J10664q9873J7469n730L1028
6022A277910k3944J9009j1562J40606l3134N4994J6355k2495m2096N6990k1720
6011A410913r7644Q0778J7675N2252J49354j62135n1968R0354j113m7788K85n7171
5999A383792r9164N0092M6672L8078J1758l0349P955p497R4588j2215p8789N8949
5987A463870r626M9334M0504O4352l7589K0768J4803J3473l0926O5373q9014O35
5975A565957p9074J66092m9182N6790p5197j46951J29720R5426n5391M0491R9538
5964A748219r1742m5675O1052L6618P1573J14421m8362o7463K2838j18111O3439
5953A746807K8257K0351O1834q3007J3274m9343K12597O965o9568J34643n5854
$$ plain form
6033 1226472 1270526 1360689 1309681 1328234 1177163 1214352 1325016 1235143 1252612 1246882 1277910
6022 1277910 1253966 1272975 1261413 1402019 1368885 1423879 1440234 1417739 1375643 1432633 1410913
6011 1410913 1313269 1394047 1411722 1463974 1613328 1451193 1399225 1489579 1488466 1440678 1440963 1383792
5999 1383792 1284628 1334720 1381392 1419470 1431228 1400879 1408834 1401337 1495925 1483710 1404921 1463870
5987 1463870 1454244 1503578 1544082 1608434 1570845 1591613 1606416 1619889 1588963 1654336 1565322 1565957
5975 1565957 1486883 1652975 1603793 1660583 1585386 1438435 1568155 1663581 1608190 1648681 1748219
5964 1748219 1656477 1610802 1671854 1708472 1780045 1894466 1846104 1778641 1801479 1683368 1746807
5953 1746807 1775064 1795415 1857249 1774242 1787516 1738173 1950770 1957735 1888167 2022810 1966956
5942A966956K3369O2810q5508P7019L7621j07505J00651J9920m2056L5546j10638
5931A978185O0970J9705O0018q9257J2067J01670L6504J1273M1694J20376K2761
5920B375966l4960n650n0359J31064l000Q3674J49847l52J7081j20555O7985Q3057
5908B693798L177R6587J00781o5093m8507J35283j5560Q9531J65270L4594J05409
5897C295270j6465L1946K9016l5734M4896q3111J48342R8468P4287J56646M4892
5886C788453J0496N6176J25807L4586p5774J41949R1987J3342K14645l322J39552
5875D537897o4256J30576J32867J16234K24794K09505J03196J10812J71923K76013
5865E949561J2372K32517K24404K17513K25179J15023J98022K52995L40005J68583
$$ plain form
5942 1966956 1990325 2053135 1967627 2044646 2082267 1974762 2075413 2095333 2053277 2088823 1978185
5931 1978185 2039155 2058860 2118878 2029621 2041688 2143358 2179862 2191135 2232829 2353205 2375966
5920 2375966 2341006 2335356 2284997 2416061 2413061 2496735 2646582 2646230 2663311 2542756 2610741 2693798
5908 2693798 2696975 2793562 2894343 2829250 2780743 2916026 2900466 2989997 3155267 3189861 3295270
5897 3295270 3278805 3310751 3339767 3304033 3348929 3265818 3414160 3512628 3586915 3743561 3788453
5886 3788453 3798949 3855125 3980932 4015518 3939744 4081693 4173680 4187022 4401667 4398345 4537897
5875 4537897 4473641 4604217 4737084 4853318 5078112 5287617 5390813 5501625 5673548 5949561
5865 5949561 5961933 6194450 6418854 6636367 6861546 6976569 7174591 7427586 7767591 7936174
5855G936174K34130L67615L35015N41386M93391L27615M85128N56850P83658Q58624
5845A2919586Q48434Q40453J044719Q09690P50586P67233R15578J167090J184008
5836B1247377J071361R09253L25740N1647K66400N08217P56583J182908J718085
5827B8037571K065009K268891K512759K714911K564257K230852J647967O09980
5819D4652197k43017p60250q62659p75337p46923l95238K80903Q22072J044825
5810D3016573J149147Q09755l26732r32516j015645n32265L14579J107651J863341
5801D5453888K587132L080482L384450L633597L371432K128258L35139j553021
5793F2421357l181841l842503l734456l295695l047661k533034k088752j728564
$$ plain form
5855 7936174 8170304 8537919 8872934 9414320 9907711 10235326 10720454 11277304 12060962 12919586
5845 12919586 13768020 14608473 15653192 16462882 17213468 17980701 18896279 20063369 21247377
5836 21247377 22318738 23227991 23553731 23605378 23871778 24379995 25136578 26319486 28037571
5827 28037571 30102580 32371471 34884230 37599141 40163398 42394250 44042217 44652197
5819 44652197 44409180 43648930 42786271 42010934 41264011 40868773 41149676 41971748 43016573
5810 43016573 44165720 44975475 44648743 43716227 42700582 42168317 42482896 43590547 45453888
5801 45453888 48041020 51121502 54505952 58139549 61510981 63639239 63974378 62421357
5793 62421357 59239516 55397013 51662557 48366862 45319201 42786167 40697415 38968851
5785C8968851r59393o90749p49637r75815j270111j222947j011663n59050l6315
5776C1493171K92712N99467J035746J131100R61599R59888N99291r0381j028011
5767C5954582j684041k114381k179287k133370k270201k032334j737242j541964
5759B0261762j231133r94147j020729p23518n35566m21473m61964k49193k65985
5750A4358054q9586q0456k06765j88580l23807l65299l86181k36479j67471j12429
5740A2201001k6705j98805l52868l91617l46701m28058k99667j73857k77436j26485
5730I578802o7339j29975p0503J46149J31492M8118P4843K09583P480o3725k05527
5719I659398k37511j84981k68249k31961j56299j55524j48426j46547j86951k58258
$$ plain form
5785 38968851 38009458 37318709 36569072 35593257 34323146 33100199 32088536 31529486 31493171
5776 31493171 31785883 32385350 33421096 34552196 35513795 36473683 37072974 36982593 35954582
5767 35954582 34270541 32156160 29976873 27843503 25573302 23540968 21803726 20261762
5759 20261762 19030629 18036482 17015753 16292235 15756669 15335196 14873232 14624039 14358054
5750 14358054 14268468 14188012 13981247 13792667 13468860 13103561 12717380 12480901 12313430 12201001
5740 12201001 12174296 11975491 11622623 11231006 10884305 10456247 10156580 9982723 9705287 9578802
5730 9578802 9511463 9381488 9310985 9457134 9588626 9636744 9711587 9921170 9928650 9864925 9659398
5719 9659398 9421887 9236906 8968657 8736696 8580397 8424873 8276447 8129900 7942949 7684691
5709G684691k67809l7705J02736k22256j04565l8064q3965m0811q5304J41525
5699G048473r5805m4949q7283M3783Q552j47201N4907p1834j88117j41965r4934
5688F283627r1003o1751p5209l6842n4106r4758j07728m2173J2099j78682L8211
5677E591685m5627J3647P4969k4215j38421L9455Q5322N2814m8110q9470Q0291
5666E592340l4773J4204J7224K5904o9138R8794n323j9468M5293K1104k9921J8649
5654E674889M9981J31416l439j19409K7794k3074P116o8949n1103J6491N4281
5643E695994N757J3738O67j9688j38737L1825O0023O9171M6772O5608J59464P0200
5631F060794N6917L8711J70385L1422N4017J18476k9879n2379l671j09177k4929
$$ plain form
5709 7684691 7416882 7379177 7481913 7259657 7155092 7117028 7033063 6992252 6906948 7048473
5699 7048473 6952668 6907719 6820436 6864219 6872771 6725570 6780477 6708643 6520526 6378561 6283627
5688 6283627 6192624 6130873 6055664 6018822 5964716 5869958 5762230 5720057 5732156 5553474 5591685
5677 5591685 5546058 5559705 5634674 5610459 5472038 5511493 5596815 5649629 5601519 5512049 5592340
5666 5592340 5557567 5571771 5588995 5614899 5545761 5644555 5639232 5619764 5665057 5686161 5656240 5674889
5654 5674889 5724870 5856286 5852847 5733438 5761232 5738158 5745274 5676325 5625222 5641713 5695994
5643 5695994 5701751 5715489 5716156 5696468 5557731 5589556 5649579 5718750 5765522 5831130 5990594 6060794
5631 6060794 6117711 6156422 6326807 6358229 6412246 6530722 6500843 6448464 6444793 6335616 6310687
5620F310687q8181j45823j9565O3887O6616k5235J000Q563j6136j67305j1100
5609E977408O7380Q7415Q7225O1515L22251K94646L70996K30952J90645N07897
5599H198330O90872O66683P84486P12040J27438o16365j095131j029012p91962
5590G647379m12835l50043l30833k93488k36887j7811j99584K9093j70238j48064
5580E516689J9024l3464j47235p1338K23721O2044o7567P4623R6409J07831k0209
5569E760528n2889j02903j57032r6434p0151k0348j7975j8149l4612p9087j00155
5558E010793K8342p6935m3480p357K2234p7581J01523q0936N0430j6581M3216
5547D953668J4434N4679N7786J01233P6212q3590n2922j1306J7402m3909J12418
$$ plain form
5620 6310687 6222506 6076683 6057118 6121005 6187621 6162386 6163386 6171949 6155813 5988508 5977408
5609 5977408 6044788 6132203 6219428 6280943 6603194 6897840 7268836 7499788 7690433 8198330
5599 8198330 8889202 9555885 10340371 11052411 11179849 10563484 9468353 8439341 7647379
5590 7647379 7234544 6884501 6553668 6260180 6023293 6005482 5805898 5834991 5664753 5516689
5580 5516689 5535713 5502249 5355014 5283676 5507397 5569441 5501874 5576497 5672906 5780737 5760528
5569 5760528 5707639 5604736 5447704 5351270 5281119 5260771 5242796 5224647 5190035 5110948 5010793
5558 5010793 5039135 4962200 4918720 4911363 4933597 4856016 4957539 4876603 4927033 4910452 4953668
5547 4953668 4968102 5022781 5080567 5181800 5258012 5174422 5121500 5110194 5127596 5083687 5196105
5536E196105Q7910J0663J28041J31983R7449J22449j51526O4666j22446j13215
5526E452079j19730r598p7821p0877P3085J04615p457J07457J07713J17361K03295
5515E880122J20277J27186o5882j02855k39355j22205j59056K4769m3552o9746
5505E349703M996N7478J31450l7474q4707J49708O920J5117J24980q3638O6056
5494E700589J76225J88579J63922J14185M2461O1132K18933J35334Q9545J51920
5484G042825R6525q2552j57656j1913k5362J98559R1830J43999K79028K56713
5474G831996K63363N13969M44244N07818O90122P51587P34263O04422K15577k03898
5464A2353463j28668l07992l10388k57314l12232j06310j52715n7586P8690o604
$$ plain form
5536 5196105 5284015 5294678 5422719 5554702 5652151 5774600 5623074 5687740 5565294 5452079
5526 5452079 5332349 5322751 5244930 5174053 5247138 5351753 5344296 5451753 5559466 5676827 5880122
5515 5880122 6000399 6127585 6061703 5958848 5719493 5597288 5438232 5463001 5419449 5349703
5505 5349703 5354699 5412177 5543627 5506153 5421446 5571154 5578074 5593191 5718171 5634533 5700589
5494 5700589 5876814 6065393 6229315 6343500 6385961 6447093 6666026 6801360 6890905 7042825
5484 7042825 7139350 7056798 6899142 6887229 6861867 7060426 7152256 7296255 7575283 7831996
5474 7831996 8095359 8609328 9053572 9561390 10251512 11003099 11737362 12341784 12557361 12353463
5464 12353463 12224795 11916803 11606415 11349101 11036869 10930559 10777844 10720258 10798948 10792344
5454A0792344m0798K66209M83774L72107N47456N22672Q51791Q85585J003395
5445A5684535J169627J284173J247932Q45319O8364q43396j469872j558654j456291
5436A4971737j121341q93975o24246m13165l29653k82253k63380k45325j96415
5427A0601984m1999j08260Q0795J42229K16303L78140M20978N21585N34858O38966
5417A3385579M40260K91259j2806o28966q69974r51484o39682o28015l44852k20572
5407I820747k82750j17904j79759k36331l30997l08557k89481k21812j41791j68213
5397G543152q4322o3610j69792j15935K221P0485r069P3546P4116N9388J75328
5386G555508J93615J89959L3000O9261J47939O2521j31690j62734k21571l13489
$$ plain form
5454 10792344 10751546 11017755 11501529 11873636 12421092 12943764 13795555 14681140 15684535
5445 15684535 16854162 18138335 19386267 20231586 20299950 19456554 17986682 16428028 14971737
5436 14971737 13850396 12956421 12332175 11919010 11589357 11307104 11043724 10798399 10601984
5427 10601984 10559985 10451725 10532520 10674749 10891052 11269192 11690170 12211755 12746613 13385579
5417 13385579 13825839 14117098 14104292 13475326 12605352 11653868 11014186 10386171 10041319 9820747
5407 9820747 9537997 9420093 9240334 9004003 8673006 8364449 8074968 7853156 7711365 7543152
5397 7543152 7458830 7395220 7225428 7109493 7111714 7182199 7173130 7246676 7320792 7380180 7555508
5386 7555508 7749123 7939082 7972082 8041343 8189282 8251803 8120113 7957379 7735808 7422319
5376G422319k92555l39461j93602j32525O480P5745p5057j64011l1061J43318
5366F419590O0251L9837L0201N7873Q0434R5802J58347J58283R8991J74814Q2857
5355G457280q3618j99275l14960j39876p3460j72817j76485o0550n9190m7685
5345F129364q9597j22785m5409l6242M0470n6302L2941k2781L8689J2026k8590
5334E851784j9477K0346K6248J02462K414l9750l6215j38536L8468n3423l3407
5323E720914q4617n2298K5995m1529J24144K7995l1819l405Q4111K77832J52634
5312F199957J36720J25884J22911r293J2882q2967J3276J11888K33061J86860
5302G051179L52145L06736K41514K25131O0925J88446P4419K07125L11508K68527
$$ plain form
5376 7422319 7129764 6790303 6596701 6464176 6470656 6546401 6471344 6307333 6276272 6419590
5366 6419590 6479841 6519678 6549879 6607752 6688186 6783988 6942335 7100618 7199609 7374423 7457280
5355 7457280 7373662 7174387 6859427 6719551 6646091 6473274 6296789 6236239 6177049 6129364
5345 6129364 6039767 5916982 5871573 5835331 5875801 5819499 5852440 5829659 5868348 5880374 5851784
5334 5851784 5832307 5852653 5878901 5981363 5983777 5944027 5907812 5769276 5807744 5754321 5720914
5323 5720914 5636297 5583999 5609994 5568465 5692609 5720604 5688785 5685380 5769491 6047323 6199957
5312 6199957 6336677 6462561 6585472 6576179 6589061 6506094 6519370 6631258 6864319 7051179
5302 7051179 7403324 7710060 7951574 8176705 8237630 8426076 8500495 8707620 9019128 9287655
5292I287655L14834M43026J77541j10444n64632n07057l69709j28394K4504P5124
5282H642448R5106O5534J71067K94843L29608M24937M73297L13880O9395k57507
5272A0622608n81966o16365l94178k28469k39676k64843k46440o0739P474j19848
5262G877558R392P0140O1227O4820J60727J46132J11377J42079L90775L37856
5252I372083L30779L79475L20064J8767l37559n53639n05957n50314m73601k62744
5242G737354l19532m08974k73575k42549j68522k17293j49998j38332j62106r1041
5232E565432k3357j51376j19723q4611k04278p6255j22578j24808p3881l4482
5222D550083K868K5194j28173p8758J17486r8127j49337p7498j07547n1025p3413
$$ plain form
5292 9287655 9602489 10045515 10223056 10112612 9547980 9040923 8671214 8542820 8567324 8642448
5282 8642448 8737554 8803088 8974155 9268998 9598606 10023543 10496840 10810720 10880115 10622608
5272 10622608 10040642 9424277 9030099 8801630 8561954 8297111 8050671 7989932 7997406 7877558
5262 7877558 7886950 7957090 8018317 8083137 8243864 8389996 8501373 8643452 9034227 9372083
5252 9372083 9702862 10082337 10402401 10421168 10083609 9529970 9024013 8473699 8000098 7737354
5242 7737354 7417822 7008848 6735273 6492724 6324202 6106909 5956911 5818579 5656473 5565432
5232 5565432 5542075 5390699 5270976 5186365 4982087 4905832 4783254 4658446 4584565 4550083
5222 4550083 4552951 4578145 4449972 4371214 4488700 4390573 4241236 4163738 4056191 4005166 3931753
5211C931753j01756j32143l5073k4898k5927j6089j06930l4720p5771l3244P1991
5200C417193j09219j08113j01665p4Q6545p9673j03921M862l834m2465l1425j03631
5188B824580L7290P4922j63674Q3448m162m2508n4509m2901N4279J5672k9552
5177B752885K6709r6551m11M4908j03507O3068j05927N203q07P656M906K4348
5165B622480l7260m9688j0022m0747j6372k8707k8565l8899R2546j10010K6250
5154B381006Q3909M5084o0338n484k5802n961j2000m1756M2290p8501k2917q2094
5142B217436M8927q6679k2778k6504l7044N8346j44150n807l3306p848j2803j03959
5130A843831m7244M2305O9776r3219R9496p2810q179R6467q1849j22096n8043
$$ plain form
5211 3931753 3829997 3697854 3662781 3637883 3611956 3595867 3488937 3454217 3378446 3345202 3417193
5200 3417193 3307974 3199861 3098196 3098122 3184667 3104994 3001073 3005935 3002101 2959636 2928211 2824580
5188 2824580 2861870 2936792 2773118 2856566 2852404 2809896 2755387 2712486 2766765 2782437 2752885
5177 2752885 2779594 2683043 2682632 2727540 2624033 2687101 2581174 2586377 2585570 2593226 2598132 2622480
5165 2622480 2585220 2535532 2525510 2484763 2468391 2439684 2411119 2372220 2464766 2354756 2381006
5154 2381006 2464915 2509999 2449661 2444177 2418375 2412414 2400414 2358658 2400948 2322447 2299530 2217436
5142 2217436 2266363 2179684 2156906 2130402 2093358 2151704 2007554 2001747 1968441 1960593 1947790 1843831
5130 1843831 1796587 1838892 1908668 1815449 1914945 1842135 1833956 1930423 1848574 1726478 1668435
5119A668435J6896K4401J7467j3945p6944k1060M4101m3674Q4N6084l6459k7660
5107A607726r8721O361R9732K7591L3565q2277K8633k8454r1864k8598L9595Q5175
5095A598464j07768m0791J07135j1915l2400N9514q4330k06814L062J69132k7836
5084A425453O1199P363j9802p0535J4608R997r0244O1855j08819K04q0680J55420
5072A366019J1210o3584q1167K83439l8354o8416q0213m0217l0519p7398J0052
5061A190852j8529Q7039J5499N5175q4013J27354q058k7328k1224m1763J16727
5050A391731r4290K8689M6108j10122j0899J7185p8482L6430N0572p2903o284
5039A197735L5330J6688j3756Q2302r075m7692O7122J09240k03489M5109P9013
$$ plain form
5119 1668435 1685331 1709732 1727199 1713254 1636310 1615250 1659351 1615677 1615761 1671845 1635386 1607726
5107 1607726 1509005 1515366 1615098 1642689 1676254 1593977 1622610 1594156 1502292 1473694 1513289 1598464
5095 1598464 1490696 1449905 1557040 1545125 1512725 1572239 1487909 1281095 1284157 1453289 1425453
5084 1425453 1486652 1494015 1474213 1403678 1418286 1428283 1338039 1399894 1291075 1291279 1210599 1366019
5072 1366019 1377229 1313645 1232478 1515917 1477563 1409147 1328934 1288717 1258198 1180800 1190852
5061 1190852 1172323 1259362 1274861 1330036 1246023 1373377 1365319 1337991 1316767 1275004 1391731
5050 1391731 1297441 1326130 1372238 1262116 1251217 1268402 1189920 1226350 1276922 1204019 1197735
5039 1197735 1233065 1249753 1235997 1318299 1309224 1261532 1328654 1437894 1234405 1279514 1358527
5028A358527l6215j1357M3063m4891P8466q8054J8002P3361q4027K6244o7893
5017A265226L337m0002j0442J42324J546Q63r5189J36671J3104K5682M0347m417
5005A479050J4002m5325k1513n1230K3083n0166L9212R0614M3943o4016m5136
4994A412518l0407j4386n9912K7911K0456o0027k8839o2582J34756P987k789L2187
4982A376873l7451K321J32463O9587m8066n6032j1654M5986Q6227K5209N0879
4971A636342O7585j48650J21417m3065Q9767J40693N7949M9308R9517J69588K81108
4960B521559J78635J85155L10236K71244L16983O69859O27224P20812P56813N03429
4950G061949j91889q35571r17358q72735o66063m21653j89812k05896j09138k03172
$$ plain form
5028 1358527 1322312 1310955 1354018 1309127 1387593 1299539 1317541 1390902 1306875 1333119 1265226
5017 1265226 1268563 1228561 1218119 1360443 1361989 1362852 1267663 1404334 1417438 1443120 1483467 1479050
5005 1479050 1493052 1447727 1426214 1374984 1398067 1347901 1387113 1477727 1521670 1457654 1412518
4994 1412518 1382111 1367725 1307813 1335724 1356180 1296153 1267314 1204732 1339488 1347475 1344686 1376873
4982 1376873 1339422 1341743 1474206 1543793 1495727 1439695 1428041 1474027 1560254 1585463 1636342
4971 1636342 1703927 1555277 1676694 1633629 1723396 1864089 1922038 1971346 2070863 2240451 2521559
4960 2521559 2700194 2885349 3195585 3466829 3783812 4453671 5080895 5801707 6558520 7061949
4950 7061949 6870060 6034489 5117131 4244396 3578333 3156680 2966868 2760972 2651834 2448662
4940B448662p6471j53987k75784J2614n257j72819n4981R597N6335p9447p4134
4929A634328N4570m2332p4154r9248K3610m5919m477K3937O4144o3869J9267J36939
4917A626796O51L156R947o6175j9158O4679r4279K7803m1119m7903P6364m7373
4905A493389o1388J09509J8142m5187k1401K4522O5810N0004n9548O6133N1357
4894A691342J21913J08156j77030o6509j07231j68602Q7958j4582q0606o4215
4884A330594L6485j0157Q4212j3550j17233k4944N708Q0168J12709m8546q0976
4873A354470l7370O0480k4451K8539j44068N4231N6389p5365J38465j99267J8469
4862A230522J00541q4606k8005J04254p8386K7210J4216R167l9106n4575l9139
$$ plain form
4940 2448662 2372191 2218204 1942420 1955034 1949777 1776958 1721977 1731574 1787909 1708462 1634328
4929 1634328 1688898 1646566 1572412 1473164 1496774 1450855 1446378 1470315 1534459 1470590 1489857 1626796
4917 1626796 1627447 1630603 1640550 1574375 1555217 1619896 1525617 1553420 1512301 1464398 1540762 1493389
4905 1493389 1432001 1541510 1559652 1514465 1493064 1517586 1583396 1633400 1573852 1639985 1691342
4894 1691342 1813255 1921411 1744381 1677872 1570641 1402039 1489997 1475415 1394809 1330594
4884 1330594 1367079 1356922 1441134 1427584 1310351 1285407 1291115 1371283 1483992 1435446 1354470
4873 1354470 1317100 1377580 1353129 1381668 1237600 1291831 1348220 1272855 1411320 1212053 1230522
4862 1230522 1331063 1246457 1218452 1322706 1244320 1271530 1285746 1294913 1255807 1201232 1162093
4851A162093J19617N4088J6964j2233J09403l4571N1780n4039M4912O4364O4434
4840A586812M8935j01123J41768J31242j4961P2494j24603j64169J7995K3011
4830A617401L7584j93643l0978K2410m5193j9428L1098L5543J0313O4833o8196
4819A461744j4548J5108J04479M647K6314J545P093N3510n8199M7636N7136L6833
4807A743298J9695L3175o7391P070K0109K3885M4388R9006J08121J23280j11321
4796B043315Q2557p9348N1119m6815j5264R4958J5987k9331O5391P0207M5558
4785B298334l9831l8780O0197K07632L065q8731J49120l5654k0789J43396N5078
4774B693037J8603J7804P1673L0210R1988J5405O5482J07790J28313P8584P7964
$$ plain form
4851 1162093 1281710 1335798 1352762 1340529 1449932 1415361 1467141 1413102 1458014 1522378 1586812
4840 1586812 1635747 1534624 1676392 1807634 1792673 1865167 1740564 1576395 1594390 1617401
4830 1617401 1654985 1461342 1430364 1452774 1407581 1388153 1419251 1454794 1465107 1529940 1461744
4819 1461744 1447196 1462304 1566783 1571430 1597744 1599289 1606382 1659892 1601693 1649329 1706465 1743298
4807 1743298 1762993 1796168 1728777 1735847 1755956 1779841 1824229 1923235 2031356 2154636 2043315
4796 2043315 2125872 2046524 2097643 2050828 2035564 2130522 2146509 2117178 2182569 2252776 2298334
4785 2298334 2258503 2219723 2279920 2487552 2490617 2401886 2551006 2515352 2494563 2637959 2693037
4774 2693037 2711640 2729444 2801117 2831327 2923315 2938720 3004202 3111992 3240305 3318889 3396853
4763C396853K41240m8254K43880J37144K13647K70717J72157J53656O0873K28682
4753E070595L13908J97368M11652L50896M47693M02287N06653N72017P76090R92491
4743A0041650J175250J553877J701647J942158K177090K570600L225851L897110
4735B8285233M605495M716632L387176R1852l917727n479170n248391m284776
4727B2156324l297217k385876j875372j548133j136515r71613p74547o86313o09760
4718H870978l88419l56362k67305k96295k06484j93456j43936k39512j68932Q8450
4708F698727j77864N4653m9548j4638k3370j04295M0827l9822m2799N0772J09194
4697F501837J21011K0220P7165j0051J38488J52976J33203K09066J41458J24901
$$ plain form
4763 3396853 3638093 3589839 3833719 3970863 4184510 4455227 4627384 4781040 4841913 5070595
4753 5070595 5384503 5581871 5993523 6344419 6792112 7194399 7701052 8273069 9049159 10041650
4743 10041650 11216900 12770777 14472424 16414582 18591672 21162272 24388123 28285233
4735 28285233 32890728 37607360 40994536 41086388 37168661 31689491 26441100 22156324
4727 22156324 18859107 16473231 14597859 13049726 11913211 10941598 10167051 9480738 8870978
4718 8870978 8482559 8126197 7858892 7562597 7356113 7162657 7018721 6779209 6610277 6698727
4708 6698727 6520863 6575516 6525968 6511330 6487960 6383665 6424492 6384670 6341871 6392643 6501837
4697 6501837 6622848 6643068 6720233 6710182 6848670 7001646 7134849 7343915 7485373 7610274
4687G610274J88616L21798K62629K56838L18273L19493K82868N39563M38610M83947
4677A1022909M43229P01412Q20030Q26042R29339R16130J066803J051877J211653
4668A8989424J171632J022028Q50869O07709L52337K34838k10619k37304m17303
4659B2363611n65910l90363k98529j03977k1685L9509O7815K59549L63217L69118
4649B2082355O41218Q24435P53146R09180J046107J159698J288940J280606J267076
4640C1252761J087226J064092R91032Q25508M83158J60651j37935l69235o67573
4631C4689685q86438q63146j034113j319854j290926j219437j259638j211742
4623B5604391r89356j022549q10990n05586l19780m18266k26721J52390J02498
$$ plain form
4687 7610274 7798890 8120688 8383317 8640155 8958428 9277921 9560789 10100352 10538962 11022909
4677 11022909 11466138 12167550 12987580 13813622 14742961 15659091 16725894 17777771 18989424
4668 18989424 20161056 21183084 22033953 22641662 22993999 23228837 23018218 22780914 22363611
4659 22363611 21797701 21407338 21108809 21004832 20983147 21022656 21090471 21350020 21713237 22082355
4649 22082355 22723573 23548008 24301154 25210334 26256441 27416139 28705079 29985685 31252761
4640 31252761 32339987 33404079 34395111 35220619 35703777 35864428 35726493 35357258 34689685
4631 34689685 33803247 32940101 31905988 30586134 29295208 28075771 26816133 25604391
4623 25604391 24615035 23592486 22781496 22275910 21956130 21537864 21311143 21463533 21566031
4614B1566031K48590K45463M74579N32416O74981P13283Q48359P30533P56897
4605B6791132M51350l8229m17410o75982j157354j565632j560558j611985j525850
4596A8689482j464466j265574j078199r36270q12020q93491o09828o63141n64129
4587A0402364m69477l20426k89161n09436j40229k78593l78068k67599k60997
4578G488378n9355j07641j91009k36687j59470j4986j16798j35065j50173K9260
4568F346454l5616j92473q2904r3000q2042J28566j57918j61958n3767q3092n915
4557E526335k51765j43156j70269j49659N8464q337j3863p4971J6105K7201j16988
4546D699097K6898p4069o0045J06982P1314j02216m2334K4966o9082J4488L123
$$ plain form
4614 21566031 21814621 22060084 22534663 23067079 23742060 24455343 25303702 26034235 26791132
4605 26791132 27242482 27204253 26786843 26110861 24953507 23387875 21827317 20215332 18689482
4596 18689482 17225016 15959442 14881243 13944973 13132953 12239462 11629634 10966493 10402364
4587 10402364 9932887 9612461 9323300 8813864 8673635 8395042 8016974 7749375 7488378
4578 7488378 7429023 7321382 7130373 6893686 6734216 6719230 6602432 6467367 6317194 6346454
4568 6346454 6310838 6118365 6035461 5942461 5860419 5988985 5831067 5669109 5615342 5532250 5526335
4557 5526335 5274570 5131414 4961145 4811486 4869950 4861613 4847750 4772779 4788884 4816085 4699097
4546 4699097 4725995 4651926 4591881 4698863 4770177 4667961 4625627 4650593 4581511 4595999 4599122
4535D599122M6147k3372p2295q2850J8348J0861r1631m539k4079n3661P9846n2903
4523D348994j21134m352J00921n5511J3204J9618n1597l5398q2254q074L594L8087
4511D166098K4540L0379p0218m4525r5548P3026l2914q9951O3809n2481l2978
4500C939237k3690r8838J02070N8764j69939q67N3934L9872o1421k0867M9729
4489C867984j02609o945J37177K9679K9384Q2884J34136P2010K3582N0212J89918
4478D507412k4078P5408K39120J00753P9093K24977O1161k0770m9799k5977q0937
4467E086363j2443r5690O8095J01179j83482O0597j78330j0576L4739k0785J35921
4456D985588L4656k3339k9069m2957n8639m1588Q2961p8677k0039J21987R8900
$$ plain form
4535 4599122 4645269 4621897 4549602 4466752 4485100 4495961 4404330 4399791 4375712 4322051 4401897 4348994
4523 4348994 4227860 4223508 4324429 4268918 4282122 4301740 4250143 4214745 4132491 4124417 4128011 4166098
4511 4166098 4190638 4221017 4150799 4106274 4010726 4083752 4050838 3960887 4024696 3972215 3939237
4500 3939237 3915547 3816709 3918779 3977543 3807604 3806737 3860671 3900543 3839122 3818255 3867984
4489 3867984 3765375 3758430 3895607 3925286 3954670 4037554 4171690 4243700 4267282 4317494 4507412
4478 4507412 4483334 4558742 4797862 4898615 4977708 5202685 5263846 5243076 5193277 5167300 5086363
4467 5086363 5073920 4978230 5046325 5147504 4964022 5024619 4846289 4835713 4870452 4849667 4985588
4456 4985588 5020244 4996905 4967836 4924879 4866240 4824652 4907613 4828936 4808897 4930884 5029784
4445E029784J53435o7859P8724R5230r1916Q7339K4060P4367J03299K4034J59691
4434E670188J99992Q2886K2260J2070J36330J41686J01862J95903m01K22701K29510
4423G014987J21353J59629J36842K11210O2047J52773j0778k0108J40681J44343
4413H112979o377J45387J76440J31991K03751J30100L4963J10902K04737J62639
4403I407512J57463J06912K06139J92125J01766J43146J10589J31474K09411J80697
4393A0947234K90554L06489K02831K26954K23590K74821K31212K29875K84367
4384A3217927L77392L42986J48227K68833N85800M91229N96571N56902O40336
4375A7226203N99787M82477O96664P10037P11325R62457J005479J206667J332258
$$ plain form
4445 5029784 5183219 5115360 5194084 5289314 5197398 5284737 5308797 5383164 5486463 5510497 5670188
4434 5670188 5870180 5953066 5975326 5987396 6123726 6265412 6367274 6563177 6562776 6785477 7014987
4423 7014987 7136340 7295969 7432811 7644021 7706068 7858841 7848063 7827955 7968636 8112979
4413 8112979 8106602 8251989 8428429 8560420 8764171 8894271 8929234 9040136 9244873 9407512
4403 9407512 9564975 9671887 9878026 10070151 10171917 10315063 10425652 10557126 10766537 10947234
4393 10947234 11237788 11544277 11747108 11974062 12197652 12472473 12703685 12933560 13217927
4384 13217927 13595319 13938305 14086532 14355365 14941165 15432394 16028965 16585867 17226203
4375 17226203 17825990 18308467 19005131 19715168 20426493 21388950 22394429 23601096 24933354
4366B4933354J430722J528662J767273J900628J991354K226165K448780K901988
4358D1128926L298931M042608M917840N758465O886052Q354852R875523J1549963
4350I5813160J3621322J6135922J9381620K2705336K5026936K3715685J8524279
4343B34924260J0082942l637616j8062313k8495355l0312944k6648932k1088700
4336A16761342j5875990j2169156r371546p558554o137472n306044m527802l958753
4328E1856025l305357k931129k598344k095328j884283j595318j415596j152287
4320C4878383r52822o65735n92681o66406q17007r03250p77892o50824n01268
4311B8350498m33924l65212m77581m97095n21257n66212o65395o01298k96019
$$ plain form
4366 24933354 26364076 27892738 29660011 31560639 33551993 35778158 38226938 41128926
4358 41128926 44427857 48470465 53388305 59146770 66032822 74387674 84263197 95813160
4350 95813160 109434482 125570404 144952024 167657360 192684296 216399981 234924260
4343 234924260 245007202 241369586 223307273 194811918 164498974 137850042 116761342
4336 116761342 100885352 88716196 79344650 71786096 65648624 60342580 55814778 51856025
4328 51856025 48550668 45619539 43021195 40925867 39041584 37446266 36030670 34878383
4320 34878383 33925561 33259826 32667145 32000739 31183732 30280482 29502590 28851766 28350498
4311 28350498 27916574 27551362 27073781 26576686 26055429 25489217 24823822 24222524 23926505
4302B3926505l43496n90813n83945p80404o66209n13789m24351l79207k12658
4293A9431633k08455j78118k39418n6160j38308k59151r8319k49329k83254p4161
4283A7646960M54L25153L10434N76050M16763K82206N4927r3831k20365k975k7546
4272A9268230p2860J05204L1186J72866J63661J88690K85945M12197K30861N36591
4262B1322571M45403M73856N79063O49205M37466M59099N70007N82814P19553
4253B6239037N13369L65250L82588K18298J31426J76958K19651K03785L45840
4244B8796202J52521L06160M11921J65356p2794k13509k01545l85851m45304m77949
4234B8035208m46512l64766k79340k97955l91532k12551l71864n43549l57990
$$ plain form
4302 23926505 23583009 22992196 22408251 21627847 20961638 20447849 20023498 19644291 19431633
4293 19431633 19223178 19045060 18805642 18749482 18611174 18352023 18253704 18004375 17721121 17646960
4283 17646960 17647414 17972567 18283001 18859051 19275814 19558020 19612947 19519116 19298751 19295776 19268230
4272 19268230 19195370 19300574 19331760 19504626 19668287 19856977 20142922 20555119 20785980 21322571
4262 21322571 21767974 22241830 22820893 23470098 23907564 24366663 24936670 25519484 26239037
4253 26239037 26752406 27117656 27500244 27718542 27849968 28026926 28246577 28450362 28796202
4244 28796202 28948723 29254883 29666804 29832160 29759366 29545857 29344312 28958461 28513157 28035208
4234 28035208 27588696 27223930 26944590 26646635 26255103 26042552 25670688 25127139 24769149
4225B4769149n83343o04962o29374n45897n12493o77689p51267o04462n83235
4216A9276427m76158n46652o55178n13441m89288n92159n95833n79747o37077
4207A4190894m74480m01414m15604n00892l61796m36490k30511l49081l02934
4198A0717692l06917k66976k62134k69208j25225j36042j19755k10511j60146
4189H860778J5140R3903r4319j88j08497J07564R3726O9589J13582K59284K88340
4178I698902L76883L26007L24409M91663L33243K92891N83148K82492L00458k540
4168A3007556k42530p4616k74211l71466n18848n22769m09981j58682J48566L37299
4158A0920318L29881N89338O93140O26697N37693K62335l80519p93924j025945
$$ plain form
4225 24769149 24185806 23580844 22951470 22405573 21893080 21215391 20464124 19859662 19276427
4216 19276427 18800269 18253617 17598439 17084998 16595710 16003551 15407718 14827971 14190894
4207 14190894 13716414 13315000 12899396 12398504 12036708 11600218 11369707 11020626 10717692
4198 10717692 10410775 10143799 9881665 9612457 9487232 9351190 9231435 9020924 8860778
4189 8860778 8875918 8969821 8875502 8875314 8766817 8874381 8968107 9037696 9151278 9410562 9698902
4178 9698902 10075785 10401792 10726201 11217864 11551107 11843998 12427146 12709638 13010096 13007556
4168 13007556 12765026 12690410 12416199 12044733 11525885 11003116 10593135 10434453 10583019 10920318
4158 10920318 11250199 11839537 12532677 13159374 13697067 13959402 13578883 12784959 11759014
4149A1759014r18437o43861m93769l73653p7704j90642o0709o7306m2309J14057
4139I004681L04364M25523L96580M48804J48324k85650l28600k65665q3553l4652
4129I730156J41847L55615M64400O95434O07261N76532r6846r62661j125607j203977
4119I182154r00735o88621n97161l45216l46273k47725k02714K960k14345j90067
4109E452257j21696j73739j49358J5969r4245r0464O0811p6688N1381K42k440
4098D872030o0844r8667M2720L8236q3051L40L8234K1666P7427K9255Q2629J85738
4086E145713J28147J05038J37116M8321O0946J32244r7024l7485J8387r6686J9896
4075E564613n0335j06323M5182J11841R9196J25028J8315N5823J7802j04906j13267
$$ plain form
4149 11759014 10840577 10196716 9702947 9329294 9251590 9060948 9000239 8932933 8890624 9004681
4139 9004681 9309045 9734568 10131148 10579952 10728276 10442626 10114026 9848361 9764808 9730156
4129 9730156 9872003 10227618 10692018 11387452 11994713 12571245 12474399 11511738 10386131 9182154
4119 9182154 8281419 7592798 6995637 6650421 6304148 6056423 5853709 5856669 5642324 5452257
4109 5452257 5330561 5156822 5007464 5023433 4929188 4838724 4899535 4822847 4874228 4874470 4872030
4098 4872030 4811186 4712519 4755239 4793475 4710424 4710764 4748998 4770664 4848091 4877346 4959975 5145713
4086 5145713 5273860 5378898 5516014 5564335 5625281 5757525 5660501 5623016 5641403 5544717 5564613
4075 5564613 5514278 5407955 5453137 5564978 5664174 5789202 5807517 5863340 5881142 5776236 5662969
4064E662969n8180r7814m9826M8233r7065J689J01123J15679j42765J75183P0290
4053E729516J06313J32441j6126J30199Q7646J50233K7046K88987M2311J75085
4043F853651M20531K54757M9955J67554K65035K06184K31015K55148J95350K23698
4033I122878K92492J94517K49874J26413K26802K33629J23677K80504L31029M64179
4023A1645994M70867N65434N63608O80010O50509O50085N73646N58178L94254
4014A6752585L00160L43846L03610L09158M49489M64445L54548L29557M52182
4005B0059580M48888K61095L22181L35381L97338N43547M64353O51418Q42891
3996B4326672Q19073J094098R87389R62180R38631Q25992P37879M99674M92766
$$ plain form
4064 5662969 5604789 5506975 5457149 5505382 5408317 5410006 5511129 5626808 5484043 5659226 5729516
4053 5729516 5835829 5968270 5952144 6082343 6169989 6320222 6347268 6636255 6678566 6853651
4043 6853651 7274182 7528939 7578894 7746448 8011483 8217667 8448682 8703830 8899180 9122878
4033 9122878 9415370 9609887 9859761 9986174 10212976 10446605 10570282 10850786 11181815 11645994
4023 11645994 12116861 12682295 13245903 13925913 14576422 15226507 15800153 16358331 16752585
4014 16752585 17052745 17396591 17700201 18009359 18458848 18923293 19277841 19607398 20059580
4005 20059580 20508468 20769563 21091744 21427125 21824463 22368010 22832363 23483781 24326672
3996 24326672 25145745 26239843 27227232 28189412 29128043 29954035 30691914 31191588 31684354
3987C1684354L18024J63136K52795O0108J83033K80762K09658J82103L06679L41283
3977C3981935J51867N0973J46202K70448K06805K57927L29047K35324M09924N99808
3967C6640260N91301O25158Q49885P69323P09261N48609N04357K63439N8311O2052
3957D1621956n151k02149l30540m94026n50159o20065p51988o63565o52956o05967
3947C6745390p03676o88102n93201p10299p45530m88868k55938l54662j62495
3938C2042619M3972K44810J50332J52765K67070K12000K9206k26690n16461p29433
3928C1670190p63870j028100j183419j144112j199792j016150q19380r79902r40710
3919B2594755q39137p29261p30109o09759m40689l76537m49638l24917q4455j17327
$$ plain form
3987 31684354 32002378 32165514 32418309 32478417 32661450 32942212 33151870 33333973 33640652 33981935
3977 33981935 34133802 34184775 34330977 34601425 34808230 35066157 35395204 35630528 36040452 36640260
3967 36640260 37231561 37856719 38706604 39475927 40185188 40733797 41238154 41501593 41559904 41621956
3957 41621956 41616805 41414656 41084116 40590090 40039931 39419866 38667878 38004313 37351357 36745390
3947 36745390 36041714 35353612 34760411 34050112 33304582 32815714 32559776 32205114 32042619
3938 32042619 32086591 32331401 32481733 32634498 32901568 33113568 33142774 32916084 32399623 31670190
3928 31670190 30906320 29878220 28694801 27550689 26350897 25334747 24515367 23535465 22594755
3919 22594755 21755618 21026357 20296248 19686489 19245800 18869263 18419625 18094708 18010253 17892926
3909A7892926j73897Q1624m1915m8423k02004j32764l30087k37640l93351n04134
3899A5910335l55404m84753l59752l79733k81755m03196k83771k92429j57991
3890A2911551j07033j30324p4636o6060J277Q4K7542J06560J19866J09963J33681
3879A3032471J57524R7901K17387L80096L82664L17389L88729M08946K91918K49051
3869A5924076K62682K06016L30501K61438J15931K42553K02907Q9760J18458L09533
3859A8063855K32829K24380K03417L15520L93753N09913M23654M14624N14875
3850B1296820O29443N96642O51071Q14321P30596Q20211P40783P60983O58381
3841B7699251N92899N10081N59441O13289P09980N09929L06676M21381N18004
$$ plain form
3909 17892926 17719029 17800653 17758738 17710315 17508311 17375547 17045460 16807820 16414469 15910335
3899 15910335 15554931 15070178 14710426 14330693 14048938 13645742 13361971 13069542 12911551
3890 12911551 12804518 12674194 12599558 12533498 12534775 12534859 12562401 12668961 12788827 12898790 13032471
3879 13032471 13189995 13287896 13505283 13885379 14268043 14585432 14974161 15383107 15675025 15924076
3869 15924076 16186758 16392774 16723275 16984713 17100644 17343197 17546104 17635864 17754322 18063855
3859 18063855 18296684 18521064 18724481 19040001 19433754 19943667 20367321 20781945 21296820
3850 21296820 21926263 22522905 23173976 23988297 24718893 25539104 26279887 27040870 27699251
3841 27699251 28292150 28802231 29361672 29974961 30684941 31194870 31501546 31922927 32440931
3832C2440931N33960L16285L86562L27769K86452K80833L72392L78131L57136
3823C5680451M05465N44614M83666O10126O97225O47305N49041O31756O52411
3814D0902060O24471P49092P73810Q32095Q08401P58735Q63052O15659N51106
3805D7478481N82916L31181L04131L84569K04446L33071K66891K90287M13929
3796E0589902L58773O00805O85320P09863O81313N99881O45673P44807N05440
3787E6121777P12397N95821P37853Q36944Q34534J135560J202478J192611J217635
3778F4587610J359263J338225J512712J666471J775576J916148K096123K328959
3770G8581087K369252K503925K294836K113397J958211J824313J328360J078573
$$ plain form
3832 32440931 32974891 33291176 33677738 34005507 34291959 34572792 34945184 35323315 35680451
3823 35680451 36085916 36630530 37114196 37724322 38421547 39068852 39617893 40249649 40902060
3814 40902060 41526531 42275623 43049433 43881528 44689929 45448664 46311716 46927375 47478481
3805 47478481 48061397 48392578 48696709 49081278 49285724 49618795 49885686 50175973 50589902
3796 50589902 50948675 51549480 52234800 52944663 53625976 54225857 54871530 55616337 56121777
3787 56121777 56834174 57429995 58167848 59004792 59839326 60974886 62177364 63369975 64587610
3778 64587610 65946873 67285098 68797810 70464281 72239857 74156005 76252128 78581087
3770 78581087 80950339 83454264 85749100 87862497 89820708 91645021 92973381 94051954
3762I4051954O37324J53475k35709m17189n61068m46095m98271l62316k68863
3753I2053242l48683m19139p80929q34909j444184j956140j992064k430111k333712
3744G9513371k301662k446791k367316k442014k127445j936379j917578j569026
3736F2405160j398848j201088j004576j070122r44727q83912q69949j093398q96668
3727E3041872r26928r27403q15379q30399o84996p53589o10627k76651j99390
3718D7016510j62648q5336N4154n256J06202J96511p7616R2521J15823K55610
3708D7506475J04002o8942N9790P9095M2269o9295J75233J5808m3130R239k40080
3697D7570464k04371m01159o06590l75047n33511m94059n41651l04430k81661
$$ plain form
3762 94051954 94689278 94842753 94607044 94189855 93628787 93182692 92684421 92322105 92053242
3753 92053242 91704559 91285420 90504491 89669582 88225398 86269258 84277194 81847083 79513371
3744 79513371 77211709 74764918 72397602 69955588 67828143 65891764 63974186 62405160
3736 62405160 61006312 59805224 58800648 57730526 56785799 55901887 55031938 53938540 53041872
3727 53041872 52114944 51187541 50372162 49541763 48856767 48103178 47492551 47215900 47016510
3718 47016510 46853862 46768526 46822680 46817424 46923626 47120137 47042521 47135042 47250865 47506475
3708 47506475 47610477 47541535 47601325 47680420 47722689 47653394 47828627 47844435 47801305 47810544 47570464
3697 47570464 47366093 46964934 46358344 45983297 45449786 44955727 44414076 44109646 43827985
3688D3827985k09590k94627l90544k80370k65733j41593K4209q5184j6374J48740
3678D2316919L54933K21602K23063L18514L56506L68580K25181K33309o7269k34595
3668D4316743j73289k67620n21506n35834n87259o06596o91119o39830n15782
3659C9777908m47658l74856j68589j75187j68677J419J42605J38286L46853K29473
3649C9301577J20520J50495L03559L54161M84174M47282L24388M53649M18773
3640D2358578M06182L44820M19422J02504O0915o2134l21252l74447n40977o17336
3630D1776275o95621p47654o81988l74518l19574l30642j02011P2863K07843K03464
3620C9008437K57154M05439N60242M65360P86486P04605P36842Q02607R18358
$$ plain form
3688 43827985 43618395 43323768 42933224 42652854 42387121 42245528 42269737 42184553 42168179 42316919
3678 42316919 42671852 42893454 43116517 43435031 43791537 44160117 44385298 44618607 44551338 44316743
3668 44316743 44143454 43875834 43354328 42818494 42231235 41624639 40933520 40293690 39777908
3659 39777908 39330250 38955394 38786805 38611618 38442941 38444360 38586965 38725251 39072104 39301577
3649 39301577 39422097 39572592 39876151 40230312 40714486 41161768 41486156 41939805 42358578
3640 42358578 42764760 43109580 43529002 43631506 43692421 43630287 43309035 42934588 42393611 41776275
3630 41776275 41080654 40333000 39651012 39276494 38956920 38626278 38524267 38597130 38804973 39008437
3620 39008437 39265591 39671030 40231272 40696632 41483118 42187723 42924565 43727172 44645530
3611D4645530J088368Q98054J181860J440455J539291J491842J687686J782938
3603E5756024J991589K180921K392747K598371K825467L257368L577394L815573
3595G8395454L846529M028850L976465L628848L590974L202777K600400K169392
3587A05439689J830173J476372J033718N65602L38503K30992J97077J19215J52375
3578A11383716J85994J69596R7029p7278p8071m09398n89203o25443o77299p78132
3568A08601511q15869n99517l35133j45892M15774R47999J434336K126107K770149
3559A14399465L171141L499010L815610L699522L446144K908236K311385J482335
3551A38732848J109652M59614L0075k88130m73993m60503l54985o22782p09602
$$ plain form
3611 44645530 45733898 46631952 47813812 49254267 50793558 52285400 53973086 55756024
3603 55756024 57747613 59928534 62321281 64919652 67745119 71002487 74579881 78395454
3595 78395454 82241983 86270833 90247298 93876146 97467120 100669897 103270297 105439689
3587 105439689 107269862 108746234 109779952 110345554 110684057 110915049 111112126 111231341 111383716
3578 111383716 111569710 111739306 111836335 111759057 111680986 111271588 110682385 110056942 109379643 108601511
3568 108601511 107785642 107186125 106850992 106705100 107120874 108068873 109503209 111629316 114399465
3559 114399465 117570606 121069616 124885226 128584748 132030892 134939128 137250513 138732848
3551 138732848 139842500 140302114 140332189 140044059 139570066 139109563 138754578 138131796 137422194
3542A37422194j217862j814239k367561l127731l689436m320328m642883n004608
3534A11237546n070178m937046m659999m453286m110665l807704l428299l184932
3526G7585437k889323k582602k211400k117102j989192j607657j481644j663338
3518F1043179j844301k191261k219402k008363j864228j666329j447802j191429
3510D6610064j145849j377727j272808j020806j181801j055272r63641p03550
3502C7888610o84738m83135n08369o13956l72126k24267o2295o8783P5449m63157
3492C4483233q62763r52437q40175o61618n81509l13526j74495L8920P4752M18482
3482C0628864L61922M87612N49140Q69285R27597J579355J972130J587295n7350
$$ plain form
3542 137422194 136204332 134390093 132022532 128894801 125205365 120885037 116242154 111237546
3534 111237546 106167368 101230322 96570323 92117037 88006372 84198668 80770369 77585437
3526 77585437 74696114 72113512 69902112 67785010 65795818 64188161 62706517 61043179
3518 61043179 59198878 57007617 54788215 52779852 50915624 49249295 47801493 46610064
3510 46610064 45464215 44086488 42813680 41792874 40611073 39555801 38592160 37888610
3502 37888610 37203872 36720737 36212368 35598412 35226286 35002019 34939724 34870941 34946390 34483233
3492 34483233 33620470 32668033 31827858 31166240 30584731 30271205 30096710 30135630 30210382 30628864
3482 30628864 30990786 31478398 32027538 32896823 33824420 35403775 37375905 38963200 38905850
3473C8905850k586455l081914k837029j941667j260383p18699p53373l92404k71178
3464B5062748j43037N5943J39139J37164M76524N98902Q41518O93146Q24005R72594
3454B9658646J531766J805237K058309K309556J753428K06550k061391k762192
3446C4499909k370753j304213n77536l35502J33679N72453R88616J473338J979883
3437C5059874K213958J784041o6593j888404k187582k001027j143909p63500l20012
3428C0686846j80180P8974J39528K42171M22584O16338P64583R71630J176444
3419C4918918J415300J536503J812741K349691K955381L542541M090087M485653
3411E7106815M272238K476904O98796L38837M91958J008780J353232J439766J131151
$$ plain form
3473 38905850 36319395 33237481 30400452 28458785 27198402 26479703 25726330 25333926 25062748
3464 25062748 24919711 24975654 25114793 25251957 25728481 26327383 27168901 27862047 28686052 29658646
3454 29658646 31190412 32995649 35053958 37363514 39116942 39323492 37262101 34499909
3446 34499909 32129156 30824943 30247407 29911905 30045584 30618037 31606653 33079991 35059874
3437 35059874 37273832 39057873 38991280 37102876 34915294 32914267 31770358 31006858 30686846
3428 30686846 30506666 30585640 30725168 30967339 31389923 32006261 32770844 33742474 34918918
3419 34918918 36334218 37870721 39683462 42033153 44988534 48531075 52621162 57106815
3411 57106815 61379053 63855957 64554753 64893590 65385548 66394328 67747560 69187326 70318477
3402G0318477R44433N35365M0279l16360o94707j055984j595275k041988k291680
3393F3842560k703637k843422l091200l117119l175833l126055k825747k714669
3385D0244878k435265k192372j928989j835538j639956j490663j493565j233772
3377B5994758j115220j119206j060930q05307p82903p25272o35694n49802n59107
3368A8641317m77430m85126m81488m00080m87538l17303l40139l75509k23037
3359A5053667k31156k36056r0106j54778j47853k31333j44072q0775m8173j45587
3349A3543778K1769r0344k47492l6305p3355p4787k43255k24006j84255l12837
3339A2078911k10062m34572k76527l08640k75464k83542j58142j30263j50223
$$ plain form
3402 70318477 71262910 71798275 71838554 71522194 70827487 69771503 68176228 66134240 63842560
3393 63842560 61138923 58295501 55204301 52087182 48911349 45785294 42959547 40244878
3385 40244878 37809613 35617241 33688252 31852714 30212758 28722095 27228530 25994758
3377 25994758 24879538 23760332 22699402 21894095 21111192 20385920 19750226 19200424 18641317
3368 18641317 18163887 17678761 17197273 16797193 16309655 15992352 15652213 15276704 15053667
3359 15053667 14822511 14586455 14496349 14341571 14193718 13962385 13818313 13737538 13689365 13543778
3349 13543778 13565547 13475203 13227711 13191406 13118051 13043264 12800009 12576003 12391748 12078911
3339 12078911 11868849 11434277 11157750 10849110 10573646 10290104 10131962 10001699 9851476
3330I851476j42471j91870p5605p3292o9496k55317k17370k6292j75687r2105
3320H531971l4511j2697j11552j63980K1797m1295j27899r1388j34500J4866L4304
3309G885116q9010O3755k20662P2177q4917j68053J5291L8700m5904k3434J15794
3298G558853O4188m6381p3134j05191N8765k7784p7928o6845q9097q6171J9390
3287G128665J17673j20980j06587Q7666N6675k1323N6320o4095M383R7221k3286
3276G212332J9714Q0840m1688J78849n3987N6381K8403k8446J77658p1129J81868
3265G740795P9424J99486J18558K797J72983J91226N1697N6405K19460K15021
3255I047852J97755L65728L20065K68041L17159L53947M34696N12409M92727M69932
$$ plain form
3330 9851476 9709005 9517135 9441530 9368238 9298742 9043425 8826055 8799763 8624076 8531971
3320 8531971 8497460 8484763 8373211 8209231 8231028 8189733 8061834 7970446 7835946 7850812 7885116
3309 7885116 7796106 7859861 7639199 7711376 7626459 7458406 7473697 7512397 7466493 7443059 7558853
3298 7558853 7623041 7576660 7503526 7398335 7457100 7429316 7351388 7284543 7195446 7109275 7128665
3287 7128665 7246338 7125358 7018771 7106437 7163112 7141789 7198109 7134014 7138397 7235618 7212332
3276 7212332 7232046 7312886 7271198 7450047 7396060 7452441 7480844 7452398 7630056 7558927 7740795
3265 7740795 7820219 8019705 8138263 8141060 8314043 8505269 8556966 8613371 8832831 9047852
3255 9047852 9245607 9611335 9931400 10199441 10516600 10870547 11305243 11817652 12310379 12780311
3245A2780311M62401R7426r3804n2788L2032l7791J15614J82797o574K22657J69920
3234A3872201K83452K67636J73819K03516K69070K42106K59159L42173L92903
3225A6306035M37833L11290L35842L92013L10067N16892N28263M63788O02273
3216B0204296M78918N91247Q31297Q15985Q00455J019141J202836J300731J378661
3207B8623567J335818J639414J586681J739138J838197J873074K336765K518885
3199D3491539K829249L149520L567626M075253M595218N140932N799437O154427
3191G8803201O295286O032833O893828Q171193R771149J1772227J3667001J5595915
3183A57002633J7902791K0389744K2720748K3641101K2375456J7236544P834637
$$ plain form
3245 12780311 13242712 13340138 13246334 13193546 13225578 13187787 13303401 13486198 13479624 13702281 13872201
3234 13872201 14155653 14423289 14597108 14800624 15069694 15311800 15570959 15913132 16306035
3225 16306035 16743868 17055158 17391000 17783013 18093080 18609972 19138235 19602023 20204296
3216 20204296 20683214 21274461 22105758 22921743 23722198 24741339 25944175 27244906 28623567
3207 28623567 29959385 31598799 33185480 34924618 36762815 38635889 40972654 43491539
3199 43491539 46320788 49470308 53037934 57113187 61708405 66849337 72648774 78803201
3191 78803201 85098487 91131320 98025148 106196341 115967490 127739717 141406718 157002633
3183 157002633 174905424 195295168 218015916 241657017 264032473 281269017 289103654
3176B89103654m266336j5398366k1956266k4216471k3184292k0831601j8233137
3169A61017185j5526952j3402610j1290855r433491q149123p398512o717511o373363
3161H2724768o241309n679088n255933m797707m230488l660335l345966k806609
3153D6707333k505016k338455k244577j988109j707809j605966j452944j222000
3145C1642457j310674j189397j060215j067309j010057r15133q12995j012049
3137B3264628q65061q27654q37366p24273q33364o93718o04772m73498m62778
3128A6942144n55001l96179l68196m07921l99336l75084l62783l14834k10107
3119A3552703l60160l70377k49246k26944k77301l62004l56375k66222j28229
$$ plain form
3176 289103654 284837318 269438952 247482686 223266215 200081923 179250322 161017185
3169 161017185 145490233 132087623 120796768 111363277 103214154 95815642 89098131 82724768
3161 82724768 76483459 70804371 65548438 60750731 56520243 52859908 49513942 46707333
3153 46707333 44202317 41863862 39619285 37631176 35923367 34317401 32864457 31642457
3145 31642457 30331783 29142386 28082171 27014862 26004805 25089672 24276677 23264628
3137 23264628 22399567 21571913 20734547 20010274 19176910 18483192 17878420 17404922 16942144
3128 16942144 16387143 15990964 15622768 15214847 14815511 14440427 14077644 13762810 13552703
3119 13552703 13192543 12822166 12572920 12345976 12068675 11706671 11350296 11084074 10955845
3110A0955845k27784k78150j98769k46418l14029k07975k19935k05035r3165j45540
3100H819045j74195k87405p9427k26272j62031k85853j41424j20522k06903j28840
3090G006173j07883k7129l22204K6551q0581j96606k04930j37782k21653k8298
3080E705658j05557j53042J3068n8778k38535j17641l5427k06317m9013q6815
3070D667601q4695q9319o2188m5028j15313j55864L2231j01662o1243j47893j59951
3059C676676J49171j11889j22874K0828m8586l7799j34214p0514j2238k125q0059
3048C226377p2142m0861j74600J359o2337M303M9214p8985j27019n2221Q585r3299
3036B588374J8073j5521n6600O7158r2156m8810K4334j69486L7502Q6856l627
$$ plain form
3110 10955845 10728061 10449911 10251142 10004724 9690695 9482720 9262785 9057750 8964585 8819045
3100 8819045 8644850 8357445 8278018 8051746 7889715 7603862 7462438 7341916 7135013 7006173
3090 7006173 6898290 6871161 6548957 6575508 6494927 6298321 6093391 5955609 5733956 5705658
3080 5705658 5600101 5447059 5460127 5401349 5162814 5045173 5009746 4803429 4754416 4667601
3070 4667601 4582906 4493587 4431399 4386371 4271058 4115194 4147425 4045763 3984520 3836627 3676676
3059 3676676 3825847 3713958 3591084 3611912 3563326 3525527 3391313 3320799 3308561 3306436 3226377
3048 3226377 3154235 3113374 2938774 2940133 2877796 2882099 2931313 2852328 2725309 2673088 2681673 2588374
3036 2588374 2606447 2590926 2534326 2601484 2509328 2460518 2484852 2315366 2352868 2439724 2436097
3025B436097j13877J5403O2348j65628J071P4567o5344K1769m9638j52569J17606
3014B181805o9882k7129m9243J24791j34681m893m1186j84077l4151n0263J9702
3003A730793p7409O5320j02342o7453r5345K2678O4820M6700N499k0788p2929
2992A499544R9062Q422N0132k9492j16482J4897j5650k7795K6474j33551j9154
2981A356407L8345P3783j01162q8521M5862N7747J6503Q293J1188q1956r410N1620
2969A378699m8496j1282j7058j31040J21855j3115o1634m4104Q868O0970j54546
2958A089117J01071R086M3271Q6024j7050o3714j30817n345K0820N6995J12065
2947A301523q3491j8646r6250J6299J68562N6935q5520l0625k9818k2058R1536
$$ plain form
3025 2436097 2322220 2337623 2399971 2234343 2235414 2309981 2244637 2266406 2216768 2064199 2181805
3014 2181805 2111923 2084794 2035551 2160342 2025661 2020768 1979582 1795505 1761354 1711091 1730793
3003 1730793 1653384 1718704 1616362 1548909 1453564 1476242 1541062 1587762 1593261 1572473 1499544
2992 1499544 1598606 1607028 1657160 1627668 1511186 1526083 1510433 1482638 1509112 1375561 1356407
2981 1356407 1394752 1468535 1367373 1278852 1324714 1382461 1398964 1407257 1418445 1336489 1327079 1378699
2969 1378699 1330203 1318921 1301863 1170823 1292678 1279563 1217929 1173825 1182693 1243663 1089117
2958 1089117 1190188 1199274 1242545 1328569 1311519 1247805 1116988 1111643 1132463 1189458 1301523
2947 1301523 1218032 1199386 1103136 1119435 1287997 1344932 1259412 1228787 1198969 1176911 1268447
2936A268447r9870Q0618q37Q5120R4920P1848M5975m185J12978J18058K9924J68317
2924A971313P5568P5956R4340k5275j41820J5963j53907l5879n6575j47523n6866
2913A615295j16814l5451q7570n9172m5674j08530N7364k47119M457J11797p3013
2902A015570m7273q0501n2644j05149L1021J71098j54701J127J1206j13550j1698
2891F64506o947P0932j6840J2564P9825k287r3859r27L8912q3354q9762J6513
2879E89276J6420Q5427j6735j1925R442k4249o1142j01134P9027L6295L7396q224
2867F29874n0166r1j09264J10504P6929n8942j4375M207m4743j7336k7755N0593
2855E49435P9046M0008j09182l8690Q415n8798j1272l359j37274j351O5527K682
$$ plain form
2936 1268447 1168577 1249195 1248358 1333478 1428398 1500246 1546221 1542036 1655014 1773072 1802996 1971313
2924 1971313 2046881 2122837 2217177 2191902 2050082 2066045 1912138 1876259 1819684 1672161 1615295
2913 1615295 1498481 1463030 1375460 1316288 1270614 1162084 1219448 972329 976786 1088583 1015570
2902 1015570 968297 887796 835152 730003 761024 932122 777421 778548 789754 676204 664506
2891 664506 657559 728491 711651 724215 804040 801753 707894 706967 745879 662525 572763 589276
2879 589276 605696 691123 674388 662463 671905 647656 586514 485380 564407 600702 638098 629874
2867 629874 579708 579617 470353 580857 657786 598844 584469 588676 543933 526597 498842 549435
2855 549435 628481 668489 559307 520617 529032 470234 458962 455603 318329 316978 382505 385187
2843C85187m4031J7019J02229l3790J2325l4919m816j382r1621q1354L2728K0837
2831B78412J52998M820l8046O1005n169Q464M42j4279K4143L8198p7836R0552
2819E23704l504j08392o8131K6351k201L2401n4288M408K8409P4571m1234l5364
2807C76730k525l5601J9075P443L7652J07315K3932m9903l4834j39760L8043L1979
2795C79546q8731n1708L2135Q1840k2998L9291J8157M0305p5777l127n7609r9869
2783A91455J31182n8044L7358j804p8899J2485J04210K5617j12112l6496j4669
2772B00283Q5049j1014K4910m8567L8422P2065n0067l6486N1514n8630k8301L3424
2760B72602M0458J3746k1195O3836M51N2216n9771L2179N2317j7526J4809j46986
$$ plain form
2843 385187 341156 358175 460404 426614 438939 404020 399204 397822 306201 224847 257575 278412
2831 278412 431410 436230 398184 459189 454020 462484 462926 448647 472790 510988 433152 523704
2819 523704 520200 411808 343677 370028 367827 400228 345940 350348 378757 453328 412094 376730
2807 376730 374205 338604 357679 365122 402774 510089 534021 484118 449284 309524 347567 379546
2795 379546 290815 239107 271242 353082 330084 369375 387532 427837 352060 348933 291324 191455
2783 191455 322637 264593 301951 300147 221248 233733 337943 363560 251448 214952 200283
2772 200283 285332 274318 299228 250661 289083 361148 311081 274595 326109 267479 239178 272602
2760 272602 313060 326806 305611 369447 369898 422114 362343 394522 446839 429313 444122 297136
2748B97136K3297n5969J43403O679q0050r301j59359M3015M7863J28046m3179
2737C41581R825L728J45270J35643p5673O8956k5459j9525J1132Q8127p324j50843
2725E25438n7399l0546k3934M5708m6270j11772N7417j33940P0704m1068p8196
2714A76142Q1998L2207K3373j12572n4247J51879m7388L6966M4231j5484j19602
2703A97503O2526Q8641m5252O7166q7425j7332l6887P9047k2224n3157Q6514J970
2691C21090M792L6937p2466N778k1852q9480J96966p0490l8867M6105J31155N3384
2679E03052j12438j32879q2098J5990J50473K1602l0663o6275K8001P2015j00231
2668B66549o9661R4148j035N0177O2788j36403k0843J08552r938l1817J8505m5365
$$ plain form
2748 297136 320433 264464 407867 414546 334496 325195 165836 208851 256714 384760 341581
2737 341581 351406 355134 500404 636047 560374 629330 603871 584346 595478 683605 676281 525438
2725 525438 468039 437493 413559 459267 412997 301225 358642 224702 295406 254338 176142
2714 176142 258140 290347 313720 201148 146901 298780 251392 288358 332589 317105 197503
2703 197503 260029 348670 303418 370584 283159 265827 228940 307987 285763 232606 319120 321090
2691 321090 325882 362819 290353 296131 274279 184799 381765 311275 272408 318513 449668 503052
2679 503052 390614 257735 175637 191627 342100 363702 333039 266764 294765 366780 266549
2668 266549 196888 291036 290001 340178 402966 266563 245720 354272 344334 312517 331022 285657
2656B85657P4995j9750m6613J9913p970K8086m5866Q0961J545l341r943p415K2302
2643C72561r4737J05258r8788J03460Q6190j6515j2352j48477o7291N3392J8402
2632C01103R3385N0310o122o4250j01678J59618q8091o5072L4070L4317J5390
2621C62980L0033Q867j8235Q6714J6913q0520K2885k4722o2973j03311J59201
2610C97832L3890L8562R2894o6902n3454k8630r7273J64133J43678o9811m3521
2599E11398k0218j19019k0035J55440o2065l5526J17529m079l6125O832k5593
2588D68539J49606j38474N1046j1157Q8278p6668P2921P9400m7599J751O8415
2577G06058k8973K6949K3956M1138o3297K2083M3158O3604j07527J22002Q9367
$$ plain form
2656 285657 360652 340902 294289 314202 306232 334318 288452 369413 370958 367617 357674 350259 372561
2643 372561 277824 383082 284294 387754 473944 457429 445077 296600 229309 282701 301103
2632 301103 394488 444798 438676 374426 272748 432366 344275 279203 313273 347590 362980
2621 362980 393013 401880 383645 470359 487272 406752 429637 404915 341942 238631 397832
2610 397832 431722 470284 563178 496276 442822 414192 316919 481052 624730 554919 511398
2599 511398 491180 372161 352126 507566 445501 409975 527504 523425 487300 494132 468539
2588 468539 618145 479671 530717 519560 607838 531170 604091 683491 635892 637643 706058
2577 706058 677085 704034 727990 769128 705831 727914 771072 834676 727149 849151 938518
2566I38518J4603j35940P3003m9342P0484J01216N4422L1837L4170Q8150J1380
2555A232501L8887O4908j409r943M4006L800l6638n6484O6470Q7021J27220p4456
2543A485883K0578J08692J20856M4842N5841L6212j61028J43378J31865o2592
2533A924527N9987P0872j67408J28369J76391K49398j42432Q5161O6459N7128
2523B508452J88778L5685K05267J64021J25817K89294K02985K2063L64725K03484
2513D310571K66016L45508M36610M09850O51438M21322N62084N87312P34585Q76882
2503I602178J026619R46511Q28025J209102J964052K257586K730857K960112L658828
2494B7183870M797987O310187P652504R879045R980006N978460o799417j1946808
$$ plain form
2566 938518 953121 817181 890184 840842 911326 1012542 1066964 1098801 1132971 1221121 1232501
2555 1232501 1271388 1336296 1334887 1324944 1368950 1372750 1336112 1279628 1346098 1433119 1560339 1485883
2543 1485883 1506461 1615153 1736009 1780851 1836692 1872904 1711876 1855254 1987119 1924527
2533 1924527 1984514 2055386 1887978 2016347 2192738 2442136 2299704 2384865 2451324 2508452
2523 2508452 2697230 2732915 2938182 3102203 3228020 3517314 3720299 3742362 4107087 4310571
2513 4310571 4576587 4922095 5358705 5768555 6419993 6841315 7403399 7990711 8725296 9602178
2503 9602178 10628797 11575308 12403333 13612435 15576487 17834073 20564930 23525042 27183870
2494 27183870 31981857 38292044 45944548 55823593 65803599 71782059 64982642 53035834
2486E3035834j1250226r318485n660836m221019l045689k555970j597651j540923
2478A3845035r70545q96858p30776p81868q92816p79952p48005p55034m37146
2469F852035n66164m40524m44872k55957j59800j82591l03064p7689k49195o7163
2459D105016j63135k51132j00907K6180j74246q2486k58881l8379l0460j80303
2449B851267j23894j77196j29347j21016n4974j47754j23932l7547O3991r6740
2439A902858j60879Q5378j31546J17173j20363j31752m3268r5972n0263J3812
2429A385178P374n382l2982l9437r3255J54214p7212m6951m6170m6984P7679n3065
2417A183007j8653J2632n8435M1797q2206q9850K4850P5399p4047q4939j9549
$$ plain form
2486 53035834 41785608 32467123 26806287 22585268 19539579 16983609 15385958 13845035
2478 13845035 12874490 11977632 11246856 10464988 9572172 8792220 8044215 7289181 6852035
2469 6852035 6285871 5845347 5400475 5144518 4984718 4802127 4499063 4421374 4172179 4105016
2459 4105016 3941881 3690749 3589842 3616022 3441776 3359290 3100409 3062030 3031570 2851267
2449 2851267 2727373 2550177 2420830 2299814 2244840 2097086 1973154 1935607 1999598 1902858
2439 1902858 1741979 1827357 1695811 1812984 1692621 1560869 1517601 1421629 1371366 1385178
2429 1385178 1392552 1387170 1354188 1314751 1221496 1375710 1298498 1251547 1205377 1158393 1236072 1183007
2417 1183007 1164354 1176986 1118551 1160348 1078142 988292 1013142 1088541 1014494 929555 910006
2406I10006p3667k0080k4704j2573M909k1743j9741Q8877l5713p8502O891q3524
2394F40436J9484O7117j74352r9673L3190O4317l249R29n501J51691O4174j55192
2382F03371o1363L2501l3546j0175n9824j43749N7318Q7033K6100Q4977p6511
2371E06132k03473J12431N3170o6836j18523p3407J15802J2477j5071Q8636n1222
2360C60116q4371k5167K5681k9575J34429K726K849p4591q678K63074j00462n2065
2348D13966r5635j04935M5248o722m2721N2k617O9012r4723J01780J26564o2640
2336C46629p2918o0379L3051R2378o2588n5837l661l2662R4051J61375q7395n3141
2324B98903p697p0178J3371M4244P048n1792J9459j0842L6678j62247j7048J31697
$$ plain form
2406 910006 836339 816259 791555 778982 783891 762148 742407 831284 795571 717069 723960 640436
2394 640436 659920 727037 552685 453012 486202 550519 547270 548199 542698 694389 758563 603371
2382 603371 542008 574509 540963 530788 470964 327215 384533 471566 497666 582643 506132
2371 506132 302659 415090 468260 401424 282901 209494 325296 337773 322702 411338 360116
2360 360116 275745 250578 276259 246684 381113 383839 386688 312097 303419 566493 466031 413966
2348 413966 318331 213396 258644 251922 209201 209253 206636 275648 180925 282705 409269 346629
2336 346629 273711 213332 246383 338761 276173 220336 216675 184013 278064 439439 352044 298903
2324 298903 291206 221028 234399 278643 285691 233899 253358 242516 279194 116947 99899 231596
2312B31596j26281J19335n7980O8600O2812k5741L6978j41716p0892J34540P186
2301B38437n8110k1136J01636o5086p3201N3589J9839n9342K6371o37j09468J84527
2289B37419O4244k8038K2449M6652l8542M284m9515r6481N1252M9239Q88j15452
2277A48399K0807O7639o6035k1679J07167k5601j77043Q0324J00471j13650m8921
2266G1878L8388N8399P4330J3190r4720K4556j2413q2456J2024L9947l222m1257
2254I8644j1945Q2232n0716N2180J6443J51720J7252L693R1004M9571m1129p3594
2242C85355j17594N9128k7850q6284n102N1059O8798j44688J3978L3877N7330
2231B88007j42657m5302K1074Q928j2268j0420l9418l5971N8792q649R9337n3377
$$ plain form
2312 231596 105315 224650 166670 235270 298082 272341 309319 167603 96711 231251 238437
2301 238437 180327 159191 260827 195741 122540 176129 195968 136626 162997 162360 52892 237419
2289 237419 301663 273625 296074 342726 304184 308468 258953 162472 213724 262963 263851 148399
2277 148399 169206 236845 170810 149131 256298 230697 53654 133978 234449 120799 71878
2266 71878 110266 168665 242995 256185 161465 186021 173608 91152 103176 143123 139901 98644
2254 98644 86699 168931 118215 170395 186838 338558 355810 359503 450507 500078 458949 385355
2242 385355 267761 326889 299039 212755 207653 258712 327510 182822 196800 230677 288007
2231 288007 145350 100048 121122 130050 117782 107362 67944 31973 90765 82116 181453 128076
2219A28076j34104M0464M162J719O3079j158M2964J52935j70667q1565L2011K8979
2207A06895J08517q9841M6267K315k16153L0737R3740k4515P8067k9856n1471
2196E4702M1803n7270q9423J14547M1152p3096N7644n1910l1130Q532P711o4288
2184d1026J65479Q796l7410n288p382j48017N6306N5786L7149q039j6586K9456
2172H9224K8266j4950M8653n1532N4988M7579p6479p5514J16841j6563j02344
2161D8169j898M9420l2185r6797J16877k2019q5082n4093J4476J18885p8864J12631
2149H9520p9089m8405j1925O5359M1812n0875N9851j26238l9931O0803L8274N3759
2137E2915n0017K5478K2485P5182M4121k9030L8190n2560m0190n0771M4095n4488
$$ plain form
2219 128076 -6028 34436 38598 40317 103396 102238 145202 298137 127470 45905 77916 106895
2207 106895 215412 125571 171838 174153 -42000 -11263 82477 57962 136029 106173 54702
2196 54702 96505 39235 -50188 64359 105511 32415 90059 38149 7019 15551 23262 -41026
2184 -41026 124453 133249 95839 90551 83169 -64848 -8542 47244 84393 76354 59768 89224
2172 89224 117490 102540 151193 99661 154649 202228 125749 50235 167076 150513 48169
2161 48169 46271 95691 63506 -33291 83586 61567 -23515 -77608 -63132 55753 -23111 89520
2149 89520 10431 -37974 -49899 15460 57272 6397 66248 -59990 -99921 -39118 -844 52915
2137 52915 2898 28376 50861 126043 170164 141134 179324 126764 86574 35803 79898 25410
2125B5410J44281K3952n8773l6112N5296n4348k7413L1284p5302o5873j3980j1028
2113f2606M0288Q7158J8368o230P8030J673r7716q9018O3111l2363Q4842q8796
2101c259N6473L7332k9005J3081N3284j3910N7846j08336K0540j1500L3792J1446
2089A17784j1853j9430q6828Q3082m2959m4913R3718m1731K5373l877N6805n2721
2077G2450n6707o343p9223P7731j5929M9442L8303j43547l3274O7160J44250O2542
2065A76855r2915j3033p9136P935J6686J8216o733K0477k4444j2509o8641k59
2053e7501r7317R0712k4782J05504l9758q996m6689p044Q5847q6332K1137n6017
2041a21236J14464L720M1199j12866L2126M7986K4589L8799M189M0736j04350
$$ plain form
2125 25410 169691 193643 134870 98758 154054 99706 72293 103577 28275 -37598 -51578 -62606
2113 -62606 -22318 64840 83208 76978 155008 156681 58965 -30053 33058 695 85537 -3259
2101 -3259 53214 90546 61541 74622 127906 113996 171842 63506 84046 72546 106338 117784
2089 117784 105931 86501 -327 82755 39796 -5117 88601 46870 72243 68366 125171 72450
2077 72450 15743 9400 -69823 7908 -8021 41421 79724 -63823 -97097 -29937 114313 176855
2065 176855 83940 70907 -8229 -294 16392 34608 27875 48352 23908 11399 -57242 -57501
2053 -57501 -154818 -64106 -88888 16616 -23142 -32138 -78827 -85871 -24 -86356 -65219 -121236
2041 -121236 -6772 -3052 38147 -74719 -42593 5393 29982 68781 72970 113706 9356
2030I356O25K1356K4762j25272J09786N7782J0199K7922j11705M2517Q8551o9485
2018H6394q0261j05971L5154J22829L5517k0508r7957O2804O1718j51181P2048
2007B0586J38861o0599k70j41835M5106j0069j732O4083P9024j82574k7475R2880
1995A5986K9379o248p7112K0513n813O7806r347k4363M2235J5722q01K7488L7433
1982A32878P886j39149n6083J17526l0310Q2362m378j62611L7603N9005m1704
1971C025k4351k3476N2112L3983J9558j625o1483J35318j2423j2393n3089O830
1959F1986O9353j35963r8153J45788J6234j52684K8265j6615J25737J38397J0734
1948A93079P6667l08880L4302K1863L311j2726p878n3224R2344J2244m2228K6568
$$ plain form
2030 9356 9981 31337 56099 -69173 40613 98395 108594 136516 24811 67328 155879 86394
2018 86394 6133 -99838 -64684 58145 93662 73154 -24803 38001 99719 -51462 20586
2007 20586 159447 98848 98578 -43257 1849 -8220 -9952 54131 133155 -49419 -76894 15986
1995 15986 45365 39117 -37995 -17482 -23295 44511 35164 10801 53036 68758 67957 95445 132878
1982 132878 140764 1615 -54468 63058 32748 115110 110732 -51879 -14276 44729 3025
1971 3025 -21326 -44802 7310 41293 60851 59226 -2257 133061 120638 108245 55156 61986
1959 61986 131339 -4624 -102777 43011 59245 -93439 -65174 -81789 43948 182345 193079
1948 193079 269746 -39134 -4832 17031 20342 7616 -262 -53486 38858 51102 8874 35442
1936C5442m9865r8651K4898M0025j6855j0509q839J3368J23588l5975k0385O905
1924C147J1064J24196n3256r3202q9709J64573k0555o9072J34650k5098j15175
1913b8437m5448O7580m8009N3281n1091q6664L6091m0242J06625R795j0552R5167
1901E8096l9850r700o2413M12J44651j55531M5897K0549J3679O6316J2659Q8961
1889A83726j20087o0381o466p9116k2253J87843N8270j62173J8211k2999q309
1878c3734N6249K4536j11900n8731j2736J20046J1777q2309J04954J5460p2330
1867c8718J2984K538M2804J1968N9288o2382N1590k3370J9669m9452m3405j07722
1855a24208M735p2572J10431L0942p0785k3586Q6610P7300J9190j3305l2381m6530
$$ plain form
1936 35442 -14423 -113074 -88176 -48151 -65006 -75515 -84354 -70986 52602 16627 -3758 3147
1924 3147 14211 138407 85151 -8051 -97760 66813 46258 -22814 111836 86738 -28437
1913 -28437 -73885 -6305 -54314 -1033 -52124 -138788 -102697 -142939 -36314 -26519 -37071 58096
1901 58096 18246 8546 -53867 -53455 91196 -64335 -18438 2111 15790 82106 94765 183726
1889 183726 63639 3258 -3208 -82324 -104577 83266 141536 -20637 -2426 -25425 -33734
1878 -33734 22515 47051 -64849 -123580 -136316 -16270 -4493 -86802 18152 33612 -38718
1867 -38718 -25734 -23196 19608 31576 90864 28482 80072 56702 76371 26919 -16486 -124208
1855 -124208 -119473 -192045 -81614 -50672 -121457 -145043 -58433 18867 38057 24752 -7629 -54159
1843e4159N5884l6293k4992r501O1923j1600o1137o0061J7085O5005l9869Q9445
1831h270o70K4092j01278Q3887J27932j14270m748N9404o3755K3579J9609k5643
1819A9869n4864M566j26739j2563J09736J77200l2175P5519o5837m9092n6042
1808a0422J5361q1024r803R9217L045O2137o898k7344J669M888j5668K3949J3077
1795G2184o2380n5734M291P2124o0304j6774M6548K8735Q7445j00689n6405J6535
1783b4424J7892k2893m47k0551N803k5542M628L682P6882p5419J1859L4330p644
1770b1844k1963m0154M6739k6640K4902J21074n3209n7968K3408Q6513k9050m0347
1758A1461o815L5048N3718j19084K1965L0186O7864j01786J8946n0037j4378j2418
$$ plain form
1843 -54159 1725 -34568 -59560 -69061 -7138 -18738 -79875 -139936 -122851 -57846 -97715 -8270
1831 -8270 -8940 15152 -86126 -2239 125693 11423 6675 66079 2324 25903 45512 19869
1819 19869 -34995 -30429 -157168 -169731 -59995 117205 85030 160549 94712 45620 -10422
1808 -10422 4939 -76085 -85888 13329 16374 78511 71613 44269 45938 50826 35158 59107 72184
1795 72184 9804 -45930 -41639 30485 -29819 -46593 -45 28690 116135 15446 -40959 -24424
1783 -24424 -6532 -29425 -29872 -50423 -44620 -70162 -65534 -61852 15030 -60389 -48530 -14200 -21844
1770 -21844 -43807 -83961 -37222 -63862 -38960 82114 28905 -29063 -5655 80858 51808 11461
1758 11461 4646 39694 93412 -25672 -3707 26479 94343 -7443 11503 -38534 -52912 -65330
1746f5330J30289o4700Q0115O5436l1023m7642Q981o3559n968k6607q8619N0792
1734e7835J04711r3678K764O4357q8694L8609j3934j9618M2423j47756P141Q4643
1722g6867J01868Q0171m0968Q4034r0223R737K8072j8859N117n2467q6266N5282
1710a369R207l4513Q1215p2022K1716P3035M210k3921r1941N2619J3902n0614
1698a8476o8949J03046m3172J29297p0109L6614p6342J20250K5796o3532K3175
1687I7598j57956j334K3374L7055K2552j1011K3100k738R5720K4189j02446M0205
1675H8308m3965j17215L2661O7340q2205O174J3828J5723n6616N7364o0103K0349
1663e8357N2717O883R6986j6718j5061q3547K337q951j23851L75J16913O3758
$$ plain form
1746 -65330 64959 259 80374 145810 114787 67145 76126 12567 6599 -20008 -108627 -57835
1734 -57835 46876 -46802 -44038 20319 -68375 -29766 -43700 -63318 -20895 -168651 -161510 -76867
1722 -76867 25001 105172 64204 148238 58015 67752 95824 76965 82082 29615 -56651 -1369
1710 -1369 7838 -26675 54540 -17482 4234 77269 81479 57558 -34383 18236 32138 -18476
1698 -18476 -87425 15621 -27551 101746 31637 68251 -8091 112159 137955 74423 97598
1687 97598 -60358 -61692 -38318 -1263 21289 10278 33378 30640 126360 150549 48103 88308
1675 88308 44343 -72872 -40211 27129 -55076 -48902 -35074 -19351 -75967 -18603 -78706 -58357
1663 -58357 -5640 1243 98229 81511 66450 -17097 -14760 -23711 -147562 -147187 -30274 33484
1651C3484j1374r6441L5443l3807Q6601N0604o8227J0674j50701P6396k6364J09835
1639A6123M3630j33001P4509p4777k489o3222O1050J11526j8741l0197L4756p3577
1627e4410M3227J4859L8478l0291l1287K234k0558J40181k2584J7352n7065k6108
1615A4028K7827n7147K7595R9471O578N936j41093p3579o739L9830M3658O6796
1603E3161j13292j06941J05735J0610N5958J01183l2356m3329k1133o009N9877
1592F3464o9333j1876P0092m8077q9011K6589M3618J22208R7379o0927j04300
1581C9826m1073l588Q9759j8012n5k4059j6712P0487q0843J03921k2088o9320
1569B8243Q5614j55563k3351P5006J5243J5514m2534M6133o4611k3291r9080K12641
$$ plain form
1651 33484 22110 -74331 -38888 -72695 13906 64510 -3717 6957 -143744 -67348 -93712 16123
1639 16123 59753 -73248 1261 -73516 -76005 -139227 -78177 33349 14608 -15589 19167 -54410
1627 -54410 -11183 3676 42154 11863 -19424 -17190 -37748 102433 79849 97201 40136 14028
1615 14028 41855 -15292 12303 111774 118352 124288 -16805 -90384 -97123 -57293 -13635 53161
1603 53161 -60131 -167072 -61337 -50727 5231 106414 74058 30729 9596 3587 63464
1592 63464 -5869 -17745 52347 4270 -84741 -58152 -14534 107674 205053 144126 39826
1581 39826 -1247 -4835 84924 66912 66857 42798 26086 96573 15730 119651 97563 28243
1569 28243 113857 -41706 -65057 9949 25192 40706 -1828 44305 -20306 -43597 -142677 69964
1557F9964r735r1822J181l4098J7752P6106l2702o7425J4208p3882N7218r873
1545h3108l8623M5992J2589M0238p113j2794P2463P4930o0120m5130J76824j17506
1533E8642l200j7361j09702L2046n1643L0693M2737R3285N5300k4942k6227j00183
1521b0555J04740L5347l610j6477J367j05832J4504R6782j24621m9516J00153
1510C2282j30484L6814M4401N8500R2480k17319J0455k1515Q4399l0605M6880
1499F288M4469l4451R6504J8319K852r0054j42029R32P8988l7068M0222m2143
1487e7171J8238J7829J9941K5203j33084J07164K8331M0445o7723j1550M0920
1476B8543k5180K3219j66170j2100P7720L6662M3518o1294k8515R095j006N6320
$$ plain form
1557 69964 60229 -31593 -30412 -64510 -46758 29348 -3354 -70779 -56571 -130453 -73235 -83108
1545 -83108 -121731 -75739 -63150 -22912 -30025 -42819 29644 104574 44454 -676 176148 58642
1533 58642 55442 38081 -71621 -39575 -91218 -60525 -17788 75497 130797 105855 79628 -20555
1521 -20555 84185 119532 115922 99445 100812 -5020 9484 106266 -18355 -67871 32282
1510 32282 -98202 -61388 -16987 41513 133993 -83326 -72871 -94386 -9987 -40592 6288
1499 6288 50757 16306 112810 131129 133981 43927 -98102 -97170 -18182 -55250 -15028 -57171
1487 -57171 -38933 -21104 -1163 24040 -109044 -1880 26451 66896 -827 -12377 28543
1476 28543 3363 26582 -139588 -151688 -73968 -37306 6212 -55082 -83597 -74502 -75508 -19188
1464a9188p3125K9372m2130n4095Q5842o7066J10759O9871o4169K8356O030N273
1452A5730m5616K06332j7098n7678j441n7260r8206j72627K19493L8087j11493
1441h1777J8151R7565M930j2027l3537J2753N9161p1110J56097o0527q4346l317
1429B016Q9550Q3420j50564j9191l9583N122K7821j31094J19895J4337M7709o2369
1417a2931Q9363L5123j34084K6023j4048K9310k5943P9853p0472l8073j02314
1406a38193J03484O3590n1396o3808j5192l8392M8989N6859l964J16874l3783
1395D5068l7543r7911J1289J27105l4014q041M6808l1592n1792J743k4048J2459
1383d0469o7288J02023Q755r254j9656Q1608p2430J2326M8519j8454p6106K301
$$ plain form
1464 -19188 -92313 -62941 -105071 -159166 -73324 -140390 -29631 40240 -23929 4427 10457 15730
1452 15730 -29886 176446 159348 101670 100229 42969 -55237 -227864 -8371 29716 -81777
1441 -81777 -63626 33939 38869 26842 -6695 6058 65219 -5891 150206 89679 5333 2016
1429 2016 91566 174986 24422 5231 -34352 -29230 -1409 -132503 -12608 1729 49438 -12931
1417 -12931 76432 111555 -22529 3494 -10554 18756 -7187 72666 2194 -35879 -138193
1406 -138193 -34709 28881 -22515 -86323 -101515 -139907 -90918 -34059 -38023 78851 45068
1395 45068 7525 -90386 -79097 48008 13994 5953 52761 21169 -30623 -28880 -52928 -40469
1383 -40469 -107757 -5734 3021 -6233 -25889 55719 -16711 -4385 44134 25680 -50426 -48125
1371d8125k1870J28875J04486j23818p404o6128J46043k9007j25246j18691J0906
1360a49979J24169k3282r8031L9129J53411R0656l7000q6574j26319j9114L8937
1349i3997Q3253j9057m067n0838J1716l1290P8915J23889r7240l6154k1063m0954
1337i6887J05889k1852p7361M5014m831R1866N7944j48295l383n1100p044N4842
1325e5198L2109m1506N0009N7405K423n5637K7214K4197o2180N4781J8991m3635
1313H973q9884n7571R2300l907r1210P9846J00182Q2064k5058j22193m4388P4196
1301C350J8437j18465o2436N8379J14467l1563k3892j03844L2740O0004K629J14082
1289F3888L681j62760J9617j5324R4143L3233n6307P3173K775j76779l9915J04480
$$ plain form
1371 -48125 -69995 58880 163366 39548 32144 -33984 112059 83052 -42194 -160885 -149979
1360 -149979 -25810 -49092 -147123 -107994 45417 136073 99073 12499 -113820 -132934 -93997
1349 -93997 -10744 -29801 -33868 -84706 -72990 -104280 -25365 98524 1284 -34870 -55933 -96887
1337 -96887 9002 -12850 -90211 -45197 -50028 41838 99782 -48513 -51896 -102996 -110040 -55198
1325 -55198 -23089 -64595 -14586 42819 45242 -10395 16819 41016 -21164 33617 52608 8973
1313 8973 -80911 -138482 -46182 -50089 -141299 -61453 38729 120793 95735 -26458 -70846 3350
1301 3350 21787 -96678 -159114 -100735 13732 -17831 -41723 -145567 -112827 -52823 -50194 63888
1289 63888 67569 -95191 -75574 -90898 3245 36478 -19829 53344 56119 -120660 -160575 -56095
1277e6095N8542o7930j5827P856p336p1725k3001J60880N4601n4296k02637J34694
1265h2274K2199J13047j5961j6602J48924k3578j34059k0352n9563J555M6690
1254a9974P0908k3078k8284K0207L0836r0731q9744K4254K9111R8195r1896o5131
1242a35327J06573O3650m0411m7902O0658n1042P5405k6683o210k307q7969K2268
1230f9297L8857k9916Q1782p1784O6379o5502P8486J5587q9763p2878M4906N4455
1218a8688p3502K3214Q4750K8948q1200q9690q4672n460J48318N5812n0395K4245
1206c8320n4060J35538j12979j390R1569J1511N7581q3281j4291M2003q9249j4148
1194f9516l1159R9179N6227n2661k374R1464L8420L5473o1540N419n7360N9268
$$ plain form
1277 -56095 2447 -65483 -81310 -73454 -80790 -152515 -175516 -14636 39965 -14331 -216968 -82274
1265 -82274 -60075 52972 37011 20409 169333 145755 11696 -8656 -68219 -66664 -19974
1254 -19974 50934 27856 -428 19779 50615 -40116 -129860 -105606 -76495 21700 -70196 -135327
1242 -135327 -28754 34896 -5515 -53417 7241 -43801 31604 4921 -1289 -3596 -91565 -69297
1230 -69297 -30440 -60356 21426 -50358 16021 -49481 29005 44592 -45171 -118049 -73143 -18688
1218 -18688 -92190 -68976 15774 44722 -36478 -126168 -210840 -216300 -67982 -12170 -62565 -38320
1206 -38320 -92380 43158 -69821 -71211 20358 31869 89450 6169 -8122 33881 -55368 -69516
1194 -69516 -100675 -1496 54731 2070 -304 91160 129580 165053 103513 108932 51572 110840
1182A10840Q7093J5152m3629j07989j20429M0411L1822K9514l3083o6842L6496
1171b0644J6717k8089K2394N3990q1187j1113l9980M6942L0581k0145Q7527j12874
1159e5881J5329J26568J2867L2732n0763L169j3279J3496Q114j6904J9583m3178
1147E1853j05113M5352J16059L2710j57760J973P0459o4872K0605l06M3990J8327
1135G3277q0791m6627P2386J01286j66048k0786r0129j10118L23296l4109q1244
1124e9607P5946J8186L7475N564j9995J05336Q023l1801r5890R2089K6320n1223
1112A10423j2483n133k8423n4513l5539j4094j11515L8731J56992k4998j19075
1101i9627O3829J09825l7899r0208j0957J26794J2617n9450j4158k9097R3126
$$ plain form
1182 110840 197933 213085 169456 61467 -58962 -18551 13271 42785 9702 -57140 -20644
1171 -20644 -3927 -32016 -9622 44368 -36819 -47932 -87912 -40970 -10389 -30534 56993 -55881
1159 -55881 -40552 86016 98883 131615 80852 84021 70742 84238 92352 75448 95031 51853
1147 51853 -53260 -7908 108151 140861 -16899 -14926 55533 -9339 11266 10960 54950 73277
1135 73277 -7514 -54141 18245 119531 -46517 -67303 -157432 -267550 55746 21637 -59607
1124 -59607 16339 34525 72000 77564 57569 162905 170928 139127 43237 135326 161646 110423
1112 110423 97940 92807 64384 9871 -25668 -39762 -151277 -112546 44446 19448 -99627
1101 -99627 -35798 74027 36128 -54080 -65037 61757 74374 14924 766 -28331 64795
1090F4795k2295N533J5195o9773r7206m4428K19868j18750n5706R355K9563J40811
1078G6962j2836j0010L547K1245M1805p0994j9952K733L6146k0958l1364k3578
1066g254N6593j27462j1287N9646r4558J02183L175l1391o4173N8763R00o8692
1054a23557P179J21371O8679l4618r8765P5353o3777N9855j5206n2538M2901j56862
1042a69985P0537J1729J50102j62638L7055R2808O2912K070q9879n2865O6607
1031A8453K4889j5217k4187n7889P6567Q4926k3568q9864J7091J08390o3409j5706
1019D0476q7749q9815P5889R2928o1439O8908p8142M1984Q420n595l3845o9280
1007i7260Q0310p828K609K5898l5133j0260k2640N8448Q740N7841j8442k8361
$$ plain form
1090 64795 42500 48033 63228 -6545 -103751 -148179 71689 -47061 -102767 -93412 -63849 76962
1078 76962 64126 54116 57663 78908 120713 49719 29767 32500 68646 47688 16324 -7254
1066 -7254 49339 -78123 -89410 -29764 -124322 -22139 -18964 -50355 -114528 -55765 -54865 -123557
1054 -123557 -116378 4993 73672 39054 -59711 15642 -48135 11720 -3486 -56024 -13123 -169985
1042 -169985 -99448 -87719 62383 -100255 -63200 29608 92520 94590 4711 -48154 18453
1031 18453 43342 28125 3938 -53951 22616 107542 83974 -5890 11201 119591 56182 40476
1019 40476 -47273 -137088 -61199 31729 -29710 39198 -38944 3040 11460 5865 -27980 -97260
1007 -97260 -16950 -24778 -22169 3729 -31404 -41664 -64304 -5856 2884 60725 42283 13922
995A3922j40313Q3925K2115O0043l2107n4525J08181k9754l5211q0023J09814
984B6067p02K7810j09973O5528N0499J10115p0001j73369Q280J19908j28143J08870
972C4889o3663q5498L4346Q5178l9311J3490M4665N1705m5114m7119J938K1005
960F511O6649M2255P3466n1445j14598L9698m7947j2211m3310l8356L0286K5581
948b3421J8552L4673m7934q4338j7093Q5678r997m0516k4980n9792K06430K5204
936F2466q6672p8834O7542J10061q2303n2463M9793R25L9601k7354k9206j2388
924c8832j472R9211n2551J9533j9590l7392L7937j1118P8616J9914L208j6449
912H1015j42328k2417L5218M1829M7355K525M7991k6787k5199j01041L5593l9478
$$ plain form
995 13922 -126391 -42466 -20351 39692 7585 -46940 61241 31487 -3724 -83747 26067
984 26067 25365 53175 -56798 8730 59229 169344 99343 -74026 -65746 54162 -73981 34889
972 34889 -28774 -114272 -79926 5252 -34059 -20569 24096 75801 30687 -16432 -14494 6511
960 6511 73160 115415 188881 137436 22838 62536 14589 2378 -40932 -79288 -49002 -23421
948 -23421 -4869 29804 -18130 -102468 -119561 -33883 -43880 -84396 -109376 -169168 37262 62466
936 62466 -24206 -103040 -35498 74563 -7740 -60203 -10410 -9485 30116 2762 -26444 -38832
924 -38832 -40304 58907 6356 25889 6299 -31093 6844 -4274 74342 94256 97464 81015
912 81015 -61313 -83730 -48512 -6683 40672 43197 91188 64401 39202 -61839 -26246 -65724
900f5724K1826P1128o2627M0610j5388k2935q887o4699o798P3864p0490j2639
888a22759L8630l0959K1051N9417n274o1104N6831P4150m6473J7830k170n7734
876e8564j791k7609r5330J7419M5268O5502L0344n3715p304k1108N7649O9747
864B0508n9080J6664J06799M111M5421q0591J9322p5805q3226J06216j7613L8302
852D1028K6180o9401k3320P3772l3571j33268M2969l7802Q2848J10302l9871j42929
840a03063K7539n6973j7606J80536k3194L1235j02353L0642j16825P6057P8565
829D560L1192N7957j05615N2876j06110K2700J21153l1801q1710n714R3719q1408
817b8201R2841Q5595j63832O3462o2549k1470L2281j1780K4169L8636k01502K3529
$$ plain form
900 -65724 -43898 27230 -35397 5213 -10175 -33110 -41997 -106696 -113494 -39630 -110120 -122759
888 -122759 -84129 -115088 -94037 -34620 -39894 -100998 -44167 29983 -16490 1340 -830 -58564
876 -58564 -60355 -87964 -183294 -165875 -120607 -55105 -24761 -78476 -85780 -106888 -49239 20508
864 20508 -38572 -21908 84891 89002 134423 53832 73154 -2651 -85877 20339 2726 41028
852 41028 67208 -2193 -25513 48259 14688 -118580 -75611 -113413 -30565 79737 39866 -103063
840 -103063 -75524 -132497 -150103 30433 7239 38474 -63879 -33237 -150062 -74005 4560
829 4560 35752 93709 -11906 40970 -65140 -42440 78713 46912 -34798 -40512 53207 -28201
817 -28201 64640 150235 -13597 49865 -12684 -34154 -1873 -13653 10516 49152 -152350 -128821
805a28821J28529j15695j4664J1406m419R3881l5727Q2432l6863N0388o7669J07961
793G0739P0282m7648j16650k1889L2415L4781j3872j0006J3672N4694N9762q1956
781D4324r0395j7018M1976O5451O3769j13043n012O8858N6038j37173J02952J04507
769A85234p3583j51635Q289L7499N0732j16644R5732k8056l4267l3279k0010N0357
757b9631r642J08302K0196L2706l74j40375Q0110J134r7546O8267q6216l8366
745i1435M364L9270p104p6043J16208j3271j0688j14524o2874R3288J27361m929
733c77P8579m2739j04812k9825M0456L0191j2769j7577M6089n911k20L4835j26067
720a10147J13147N4492n1044j11366J00992m0605R8289M6044p138j6734o3371
$$ plain form
805 -128821 -292 -115987 -130651 -119245 -123664 -29783 -65510 16922 -19941 30447 -37222 70739
793 70739 141021 93373 -23277 -45166 -12751 22030 8158 -1848 11824 66518 126280 44324
781 44324 -46071 -63089 -21113 44338 108107 -4936 -9948 58910 114948 -22225 80727 185234
769 185234 111651 -39984 -31695 5804 56536 -60108 35624 7568 -26699 -59978 -79988 -29631
757 -29631 -39273 69029 89225 121931 121557 -18818 61292 62426 -35120 33147 -53069 -91435
745 -91435 -87071 -47801 -54905 -130948 -14740 -28011 -38699 -153223 -216097 -122809 4552 -377
733 -377 78202 35463 -69349 -99174 -58718 -28527 -41296 -58873 -12784 -18695 -18915 15920 -110147
720 -110147 3000 57492 6448 -104918 -3926 -44531 53758 99802 92664 75930 12559
709A2559O7256k5360j992O3729l8603j08770n4322n4400O2884j1837N067J920
697h1869M2483Q3467O356j11706J15773M5432n1737n4479K5076o718q4878m0127
685a12927L0575R7673l802M96k3552p1722n033k3722k4561O5786L2281K2208j762
672a8062m8554n2126O3015L5402K7224J0035J5677j3696l126o0495N5160l1156
660b0702J04901l9207r6550K2986l4608R3425J03895k6085K2555j24741O9699
649G5568k5009l6962N2988o0464R0474o1748r5217K7250K7928m7578j46192Q5509
637a13453J83601n0702K1391j06800K8615k4044m916M9131J45615J6890j43287
626B041O2093l7485q7697R8371o2419n3197k8304J06394k3649p8775L9791J56627
$$ plain form
709 12559 79815 54455 52463 116192 77589 -31181 -85503 -139903 -77019 -88856 -83789 -81869
697 -81869 -39386 44081 50437 -61269 54504 99936 48199 -6280 18796 12078 -72800 -112927
685 -112927 -82352 15321 11519 12015 -11537 -83259 -88292 -112014 -136575 -70789 -38508 -16300 -18062
672 -18062 -66616 -118742 -55727 -20325 6899 16934 32611 18915 15789 -44706 10454 -20702
660 -20702 84199 44992 -51558 -28572 -63180 30245 134140 108055 130610 5869 75568
649 75568 50559 13597 66585 6121 96595 34847 -60370 -33120 -5192 -52770 -198962 -113453
637 -113453 70148 19446 40837 -65963 -37348 -61392 -66308 -17177 128438 145328 2041
626 2041 64134 26649 -61048 37323 -25096 -78293 -106597 -203 -23852 -102627 -62836 93791
614I3791r0110o2336J5110K0161j06918Q9737P0897l339o5462l8941J11977p6469
602d1902J2827Q5991O401J4784m934o4880j178l6900J37250L4523j29572l2829
590b0419n4754n8678Q8341J00743J6177j35307J39270p1521r3701k1566J54755
579D3340o9568J5468j081P007N604o3601O3279j4353l9081K661O5285l4338K8217
566H839n8504J2259J37948M4144q807j31470r8204n9521J07957L325K9500j48521
554a61055J9206P3871M0837M0383r567j4395l6591r9716J17233J11464r9472k5527
542d3329q1749j4740k3538O1582J75695J4085J8587j442r7730m1267o0863O2444
530c2265r0151P5316K4785j00339J13061K149o1854J6418j5744j2251k8330P8941
$$ plain form
614 93791 3681 -58655 -43545 -23384 -130302 -40565 30332 26993 -38469 -77410 34567 -41902
602 -41902 -29075 56916 63317 78101 73167 8287 7109 -29791 107459 141982 12410 -20419
590 -20419 -75173 -133851 -45510 55233 71410 -63897 75373 3852 -89849 -111415 43340
579 43340 -26228 -10760 -11841 -4834 770 -62831 448 -13905 -52986 -50325 14960 -19378 8839
566 8839 -49665 -37406 100542 144686 135879 4409 -93795 -153316 -45359 -42034 -12534 -161055
554 -161055 -141849 -67978 -27141 13242 3675 -10720 -47311 -147027 -29794 81670 -17802 -43329
542 -43329 -125078 -139818 -163356 -101774 73921 88006 106593 105151 7421 -33846 -94709 -32265
530 -32265 -122416 -47100 -22315 -122654 -9593 -7444 -69298 -52880 -68624 -80875 -109205 -30264
518c0264L3551L6790p7653k6188Q3445K974K3835j4745o7430O1503m711r8311
506g7204J7610J6153q1391l230P6685J9406l3058R1604Q559N9072j04258M6031
494C5979n2080r596J36600q5667l0480l2326q1399J6630N4797K0870l9155K2693
482d3134l8017l7955Q4419J370J2588n726J07548q2372k9558J17788j22626O4169
470B8494N9605K3915J2694q1048l8003r5053K4177J20910k6025n3092p0954j166
458i5546P5707N7634n0976O80K0304O9985m7800N7001q9841K650j9117n4801Q8
445g4032J39251K2334j67571J10948J77m8523J691j7579J7140P1061q2088k8811
433e6002j0997P8270K2212P761k6514m1881K5564p649M4036R10r3P1445P1917
$$ plain form
518 -30264 3287 40077 -37576 -63764 19681 22655 46490 31745 -35685 25818 21107 -77204
506 -77204 -59594 -43441 -124832 -128062 -51377 -31971 -65029 26575 35134 94206 -10052 35979
494 35979 -16101 -25697 110903 25236 -5244 -37570 -118969 -102339 -47542 -26672 -65827 -43134
482 -43134 -81151 -119106 -34687 -33317 -20729 -26455 81093 -1279 -30837 86951 -35675 28494
470 28494 88099 112014 124708 43660 5657 -89396 -65219 55691 29666 -23426 -94380 -95546
458 -95546 -19839 37795 -13181 -12501 7803 77788 29988 86989 -2852 -202 -19319 -74120 -74032
445 -74032 65219 87553 -80018 30930 31107 -17416 -15725 -33304 -16164 54897 -27191 -56002
433 -56002 -66999 11271 33483 41244 14730 -27151 -1587 -9236 34800 35710 35617 107062 178979
420A78979n3221N1833q512l4177O7665j12909j2307P283l8463q486q2105n6194
408a00614J64501N198k0607j10953j15663N9150J44104j1652M8609k5713m0219
397c859J786R342j05088O0216K4704L3976Q9265j44155o0788J22014k1042k5816
385a9445N6756Q5230N4067j00809j05364M1262P3683n293n5143j02980K4032J03787
373D9783j39594m3488L6173P5829M7318o9292P4299o4812P9667m483M7118n4554
361C3964n9770k4711k6815J09561K3306j7074M7152m8722m734L5136q9915M4475
349B1853j04318N4248J19295m6276n9266J6322N1387R7515j03559r4493p3757
338a21049J50064N6452K5388r5513k4570p9595p891J12233o3536N1321r8987L2134
$$ plain form
420 178979 125758 177591 169079 134902 202567 89658 77351 84634 46171 37685 -44420 -100614
408 -100614 63887 69085 48478 -62475 -178138 -118988 25116 13464 62073 36360 -3859
397 -3859 -2073 7269 -97819 -37603 -12899 21077 110342 -33813 -94601 27413 6371 -19445
385 -19445 37311 122541 176608 75799 -29565 11697 85380 80087 24944 -78036 -54004 49783
373 49783 -89811 -133299 -97126 -21297 26021 -43271 31028 -33784 45883 41400 88518 33964
361 33964 -25806 -50517 -77332 32229 55535 38461 85613 36891 32157 67293 -22622 21853
349 21853 -82465 -28217 91078 44802 -14464 1858 53245 150760 47201 -47292 -121049
338 -121049 29015 85467 110855 15342 -9228 -88823 -96714 15519 -48017 3304 -95683 -63549
326f3549n3276p1637L2265n4379O4757K81J7566J62466o8216L1334K1615j8843
314C84K8591P9039j08638M2985J4884k5431P2559k4854m4321L9990l4960q0398
302d0170M353L2022j27112O2763O6261N8030k393P1772J6105p3184p2749l2963
290c7265l317J01178k4439j13099K8480Q0064R7400j06633j8763N3435j515q3577
278b8051M024n9179M9920J12309l250o2107O5949K5414j26791K4895O1355j9590
266D4898Q2216o4719m5063O5122p6408q16r804O9839j04953p0543J24711K6005
254D0485o0013r6511R717O1388o853k2376n337P7635Q1262L3108n8242p4060q6758
241a06555n758P5032R504l2335L5269p5069m7397J07234l2128l749l4863j2718
$$ plain form
326 -63549 -116825 -188462 -156197 -210576 -145819 -145538 -127972 34494 -33722 -2388 19227 384
314 384 28975 108014 -624 42361 57245 31814 104373 79519 35198 75188 40228 -40170
302 -40170 -35817 -3795 -130907 -68144 -1883 56147 53754 125526 141631 68447 -4302 -37265
290 -37265 -40582 60596 36157 -76942 -48462 31602 129002 22369 3606 57041 55526 -28051
278 -28051 -24027 -83206 -33286 79023 75773 13666 79615 105029 -21762 3133 64488 44898
266 44898 127114 62395 17332 82454 6046 5230 -4574 65265 -39688 -110231 14480 40485
254 40485 -19528 -116039 -106322 -44934 -51787 -74163 -79500 -1865 79397 112505 54263 -19797 -106555
241 -106555 -112313 -37281 -27777 -60112 -24843 -99912 -147309 -40075 -72203 -75952 -110815 -123533
229a23533J55489j351o0647J01175p1670k661J57425j70628P331K0565o2265J90400
217A39630j16115q2078k5027Q300M7732O3923J48939n6733l1354m179M0222n3282
205G9978j15388o8147P7201r6660r968J5591n369J42087K7683O2498n6495o2338
193i327k2461J30280n1308r9639l178R0263R1884L945j92330K9587M7393j2106
181C003o6466K9453L0102o6269P989O3982l9391M7529J1705N1020l1040m1627
169a0j9866L0935L0606k7760R6647o0827P1306j7065j40711J72070K2336j87335
157b9674J5620o5020J20785L8851k8075J2320n9946l3465R6084m7374N8851m2941
145C6016L7282l0984J5570J256k4127O232q9613L2823l8260J9960J02491n5322
$$ plain form
229 -123533 31956 30605 -30042 71133 -537 -3198 154227 -16401 -9070 11495 -50770 139630
217 139630 23515 -58563 -83590 -75290 -27558 36365 185304 128571 97217 93038 133260 79978
205 79978 -35410 -103557 -26356 -123016 -132984 -117393 -122762 19325 47008 109506 53011 -9327
193 -9327 -31788 98492 47184 -52455 -55633 34630 126514 130459 -61871 -32284 15109 3003
181 3003 -63463 -34010 -3908 -70177 -62188 1794 -37597 9932 21637 72657 41617 -10
169 -10 -19876 11059 41665 13905 110552 49725 121031 103966 -36745 135325 157661 -29674
157 -29674 -14054 -79074 41711 80562 52487 64807 4861 -28604 67480 20106 78957 36016
145 36016 73298 42314 57884 59140 35013 41245 -48368 -15545 -53805 -33845 68646 13324
133A3324m2996P437r5934J7364P4617J09119k3616p6445k8854L7166j32100P6374
121f4544R9956o6486o217P0590j840l4186K0212M1281n7435K2860j1339j8795
109e943J8949l3075j6125j3936L8754l0547M7694N1517r4023m7262K3773j3392
97g3616K2085N4391k0760O3403k3368p2793l270M8855L743J8325J9242N4613m4287
84D6563l1719n6011R6100o3737o5407J29796j63825R6279p390K5634o8178N0307
72a1588J00162n4026o6241O0528j5775n2496N6799M8728m8925k3212k4586o204
60c6836O6709j8741k7127j002N9031K8652q5156k4982M8222n0232J69470o4701
48F3307q4657K614L8693n1373j6011O1139j4273J9777K1359O7231j36043J9399
$$ plain form
133 13324 -29672 -22235 -118169 -100805 -26188 82931 59315 -17130 -45984 -8818 -140918 -64544
121 -64544 35412 -31074 -37291 33299 31459 -2727 17485 58766 1331 24191 12852 -5943
109 -5943 13006 -20069 -36194 -50130 -11376 -41923 5771 57288 -36735 -83997 -60224 -73616
97 -73616 -51531 2860 -17900 45503 22135 -50658 -53928 -5073 -1330 16995 36237 90850 46563
84 46563 14844 -41167 54933 -8804 -74211 55585 -108240 -11961 -19351 6283 -61895 -11588
72 -11588 88574 34548 -31693 28835 13060 -39436 17363 66091 17166 -6046 -30632 -36836
60 -36836 29873 11132 -15995 -16997 42034 70686 -14470 -39452 8770 -41462 128008 63307
48 63307 -21350 -18736 19957 -31416 -47427 13712 -561 19216 40575 107806 -28237 -8838
36h838N8247n0469J6360p915P69M4881p2969O9375K8266o460n1622k3497j1392
23a5264o8140J13825N2729m5960j6962o2859N806O839R7615n5388k8479J2554
11c684j8418K0557O0200K5347k3956r7634m0811L804L597P5489M3258
0D7749
$$ plain form
36 -8838 49409 -1060 15300 7385 8154 53035 -19934 49441 77707 71247 19625 -3872 -15264
23 -15264 -83404 30421 83150 37190 20228 -42631 -36825 -29986 67629 12241 -16238 -3684
11 -3684 -22102 -1545 58655 84002 60046 -37588 -78399 -74595 -70998 4491 47749
0 47749
$$ Imaginary data points
##PAGE= N=2
##DATA TABLE= (X++(I..I)), XYDATA
16383a627056J6081N8895M4692L2986j2631k6649N5670L661K7615K528K1185k7057
16371a430080O0041M851J01254O2165O217L3306L3140L0695n34k3177k857n4339
16359a179318M5457N6667L4381j4195M6092J2599j2966M1208J793J34640J013
16348h32629N2529m087L2195Q2834p4535J33684o28o0554P5313J84572q6422Q2823
16336d14905Q0533j03258n2517K8438Q8833L7399l298O6964N9758n8583L8722
16325b31914j2637N8515O6646n4307O6550N3771K9090Q4865j3794k5083J9957
16314D1659P9175o6084q1253Q5914O4608Q37k0775O6391j5965K6420J52213k643
16302C30497J6967j8465J4206n973O6820k0104L8057k3217O6514k966o259L4727
$$ plain form
16383 -1627056 -1610975 -1552080 -1507388 -1474402 -1487033 -1513682 -1458012 -1454351 -1426736 -1424208 -1403023 -1430080
16371 -1430080 -1370039 -1365188 -1263934 -1201769 -1195552 -1162246 -1129106 -1098411 -1098945 -1122122 -1124979 -1179318
16359 -1179318 -1133861 -1077194 -1042813 -1057008 -1010916 -998317 -1011283 -970075 -968282 -833642 -832629
16348 -832629 -780100 -784187 -751992 -669158 -743693 -610009 -610637 -671191 -595878 -411306 -497728 -414905
16336 -414905 -334372 -437630 -490147 -461709 -372876 -335477 -338775 -271811 -212053 -270636 -231914
16325 -231914 -244551 -186036 -119390 -173697 -107147 -53376 -24286 60579 46785 21702 41659
16314 41659 120834 54750 -26503 59411 124019 124856 104081 170472 154507 180927 333140 330497
16302 330497 347464 328999 343205 337232 404052 383948 422005 398788 465302 462336 456077 490804
16290D90804O9098j3052l7421j4473J02084J7334n6400J41662O1229p0283p478
16279F83104N150R623K7893P3089Q760L4636O3830p1070P1047n3784Q3239Q8741
16267A024258j8270o8187m990N2216P7830j7106J4601L8044m6592K2215L866K3135
$$ plain form
16290 490804 559902 546850 509429 494956 597040 614374 557974 699636 760865 690582 683104
16279 683104 688254 697877 725770 798859 807619 842255 906085 835015 906062 852278 935517 1024258
16267 1024258 1005988 937801 932811 985027 1062857 1045751 1060352 1098396 1051804 1074019 1077885 1101020
$$ [...]
##END NTUPLES=NMR SPECTRUM
##END=
