##TITLE=1H_EC-3263(1)
 CDCl3,8 sc, 
 24.9.2021
##JCAMPDX= 6.0         $$ Bruker NMR JCAMP-DX V2.0
##DATA TYPE= NMR SPECTRUM
##DATA CLASS= NTUPLES
##ORIGIN= UXNMR, Bruker Analytische Messtechnik GmbH
##OWNER= root
$$ XWIN-NMR		Version 3.5
$$ Fri Sep 24 09:41:55 2021 Russian Standard Time (UT+4h)  she@DPX200
##.OBSERVE FREQUENCY= 200.1314
##.OBSERVE NUCLEUS= ^1H
##.ACQUISITION MODE= SIMULTANEOUS
##.ACQUISITION SCHEME= undefined
##.AVERAGES= 8
##.DIGITISER RES= 18
##SPECTROMETER/DATA SYSTEM= spect
##.PULSE SEQUENCE= zg30
##.SOLVENT NAME= CDCl3
##.SHIFT REFERENCE= (INTERNAL, CDCl3, 0, 16.9754)
##AUDIT TRAIL= $$ (NUMBER, WHEN, WHO, WHERE, WHAT)
$$ ##TITLE= Audit trail, XWIN-NMR		Version 3.5
$$ ##JCAMPDX= 5.01
$$ ##ORIGIN= Bruker BioSpin GmbH
$$ ##OWNER= she
$$ F:/spectra/data/she/nmr/H-F/1/pdata/1/auditp.txt
$$ ##AUDIT TRAIL=  $$ (NUMBER, WHEN, WHO, WHERE, WHAT)
(   1,<2021-09-24 09:39:54.78 +0400>,<she>,<DPX200>,
      <created by zg, POWCHK disabled, PULCHK disabled
       configuration hash MD5:
       00 E9 B6 7A A2 85 ED C7 34 08 36 98 17 FE 4E 26
       data hash MD5: 16K
       41 A3 86 04 CD 9D 6A 7F 87 A5 82 C9 FA 6B 8C 2B>)
(   2,<2021-09-24 09:40:12.64 +0400>,<she>,<DPX200>,
      <Start of raw data processing
       efp BC_mod = 2 LB = 0.24 FT_mod = 6 PKNL = 1 PHC0 = -14239.56 PHC1 = 19.40088 SI = 16K 
       data hash MD5: 16K
       CD 36 33 65 0B F1 11 CF F9 DA F4 C4 E4 93 70 B8>)
(   3,<2021-09-24 09:40:54.92 +0400>,<she>,<DPX200>,
      <pk PHC0 = 161.8962 PHC1 = -5.400002 
       data hash MD5: 16K
       C5 B9 1D 82 07 3E 9A 13 F9 F0 CC 79 34 0B 20 62>)
(   4,<2021-09-24 09:40:58.21 +0400>,<she>,<DPX200>,
      <abs ABSG = 5 
       data hash MD5: 16K
       49 3F EB A3 2A 5D 7F F3 0D 10 A3 12 25 5E EC 69>)
$$ ##END=
$$ 
$$ hash MD5
$$ B4 93 5D 02 E4 70 AD D5 2F DF A4 41 41 72 42 F0
##$RELAX= 
##$RELAX= 
##$RELAX= 
##$RELAX= 
##$RELAX= 
##$RELAX= 
$$ Bruker specific parameters
$$ --------------------------
##$DU= <F:/spectra>
##$EXPNO= 1
##$NAME= <H-F>
##$PROCNO= 1
##$TYPE= <nmr>
##$USER= <she>
##$AMP= (0..31)
100 100 100 100 100 100 100 100 100 100 100 100 100 100 100 100 100 100 
100 100 100 100 100 100 100 100 100 100 100 100 100 100 
##$AQSEQ= 0
##$AQ_mod= 1
##$AUNM= <au_zg>
##$AUTOPOS= <>
##$BF1= 200.13
##$BF2= 200.13
##$BF3= 200.13
##$BF4= 200.13
##$BF5= 200.13
##$BF6= 200.13
##$BF7= 200.13
##$BF8= 200.13
##$BYTORDA= 1
##$CFDGTYP= 0
##$CFRGTYP= 5
##$CHEMSTR= <none>
##$CNST= (0..31)
1 1 145 1 1 1 1 1 1 1 1 1 1 1 1 1 1 1 1 1 1 1 1 1 1 1 1 1 1 1 1 1 
##$CPDPRG= <>
##$CPDPRG1= <>
##$CPDPRG2= <>
##$CPDPRG3= <>
##$CPDPRG4= <mlev>
##$CPDPRG5= <mlev>
##$CPDPRG6= <mlev>
##$CPDPRG7= <mlev>
##$CPDPRG8= <mlev>
##$CPDPRGB= <>
##$CPDPRGT= <>
##$D= (0..31)
0 1.2 0 0 0 0 0 0 0 0.06 0 0.03 0 0 0 0 0.0002 0 0 0 0 0 0 0 0 0 0 0 0 
0 0 0 
##$DATE= 1632461994
##$DBL= (0..7)
120 120 120 120 120 120 120 120 
##$DBP= (0..7)
150 150 150 150 150 150 150 150 
##$DBP07= 0
##$DBPNAM0= <>
##$DBPNAM1= <>
##$DBPNAM2= <>
##$DBPNAM3= <>
##$DBPNAM4= <>
$$ [...]
##$SUBNAM3= <"">
##$SUBNAM4= <"">
##$SUBNAM5= <"">
##$SUBNAM6= <"">
##$SUBNAM7= <"">
##$SUBNAM8= <"">
##$SUBNAM9= <"">
##$SW= 20.0188988654967
##$SWIBOX= (0..15)
0 0 2 0 0 0 0 0 0 0 0 0 0 0 0 0 
##$SW_h= 4006.41025641026
##$TD= 16384
##$TD0= 1
##$TE= 0
##$TE2= 300
##$TE3= 300
##$TEG= 300
##$TL= (0..7)
0 120 120 120 120 120 120 120 
##$TP= (0..7)
150 150 150 150 150 150 150 150 
##$TP07= 0
##$TPNAME0= <>
##$TPNAME1= <>
##$TPNAME2= <>
##$TPNAME3= <>
##$TPNAME4= <>
##$TPNAME5= <>
##$TPNAME6= <>
##$TPNAME7= <>
##$TPOAL= (0..7)
0.5 0.5 0.5 0.5 0.5 0.5 0.5 0.5 
##$TPOFFS= (0..7)
0 0 0 0 0 0 0 0 
##$TUNHIN= 0
##$TUNHOUT= 0
##$TUNXOUT= 0
##$USERA1= <user>
##$USERA2= <user>
##$USERA3= <user>
##$USERA4= <user>
##$USERA5= <user>
##$V9= 5
##$VALIST= <valist>
##$VCLIST= <CCCCCCCCCCCCCCC>
##$VD= 0
##$VDLIST= <DDDDDDDDDDDDDDD>
##$VPLIST= <PPPPPPPPPPPPPPP>
##$VTLIST= <TTTTTTTTTTTTTTT>
##$WBST= 1024
##$WBSW= 4
##$XGAIN= (0..3)
0 0 0 0 
##$XL= 0
##$YL= 0
##$YMAX_a= 255629
##$YMIN_a= -392078
##$ZGOPTNS= <>
##$ZL1= 120
##$ZL2= 120
##$ZL3= 120
##$ZL4= 120
##$ABSF1= 17.02913
##$ABSF2= -2.989908
##$ABSG= 5
##$ABSL= 3
##$ALPHA= 0
##$AQORDER= 0
##$ASSFAC= 0
##$ASSFACI= 0
##$ASSFACX= 0
##$ASSWID= 0
##$AUNMP= <proc_1d>
##$AZFE= 0.1
##$AZFW= 0.1
##$BCFW= 0
##$BC_mod= 2
##$BYTORDP= 0
##$COROFFS= 0
##$CY= -3
##$DATMOD= 1
##$DC= 0
##$DFILT= <>
##$DTYPP= 0
##$F1P= 0
##$F2P= 0
##$FCOR= 1
##$FTSIZE= 16384
##$FT_mod= 6
##$GAMMA= 0
##$GB= 0
##$INTBC= 1
##$INTSCL= 1.334414e-10
##$ISEN= 128
##$LB= 0.24
##$LEV0= 0
##$LPBIN= 0
##$MAXI= 10000
##$MC2= 0
##$MEAN= 0
##$ME_mod= 0
##$MI= 1.114404
##$NCOEF= 0
##$NC_proc= -7
##$NLEV= 6
##$NOISF1= 3.799351
##$NOISF2= 2.8
##$NSP= 0
##$NTH_PI= 0
##$NZP= 0
##$OFFSET= 16.97537
##$PC= 1
##$PHC0= -14077.66
##$PHC1= 14.00088
##$PH_mod= 1
##$PKNL= yes
##$PPARMOD= 0
##$PSCAL= 0
##$PSIGN= 0
##$REVERSE= no
##$SF= 200.130005922972
##$SI= 16384
##$SIGF1= 3
##$SIGF2= 2
##$SINO= 5.538805
##$SIOLD= 16384
##$SREGLST= <1H.CDCl3>
##$SSB= 0
##$STSI= 16384
##$STSR= 0
##$SW_p= 4006.41025641027
##$SYMM= 0
##$S_DEV= 0
##$TDeff= 16384
##$TDoff= 0
##$TI= <>
##$TILT= no
##$TM1= 0
##$TM2= 0
##$TOPLEV= 0
##$USERP1= <user>
##$USERP2= <user>
##$USERP3= <user>
##$USERP4= <user>
##$USERP5= <user>
##$WDW= 1
##$XDIM= 16384
##$YMAX_p= 324281330
##$YMIN_p= -1031456
$$ End of Bruker specific parameters
$$ ---------------------------------
##NTUPLES= NMR SPECTRUM
##VAR_NAME=  FREQUENCY,     SPECTRUM/REAL,   SPECTRUM/IMAG
##SYMBOL=    X,             R,               I
##VAR_TYPE=  INDEPENDENT,   DEPENDENT,       DEPENDENT
##VAR_FORM=  AFFN,          ASDF,            ASDF
##VAR_DIM=   16384,         16384,           16384
##UNITS=     HZ,            ARBITRARY UNITS, ARBITRARY UNITS
##FACTOR=    0.244546801953871, 1,           1
##FIRST=     3397.28098011847, 0,            0
##LAST=      -609.129276291804, 0,           0
##MIN=       -609.129276291804, -1031456,    0
##MAX=       3397.28098011847, 324281330,    0
$$ Real data points
##PAGE= N=1
##DATA TABLE= (X++(R..R)), XYDATA
$$ [...]
5912E989505P9094J15809J47548N4242Q5877J04007O2421Q4668O6872q7953j00762
5901F601328K12413K28450J08723K9092K26533J84973j45784J17719L02567L06119
5891H172133J39578k9212r9488J62209J37144K04692J14143j1586L7663J55963
5881H983239J88578R2061M11957K29136K68J80329L04736J92537K58129r964L38139
5870A1169145N21720L34471K66818J28033M07671K73003J91760P71791M10830
5861A4475242N06303P01215M20434N51210J007563Q87787R04850P08002J355632
5852B1518238J500111J390095J521681J902722J894581J981969J666070J263170
5844C4638637J104328R86126J271964J128997L67380q42100j282374j029574p28837
$$ plain form
5912 5989505 6068599 6184408 6331956 6386198 6472075 6576082 6638503 6723171 6790043 6702090 6601328
5901 6601328 6813741 7042191 7150914 7180006 7406539 7591512 7445728 7563447 7866014 8172133
5891 8172133 8311711 8282499 8183011 8345220 8482364 8687056 8801199 8789613 8827276 8983239
5881 8983239 9171817 9263878 9675835 9904971 9905239 10085568 10390304 10582841 10840970 10831006 11169145
5870 11169145 11690865 12025336 12292154 12420187 12827858 13100861 13292621 14064412 14475242
5861 14475242 14981545 15682760 16103194 16654404 17661967 18549754 19454604 20162606 21518238
5852 21518238 23018349 24408444 25930125 27832847 29727428 31709397 33375467 34638637
5844 34638637 35742965 36729091 38001055 39130052 39497432 38655332 37372958 36343384 35614547
5835C5614547q44923j59359J86933R91061J003149J404638J901359K356565K804463
5826D5258433L200462L562808L251721K807970K333011K761962K833234K318027
5818F8327628J516857J170779J787448K333395J004934j097327k648580k931993
5810F9463141k812838k588956j863996j684765j525372j213704j238946q37293
5802E5697271n52733l46615P0510J31217M15638O63677J169515J623389J604151
5793F0476020J635022J259687J156691J906670J989987J503826P30573K44747
5785G0903223n6126J12308k50826j141858j601959k488393l306706l404555l153107
5776E5612001k947762k571640k146460j984729j609174j518663j281121j329707
$$ plain form
5835 35614547 34769624 34610265 34797198 35788259 36791408 38196046 40097405 42453970 45258433
5826 45258433 48458895 52021703 55273424 58081394 60414405 63176367 66009601 68327628
5818 68327628 69844485 71015264 72802712 75136107 76141041 75043714 72395134 69463141
5810 69463141 66650303 64061347 62197351 60512586 58987214 57773510 56534564 55697271
5802 55697271 55144538 54797923 54868433 54999650 55415288 56078965 57248480 58871869 60476020
5793 60476020 62111042 63370729 64527420 66434090 68424077 69927903 70658476 70903223
5785 70903223 70847097 70959405 70708579 69566721 67964762 65476369 62169663 58765108 55612001
5776 55612001 52664239 50092599 47946139 45961410 44352236 42833573 41552452 40222745
5768D0222745j087783n75675m89691j62963J3580J65062M38114M54460O23612
5759C9601461N69540M76340K75396J02333k10974r68615p26383r77093j482966
5750C6659039j573861j056506j495684j365548j064157j292039j008702r05718
5742B6896824q29671p82488j169814n08095o98312n44561o51757k61936m14017
5733B1036173m91383k28973l9195j90989j9391L25392J23457L19502K40427n8006
5723B1017014n32684k4771n82376o39421o27067n53442l32301k77815m44955m93601
5713A6508581l28191k1634j04773k15317j11894l09453m5013j2527k43671l9121
5703A5076987N0015j57977j5861J26350l5484K10386o9122l22325k22829l12848
$$ plain form
5768 40222745 39134962 38559287 38069596 37906633 37920213 38085275 38523389 38977849 39601461
5759 39601461 40171001 40647341 40922737 41025070 40814096 39845481 39119098 38142005 36659039
5750 36659039 35085178 34028672 32532988 31167440 30103283 28811244 27802542 26896824
5742 26896824 26067153 25284665 24114851 23606756 22908444 22363883 21712126 21450190 21036173
5733 21036173 20544790 20315817 20276622 20085633 20066242 20391634 20515091 20834593 21075020 21017014
5723 21017014 20484330 20459559 19877183 19237762 18610695 18057253 17724952 17447137 17002182 16508581
5713 16508581 16180390 16158756 16053983 15838666 15726772 15417319 15372306 15359779 15116108 15076987
5703 15076987 15127002 14969025 14953164 15079514 15044030 15254416 15185294 14862969 14640140 14327292
5693A4327292j36228p3900k45257j21990l93512j42966m8577k4148q4619l30319
5683A2725776j23982j24066j52933k7429M6641J72389k85672m6193r9094K06668
5673A2292105Q8699J76011j37482m4219N5724r1752n1898j75124p3311j86488
5663A1852265M6820P3419O6637q0524q9573l02620k3264n427J64234m0774q470
5652A1652723q477J80200K23497N4943J6455J29231m8356j16990k95230j01345
5642A1686651O5470o2750J3273k59724M49335J21502J58539k47680o8500M34471
5632A2290587j0590J18809J52358K09102P8265l16706O9362P8911K35903L33452
5622A3239453L2305k02849n04936q6454k52447k97102k94504q175M8804M48296
$$ plain form
5693 14327292 14191064 14117164 13871907 13749917 13356405 13213439 13164862 13140714 13056095 12725776
5683 12725776 12601794 12477728 12324795 12297366 12344007 12516396 12230724 12184531 12085437 12292105
5673 12292105 12380804 12556815 12419333 12375114 12430838 12339086 12287188 12112064 12038753 11852265
5663 11852265 11899085 11972504 12039141 11958617 11869044 11566424 11543160 11537733 11701967 11661193 11652723
5652 11652723 11644246 11824446 12047943 12102886 12119341 12248572 12200216 12083226 11787996 11686651
5642 11686651 11752121 11689371 11702644 11442920 11892255 12013757 12172296 11924616 11856116 12290587
5632 12290587 12279997 12398806 12551164 12760266 12838531 12521825 12591187 12670098 12906001 13239453
5622 13239453 13271758 13068909 12563973 12477519 12225072 11927970 11633466 11625291 11674095 12122391
5612A2122391J75723K70719L01960N8918O53700L26894L10624Q51953Q06782R26707
5602A6806371J280208J515933J039073J05899j615266j565986j084357j549442
5594A4932433j345708n86043k49712q73270n52674j33158k26389l43508o1532
5585A0560439N1321k01678j11284k13376J30332K95606l84356K55194K70432m7703
5575A0604927J0039J82818o1834o0261l66502m28843j40656l08298J1963k96725
5565I146628j23474n2911k60529Q3245J5268k36107M3942J6413J04103J99956
5555H936534p8407k7537J93926J63464j85612l7250J60268L8037j5908k0366j03005
5544I024144p6313m1133J89345R6813J21215J47123N1962J21351L81722M72019
$$ plain form
5612 12122391 12298114 12568833 12870793 12929711 13583411 13910305 14220929 15072882 15879664 16806371
5602 16806371 18086579 19602512 20641585 20747484 19132218 17566232 16481875 14932433
5594 14932433 13586725 13000682 12750970 11877700 11325026 11191868 10965479 10621971 10560439
5585 10560439 10611760 10410082 10298798 10085422 10215754 10511360 10127004 10382198 10652630 10604927
5575 10604927 10614966 10797784 10735950 10675689 10309187 9880344 9739688 9431390 9443353 9146628
5565 9146628 9023154 8970243 8709714 8792959 8808227 8572120 8616062 8632475 8736578 8936534
5555 8936534 8858127 8830590 9024516 9187980 9002368 8965118 9125386 9163423 9147515 9127149 9024144
5544 9024144 8947831 8906698 9096043 9192856 9314071 9461194 9513156 9634507 10016229 10488248
5534A0488248J73623Q349m83253j04072J47311j03314j67817K9947J1966L99274
5524A0400262M18883N88803K42887l91984j81517k96012l48174j96848k80566
5515I955734M5412l05622j7599q1463m0508J21424q3225P410j01407K88641K405
5504I791202p7240L61332M19599J28205J66783J80257L14700N05375M16000L70627
5494A2576840O03748M45949J61919k94804o1013j75769k44603J91966J46495L56024
5484A3706752L30172P44519O82050N39321R66749J100290J306093J392484J511303
5475B2279733P55626J67029k49791o15958n05162l74648o30100l96890j74710
5466B0255129l39028R4184j23663L35966M73851O26366O64466O29243J243492
$$ plain form
5534 10488248 10661871 10670220 10186967 10082895 10230206 10126892 9959075 9989022 10000988 10400262
5524 10400262 10819145 11407948 11650835 11258851 11077334 10781322 10433148 10236300 9955734
5515 9955734 10001146 9695524 9677925 9596462 9555954 9677378 9594153 9601563 9500156 9788797 9791202
5504 9791202 9713962 10075294 10494893 10623098 10789881 10970138 11284838 11790213 12206213 12576840
5494 12576840 13180588 13626537 13788456 13493652 13432639 13256870 13012267 13204233 13350728 13706752
5484 13706752 14036924 14781443 15463493 16002814 16969563 18069853 19375946 20768430 22279733
5475 22279733 23035359 23202388 22952597 22336639 21831477 21456829 20826729 20429839 20255129
5466 20255129 19916101 20010285 19886622 20222588 20696439 21322805 21987271 22616514 23860006
5457B3860006J484050J353665J666545K077523K182064K619708K192975J047023
5449C8483559r74334k480272k868699k780237k482020k137952j444242j250631
5441B2065172p65918o06045n81689n47874j10271J77098j7009M61461N12337J48243
5431B0735505J59428Q85109O61465P37833J161020J123127Q03611L0397j208727
5422B5088768j160892j527881j734862j295282q80162q44598l17048J24197J38104
5413A7590344o3447k89045M4628J62339j5753n35505n92381p22107n25560n67322
5403A4486191p67021l35682J74736J46628m10038o1428K3425p558J86693L03022
5393A3738968M20039K55637P48214L70170N57809O67786M11206N00997K25064
$$ plain form
5457 23860006 25344056 26697721 28364266 30441789 32623853 35243561 37436536 38483559
5449 38483559 37509225 35028953 32160254 29380017 26897997 24760045 23315803 22065172
5441 22065172 21299254 20693209 20111520 19563646 19453375 19630473 19613464 20074925 20587262 20735505
5431 20735505 20894933 21780042 22441507 23179340 24340360 25463487 26267098 26297495 25088768
5422 25088768 23927876 22399995 20665133 19369851 18489689 17645091 17328043 17452240 17590344
5413 17590344 17526897 17237852 17282480 17444819 17429066 16893561 16301180 15579073 15053513 14486191
5403 14486191 13719170 13383488 13558224 13704852 13294814 13233386 13256811 13249253 13435946 13738968
5393 13738968 14159007 14414644 15162858 15533028 16090837 16758623 17169829 17670826 17895890
5384A7895890J12845r4366p74080j105647j013574q39855m85015o83924j41080
5375A2871194o0660j65596k97077J7903k0874L74670l7924Q9477J77700K71431
5365A3220244L27077J02527M57323L86628M06094N47131L61864J15346m97716
5356A5426518j053837n36734p14651o32017m12375j44935j85097j22519l44974
5347A1279379k55156k25907P8567r7154J32138N3283J28069R794K56919n2905
5337A1307027m4456O4852J12833N9476P9759p3398N1053o7810l05493j04016K12308
5326A1292135P00j52089o5826J6431j203m543K24913K47416L57428K66041N65569
5315A2746972K70879M18894L61946J91322J90314L63259L36056M11144Q71936
$$ plain form
5384 17895890 18008735 17914369 17140289 16034642 15021068 14181213 13696198 13012274 12871194
5375 12871194 12810534 12644938 12347861 12365764 12344890 12719560 12681636 12771113 12948813 13220244
5365 13220244 13547321 13649848 14107171 14493799 14899893 15447024 15808888 15924234 15426518
5356 15426518 14372681 13835947 13121296 12489279 12076904 11931969 11746872 11624353 11279379
5347 11279379 11024223 10798316 10876883 10779729 10911867 10965150 11093219 11103013 11359932 11307027
5337 11307027 11262571 11327423 11440256 11499732 11579491 11506093 11557146 11489336 11183843 11079827 11292135
5326 11292135 11292835 11140746 11074920 11091351 11090148 11085605 11310518 11557934 11915362 12181403 12746972
5315 12746972 13017851 13436745 13798691 13990013 14180327 14543586 14879642 15290786 16162722
5306A6162722P28570Q55877J412663J391613R89090O62023L4617r60355q61089
5297B0415731q54151r40419l19648l34158k68011l28722l05099j14128J96990
5288A7148385K38902L52321M67309O41215Q41475J000535J185585J311027J650307
5279B4837061J581860J149762L36465q17847j403682j793758j739393j668615
5271B0481853j189661o93721p25759p98306l35507l27529k68840k02280K62894
5262A6203144J62093L56242N12706O01280P20471Q86555J451409J189208J581119
5253B3664227J528800R08301m63573j548630k303472k114695k069643j483449
5245A6117866j283127o92660o61643r28196m00438k10902l90698k39939j50342
$$ plain form
5306 16162722 16891292 17747169 19159832 20551445 21540535 22202558 22237175 21276820 20415731
5297 20415731 19561580 18621161 18301513 17967355 17699344 17370622 17065523 16951395 17148385
5288 17148385 17387287 17739608 18206917 18848132 19689607 20690142 21875727 23186754 24837061
5279 24837061 26418921 27568683 27905148 27087301 25683619 23889861 22150468 20481853
5271 20481853 19292192 18598471 17872712 17074406 16738899 16411370 16142530 15940250 16203144
5262 16203144 16365237 16721479 17234185 17835465 18555936 19442491 20893900 22083108 23664227
5253 23664227 25193027 26101328 25637755 24089125 21785653 19670958 17601315 16117866
5245 16117866 14834739 14142079 13480436 12552240 12151802 11940900 11550202 11310263 11159921
5236A1159921l24500l06546q7849j50901k27390j29277K4777m92587n39744k02902
5226H723002K27117j16886m78918l79676J10671k43867j63555l43803k16324j6429
5216G101332j46304j24938r9770O8659J38721N4356o5999K7982k84038o2132J03150
5205F711019j73813k2533r2037k21933l80961m9534j24642p1429k26139J9633
5195E367631n8664r9591k6996o2134P9066k89621J07189N0885j72753n1045J06868
5184D950835j64559J04175j79015j78021k0339N106j67526k2020O5601J5176L6377
5173D445790k10086j48744J76627j74091j55550J8355J03718J34263K8025M1175
5163D259482k57592r7263p8729M5023K09069k19054M2372N5058L17241J87574
$$ plain form
5236 11159921 10835421 10528875 10441026 10290125 10062735 9933458 9958235 9465648 8925904 8723002
5226 8723002 8950119 8833233 8354315 7974639 8085310 7841443 7677888 7334085 7117761 7101332
5216 7101332 6955028 6830090 6730320 6798979 6937700 6992056 6926057 6954039 6670001 6607869 6711019
5205 6711019 6537206 6514673 6422636 6200703 5819742 5770208 5645566 5574137 5347998 5367631
5195 5367631 5308967 5209376 5182380 5120246 5199312 4909691 5016880 5067765 4895012 4843967 4950835
5184 4950835 4786276 4890451 4711436 4533415 4513076 4518182 4350656 4328636 4394237 4409413 4445790
5173 4445790 4235704 4086960 4263587 4089496 3933946 3952301 4056019 4190282 4218307 4259482
5163 4259482 4001890 3904627 3825898 3870921 4079990 3860936 3903308 3958366 4275607 4463181
5153D463181L4437j43373J52475J48671k10482k03610K99149J8966j8920q7317
5143D453177J23006j24118j351l40157j14887k80202l04642K25857j49240k369
5133C485074k27611q0378J06142K7607j78113K6188j12663o4670K18155k72450
5123B927281J40799n6840k98376l2879n271J59800j21003j08027Q3967J20739
5113B810190k28166j78674J17518j05816n7843N36978j09081k87301p6867n849
5103B415089P1513r6320M1916R4202p7430r9182j74369j29030j34680J72038J35940
5092B219687n0568l0023K012j8814k4467J52221R875J48238k02601J8540N8052
5081B282152K9402j90080r0284L38719n5420k77914p5173P0610R1076j45558q845
$$ plain form
5153 4463181 4497618 4354245 4506720 4655391 4444909 4241299 4540448 4559414 4540494 4453177
5143 4453177 4576183 4452065 4450714 4110557 3995670 3715468 3410826 3636683 3487443 3485074
5133 3485074 3257463 3177085 3283227 3310834 3132721 3158909 3046246 2981576 3199731 2927281
5123 2927281 3068080 3011240 2712864 2679985 2674714 2834514 2713511 2605484 2689451 2810190
5113 2810190 2582024 2403350 2520868 2415052 2357209 2894187 2785106 2497805 2420938 2415089
5103 2415089 2486602 2390282 2432198 2526400 2448970 2349788 2175419 2046389 1911709 2083747 2219687
5092 2219687 2169119 2139096 2141108 2122294 2097827 2250048 2259923 2408161 2205560 2224100 2282152
5081 2282152 2311554 2121474 2031190 2369909 2314489 2036575 1961402 2032012 2123088 1977530 1968685
5070A968685J70283N1876j0906k80545L7608J00175P342J07860j01775k77268
5060A773335M9703k1483J75195j0677q690J6913J47880L2310K43k6802N2623k05536
5048A975014j47561m2623O5426p3782K12576p9427j22633l9611N1474Q2631R9707
5037A981191J12386k76044J14827J38136o0870l82408J9633K77613o5213P2716
5027A931967q7378J6725J98092K78481k6737n6023J38308k65920L6610n0621N3374
5016B166878Q0442L3400k5723L6022K15486j9162j31022O8769J08193l28483L0649
5005B235449J11961O2842j27146k76540j84236K61772L3997j10398Q4321K30665
4995B322687K863p28J82069j04006j06773J21231J96528j81343j50039K43663
$$ plain form
5070 1968685 2138968 2190844 2179938 1899393 1937001 2037176 2044518 2152378 2050603 1773335
5060 1773335 1823038 1801555 1976750 1966073 1957383 1974296 2122176 2154486 2154729 2127927 2180550 1975014
5048 1975014 1827453 1784830 1850256 1776474 1989050 1909623 1786990 1747379 1798853 1881484 1981191
5037 1981191 2093577 1817533 1932360 2070496 2009626 1627218 1646851 1924464 1859251 1931967
5027 1931967 1844589 1861314 2059406 2337887 2311150 2255127 2393435 2127515 2164125 2113504 2166878
5016 2166878 2247320 2280720 2254997 2291019 2506505 2487343 2356321 2425090 2533283 2204800 2235449
5005 2235449 2347410 2410252 2283106 2006566 1822330 2084102 2118099 2007701 2092022 2322687
4995 2322687 2325550 2324822 2506891 2402885 2296112 2417343 2613871 2432528 2282489 2526152
4985B526152J40116j57004P6668Q0765L81793k33336J84576M7528R4402L01924
4975C443584J38672j33961J05045L02407K55254K97151L5735J08962J87901M68609
4965E209359K11672O49215P79304L64171R93430Q28205J366880J669941J765588
4956A3837765K228036K009276L89062j756117k350735k129329k005492j643829
4948H578637j214743j037605l76333n75947m04220j29534k61002k33840k80285
4939D065128l31449k47951l1584m7168q4687j95207k14557K9884L6715l7774r8598
4928B842752j81282n2073P6486n6424m5865Q9676P1630R4119k39829J23048Q0962
4917B803200l41370J55217k88217k56106K60186J9938m2700K0569J08349O8975
$$ plain form
4985 2526152 2666268 2509264 2585932 2666697 3048490 2815154 2999730 3047258 3141660 3443584
4975 3443584 3582256 3448295 3553340 3855747 4111001 4408152 4443887 4552849 4740750 5209359
4965 5209359 5421031 6070246 6849550 7213721 8207151 9035356 10402236 12072177 13837765
4956 13837765 16065801 18075077 18464139 16708022 14357287 12227958 10222466 8578637
4948 8578637 7363894 6326289 5949956 5374009 4969789 4840255 4579253 4345413 4065128
4939 4065128 3733679 3485728 3454144 3406976 3322289 3127082 2912525 2942409 2979124 2941350 2842752
4928 2842752 2661470 2609397 2685883 2629459 2583594 2673270 2744900 2839019 2599190 2722238 2803200
4917 2803200 2461830 2617047 2328830 2072724 2332910 2352848 2310148 2330717 2439066 2508041
4907B508041m8335R649j6853j2141O1517J57601N271l01330J89559o1966k03510
4896B287503J46737o7794j56209l5405o7908m3088l6111M7886J38171m5074p2018
4885B096690j26644k9587K8597o9521K77508j19804n0505j31367P8783j39927
4875A814223J05021K85372j53528R5385p0101j60440r066J53381p3019j03730
4865A883498j13007J32779K69744j71478k95483K57750N7278L9407M4651n5584
4855B049555p0530m9928j59541J58860J0723o0308M6862O2668N2290K33339j43152
4844B130838n4726J86612K35641q4626q2936l2607J54625j8849R6892J6065k43141
4833B303788k35921k9825N0755L3042o377R5689j04946K49693j1507j62592J75318
$$ plain form
4907 2508041 2459706 2469355 2452502 2440361 2501878 2659479 2664750 2363420 2552979 2491013 2287503
4896 2287503 2434240 2366446 2210237 2174832 2106924 2063836 2027725 2075611 2213782 2168708 2096690
4885 2096690 1970046 1940459 1969056 1899535 2177043 2057239 2006734 1875367 1954150 1814223
4875 1814223 1919244 2204616 2051088 2146473 2076372 1915932 1906866 2060247 1987228 1883498
4865 1883498 1770491 1903270 2173014 2001536 1706053 1963803 2021081 2060488 2105139 2049555
4855 2049555 1979025 1929097 1769556 1928416 1939139 1878831 1925693 1988361 2040651 2273990 2130838
4844 2130838 2076112 2262724 2498365 2413739 2330803 2298196 2452821 2433972 2530864 2546929 2303788
4833 2303788 2067867 2038042 2088797 2121839 2115462 2211151 2106205 2355898 2344391 2181799 2357117
4822B357117j72431j95876J06015M1424r9333J74223p6599J13109O23R5978J45704
4811B489954J23728j99389L05210j18635l8205m3279R650J67743K11870J54098
4801C062745l11427J6030K1864K4962K65951k589j94540K10258l9785j42601L46331
4790C257199N2144m1120r1834K04606k07284J21336K23890j19349K28251P5873
4780C703712O7641O4210j31352N1526K01210J31483r5235j6890k6965J62272l8617
4769D072995L58821L26344j0791L19025K19215K79770L0359P376n3133K85513
4759E835494J21929K44129K87265N01135L42784L88054K94313L74735O42581M94787
4749I527206R14351O33353Q74753J321123J426562J834974J832694K203401K640528
$$ plain form
4822 2357117 2184686 1988810 2094825 2136249 2036916 2211139 2134540 2247649 2248272 2344250 2489954
4811 2489954 2613682 2414293 2719503 2600868 2562663 2519384 2529034 2696777 2908647 3062745
4801 3062745 2751318 2767348 2789212 2814174 3080125 3077536 2882996 3093254 3053469 2910868 3257199
4790 3257199 3309343 3268223 3176389 3380995 3173711 3295047 3518937 3399588 3627839 3703712
4780 3703712 3771353 3835563 3704211 3755737 3956947 4088430 3993195 3976305 3949340 4111612 4072995
4769 4072995 4431816 4758160 4747369 5066394 5285609 5565379 5595738 5603114 5549981 5835494
4759 5835494 5957423 6201552 6488817 6989952 7332736 7720790 8015103 8389838 9032419 9527206
4749 9527206 10441557 11074910 11949663 13270786 14697348 16532322 18365016 20568417 23208945
4740B3208945L261742L766680M072902M046923J473069j867519m137528m379836
4732B9445378m239045l584887k529892k357916j614751j104234j075882o48955
4724A2289816p69186n25903n33432m26283o7232j93511k80348n43686K1834r9619
4714H872450j74923j17091J06196P0949j31782n3560Q0398L09047J23320K11361
4704I296365J25628j84558J24745K01088M66150N5163K60610N59951J73938M01286
4694A1480366N53455L18503K93937N36840O90287O15056O17572Q36642J057979
4685A7000637J017062N13812O34659J085529R57541O79089O65554M18792k7144
4676B2945531J55590k813k99927l11154j45648k22846l03658j58810Q4588Q1690
$$ plain form
4740 23208945 26470687 30237367 34310269 38357192 39830261 37962742 33825214 29445378
4732 29445378 25206333 21621446 19091554 16733638 15118887 14014653 12938771 12289816
4724 12289816 11520630 10994727 10461295 10035012 9967780 9774269 9493921 8950235 8972069 8872450
4714 8872450 8697527 8580436 8686632 8757581 8625799 8572239 8652637 8961684 9085004 9296365
4704 9296365 9421993 9237435 9362180 9563268 10029418 10084581 10345191 10905142 11079080 11480366
4694 11480366 12033821 12352324 12646261 13183101 13873388 14488444 15106016 15942658 17000637
4685 17000637 18017699 18531511 19166170 20251699 21209240 21888329 22553883 22972675 22945531
4676 22945531 23101121 23098308 22798381 22487227 22341579 22118733 21815075 21656265 21740853 21822543
4666B1822543K7703O23466K51161M23655M96134O17951Q81639O19012P35888P85100
4656B7284252P79440P79403Q00391P58572P52634O04840L28333M05596K49161
4647C2742622K05718j51765m60607l08863p33452n83167m28540o42244p00000
4638B8939702o29240n23268l44536m10810o69024p50211o69573k36002n23939
4629B4183099p38415j55154q5033m7844L03942J55218L68358K68603N38796M68610
4619B5260180N18787L90374J7212k08258p06220l80554o34837j024029r49665
4610B2282990r72184r08299r33009r06590p54511p79276q17110o93064o79652
4601A4839295n39313p84595q38487n14086n21597m29127j92128l33448l34691
$$ plain form
4666 21822543 21850246 22473712 22724873 23148528 23644662 24262613 25144252 25763264 26499152 27284252
4656 27284252 28063692 28843095 29643486 30402058 31154692 31759532 32087865 32493461 32742622
4647 32742622 32948340 32796575 32335968 32027105 31293653 30710486 30281946 29639702 28939702
4638 28939702 28310462 27787194 27442658 27031848 26362824 25612613 24943040 24707038 24183099
4629 24183099 23444684 23289530 23204497 23156653 23460595 23615813 23984171 24252774 24791570 25260180
4619 25260180 25778967 26169341 26186553 25978295 25272075 24891521 24256684 23232655 22282990
4610 22282990 21310806 20402507 19469498 18562908 17808397 17029121 16212011 15518947 14839295
4601 14839295 14299982 13515387 12676900 12162814 11641217 11212090 11019962 10686514 10351823
4592A0351823k3460m44248l14351j12749L6339j76502m19851k55883p6520J27459
4582H692057j71513o0117J99853k53636j87393m6467j82587n6752j44987p4987
4572G713471J18084j11782o5101l54230j40765j53892j53319k4720n3374R9743
4562F874115J02953J06791k66260q7096L49515N2770k23453K01818j18290K12811
4552G205674N994J12976l9183m2452j80794l48401L02086J25014J75337k04528
4542G111723j97331O0826Q4648k32645R5411j02435r9313R723k5653J19098O5754
4531F889806J51261R602j33440j49172K54807O4567L985O24j52859K38675R0315
4520G268171K2046Q0124r8705J6873p1875r706Q3523l9820j78043J1563q2898
$$ plain form
4592 10351823 10328363 9884115 9569764 9457015 9493354 9316852 8897001 8641118 8564598 8692057
4582 8692057 8520544 8460427 8660280 8406644 8219251 8172784 7990197 7933445 7788458 7713471
4572 7713471 7831555 7719773 7654672 7300442 7159677 7005785 6852466 6827746 6774372 6874115
4562 6874115 6977068 7083859 6817599 6730503 7080018 7132788 6909335 7111153 6992863 7205674
4552 7205674 7211668 7324644 7285461 7243009 7062215 6713814 7015900 7140914 7316251 7111723
4542 7111723 6914392 6975218 7059866 6827221 6922632 6820197 6720884 6730607 6704954 6824052 6889806
4531 6889806 7041067 7050669 6917229 6768057 7022864 7087431 7091416 7092040 6939181 7177856 7268171
4520 7268171 7290217 7370341 7271636 7288509 7216634 7206928 7290451 7250631 7072588 7084151 7001253
4509G001253L0542j59930q0920K74276l9251m252M9935k93m393K19887M9848k25459
4497G111243K8700j90482L56215J76769r5863J7977l5351l3645J63691J57481
4487G656735L02238L4776k83082j5662k9962N3829J44933J57023J2258J29999
4477H163085J06986M82121k558K17173K68517L37788M12867K55180K09611L54898
4467A0805668M1527j48524o4647M11648M23632P215L36197J60931k38688l55157
4457A1379802j68831k3007m20346j33162R0124j9907L37043O9345K6135j61294
4447A0975902L84853K78741j00651J98559N7677J33519J54489K49864J08093K09480
4437A2650526K15093K4273L40243J47576J11989K63107M8204L71839K06592K92478
$$ plain form
4509 7001253 7031795 6871865 6790945 7065221 7025970 7021718 7071653 7071360 7066967 7286854 7336702 7111243
4497 7111243 7139943 6949461 7305676 7482445 7386582 7404559 7369208 7335563 7499254 7656735
4487 7656735 7958973 7993749 7710667 7695005 7665043 7718872 7863805 8020828 8033086 8163085
4477 8163085 8270071 8752192 8749634 8966807 9235324 9573112 9985979 10241159 10450770 10805668
4467 10805668 10847195 10698671 10634024 11045672 11469304 11476519 11812716 11973647 11734959 11379802
4457 11379802 11210971 11187964 10767618 10634456 10724580 10704673 11041716 11111061 11137196 10975902
4447 10975902 11360755 11639496 11538845 11737404 11795081 11928600 12083089 12332953 12441046 12650526
4437 12650526 12865619 12889892 13230135 13377711 13489700 13752807 13801011 14172850 14379442 14671920
4427A4671920M48529L97338J14126J88859J04847k02768K06757k1307k3956j7177
4417A5867168M99808J48827Q8073L92244L21997Q5684L41783M66504L32683K61962
4407A8806733L16120K30636J77137M08240J60030M60428o5605N0059J82662L93957
4397B1120397K17342L14517M62859N63408L32078M60496M75808O46035O24208
4388B5217148P07750L91393N84951Q46260N51101J073701P23493J030382P91835
4379C1918014J187207J042534J454899J158808J469082J597002J622102J322314
4371D2771962J761469K046961K235504K361503K467948K859236K798746L538452
4363F2841781M002198M331017N004601N959662P088216Q486499R854544J1580639
$$ plain form
4427 14671920 15120449 15517787 15631913 15820772 15925619 15722851 15929608 15908301 15884345 15867168
4417 15867168 16366976 16515803 16603876 16996120 17318117 17403801 17745584 18212088 18544771 18806733
4407 18806733 19122853 19353489 19530626 19938866 20098896 20559324 20493719 20543778 20726440 21120397
4397 21120397 21337739 21652256 22115115 22678523 23010601 23471097 23946905 24592940 25217148
4388 25217148 25924898 26316291 26901242 27747502 28298603 29372304 30095797 31126179 31918014
4379 31918014 33105221 34147755 35602654 36761462 38230544 39827546 41449648 42771962
4371 42771962 44533431 46580392 48815896 51177399 53645347 56504583 59303329 62841781
4363 62841781 66843979 71174996 76179597 82139259 89227475 97713974 107568518 119149157
4355A19149157J2839736J4989817J7298956K1023174K4656043K8805380L1238323
4348B70000586K8536416J8452957P291371j95498o106067j5721114k7693700l2442777
4340B42122174l1787958k8003684k3478276j8241772j4124306j1058808q614320
4333A06813050p136121o812772o179574n097229m493739l829187k947455k694482
4325F7622491k595749k725528j929139j635326j244196r04936p84063m16166m91993
4316E4895395n2313j81304q7188j33976j14577n10145o49934j201362j513108
4307E0451488j474283j383837j263416q39001n99235j8757K24680j50214p28479
4298D4218946q13152r71568r70432p01162n48927m09628l62660p0545m88813j115554
$$ plain form
4355 119149157 131988893 146978710 164277666 185300840 209956883 238762263 270000586
4348 270000586 298537002 316989959 324281330 324085832 317979765 302258651 274564951 242122174
4340 242122174 210334216 182330532 158852256 140610484 126486178 115427370 106813050
4333 106813050 99676929 92864157 86684583 81587354 77093615 73264428 70316973 67622491
4325 67622491 65026742 62301214 60372075 58736749 57492553 56587617 55803554 55387388 54895395
4316 54895395 54843082 54661778 54574590 54440614 54326037 53815892 53165958 51964596 50451488
4307 50451488 48977205 47593368 46329952 45490951 44891716 44872959 45097639 44947425 44218946
4298 44218946 43405794 42434226 41463794 40762632 40213705 39804077 39441417 39370872 38882059 37766505
4288C7766505j166785j480635j138154o77526n39673k54817j93570r6096n318
4279C2213931k116K02825M39559P4855m1334O1352j12954q7521k86773j66685
4269C2295139m7441K88821K65785N5952M30810M47017J68209K11078L26330J72858
4259C4614558O47948L50912P38378P99879Q31077R46488O51051O24951N18146
4250D0723388K27457L35264K45078j20425J38872k85931r5833J92266J86175j19382
4240D1426929j26443k26417m03758l32888k66853q2633l91747k11366k14291j79096
4230C8991437k97333k60677j57458n22513p51163o81025q03828q43595o27262
4221C4046583o75868m99996o37889n07741l75912n50249n91713j06032l22944
$$ plain form
4288 37766505 36599720 35119085 33980931 33303405 32763732 32508915 32315345 32219249 32213931
4279 32213931 32211815 32414640 32854199 32929054 32887720 32949072 32836118 32748597 32461824 32295139
4269 32295139 32247698 32536519 32802304 32858256 33289066 33736083 33904292 34115370 34441700 34614558
4259 34614558 35262506 35613418 36351796 37151675 37982752 38929240 39580291 40205242 40723388
4250 40723388 40950845 41286109 41531187 41410762 41549634 41263703 41167870 41360136 41546311 41426929
4240 41426929 41300486 41074069 40670311 40337423 40070570 39987937 39596190 39384824 39170533 38991437
4230 38991437 38694104 38433427 38275969 37753456 37002293 36321268 35517440 34673845 34046583
4221 34046583 33370715 32870719 32232830 31725089 31349177 30798928 30207215 30101183 29778239
4212B9778239n6371m43233n59805n21851n21310q79835q70741o41605o22638q49643
4202B3811207o39797n42596m28483k10118l47364m2011L7056l65874k89218k07628
4192B0775174J395n70k01219j77281K31188R4732k42718K7688P7578N74150M26783
4181B1586900L26014N25621N94942K40526M67888L33380N78676L21451O60543
4172B5635941P82844Q32033J178051Q66363l12428q33225j116021j160874o14330
4163B5258354m07549k00834L41711P29137J023256Q55045R50046N92975M58363
4154B9600504j88626j011564j823932j320810j025131j078827r94396p65919k95648
4145B1095651l69474m61369P1838L55493L80214O48853J224874M07931j46516
$$ plain form
4212 29778239 29721868 29278635 28718830 28196979 27675669 26795834 25925093 25283488 24660850 23811207
4202 23811207 23171410 22628814 22200331 21990213 21642849 21600838 21637894 21272020 20982802 20775174
4192 20775174 20776569 20775999 20574780 20397499 20628687 20723419 20480701 20508389 20585967 21160117 21586900
4181 21586900 21912914 22438535 23033477 23274003 23741891 24075271 24653947 24975398 25635941
4172 25635941 26418785 27250818 28428869 29295232 28982804 28149579 27033558 25872684 25258354
4163 25258354 24850805 24649971 24991682 25720819 26744075 27599120 28549166 29142141 29600504
4154 29600504 29411878 28400314 26576382 25255572 24230441 23151614 22157218 21391299 21095651
4145 21095651 20726177 20264808 20336646 20692139 21072353 21721206 22946080 23354011 23207495
4136B3207495m53061m72871j51019j84137j14870Q43102Q29363J009318J380386
4127B5893706J130684Q4140j845572k401484k297508k290696j777407j112269
4119A5383594r49647o48091o19870n43305o12867m69343l15744p4929j98163P8239
4109A1029874l17027j18227l42530j67632R5792j883k16587k4386j35369r8978
4099I703047k76831J89253q934k7643j52518L57314r3261j63256J98175J77658
4089I903004J44041K17392J03681L10100J01448q1938L14728j8346L4901k94925
4079A0734086O6K54728p4942J93469J0868M02942K46095p997K24963J43886R6251
4068A2224415P2027L3919l08630j91650q2918L3387j99334l27579p449M8863m8217
$$ plain form
4136 23207495 22754434 22281563 22130544 21946407 21831537 22674639 23504002 24513320 25893706
4127 25893706 27024390 27108530 25262958 22861474 20563966 18273270 16495863 15383594
4119 15383594 14433947 13785856 13165986 12622681 12009814 11540471 11224727 11149798 10951635 11029874
4109 11029874 10712847 10594620 10252090 10084458 10180250 10178367 9961780 9937394 9802025 9703047
4099 9703047 9426216 9615469 9606535 9578892 9426374 9783688 9690427 9527171 9725346 9903004
4089 9903004 10047045 10264437 10368118 10678218 10779666 10697728 11012456 10994110 11029011 10734086
4079 10734086 10734152 10988880 10913938 11107407 11118275 11521217 11767312 11759315 11984278 12128164 12224415
4068 12224415 12296442 12330361 12021731 11830081 11747163 11780550 11581216 11253637 11246188 11295051 11246834
4057A1246834J42556J90656P382M7002K29797L70234J08106K23840M08076L62437
4047A3336920M12943M37928M56312M88032M51435N66192O2780J99524M24549J41114
4037A6977729K81656j50461J24798R4615j31199r057P3433K9214N77608N71696
4027A8440032L81755L60578O20487R57277P64742R42312J110891J177548J154274
4018B5909896J375700J398837R32907J173115J030068P21610O37263O17443J46095
4009C3942934K90406O8545J51022k64402k44441k77961L55608Q2745r5926J57974
3999C4166504J01846N45544N19243M63976J015058J061805J100086J474769J387166
3990D1835997J516297J588819J394667J676114J774316J347822J208069N68698
$$ plain form
4057 11246834 11389390 11580046 11587428 11634430 11864227 12234461 12342567 12566407 12974483 13336920
4047 13336920 13749863 14187791 14644103 15132135 15583570 16149762 16212542 16412066 16836615 16977729
4037 16977729 17259385 17108924 17233722 17328337 17197138 17188081 17261514 17290728 17868336 18440032
4027 18440032 18821787 19182365 19802852 20760129 21524871 22467183 23578074 24755622 25909896
4018 25909896 27285596 28684433 29617340 30790455 31820523 32542133 33179396 33796839 33942934
4009 33942934 34233340 34301885 34452907 34188505 33944064 33666103 34021711 34104456 34008530 34166504
3999 34166504 34268350 34813894 35333137 35797113 36812171 37873976 38974062 40448831 41835997
3990 41835997 43352294 44941113 46335780 48011894 49786210 51134032 52342101 52910799
3982E2910799P45321P71233L35081j13057l24106l23117o36787p10371m68822
3973E2186174o67541p66892n57115j71923j69957J38144M91708M04900P72171
3964E1659669R10828J054473J049491J115662J119887P94528Q60305P87284P27075
3955F0079202O57492K91247N8320l6162l78718p98174r16164p58631o85900j134344
3945E6378168j094880q81960j086203o96605j028714j008647r68742o25883l79851
3936D8606683m48520l30935l80091o65062n86229j97356n02829m72954k52280
3927D4770427k15423m58732l27183l71352l28914j25797l74300o8546j41144J6394
3917D2375430q3443n12346l13356k83494m12902q61216q94881q54682r61336n67005
$$ plain form
3982 52910799 53656120 54427353 54762434 54649377 54325271 54002154 53365367 52654996 52186174
3973 52186174 51518633 50751741 50194626 50022703 49852746 49990890 50482598 50887498 51659669
3964 51659669 52570497 53624970 54674461 55790123 56910010 57704538 58564843 59352127 60079202
3955 60079202 60736694 61027941 61086261 61050099 60671381 59873207 58957043 58198412 57512512 56378168
3945 56378168 55283288 54401328 53315125 52618520 51589806 50581159 49612417 48986534 48606683
3936 48606683 48158163 47827228 47447137 46782075 46195846 45998490 45495661 45022707 44770427
3927 44770427 44555004 44096272 43769089 43397737 43068823 42943026 42568726 42500180 42359036 42375430
3917 42375430 42291987 41779641 41466285 41182791 40769889 39908673 39013792 38159110 37197774 36630769
3907C6630769m93810q97134o73925l99129n26450m36419j88572j38668l0593J7961
3897C2864030k40897j46271J3020J86598R8792J75619J5577P9808L22313J58857
3887C3527446N6541l5849O536Q0843L32725K94033K01811O81391L75583P66812
3877C6287872P45096L31274O96596L99238L26648L99132L56116K88517K19906
3868D0050395M50094M95627N6284N32291P20296K92137M83663K85432M78230M71148
3858D4315597L87186M80851N28104L81772O78326O13893Q53226P80517O11944
3849D9631416Q06038Q56629J084298R04203J360837R39351J024507J014980Q32734
3840E8454993R54152P89185Q82394R49643P32503N42795P78225N33849J25905
$$ plain form
3907 36630769 36136959 35239825 34565900 34166771 33640321 33203902 33015330 32876662 32846069 32864030
3897 32864030 32623133 32476862 32489882 32676480 32775272 32950891 32966468 33046276 33368589 33527446
3887 33527446 33583987 33548138 33554674 33635517 33968242 34262275 34464086 35145477 35521060 36287872
3877 36287872 37032968 37364242 38060838 38460076 38786724 39185856 39541972 39830489 40050395
3868 40050395 40500489 40996116 41052400 41584691 42304987 42597124 43080787 43366219 43844449 44315597
3858 44315597 44702783 45183634 45711738 46093510 46771836 47385729 48238955 49019472 49631416
3849 49631416 50437454 51294083 52378381 53282584 54643421 55582772 56607279 57622259 58454993
3840 58454993 59409145 60198330 61080724 62030367 62762870 63305665 64083890 64617739 64743644
3831F4743644j32285O5947L81229M22053N58001M31023N48939O45056N69167O87121
3821F8919895Q07910N01772P50550O78358J053713J378499J297404J460358J594129
3812G8442588J655266J348519J583986J646536J748202K047988J759934J658432
3804I1891451J602620J914158J922568K072616K548810K446233K191928K121039
3796A08711423J993296J736810J621922J205251Q35256N62506M71938L27649J93167
3787A17659218J32360K75195K35663M4485K35747j28277j44975k52592l46443
3778A17710381m80675p05160j111467j104536j221935j868327j751520k043720
3770A07423041k054376k088188j714822j770869k164403k173559j936975j511143
$$ plain form
3831 64743644 64611359 64677306 65058535 65480588 66038589 66469612 67018551 67663607 68232774 68919895
3821 68919895 69727805 70229577 70980127 71658485 72712198 74090697 75388101 76848459 78442588
3812 78442588 80097854 81446373 83030359 84676895 86425097 88473085 90233019 91891451
3804 91891451 93494071 95408229 97330797 99403413 101952223 104398456 106590384 108711423
3796 108711423 110704719 112441529 114063451 115268702 116103958 116666464 117138402 117466051 117659218
3787 117659218 117791578 118066773 118302436 118346921 118582668 118454391 118309416 118056824 117710381
3778 117710381 117229706 116524546 115413079 114308543 113086608 111218281 109466761 107423041
3770 107423041 105368665 103280477 101565655 99794786 97630383 95456824 93519849 92008706
3762I2008706j246110j046591p90900n97824r27104j210966j234137j356403j456452
3753H2142219j152811j095112j197328j024113q31259o33669q82750o34572n69626
3744G4120979o79001o35749m74255m67699o92234n50764p15206o91904p11719
3735F8502448o42141p31690j014232o21202o75468n07371j95665o05392m73141
3726F3036146k93952L0263l9947R7849L56632L30302L34523J97156J38667M03372
3716F4591011L18888K11496Q3357K54274j27893l17955m28860q10327o55170n55337
3706F2563484m83294k23234k49339m66813o1584P192J36450M64478M61112K17456
3696F2365908M48082O22679O21074L29090L85722K27914P38402N28507Q06946
$$ plain form
3762 92008706 90762596 89716005 88925105 88327281 87400177 86189211 84955074 83598671 82142219
3753 82142219 80989408 79894296 78696968 77672855 76841596 76207927 75325177 74690605 74120979
3744 74120979 73441978 72806229 72331974 71864275 71172041 70621277 69906071 69214167 68502448
3735 68502448 67860307 67128617 66114385 65493183 64817715 64310344 64114679 63509287 63036146
3726 63036146 62742194 62772457 62732510 62830359 63186991 63517293 63851816 64048972 64187639 64591011
3716 64591011 64909899 65121395 65204752 65459026 65331133 65013178 64584318 63773991 63118821 62563484
3706 62563484 62080190 61856956 61607617 61140804 61079220 61086412 61222862 61687340 62148452 62365908
3696 62365908 62813990 63436669 64057743 64386833 64772555 65000469 65738871 66267378 67074324
3687F7074324N62182L84441O97986O25039P13899N30349K11985L35647O22384
3678G1758236L20523L51859M09403N08161L79216N64970O87785N94352M62710
3669G6037215P46564K54410J54018L34775J05299J18015K19785L08267K56035
3660G8534383J50603J59534K45520L03632M46393J91921K9212j2150J59811O2779
3650H0271638j41492n3068j50325j61564J66020m2425k40306K472K30502L65019
3640H0246471O58773Q85704R18819J103800J162828J180142J468484J824869J791240
3631I1241130J877388J893113K123883K125292K312737K686696K810091K299762
3623A09370092K544080K388558K054664J897314J544365J169943P75501J26877
$$ plain form
3687 67074324 67636506 68020947 68718933 69343972 70057871 70588220 70800205 71135852 71758236
3678 71758236 72078759 72430618 72840021 73348182 73727398 74292368 74980153 75574505 76037215
3669 76037215 76783779 77038189 77192207 77526982 77632281 77750296 77970081 78278348 78534383
3660 78534383 78684986 78844520 79090040 79393672 79840065 80031986 80061198 80049048 80208859 80271638
3650 80271638 80130146 80077078 79926753 79765189 79931209 79888784 79648478 79650950 79881452 80246471
3640 80246471 80905244 81790948 82709767 83813567 84976395 86156537 87625021 89449890 91241130
3631 91241130 93118518 95011631 97135514 99260806 101573543 104260239 107070330 109370092
3623 109370092 111914172 114302730 116357394 118254708 119799073 120969016 121744517 121871394
3615A21871394R0375r9933j83265o69245n18333m50236o22553p13587o30504n75097
3605A17499016j072874r35077j145701j344451j478573j531994j915237j774387
3597A06300722j912020k270170k254311j785697k083130j563028j666628j918466
3589I0847272j614661j145042j254308j219674p45221r56801p18040n29531n24111
3580H2139883k30294j16720k747L06749K77362O37229N07815Q35828Q89405R84463
3570H6228973J104097J277573J344136J546005K058455J767605K259634K589733
3562A00176211L273753L529827L774226M195989M079544M241598M579920M676431
3554A32527499M551658M141821L531983L499468K990046K020778J712553J160159
$$ plain form
3615 121871394 121961769 121861836 121678571 121009326 120490993 120040757 119418204 118704617 118074113 117499016
3605 117499016 116426142 115491065 114345364 113000913 111522340 109990346 108075109 106300722
3597 106300722 104388702 102118532 99864221 98078524 95995394 94432366 92765738 90847272
3589 90847272 89232611 88087569 86833261 85613587 84868366 83911565 83193525 82663994 82139883
3580 82139883 81909589 81792869 81790122 82096871 82374233 83011462 83519277 84355105 85244510 86228973
3570 86228973 87333070 88610643 89954779 91500784 93559239 95326844 97586478 100176211
3562 100176211 103449964 106979791 110754017 114950006 119029550 123271148 127851068 132527499
3554 132527499 137079157 141220978 144752961 148252429 151242475 153263253 154975806 156135965
3546A56135965N44374Q4981J21017l75212k52232p23872r10067o94007j185548
3537A52745399j717731j980643k084411k734086k891363k642013k922980k761955
3529A33010217k639219k266677j449463j126057o87632R3545N44271M25113m94756
3520A25409342j946908k627755k392411k351784k210105k221429k568336k184568
3512A06906046k101287j968281j636894j254039j311825j427790j624804j669776
3504I3911350j614524j262888j398906q39891p04413k77555L30870K61435L00599
3495H8706077q57686k231033k197757j968486j739947j100612m85122l03524o5352
3486G7756558p60057j075190j171820n87507L7916J024383Q65171o89153l273264
$$ plain form
3546 156135965 156680339 156765320 156886337 156511125 156258893 155535021 154624954 153930947 152745399
3537 152745399 151027668 149047025 146962614 144228528 141337165 138695152 135772172 133010217
3529 133010217 130370998 128104321 126654858 125528801 124841169 124934714 125478985 125904098 125409342
3520 125409342 123462434 120834679 118442268 116090484 113880379 111658950 109090614 106906046
3512 106906046 104804759 102836478 101199584 99945545 98633720 97205930 95581126 93911350
3504 93911350 92296826 91033938 89635032 88795141 88090728 87813173 88144043 88405478 88706077
3495 88706077 87848391 85617358 83419601 81451115 79711168 78610556 78125434 77821910 77756558
3486 77756558 76996501 75921311 74749491 74161984 74199900 75224283 76089454 75400301 72127037
3477G2127037m060039l371479l510179k579724k207314j704638j449209q10621
3469E2433834r63512o88376p13556q4968M4968L02779K69303N45584J042232J434307
3459E3622595J614494J749360J827245K075982K314801N87944j403463k091078
3451F0297880j235646j050472j00158R32125J398224J512720K041460K653280
3443F6449413L779644N401736O980677Q130487Q021810L435868m690205p679926
3435H9829504o457830o389951m823617l114458j813283j148332n28777K3586L5154
3426F5611996N7858N44264Q08092J291074J667290J598131K123915K906433M058497
3417H0667550N459871P007210Q777989Q404500L718327l862543o640507n468876
$$ plain form
3477 72127037 68066998 64695519 61185340 58605616 56398302 54693664 53244455 52433834
3469 52433834 51470322 50781946 50068390 49983422 50028390 50331169 50600472 51146056 52188288 53622595
3459 53622595 55237089 56986449 58813694 60889676 63204477 63792421 62388958 60297880
3451 60297880 59062234 58011762 57911604 58843729 60241953 61754673 63796133 66449413
3443 66449413 70229057 75630793 82611470 90741957 98763767 102199635 97509430 89829504
3435 89829504 83371674 76981723 72158106 69043648 67230365 66082033 65553256 65576842 65611996
3426 65611996 65669854 66214118 67022210 68313284 69980574 71578705 73702620 76609053 80667550
3417 80667550 86127421 93134631 101912620 110317120 114035447 110172904 103532397 98063521
3409I8063521m967072l465074k142441q47534k92523L42838K39233J74942l52949
3400H6752941m17911k54661p00309r31357j144221j644373j649750k132696k124606
3391G5753057k341509k500693k528438k319927k441025k245123k293490k371757
3383E6711095j900888j738293j579370j457777j172576j068401j121508p06271
3375D5966011o68267o74658q07055n12004n75093o19929n48930r97736p71660
3366C9790679q22516p44836r13882o49981j050614q97792r44306j007553j045813
3357C1713386p66422p09288j256251p15776j024846j070940o11556o83689k33660
3348B4640958m14070n91749m01965o20937m07109l92202m98682n00094j40567
$$ plain form
3409 98063521 93096449 89631375 87488934 86641400 86348877 86691715 86930948 87105890 86752941
3400 86752941 86335030 86080369 85380060 84448703 83304482 81660109 80010359 77877663 75753057
3391 75753057 73411548 70910855 68382417 66062490 63621465 61376342 59082852 56711095
3383 56711095 54810207 53071914 51492544 50034767 48862191 47793790 46672282 45966011
3375 45966011 45297744 44623086 43816031 43304027 42728934 42109005 41560075 40562339 39790679
3366 39790679 38968163 38223327 37309445 36659464 35608850 34711058 33766752 32759199 31713386
3357 31713386 30946964 30237676 28981425 28265649 27240803 26169863 25558307 24874618 24640958
3348 24640958 24226888 23635139 23233174 22612237 22205128 21812926 21314244 20814150 20673583
3339B0673583m48870k92848n52254l74277l35112m97958j28813m39967l47308
3330A7256176l39761k70338l37533k64494k67957k30600m64178j91004j0350o7503
3320A4812458k78600O259k07971N4398k2986k82527j40238K63542l93457m00028
3310A3410850K28912N8764m9221l36797l8443q8763j27859M9765N7559j37933
3300A3026834j15631k88859n0903K657N036k90280J68942j50696m8142N5608N2598
3289A2367164K9359j65021J28492j09509K3903m5614r7544J27533Q1632N9112
3279A2399507K0548j53663L78106M9264J06076K30201J89445M8614M8728J48775
3269A3465601L86500N0570O4105K71112J20751K65568K08939L84126J6472K79313
$$ plain form
3339 20673583 20224713 19931865 19379611 19005334 18670222 18172264 18043451 17603484 17256176
3330 17256176 16916415 16646077 16308544 16044050 15776093 15545493 15081315 14890311 14879961 14812458
3320 14812458 14533858 14540117 14332146 14386544 14363558 14081031 13940793 14204335 13810878 13410850
3310 13410850 13639762 13698526 13649305 13312508 13274065 13185302 13057443 13107208 13164767 13026834
3300 13026834 12911203 12622344 12571441 12574098 12579134 12288854 12457796 12307100 12258958 12314566 12367164
3289 12367164 12396523 12231502 12359994 12250485 12274388 12228774 12131230 12258763 12340395 12399507
3279 12399507 12420055 12266392 12644498 12693762 12799838 13030039 13219484 13268098 13316826 13465601
3269 13465601 13852101 13902671 13966776 14237888 14358639 14624207 14833146 15217272 15233744 15513057
3259A5513057N43681K38071O95040O61702P02605Q80399Q86224J126770R26012
3250B2173561J091223J124414Q85552L55184o16288p58092o78260l03968n98400
3241B2674926j37061P2826n4597K00821J96601L71040J78186M86359L63735L85592
3231B4738428M62946M62411L14423O53182N29839L14597M75739O59091O53144
3222B9263800L18745O09280P17364P96065J002409Q17345P13949J074425J098417
3213C6411799P03594J229923J369945J705872J707940J780113J920739K477242
3205D9307167K827508L333436L627286L777766M233383M722875N175379N442563
3197H2447363N797381O104971N123817K910506R37431K54788R73843J960853L718484
$$ plain form
3259 15513057 16056738 16294809 16989849 17651551 18354156 19234555 20120779 21247549 22173561
3250 22173561 23264784 24389198 25274750 25629934 25013646 24255554 23577294 23273326 22674926
3241 22674926 22537865 22610691 22556094 22756915 22953516 23324556 23502742 23989101 24352836 24738428
3231 24738428 25201374 25663785 25978208 26631390 27161229 27475826 27951565 28610656 29263800
3222 29263800 29582545 30191825 30909189 31705254 32707663 33525008 34238957 35313382 36411799
3213 36411799 37115393 38345316 39715261 41421133 43129073 44909186 46829925 49307167
3205 49307167 52134675 55468111 59095397 62873163 67106546 71829421 77004800 82447363
3197 82447363 88244744 94349715 99473532 102384038 103321469 103576257 104550100 106510953 110229437
3188A10229437N804638P284340Q797570J0711910J1949449J3420110J5286984
3181A83484438J7447691J8647262K0002907K0892268J9379103J4882924Q423125
3174C03159718n83461r300454j6025586j9265066j9219632j7551618j5088424
3167B06125477j2595950j0485578q580232o596067m589305l420313k115171j979155
3159A55763706l221673o156109r289564j0812663j1305846j0673264r476623q280608
3151H6547356p185705n801578m912127m501841m102763l525419l122991k996791
3143E0398141k386896k235072k433909j903240j922706j849651j277039j385317
3135C5004311j497491j197786j191061q89888j008248p26865j020388m23434q41030
$$ plain form
3188 110229437 116034075 123318415 132115985 142827895 154777344 168197454 183484438
3181 183484438 200932129 219579391 239582298 260474566 279853669 294736593 303159718
3174 303159718 302576257 293275803 277250217 257985151 238765519 221213901 206125477
3167 206125477 193529527 183043949 174463717 167867650 163278345 159858032 157742861 155763706
3159 155763706 152542033 146385924 137096360 126283697 114977851 104304587 94827964 86547356
3151 86547356 79361651 73560073 68647946 64146105 60043342 56517923 53394932 50398141
3143 50398141 48011245 45776173 43342264 41439024 39516318 37666667 36389628 35004311
3135 35004311 33506820 32309034 31117973 30228085 29219837 28492972 27472584 27049150 26208120
3126B6208120r61048n43759l20340n68128m33649n21550m95085k68180m88907
3117B1607474m96367m51670n81370m47803k72620p09921m25000k59022o85167
3108A7278534l85064l91792l89816l41914k93593o01239m81863l63211n34206
3099A3495836l69797k02660m59284l61483l97322k03296k62930k42137l41841
3090A0655086k62911j21413k98354k65922l09794k41002l05912J05303k37337
3081H717744l80942k78761j12687j92176n5921q3088l0107k91221l45566k22322
3071F724953j85735P5063j17006o7249p4897k29427l03390j45117O6576j26735
3061E617036q1940l47370j48580j29155K01251l60920K18630n3218j98824J69907
$$ plain form
3126 26208120 25247072 24703313 24382973 23814845 23381196 22859646 22364561 22096381 21607474
3117 21607474 21111107 20659437 20078067 19630264 19357644 18647723 18222723 17963701 17278534
3108 17278534 16893470 16501678 16111862 15769948 15476355 14875116 14393253 14030042 13495836
3099 13495836 13126039 12923379 12464095 12102612 11705290 11501994 11239064 10996927 10655086
3090 10655086 10392175 10270762 9972408 9706486 9396692 9155690 8849778 8955081 8717744
3081 8717744 8336802 8058041 7945354 7753178 7697257 7614169 7584062 7292841 6947275 6724953
3071 6724953 6539218 6614281 6497275 6430026 6355129 6125702 5822312 5677195 5743771 5617036
3061 5617036 5535096 5187726 5039146 4909991 5111242 4750322 4968952 4915734 4716910 4886817
3051D886817j17450j9426Q891j88347k2472j04628j34593r6135N0729m2847K1362
3040D241901j39813n5594J75322o2942J40411k98451l20180K5166J2434J5715
3030C733969R886k72435j26116n5011p5158j29118J7291n0127l25622J54944J80670
3019C063173J45681j72734O7685M0720m30003J83238q9707J98739o5198k90531
3009B651063p0574Q89K05477M2806j46387j22357j11638M2535p6569k26189J6722
2998B205778K9550p4024K11058r3108j59280J23511M6516J17701k24976p3505
2988B109221o0108J50576q675m8710o1606q0878r2852k0027J97553p1672j92384
2977A820438k0307k45099n3849J69720l0o761P9206P0805r6272j7481j08574L85325
$$ plain form
3051 4886817 4769367 4749941 4758832 4570485 4548013 4443385 4308792 4212657 4263386 4220539 4241901
3040 4241901 4102088 4046494 4221816 4158874 4299285 4000834 3680654 3705820 3718254 3733969
3030 3733969 3743855 3471420 3345304 3290293 3215135 3086017 3103308 3053181 2727559 2882503 3063173
3019 3063173 3208854 3036120 3103805 3144525 2714522 2897760 2808053 3006792 2941594 2651063
3009 2651063 2580489 2581378 2786855 2829661 2683274 2560917 2449279 2491814 2415245 2189056 2205778
2998 2205778 2235328 2161304 2372362 2279254 2119974 2243485 2290001 2407702 2182726 2109221
2988 2109221 2049113 2199689 2191014 2142304 2080698 1999820 1906968 1886941 2084494 2012822 1820438
2977 1820438 1800131 1555032 1501183 1670903 1670873 1664112 1743318 1814123 1717851 1700370 1591796 1977121
2965A977121j12099j14618P5K30339m7086q4603j69071j53705n203J7611J76246
2954A715007J9712k56836K4163J45199L9364J98885j48308j77077r5818K04816
2944A669107J0048j13740J14511Q8897j75053Q5620k5881j72765K09711r0978
2934A599477J85081K19703q1025K5781J13165o3366K13684k10806K41423J60758
2924B403875l44456K4463K00416P1387Q1378O8987k16219m2316m5272r0680j02466
2913B009097j18080j63547R2340J3487j42204J8142Q3172j29572j9896j09430
2903A533509j36468Q9107P2200l7553P6736m04689l4841O5480P3729m4372k55790
2892I97048m3693j49530O0314J24688l6391j2734O3832j74611j9802P0668o2375
$$ plain form
2965 1977121 1865022 1750404 1750479 1980818 1933732 1849129 1680058 1526353 1521150 1538761 1715007
2954 1715007 1734719 1477883 1502046 1647245 1686609 1885494 1737186 1560109 1464291 1669107
2944 1669107 1679155 1565415 1679926 1768823 1593770 1679390 1653509 1480744 1690455 1599477
2934 1599477 1784558 2004261 1923236 1949017 2062182 1998816 2212500 2001694 2243117 2403875
2924 2403875 2059419 2083882 2284298 2355685 2437063 2506050 2289831 2247515 2202243 2111563 2009097
2913 2009097 1891017 1727470 1819810 1833297 1691093 1709235 1792407 1662835 1642939 1533509
2903 1533509 1397041 1486148 1558348 1520795 1597531 1192842 1158001 1223481 1297210 1252838 997048
2892 997048 953355 803825 864139 988827 952436 939702 1003534 828923 809121 879789 817414
2881H17414J37996j56399j60198J95599m8871j96583j09786k567R7751l0365o9539
2870D74452J19848j29521N0940J25728L5831j15753j464K53693J0989Q7367m0879
2859H71231l08223j42052L21944K28161K4818k84339O6187j73449R4176R6862
2849G95316j92335K78979m3482n7881L1161j02668j34481P203L50J38797j03894
2838F17065p5108J3691j36358P6109K69937K3760l43564r4139J08630j60929J5986
2827C15080j18115N1593J53235K24961K3475o3359j64447k39591J13127q099J02204
2816C90064J82274j08797J2691j93961j34171L02201j1830K65430j34327J54853
2806G24427m3346k06962k1900K35770o2562j41565k38951P9007j37272J68290
$$ plain form
2881 817414 955410 799011 638813 834412 785541 588958 479172 476605 574356 543991 474452
2870 474452 594300 464779 515719 641447 677278 561525 560061 813754 824743 912110 871231
2859 871231 563008 420956 742900 971061 995879 711540 777727 604278 698454 795316
2849 795316 602981 881960 838478 780597 811758 709090 574609 581812 582162 720959 617065
2838 617065 541957 555648 419290 495399 765336 789096 445532 351393 460023 299094 315080
2827 315080 196965 248558 401793 626754 650229 586870 422423 182832 295959 287860 390064
2816 390064 572338 463541 476232 282271 148100 450301 438471 703901 569574 724427
2806 724427 681081 474119 452219 687989 625427 483862 244911 323918 186646 354936
2796C54936J42986L7522L9956k38540K1517r0705K1833K10675J4523k25358J84503
2785D73848k7308L5965k3679J32887L4832j97037k279j95174j46466J11985l9913
2774A57661J85552p301q5695j9055N7407j82491K83110j43481R1124O4321Q614
2763D09766K8167K0827J03420j06466m2167J40815n564N549j51234P0793J04173
2752E78079M0383k3428l45461J0117p4606K0680J20856L7045K4751J33399k16413
2741C05402j6731J36824J02180p9244J92242j47662K86954J52679L4050J2747
2731I79441j13177R6974j93769l3267L1317k3232l8166j24805J12409J26042k24579
2720E95188k81514O9765J15263j04919J36394j39016J38890k02593O1179o9946
$$ plain form
2796 354936 497922 535444 575400 336860 358377 267672 289505 500180 514703 289345 473848
2785 473848 446540 482505 458826 591713 626545 429508 427229 232055 85589 197574 157661
2774 157661 343213 335912 250217 231162 288569 106078 389188 245707 336831 401152 409766
2763 409766 437933 458760 562180 455714 413547 554362 548798 554347 403113 473906 578079
2752 578079 618462 595034 249573 259690 185084 205764 326620 363665 388416 521815 305402
2741 305402 288671 425495 527675 448431 640673 493011 779965 932644 966694 979441
2731 979441 866264 963238 769469 736202 767519 744287 706121 581316 693725 819767 595188
2720 595188 313674 383439 498702 393783 530177 391161 530051 327458 388637 318691
2710C18691K43174j28334l5104n6667k7827J76690j11235K76343p7159j7537j48285
2699D12750l4646Q2253k3313J45771J64491j40777j13239k01128N7097K7388m4461
2688C32186o7308N0469N6347K41k86194q5777K02758J80425o9943k91521L71804
2677C93487j15025k7101J53857n5126N7802l5628j56320j71499R9160q739J53338
2666B88206J8933K47535j4542J23577q4361l50291P6398P3692K189l8849J31348
2655D73835J04298l9675j00287J92069p4476j23049q5617L19587K33269k08120
2645F91834J8413j83311k0531M8478M5426r8864L6067J66234O987j11204k2938
2634E76591M5319k19037Q8258J12704j66824L12772l8139m3999k0882J36794k69686
$$ plain form
2710 318691 561865 433531 398427 341760 313933 490623 379388 655731 578572 561035 412750
2699 412750 378104 460357 437044 582815 747306 606529 493290 292162 349259 376647 332186
2688 332186 264878 315347 371694 371935 85741 -36 202722 383147 313204 21683 393487
2677 393487 278462 251361 405218 350092 407894 372266 215946 44447 143607 134868 288206
2666 288206 307139 554674 540132 663709 579348 229057 305455 379147 381336 342487 473835
2655 473835 578133 538458 438171 630240 555764 432715 347098 666685 899954 691834
2645 691834 710247 526936 506405 554883 600309 501445 537512 703746 710733 599529 576591
2634 576591 621910 402873 491131 603835 437011 749783 711644 667645 646763 783557 513871
2623E13871K20329M7395k09215J70111J5236k37269K70442R5084j39160M8812
2613G95636p5098J93136L7218k17780n9319K52729j46500J52186p3436Q1795k22166
2602G18401O937K50550O0139L8146j01031J1350O9955M2511k7579Q893K56824
2591A335096k02327j16580m8159M6042N3946K33392O0757K5833R6784o7009L3621
2580A451396L2377j08298K4866J79979j42579J8705L53008j96816P8704r2132
2570A599210R6707R0557Q9166J42572K12352P2150m1548Q6661J59211L6910J22608
2559B666556r7676J25974J91624J55967J64394J10020l65566j08113M92742R2687
2549C428609Q7877L9713R2655k8925k1106Q646L44080K4372L8117Q7915r220J03323
$$ plain form
2623 513871 734200 781595 572380 742491 757727 520458 790900 885984 746824 795636
2613 795636 720538 913674 950892 733112 673793 926522 780022 932208 858772 940567 718401
2602 718401 725338 975888 1036027 1074173 973142 984492 1054447 1096958 1069379 1078272 1335096
2591 1335096 1132769 1016189 968030 1014072 1068018 1301410 1362167 1388000 1484784 1417775 1451396
2580 1451396 1483773 1375475 1400341 1580320 1437741 1456446 1809454 1612638 1691342 1599210
2570 1599210 1695917 1786474 1875640 2018212 2230564 2302714 2261166 2347827 2507038 2543948 2666556
2559 2666556 2568880 2694854 2886478 3042445 3206839 3316859 2951293 2843180 3335922 3428609
2549 3428609 3516486 3556199 3648854 3619929 3598823 3607469 3951549 3975921 4014038 4101953 4092733 4196056
2537D196056K01884M0911L43378J9828L97069K00083r0873L97898J28951k08916
2527E626269J72406K77137L46331L65180K49959L30676L76687M67879N35463O58251
2517I406238O90914N43073L36019O26306R78088O29307J152875J164486J200085
2508A6727391J178023J470703J730815K354996J863331K290418K837954L853945
2500C4307576L884538N260689N814346P215554R669024J2878432J4937824J9245664
2492A13213647K0604202Q934207j5698192k3828209j6408335j7873885j3730384
2485E5213051r108285o364243n064833l616373k991566k096877j786315j409255
2477B2775304j487447j817384j512389j518054j435853j110887j102025r38136
$$ plain form
2537 4196056 4397940 4438851 4782229 4802057 5199126 5399209 5308336 5706234 5835185 5626269
2527 5626269 5798675 6075812 6422143 6787323 7037282 7367958 7744645 8212524 8747987 9406238
2517 9406238 10097152 10640225 10976244 11602550 12580638 13209945 14362820 15527306 16727391
2508 16727391 17905414 19376117 21106932 23461928 25325259 27615677 30453631 34307576
2500 34307576 38192114 43452803 49267149 56482703 66151727 79030159 93967983 113213647
2492 113213647 133817849 142752056 127053864 103225655 86817320 68943435 55213051
2485 55213051 46104766 39740523 34675690 31059317 28067751 25970874 24184559 22775304
2477 22775304 21287857 19470473 17958084 16440030 15004177 13893290 12791265 11853129
2469A1853129n90378o83592p42780l32502l83946j32074m66818m77255k55448
2460G788336l01901j64763r7433m06700l90091m92660k50285j55310k70979j75526
2450E082688k94006q2350n0918m4595j66368k73667p4405j39916q8387k69957
2440C598119r6918j16259j83390n7366r6446J9107N014j81656l71858r8027J67204
2429B587524k9035j26270j45730j021J51864p4165k01385J15545l1781n7570K5464
2418B213440m38836l09785r9411N2542Q2150r8715o0856q1350K11871P3013l7580
2407A506483j93402J71545R4450j54941j17206j99751n3901L7520J7000l98589
2397G09208q2375R1896L32334J40196l44938J12905L9268p0533M8229j55333J01821
$$ plain form
2469 11853129 11262751 10579159 9836379 9503877 9119931 8987857 8521039 8043784 7788336
2460 7788336 7486435 7321672 7224239 6817539 6427448 5934788 5684503 5529193 5258214 5082688
2450 5082688 4788682 4706332 4655414 4610819 4444451 4170784 4096379 3956463 3868076 3598119
2440 3598119 3501201 3384942 3201552 3144186 3047740 3066847 3071861 2890205 2518347 2420320 2587524
2429 2587524 2558489 2432219 2286489 2285468 2437332 2363167 2161782 2277327 2245546 2187976 2213440
2418 2213440 1774604 1464819 1365408 1417950 1500100 1401385 1340529 1259179 1471050 1544063 1506483
2407 1506483 1313081 1484626 1579076 1424135 1306929 1107178 1053277 1090797 1107797 709208
2397 709208 626833 718729 1051063 1191259 846321 959226 998494 927961 976190 820857 922678
2386I22678k11436P7616j13083l4671l7847o018R7068K22699M445q1392K04272
2375A044331j38994k21874J09898K82818j96026k46406K13032l30920N4680R1521
2365F62060j8960o6469K3019N5559L2447o1255j1689q2825j1120J56658p1022
2354F06403k6074o4566O016K71281K33612j73455j19216k70463j8550N9923l7761
2343D67150q3608L6640K07337O0754k24823j67908J73373K3797O3548l6363J49889
2332F69786j56790r5887q695O7026L07209m6569m55916r14K42785q3037k08367
2321B30631K19767J13421l21682o1996Q0954Q9332j92225p3480J63363K87443
2311E35528j04559k01468l025K30206J36135j23682l79062J1809K99355k26353
$$ plain form
2386 922678 711242 788858 675775 641104 603257 597239 694307 917006 921451 840059 1044331
2375 1044331 905337 683463 793361 1076179 880153 633747 846779 515859 570539 662060
2365 662060 643100 576631 599650 655209 687656 626401 614712 531887 520767 677425 606403
2354 606403 580329 515763 521779 793060 1026672 853217 734001 463538 444988 504911 467150
2343 467150 383542 420182 627519 688273 463450 295542 468915 492712 556260 519897 669786
2332 669786 512996 417109 408414 475440 782649 736080 280164 279250 522035 438998 230631
2321 230631 450398 563819 242137 180141 261095 350427 158202 84722 248085 535528
2311 535528 430969 229501 226476 456682 592817 469135 90073 101882 401237 174884
2301A74884J68683o2513j60361J33675r4115J86452N1362J32565j00039j41967
2291B88626o2209j05651n5239j04847K43611p9849q5252K28042O3365K6182n5519
2280C01260j54899k40137O6331k3963J16150M4272r9800L5083k1526J57726L2613
2269B13110J3279Q6825o6040J26648j12040k03865J28737j08416k5003J12173
2259A65408J62241J87528J98699l49653k07835K01869k6745J76635o4471K16528
2249F60204J70557J7273j29045L7330j74010j3694k9844m2982j71132o4721J66535
2238D26471R104j89346J15068j75273K71414n6766j93752J02850K5122j75833
2228A59059P5645k6388j96209O9853k6727L9054k72362K05843K46878R4957j20784
$$ plain form
2301 174884 343567 281054 120693 254368 160253 346705 398067 530632 430593 288626
2291 288626 226417 120766 65527 -39320 204291 124442 39190 267232 330597 356779 301260
2280 301260 146361 -93776 -27445 -51408 64742 109014 9214 44297 22771 180497 213110
2269 213110 226389 313214 247174 373822 261782 57917 186654 78238 53235 165408
2259 165408 327649 515177 713876 364223 156388 358257 331512 508147 443676 660204
2249 660204 830761 848034 718989 756319 582309 568615 538771 495789 324657 259936 426471
2238 426471 435575 246229 361297 186024 457438 400672 206920 309770 334892 159059
2228 159059 234704 208316 12107 81960 55233 94287 -178075 27768 274646 369603 248819
2217B48819L9905o2805J2971p4416n3227K6414J29654p4443J65502j95207O7889
2206B31056o9542o4520j94464O6092l7770m6187J89133p9390l9361R5319j3495
2195C6871R8209J22693q3723j10150m4271J41585j09270j39999K1973j68956J3743
2184b21295J17680J72467L1060l7465O1708j24582M9486J17337j47618M9623J41971
2173B10372j0394j11852m182Q9730j1552o5999j08071J21319O1508k1619l48253
2162a98993K25666P4886K5586j45620K45254r5250q2488K01270p4833j23363o0149
2151h034J49836P6895l41014O9603m926p9044J35500k06681l3436Q1835K85721
2140A26255R2450k28044L4356K67055j00285j5632Q346j705k9256j52939l6760
$$ plain form
2217 248819 288724 225919 238890 164474 111247 137661 267315 192872 358374 163167 231056
2206 231056 161514 96994 -97470 -31378 -69148 -115335 73798 -5592 -44953 50366 36871
2195 36871 135080 257773 174050 63900 19629 161214 51944 -88055 -66082 -235038 -221295
2184 -221295 -103615 68852 99912 62447 124155 -427 49059 166396 18778 68401 210372
2173 210372 199978 88126 83944 173674 162122 96123 -11948 109371 170879 149260 -198993
2162 -198993 26673 101559 127145 -18475 226779 131529 49041 250311 175478 52115 -8034
2151 -8034 141802 218697 -122317 -52714 -57640 -136684 -1184 -207865 -241301 -159466 126255
2140 126255 218705 -9339 25017 292072 191787 176155 184501 182796 153540 601 -36159
2129c6159M7394J23257j77360j25648l4665J64839M5065J5571N5002j6667O2806
2118A23435J44312O6564k31944j34861o0761K9491L7933q217M1572j1226J05357
2107A01655K56561k36196K75190n3208k04551m9318J12606O6780k65466J2473
2097A6526m3494K8537J34610k215k937j87998p819j9086N1093j25310J40745n8926
2085g6274n0961J39672k3939J17283K0379p283q9591j49081J98703J37957L667
2074B20532l32785J85340P721l12725R4986J35895J29296l1121K5108k3035k9868
2063F9344J51619o0488k8880J23840J50489j12511k22165J08856j13711l6003
2053C0390L3967j12532N3416l3612L4235J23752k5484k77048p8461K09596J89343
$$ plain form
2129 -36159 11235 134492 -42868 -168516 -203181 -38342 6723 22294 77296 60629 123435
2118 123435 267747 334311 102367 -32494 -93255 -63764 -25831 -34048 7524 -3702 101655
2107 101655 358216 122020 397210 344002 139451 90133 202739 269519 4053 16526
2097 16526 -26968 1569 136179 133964 131027 -56971 -64790 -83876 -32783 -158093 -17348 -76274
2085 -76274 -127235 12437 -11502 105781 126160 118877 29286 -119795 78908 216865 220532
2074 220532 -112253 73087 80808 -231917 -136931 -1036 128260 97139 122247 99212 69344
2063 69344 220963 160475 131595 255435 405924 293413 71248 180104 66393 30390
2053 30390 64357 -48175 5241 -28371 5864 129616 104132 -172916 -251377 -41781 147562
2042A47562n3134j97345m5434j81963J68974R7455J55773n6040o7621o9963N6211
2031d5525P5115L5888l5757O7695j55841Q7719P0562O8509p0591j16091j64499
2020a82816J75398J29518l5431j65958j73380K28687R6003p8916K1826L7409j49804
2009i7464p0268J16277K28489P5074j18530q2496k46521J86801J31025m3880k45072
1998a66565K8304J79838n0243j77170n5656Q4647R7888K79941k29213j00366P928
1987a00667J45112m2519m9954j66101j12061J36440J45406Q4077j57620J45296
1977B7409r9949k28776N2252M7546R1052J36700J2264K2631K9424J43734r1521
1966A42766j83994R053P0130k9229o7385M7544k04544k8747J36616J3595O2841
$$ plain form
2042 147562 94428 -102917 -148351 -330314 -161340 -63885 91888 35848 -31773 -101736 -45525
2031 -45525 29590 65478 29721 97416 -58425 29294 99856 168365 97774 -18317 -182816
2020 -182816 -7418 122100 86669 -79289 -252669 -23982 72021 -6895 14931 52340 -97464
2009 -97464 -167732 -51455 177034 252108 133578 51082 -195439 -8638 122387 78507 -166565
1998 -166565 -138261 41577 -8666 -185836 -241492 -156845 -58957 220984 -8229 -108595 -100667
1987 -100667 44445 1926 -48028 -214129 -326190 -189750 -44344 39733 -117887 27409
1977 27409 -72540 -301316 -249064 -201518 -110466 26234 38498 61129 90553 234287 142766
1966 142766 -41228 -32175 37955 8726 -58659 -11115 -215659 -244406 -107790 -94195 -31354
1955c1354Q4046j6136j15333O5323J09416K2048m3696P0666M8787m8194L170J69092
1943C17835P5277l57046J7049N9954r0197Q9361O7113l4565j54795j14514J8649
1932a05879P6499j28350n5001n189K00K26412J0019J76284k11679Q9795J09926
1921A83037K871m8096o2125j40252l9004K41189L26362l47989k07386j5425r795
1910a16613L5441o6152P0165q5943K8257J31121N4706N2088q9625J1518J3934
1899C8897J3209M4054O5379k33985l9183J45500J58926j01993m7838J4315j05400
1888d8119r3082R7837J32598j34432Q359n8248K61374j29886o1245P3751M3336
1877I2243k72640l4233K81133L655M7377j14662K03011N460j78036p1157Q1624
$$ plain form
1955 -31354 52692 36556 -78777 -13454 95962 118010 74314 144980 193767 145573 148743 317835
1943 317835 393112 36066 53115 113069 22872 112233 179346 144781 -10014 -124528 -105879
1932 -105879 -29380 -157730 -212731 -217920 -217720 8692 18711 194995 -16684 73111 183037
1921 183037 185908 137812 75687 -64565 -103569 137620 463982 115993 -91393 -106818 -116613
1910 -116613 -81172 -147324 -77159 -163102 -134845 -3724 50982 103070 13445 24963 38897
1899 38897 52106 96160 161539 -72446 -111629 33871 192797 90804 42966 57281 -48119
1888 -48119 -141201 -43364 89234 -45198 -36839 -95087 166287 36401 -24844 48907 92243
1877 92243 -180397 -214630 66503 70158 117535 2873 205884 211344 33308 -37849 43775
1866D3775n0393j21769J52927O0946K4053k8364j64540q8565J65639j08672R4171
1855b0792j95802J27231J46180j8559j02422L48956j74010l05644J58040l9181
1845g6003M7930J02096n1707J7285K59368j90517P4718r3260N173l007N2114j17236
1833B6954j20369J09380J4361J87977O6295k5060K1228k64378J2490j13607k44980
1822c29709K54341M8130R5426N9857j44092k3874o5281n4909p0318p5096O8817
1811b36708K48418p2400r2574k1399m6452q6839K8007M4640Q4457J32351j40251
1800a58750R8292Q2416P7731k00070J19617l6885k40868j3124K54139k929J24951
1789A04520R3618l4090k18521K26985n4510k38702J58005m3097j52374J72669
$$ plain form
1866 43775 -6618 -128387 24540 85486 109539 81175 -83365 -171930 -6291 -114963 -20792
1855 -20792 -216594 -89363 56817 38258 -64164 284792 110782 -194862 -36822 -76003
1845 -76003 -28073 74023 22316 39601 298969 108452 183170 89910 95083 92076 144190 26954
1833 26954 -93415 15965 30326 218303 284598 259538 280766 16388 28878 -84729 -329709
1822 -329709 -75368 -27238 68188 128045 -16047 -39921 -105202 -160111 -230429 -305525 -236708
1811 -236708 11710 -60690 -153264 -174663 -221115 -307954 -279947 -235307 -150850 -18499 -158750
1800 -158750 -60458 21958 99689 -100381 19236 -17649 -258517 -271641 -17502 -20431 104520
1789 104520 198138 164048 -54473 172512 118002 -120700 37305 -5792 -158166 14503
1779A4503O3044M8269N4002j48400P1944l02715j9652K45823j64141l8732R6019
1768h0036k3390k8062J41857O0542J506p6876K8449n756O9767M5293M7494j47857
1756C2931o7168k4825o3688K09820j52127J58565n8236k3026m9394j47655K87205
1745A02402q1746l6251j13554j17378K79734j26049J9209J55477K15574j7393
1735B80025J908j55236p2151J29220j33819k21234q4387L6279N1763J47487m0125
1724f0270o8894L18520k01510j85914O313J00818l0924j7672J19339J5504K9455
1713B4765K14563j13753j97128N2101j40280J25882J2601n8189J40615j53739
1703i2562J5407J37209n6014J55782Q8417j75852M7422o1867J42855j21039N7378
$$ plain form
1779 14503 77547 125816 179818 31418 103362 -199353 -219005 26818 -137323 -176055 -80036
1768 -80036 -103426 -131488 10369 70911 72417 -4459 23990 18234 88001 133294 180788 32931
1756 32931 -34237 -59062 -122750 87070 -65057 93508 35272 12246 -37148 -184803 102402
1745 102402 20656 -15595 -129149 -246527 33207 -92842 -73633 81844 297418 280025
1735 280025 281933 126697 54546 183766 49947 -171287 -255674 -219395 -167632 -20145 -60270
1724 -60270 -129164 189356 -12154 -198068 -191755 -90937 -121861 -139533 -20194 -4690 24765
1713 24765 239328 125575 -71553 -19452 -159732 -33850 -21249 -79438 61177 -92562
1703 -92562 -77155 60054 4040 159822 248239 72387 119809 57942 200797 79758 137136
1692A37136r7435o2533j6258J56736O3682k27647P2031K32396N130P152r0110
1681A80280K3880J8040k64951J76240k54904p1032P5705L21000k31671j12061
1671a39474l1141M9534J31423j26227N4064m3565J00386J3438k27931J63602O0608
1660D717k4066K2811n9996M1161J52288l6920N4569m5222k92433r8286M3801P4542
1648a63034J15891J16468j97323J19717j37147M7134K75569j77214K1343k2245
1638h41m3952M9995k1023J36969p6915J84910p2100k25174M691J15726J25956
1627A78242L06730l13173k06750J30963J92260j65727j62672j41866m7539K75809
1617D6277R3490l15635p8967J95191R7717r250J50454P2165k84199R7231j91221
$$ plain form
1692 137136 39701 -22832 -39090 117646 181328 -46319 25712 258108 263238 270390 180280
1681 180280 204160 222200 -42751 133489 -121415 -192447 -116742 204258 -27413 -139474
1671 -139474 -170615 -121081 10342 -115885 -61821 -105386 -5000 8438 -219493 -55891 4717
1660 4717 -19349 3462 -56534 -15373 136915 99995 154564 109342 -183091 -281377 -237576 -163034
1648 -163034 -47143 69325 -127998 -8281 -145428 -98294 177275 61 21404 -841
1638 -841 -44793 5202 -15821 121148 44233 229143 157043 -68131 -63440 52286 178242
1627 178242 484972 171799 -34951 96012 288272 122545 -40127 -181993 -229532 46277
1617 46277 139767 -175868 -254835 -59644 38073 28823 179277 251442 -32757 64474 -126747
1606a26747q3066K98882J27056j71256L9731p6251l6921j09104K12644P0231J45721
1595B90920k03273K4707k65629Q346N5533j14777l724J30951J34716O3107j16305
1584D572n4833n2256m3776K85490K32811k16930k18222j31179J06779k01443J9827
1573b69160Q9398o506Q0216K05938r7949k48718j04534k5414O2003N4871K88442
1562B8587K4394j3269K8795j18448J9478j55933m071L07750J30895P877r8372
1551A57683j35292k08435N1285p3110N1367P9041K57515M0115k15791k85389N7469
1540b23542Q0602Q3953R2123l3743O6426n3751j997j13464j82752m5969Q8803
1529b43311J41997K90163n3267j38280n593k96708L48176j19408R3019J0869l7184
$$ plain form
1606 -126747 -209813 89069 216125 44869 84600 8349 -28572 -137676 74968 145199 290920
1595 290920 87647 112354 -153275 -144929 -89396 -204173 -207897 -76946 57770 120877 4572
1584 4572 -50261 -102517 -146293 139197 372008 155078 -63144 -194323 -87544 -288987 -269160
1573 -269160 -179762 -186268 -106052 99886 1937 -246781 -351315 -376729 -314726 -259855 28587
1562 28587 52981 39712 68507 -49941 -30463 -186396 -190467 117283 248178 256055 157683
1551 157683 22391 -186044 -134759 -207869 -156502 -77461 180054 220169 4378 -281011 -223542
1540 -223542 -142940 -58987 33136 -607 65819 12068 10071 -103393 -286145 -332114 -243311
1529 -243311 -101314 188849 135582 -2698 -8291 -304999 43177 -76231 16788 27657 -9527
1518i527K37719P1088l05800m2042J01262j64359n9427j00440R0819P4109o9959
1507a76557J62076l2389j64958L00362K60026r9748Q903j52945J25321j85848
1497D4243k15075J7753n1629K4346K1132M729J96692J96201K2940j94258K7904
1486I4978J68398k80290L3715N8793R6172m9794o9350l3230K7202P0064n8834
1475E7824j8222k09822k4887K14765J42793j42989j52552o2772J53256j07602
1465a50208K31268K11560k72041r0348K57136Q7251r1372j99824n6323K1720K8274
1454b2907j28249r0751J03201l7257j09826j66846J84314J45671R1914J43708
1444A12972j60950O9089R9211j21946o3373k464O8806j8357Q281k3295k5494J30311
$$ plain form
1518 -9527 228192 299280 -6520 -48562 52700 -111659 -171086 -271526 -180707 -106598 -176557
1507 -176557 -14481 -46870 -211828 88534 348560 248812 257715 104770 230091 44243
1497 44243 -170832 -153079 -204708 -180362 -159230 -154501 42191 238392 261332 67074 94978
1486 94978 263376 -16914 16801 75594 171766 121972 52622 19392 46594 116658 57824
1475 57824 39602 -170220 -195107 19658 162451 19462 -133090 -195862 -42606 -150208
1465 -150208 81060 292620 20579 -69769 187367 274618 183246 -16578 -72901 -51181 -22907
1454 -22907 -151156 -241907 -138706 -175963 -285789 -452635 -268321 -122650 -30736 112972
1444 112972 -47978 21111 120322 -1624 -64997 -67461 1345 -17012 -8731 -32026 -57520 72791
1432G2791n3202J36746P7758k39191Q0837j14480r2356l0820J40236J53686p2259
1421E9746k12973R6149O3255M442N0050l8098o0219l6027k01088K22575k36411
1410b88599J31968O7170L5206l2402O2968L087Q771K41256j37119k10666K23779
1399A05419J08847k55782Q9319J27986k84050L32722j64911j41996Q6809J21021
1389A25384m3495J20845k2161k3198O8144j85460k56288n3941J215k872K01623
1378g0204j7909R8899o8861m5018L8353J69296k61231J76285J39411q7691M8806
1367A20136j76915p8442J89205J24326j97950j93721o1827M7773L70015j8475
1357A24125j58267K8424r6176n5816J37817P7989m2293j09131O9050l2790J22372
$$ plain form
1432 72791 19589 156335 234093 -5098 75739 -38741 -131097 -161917 -21681 132005 59746
1421 59746 -153227 -57078 6177 10619 60669 22571 -37648 -73675 -274763 -52188 -288599
1410 -288599 -156631 -89461 -54255 -86657 -23689 -20602 -11831 229425 92306 -118360 105419
1399 105419 214266 -41516 47803 175789 -108261 224461 59550 -82446 4363 125384
1389 125384 81889 202734 180573 157375 225519 40059 -216229 -270170 -268955 -271827 -70204
1378 -70204 -88113 10786 -58075 -103093 -64740 104556 -156675 19610 159021 71330 120136
1367 120136 -56779 -135221 53984 178310 -19640 -213361 -275188 -227415 142600 124125
1357 124125 -34142 -5718 -101894 -157710 -19893 58096 15803 -93328 -24278 -57068 65304
1346F5304r3167R0679o7986k3595J8156N0169k7627J4845n3657k67636Q2433J98318
1334a3764K15579k4104k12060n7306K50084o6697k51026L02844r5662q832K52051
1323B91107k06969j60244J46307j5071O7523L037P1098j52211O1961P7484J08751
1312B92773l0843p2909r2733l5010o4522J3226K1227j10635R4308r5997J28953
1301D7838m0370j0478J76936j97583q0155K02011k42713K2306N3521J1806L4718
1290b2163k06303O1253R4687K26541j93963q8691K12004j9289J12921L0735k93784
1279h6052q0988J69243N1385J11710k9612j93139M7832J50822m2018q9905k01217
1268a91939K18469j75864N0037J17657j95952O932J02892N53l0678k05020J23834
$$ plain form
1346 65304 -27863 62816 -5170 -28765 -10609 39560 11933 26778 -26879 -294515 -212082 -13764
1334 -13764 201815 177711 -34349 -91655 158429 91732 -159294 143550 47888 39056 291107
1323 291107 84138 -76106 70201 55130 122653 125690 196788 44577 106538 184022 292773
1312 292773 261930 189021 96288 61278 -3244 9982 31209 -79426 14882 -81115 47838
1301 47838 7468 -3010 173926 -23657 -103812 98199 -144514 -122208 -68687 -56881 -22163
1290 -22163 -228466 -167213 -72526 154015 -39948 -128639 83365 64076 176997 207732 -86052
1279 -86052 -167040 2203 53588 165298 135686 -57453 -9621 141201 99183 9278 -191939
1268 -191939 26530 -149334 -99297 18360 -177592 -170660 -67768 -67215 -97893 -302913 -179079
1257a79079J96805k61170j01032j23606K68047J92380l5215J22236L48066l06049
1247A21383k78171J542l1524N9194J35793J86768J151j07153p6532P9815J79171
1236B71437l37717l9573J85812l5192R4055k83381K79231k2584j84649K39437
1226A66876k75161P0229P4083l29374K15396J01411J66269J10153r462l08124
1216a7704k246j60299K51625K3339j46103j91893O5941j44841L15181J82570p1809
1205A03761P1667k59106j0339j28062M6630P0072J96444J323K469j97367m7467
1194a49975K30368j4938K2823P8906k23793j50921j48717J29166J89852L251M374
1183b9604J42466k10453m5488K72406O887L5852K9257j95526m2782O598r4496
$$ plain form
1257 -179079 17726 -243444 -344476 -468082 -200035 -7655 -42870 79366 427432 121383
1247 121383 -156788 -155246 -186770 -127576 8217 194985 196136 88983 12451 92266 271437
1236 271437 -66280 -105853 79959 44767 138822 -144559 134672 112088 -72561 166876
1226 166876 -108285 -38056 36027 -293347 -77951 23460 189729 299882 290420 -17704
1216 -17704 -19950 -180249 71376 94715 -51388 -243281 -177340 -322181 -7000 175570 103761
1205 103761 175428 -83678 -94017 -222079 -175449 -105377 91067 92390 94859 -102508 -149975
1194 -149975 80393 65455 88278 167184 -56609 -207530 -356247 -227081 -37229 -33978 -29604
1183 -29604 112862 -97591 -143079 129327 136214 172066 201323 5797 -36985 -30387 -124883
1172a24883J67955L5120J1077j64010j01332n5071J60104R3411j45383q21l3374
1161a57207Q146j5845K63129K8633j21161M7994j46686j16877l516L5459j98738
1150c76669L9253L35317p5863J16380J07209J2415r6138o6190J37467n2132Q506
1139H9555R2027p2531O7884k01978K11472J25336k72291l12144J4119Q1900L94960
1128B18309L8834j33075j3766j37539q792J34836l0504o9575L3935M7443J08211
1117A88317L4056j98258N8765j68011j23180J37834J07420R573j73950K62302
1107A34868j06758P0216J54796q7946j32492J47834n2325J08533k30143n6486
1097d9903J70527k47257q202J24522j47268l8438O8003K42852J63675j15059k71316
$$ plain form
1172 -124883 43072 78192 89269 -74741 -176073 -231144 -71040 22371 -123012 -123833 -157207
1161 -157207 -149061 -164906 98223 126856 5695 53689 -92997 -209874 -213390 -177931 -376669
1150 -376669 -337416 -2099 -77962 38418 145627 158042 61904 -4286 133181 81049 89555
1139 89555 181582 109051 176935 -25043 186429 311765 39474 -272670 -258551 -176651 218309
1128 218309 257143 124068 110302 -27237 -36029 98807 68303 -1272 32663 80106 188317
1117 188317 222373 24115 82880 -85131 -208311 -70477 36943 46516 -127434 134868
1107 134868 28110 98326 253122 165176 32684 180518 128193 236726 6583 -49903
1097 -49903 120624 -126633 -134835 -10313 -157581 -196019 -128016 114836 278511 163452 -107864
1086a07864n1680P0367j10512J40292R6161M1932M3459J04457j08589K23464J66939
1075E08426n38416q1096P039q929K04215M2793P5133J01911o2832j37211J3322
1064A24355j04328j68309N6028J24210r9568q3201j03857K97728J305o1752j02368
1053a19757J64313K72326l15230j18756Q3560L16004k14825q5176K42712p0542
1043A54629j40832j53624R5283j00388m9116P3427L89334j55529q0793r1438k7500
1032h6547J75727n0294k72136K69188L04715j29314k29294k08227K02468l8910
1022f2624R3692K541K05534J7948Q5928j24243l11103o0203P5673N9380J96463
1011A78986r3075Q7285o7900k57454K12783K88584K809l94965l78319Q7165L87259
$$ plain form
1086 -107864 -159544 -89177 -199689 -59397 36764 78696 122155 226612 118023 341487 508426
1075 508426 -29990 -111086 -104047 -112976 91239 134032 209165 311076 248244 111033 124355
1064 124355 20027 -148282 -92254 31956 -67612 -150813 -254670 43058 44363 -17389 -119757
1053 -119757 44556 316882 1652 -117104 -33544 282460 67635 -17541 225171 154629
1043 154629 13797 -139827 -44544 -144932 -194048 -120621 268713 113184 32391 -59047 -86547
1032 -86547 89180 38886 -233250 35938 340653 211339 -17955 -226182 -23714 -62624
1022 -62624 31068 33609 239143 257091 343019 218776 -92327 -152530 -76857 -17477 178986
1011 178986 85911 173196 105296 -152158 60625 349209 352018 -42947 -421266 -334101 53158
1000E3158P9454q8129J13446p8340p997k54104o8628N2955K08075r1655J8617
989f3148O683J46673l81871q3424j93109K37194M98322j78647r8443q9449J1493
978a87726l1517K96670L491J03520j70063j37879k30492Q0359P70K08400J65215
967A00748J9240j30052K10738p7088L5697r0811k76654Q4862K04391L68821l94521
956E5371J35383q7218k56024p7039P091L62564j805j31492q7669K48407j02974
945F4595J11120M251k098K42467j66516m56123K728J66700Q2327K1440M2617o5629
933D7879j87743L44221n5416q015R5592o6403k20633m6775J29331K2415l0023
922B4430O2546J5714J3141K7436j31869N8279j42560j59718K67774j1083m329
$$ plain form
1000 53158 132612 44483 157929 79589 71592 -182512 -251140 -198185 9890 -81765 -63148
989 -63148 -56465 90208 -291663 -375087 -568196 -331002 167320 -11327 -109770 -199219 -187726
978 -187726 -219243 77427 80918 184438 14375 -123504 -353996 -273637 -272867 -64467 100748
967 100748 119988 -10064 200674 123586 159283 68472 -208182 -123320 81071 449892 55371
956 55371 190754 103536 -152488 -229527 -222436 140128 138323 6831 -80838 167569 64595
945 64595 175715 179966 177868 420335 253819 -202304 -199576 -32876 49451 70891 113508 47879
933 47879 -139864 204357 148941 140926 236518 170115 -50518 -97293 32038 54453 24430
922 24430 86976 102690 115831 143267 11398 69677 -72883 -232601 35173 24090 19761
911A9761j69616j13436J58888J80858r3056J6206m3592K7852Q0157k08347j87474
900c31799P498L02786R3826j1479j70234J14152J64021n5127j3208n0780R8871
889A48527o9014q8546j0524j74961R4819K76082p8204k20038J47667r278N472
878B2002M7193n3896n0561J23762j29571K27672l12954Q6097O3015k7592L1599
867B6766k39840l2762j11922J70669L56956r3355j34592j79448P108K75099j90471
856a45792L8139M6071J8954J35643j7283L72L0478m5327R3051j46340m3058J15019
844G9927m2812Q5758p1467k14571K6718P3519j9664n3449l6480k8804P6490L6062
832h8773j71970K0347J9326J57090Q856k32178P4960J38643n705l9247J18007
$$ plain form
911 19761 -149855 -263291 -104403 76455 -16601 -395 -43987 -16135 64022 -144325 -331799
900 -331799 -324301 -21515 72311 60832 -109402 4750 168771 113644 100436 49656 148527
889 148527 79513 -9033 -19557 -194518 -99699 176383 98179 -121859 25808 16530 22002
878 22002 69195 15299 -35262 88500 -41071 186601 -126353 -40256 22759 -4833 26766
867 26766 -213074 -245836 -357758 -187089 169867 76512 -58080 -237528 -230420 44679 -145792
856 -145792 -107653 -61582 -42628 93015 75732 76104 106582 61255 154306 7966 -35092 79927
844 79927 37115 122873 51406 -163165 -136447 -62928 -82592 -136041 -172521 -201325 -124835 -88773
832 -88773 -260743 -240396 -221070 -63980 -55124 -287302 -212342 -73699 -79404 -118651 -644
821f44K04453Q7980j7509p6573k27734o6405r4647J40630M7415J31235J034k05979
809g6744k15659K31327j9162J95867m5325j49412J00943R6236q1427r9273l7096
798i9725K12574q7440j08134j15840k56831K88315P1410K5922K60096j36309p6814
787b2776J02032J05672o8942j83191K7746p8284J08894j61600j32418K02338K783
776i7746k15087Q0002l3885J66676k6873r1833J42816j0590K08953L4838j90973
765c3702N4676R3041J9806j65126l0824K39479J63160j91514j17416j33154J15654
754A4080N9129j31180L8410n3805J25221K2691j86594m2449N6277n3306K9254
743a22272J90295J51668J43257l3548k38480r1962o6552O1254o7176l7272K34991
$$ plain form
821 -644 203809 291789 274280 197707 -30027 -96432 -191079 -50449 -3034 128201 129235 -76744
809 -76744 -292403 -61076 -80238 115629 70304 -79108 21835 118071 36644 -62629 -99725
798 -99725 112849 25409 -82725 -198565 -455396 -167081 -95671 -69749 190347 54038 -22776
787 -22776 79256 184928 115986 -67205 -39459 -117743 -8849 -170449 -302867 -100529 -97746
776 -97746 -312833 -232831 -266716 -100040 -126913 -218746 -75930 -86520 122433 157271 -33702
765 -33702 20974 114015 133821 -31305 -62129 177350 340510 148996 31580 -101574 14080
754 14080 73209 -57971 -19561 -73366 51855 74546 -112048 -154497 -98220 -151526 -122272
743 -122272 68023 219691 362948 329400 90920 -1042 -67594 -6340 -73516 -110788 124203
732A24203m6712j11241N0483k9846N3402o1962m8433q5896M0132K30761l8410
721G6481j81756o0932K3030J60820k95q197j72724r9695J05920J12778l4743q6668
709a65981m0987p0984J19023r8395K9103j11115N0026n775M7459K3204J27066
698i7356N6823K478k35530J09155J98285j81496j7873J84887j08434j51882Q2669
687a58274Q2034J44952j07332K1104j17065N2300n1859L5609O9250N6278M5350
676G2347j6270p5034p953O437j25112l6303j19367Q22J34271K18241Q2365k09339
664g4895J18362K17028J32314k31536J18460k80606j05150Q2315l3970J33620
654G5942n9732p5339j30443j31883L0540J38343j11156K38544J6019K8517k52147
$$ plain form
732 124203 77491 -33750 16733 -13113 40289 -21673 -70106 -156002 -115870 114891 76481
721 76481 -105275 -166207 -143177 17643 17348 9151 -163573 -263268 -157348 -44570 -79313 -165981
709 -165981 -206968 -277952 -158929 -257324 -228221 -339336 -289310 -295085 -247626 -224422 -97356
698 -97356 -40533 -38055 -273585 -164430 33855 -147641 -165514 19373 -89061 -240943 -158274
687 -158274 -76240 68712 -38620 -17516 -134581 -82281 -134140 -98531 -29281 26997 72347
676 72347 56077 -18957 -26910 -20473 -145585 -181888 -301255 -300433 -166162 52079 134444 -74895
664 -74895 43467 260495 392809 161273 279733 -873 -106023 -23708 -57678 75942
654 75942 16210 -59129 -189572 -321455 -290915 -152572 -263728 -25184 -9165 19352 -232795
643b32795O4968k00598K05351J84124j8569j24707J29059K50292L3504l87776
633i7147k16641L57125J01772l45230L12414j77319j89224M2773j5245o221m5052
622b77995L6848J89804K54857j14844K052n2471J50737O6918J06655j30921j50941
611H0699m268j64049N3398K54402m8015j31357P6778O087j8448l2634j78665J04289
599a783j36196R2283o1175J79355j46902r3243m9064J64336j4596j8831K3096
588f2720K95858J30890m4417k75024p9456L8250j54806L61900l7716j81387l8868
577d7496J76012N744m0649k12265j34545J91954j799k2872j4836l2677K96440
566A63011j66135q0075L2490l22629K46911L4201n939L6638O1466q0229J46959
$$ plain form
643 -232795 -167827 -368425 -163074 21050 2481 -122226 6833 257125 290629 -97147
633 -97147 -313788 43337 145109 -200121 112293 -65026 -254250 -211477 -226722 -232943 -277995
622 -277995 -241147 -51343 203514 88670 90722 38251 188988 255906 362561 231640 80699
611 80699 76431 -87618 -34220 220182 172167 40810 117588 123675 105227 72593 -106072 -1783
599 -1783 -137979 -45696 -106871 72484 -74418 -167661 -216725 -52389 -66985 -85816 -62720
588 -62720 233138 364028 319611 44587 -34869 3381 -151425 210475 172759 -8628 -47496
577 -47496 128516 134260 93611 -118654 -253199 -61245 -63044 -85916 -100752 -133429 163011
566 163011 -3124 -83199 -50709 -373338 -126427 -92226 -98165 -61527 -61 -80290 66669
555F6669Q0615j14827K369M7838p5390k45810m3680K11712J43736L09281j43709
544B38804l77757k04066J95258J79864k3966j03588p4390J25998J15304j37642
534f6181j01522L9307n4538J4518n3381N2720J01902N6802n5565J09418K5195
523F8675J1104l3039l490m5772j6950l4741O2759p0670j03332J18755k26111j00650
511c73462J69564M68911n0721l20434J83350l3157K9477l2118p5990K8637o1366
500f7309J57531J63530k89524R6765M8970L484L8902N6483j8629K154j16587o780
488F8990k21872M0575L7032K37543J9066k83854j26004J73682N5149n7081j36513
477a93287k3945K47080L4055Q9638p6591J71118K5635P2092k74313l15520K8465
$$ plain form
555 66669 147284 32457 34826 82664 7274 -238536 -282216 -70504 73232 382513 238804
544 238804 -138953 -343019 -147761 32103 8137 -95451 -169841 -43843 71461 -66181
534 -66181 -167703 -128396 -182934 -168416 -221797 -169077 -67175 -10373 -65938 43480 68675
523 68675 79779 46740 43250 -2522 -19472 -54213 8546 -62124 -165456 -46701 -272812 -373462
511 -373462 -203898 265013 214292 -106142 77208 44051 73528 41410 -34580 -5943 -67309
500 -67309 90222 253752 -35772 60993 109963 113447 152349 208832 190203 192357 75770 68990
488 68990 -152882 -112307 -75275 162268 181334 -102520 -228524 -54842 307 -56774 -193287
477 -193287 -217232 29848 63903 153541 76950 248068 273703 345795 71482 -244038 -215573
466b15573J78573L8925N0962k03881l573K93362k28997J80423Q4664l6176j35379
455C330j58109R0883J09688L5118N610m0544j18796j2180Q5552J24554J76227
444C01333j47802r2876r7082j05966k14103J20534n3986J79876J60736K06715
434B57379m2522N116j81956r1561k23J19739j8454k02665K8684J40577j40056
423a25942r48J21878j00253K50817Q1812O1496j18921n2361j48304o9248M1663
412e8311K24787j69371K1131p5824O4646R0724q8514O8024j42345o3674M8693
401h0034J38873o0782j33348J08397l30634K92558j00173J59963m4045R3676n7081
390a2630J55097j10176J1627K20667k0827j79510J43819j68008j31517L61051
$$ plain form
466 -215573 -37000 1925 52887 -150994 -154567 138795 -90202 90221 174885 138709 3330
455 3330 -154779 -63896 45792 80910 86520 45976 -72820 -85000 552 125106 301333
444 301333 153531 60655 -36427 -142393 -356496 -235962 -289948 -110072 50664 257379
434 257379 214857 219973 38017 -53544 -53767 65972 47518 -155147 -126463 14114 -125942
423 -125942 -126890 -5012 -105265 145552 227364 288860 169939 117578 -30726 -99974 -58311
412 -58311 166476 -2895 18236 -57588 7058 97782 9268 77292 -65053 -128727 -80034
401 -80034 58839 -1943 -135291 -26894 -357528 -64970 -165143 -5180 -49225 44451 -12630
390 -12630 142467 32291 43918 264585 243758 64248 208067 40059 -91458 269593
380B69593j13372j90374J50484p4296N5469l7804l33345J81046r5557K190J53803
369c2163J47039j44088P8684O3054j3738P4129L0134j43326j24555L4604N5491
358B5265n9281j7224j68127P6223l2953M7895J61228j24119k81961K88328J52786
347F8060L4749K19589j66840k82295k4508J43790P2364J83591J06646J8320j78655
336A94811j00386J06494n6315k19472k57668J26805Q7569j08912Q0026k6501k3311
325a96860J70393k02522n8487K39991J5894q4029R3943j42357k9401J46756M2922
314c757R9456r6878r325q0843J49260j79023L2409K04262J4401K6866o7865J64495
302B53458j98907q8964l9870N7408K33297j36397r6414L8957m5905K149k5351
$$ plain form
380 269593 156221 -34153 116331 42035 97504 59700 -273645 -92599 -188156 -185966 -32163
369 -32163 114876 -29212 49472 112526 98788 172917 203051 59725 -64830 -30226 25265
358 25265 -34016 -51240 -219367 -143144 -176097 -128202 33026 -91093 -373054 -84726 68060
347 68060 102809 322398 155558 -126737 -151245 -7455 64909 248500 355146 373466 194811
336 194811 94425 200919 144604 -74868 -332536 -205731 -118162 -227074 -147048 -173549 -196860
325 -196860 -26467 -228989 -287476 -47485 -31591 -115620 -21677 -164034 -193435 -46679 -3757
314 -3757 95699 -1179 -10504 -91347 57913 -121110 -88701 115561 129962 156828 88963 253458
302 253458 54551 -34413 -74283 -16875 216422 80025 -16389 22568 -23337 -21188 -46539
291d6539J32790J23251j46119j35159Q4467J12483Q2524l1698K24857L9961l44804
280I6014j45716J00736K50590j21414k53985J33459p1970J51373O204j38860P6471
269H2902J15622k83439j19777J15202K02453O017j75746J13613n2335m4634j17255
258a57377J31703n4603J09118J35847j56462l7588L1085j04944J72761j6024N6274
247A09790K2324r6267J30444j301k10733j86356J33459k56912O1624K57715P0281
236C4068J4460J10733k58505j04505J6870P181k676J73924R6025j55217l7035
225a04677L7053J29094O9914K3272n6514o0248O9503O8056j22802J59988N2373
214B65012J05689L776k92167n9382m1852R0620J60551N7040j80271j39924O2423
$$ plain form
291 -46539 86251 209502 63383 -71776 12691 125174 207698 176000 400857 440818 96014
280 96014 -49702 51034 301624 180210 -73775 59684 -12286 139087 145291 6431 82902
269 82902 198524 -84915 -204692 -89490 112963 118980 -56766 56847 4512 -40122 -157377
258 -157377 -25674 -80277 28841 164688 8226 -29362 1723 -103221 69540 53516 109790
247 109790 132114 35847 166291 164990 -45743 -232099 -98640 -355552 -293928 -36213 34068
236 34068 48528 159261 -99244 -203749 -186879 -179698 -182374 -8450 87575 -67642 -104677
225 -104677 -67624 61470 131384 154656 98142 37894 107397 175453 52651 212639 265012
214 265012 370701 374477 82310 22928 -18924 71696 232247 289287 109016 -30908 31515
203C1515n9284K07438o8276q3111l1293q7942R6001M5256J38908J37430l43455
192a6813N8034n7062p5705J53686P8364m0766j14503r6968j65152N0968J44445
181h1472O7321j1255j49025J85171r1184J30042J51821q6571K35968k70462N842
170H6196J2352Q1532k52377j61242K30661j56180n0411j86869J87126J71699Q5564
159D8051k8300k1881N7134M525j40052J06273K01406m2401n5833k76456P713J77425
147C7604K06565j64417l162k6655P0309o0115M5206j71502J7466J072J34260R655
135I6286M8823n1431j20322m3877k7655p2619J46083n7020N1181J84026o8684
124H4791J37491j43644J87738j20866J0471j68991k11953J22162J31725J75795
$$ plain form
203 31515 -27769 179669 111393 28282 -3011 -90953 5048 50304 189212 326642 -16813
192 -16813 41221 -15841 -91546 62140 140504 99738 -14765 -111733 -276885 -225917 -81472
181 -81472 -14151 -25406 -174431 10740 -80444 49598 201419 114848 350816 80354 86196
170 86196 98548 180080 -72297 -233539 -2878 -159058 -209469 -396338 -209212 -37513 48051
159 48051 19751 -2130 55004 59529 -80523 25750 227156 184755 128922 -147534 -139821 37604
147 37604 244169 79752 76590 49935 120244 60129 105335 -66167 -48701 -47629 86631 96286
135 96286 145109 93678 -26644 -70521 -98176 -170795 -24712 -81732 -30551 153475 84791
124 84791 222282 78638 266376 145510 155981 -13010 -224963 -102801 28924 204719
114B04719O3683l54847L9433Q1340P0215Q6423r952k22830m9807N3130K59302
103B20809j83274N1008p5744R845J44854P5514j4092j08182k6811j16947P0261
92D7241R960R2343l8902j07682j64331K05676k8157j29985k4945j03174K13769
81b8187J57748j26552N470J54602j88805J3785K83J62027J26541J13082j16385
70B73609q9556K5246j74440n1076N5652J061K7663n6013J37221J6732K1395j17262
$$ plain form
114 204719 268402 -86445 -47012 34328 104543 190966 181014 -41816 -91623 -38493 220809
103 220809 37535 88543 12799 22644 167498 243012 228920 120738 93927 -23020 47241
92 47241 57201 149544 110642 2960 -161371 44305 16148 -113837 -138782 -241956 -28187
81 -28187 129561 3009 8479 163081 -25724 -11939 -11656 150371 276912 389994 273609
70 273609 184053 209299 34859 -16217 39435 40496 68159 12146 149367 166099 187494 70232
$$ [...]
##END NTUPLES=NMR SPECTRUM
##END=
