##TITLE=1H_EC-3261(2)
 CDCl3, 8 sc, 
 25.08.2021
##JCAMPDX= 6.0         $$ Bruker NMR JCAMP-DX V2.0
##DATA TYPE= NMR SPECTRUM
##DATA CLASS= NTUPLES
##ORIGIN= UXNMR, Bruker Analytische Messtechnik GmbH
##OWNER= root
$$ XWIN-NMR		Version 3.5
$$ Wed Aug 25 11:36:41 2021 Russian Standard Time (UT+4h)  she@DPX200
##.OBSERVE FREQUENCY= 200.131506
##.OBSERVE NUCLEUS= ^1H
##.ACQUISITION MODE= SIMULTANEOUS
##.ACQUISITION SCHEME= undefined
##.AVERAGES= 8
##.DIGITISER RES= 18
##SPECTROMETER/DATA SYSTEM= spect
##.PULSE SEQUENCE= zg30
##.SOLVENT NAME= CDCl3
##.SHIFT REFERENCE= (INTERNAL, CDCl3, 0, 17.5521)
##AUDIT TRAIL= $$ (NUMBER, WHEN, WHO, WHERE, WHAT)
$$ ##TITLE= Audit trail, XWIN-NMR		Version 3.5
$$ ##JCAMPDX= 5.01
$$ ##ORIGIN= Bruker BioSpin GmbH
$$ ##OWNER= she
$$ F:/spectra/data/she/nmr/H-F/1/pdata/1/auditp.txt
$$ ##AUDIT TRAIL=  $$ (NUMBER, WHEN, WHO, WHERE, WHAT)
(   1,<2021-08-25 11:35:14.84 +0400>,<she>,<DPX200>,
      <created by zg, POWCHK disabled, PULCHK disabled
       configuration hash MD5:
       00 E9 B6 7A A2 85 ED C7 34 08 36 98 17 FE 4E 26
       data hash MD5: 16K
       51 93 CA 64 5F 72 5C CE 94 30 30 FB A5 E5 23 9A>)
(   2,<2021-08-25 11:35:17.53 +0400>,<she>,<DPX200>,
      <Start of raw data processing
       efp BC_mod = 2 LB = 0.24 FT_mod = 6 PKNL = 1 PHC0 = -13357.93 PHC1 = 14.40099 SI = 16K 
       data hash MD5: 16K
       5A A4 78 7F 4E CA C0 D1 35 4E EF 59 34 CF 75 B2>)
(   3,<2021-08-25 11:35:36.35 +0400>,<she>,<DPX200>,
      <pk PHC0 = -1.852564 PHC1 = 2.8 
       data hash MD5: 16K
       0F ED 63 7B 1E 3C 0F 92 DB 3A 6A FB 81 80 02 FE>)
(   4,<2021-08-25 11:35:39.64 +0400>,<she>,<DPX200>,
      <abs ABSG = 5 
       data hash MD5: 16K
       0A D6 23 2E B5 94 7E E3 70 7B 7E 12 62 89 B7 C2>)
$$ ##END=
$$ 
$$ hash MD5
$$ F7 9C 06 95 42 E1 CE 53 74 E5 A2 FE 81 6A 1F 3E
##$RELAX= 
##$RELAX= 
##$RELAX= 
##$RELAX= 
##$RELAX= 
##$RELAX= 
$$ Bruker specific parameters
$$ --------------------------
##$DU= <F:/spectra>
##$EXPNO= 1
##$NAME= <H-F>
##$PROCNO= 1
##$TYPE= <nmr>
##$USER= <she>
##$AMP= (0..31)
100 100 100 100 100 100 100 100 100 100 100 100 100 100 100 100 100 100 
100 100 100 100 100 100 100 100 100 100 100 100 100 100 
##$AQSEQ= 0
##$AQ_mod= 1
##$AUNM= <au_zg>
##$AUTOPOS= <>
##$BF1= 200.13
##$BF2= 200.13
##$BF3= 200.13
##$BF4= 200.13
##$BF5= 200.13
##$BF6= 200.13
##$BF7= 200.13
##$BF8= 200.13
##$BYTORDA= 1
##$CFDGTYP= 0
##$CFRGTYP= 5
##$CHEMSTR= <none>
##$CNST= (0..31)
1 1 145 1 1 1 1 1 1 1 1 1 1 1 1 1 1 1 1 1 1 1 1 1 1 1 1 1 1 1 1 1 
##$CPDPRG= <>
##$CPDPRG1= <>
##$CPDPRG2= <>
##$CPDPRG3= <>
##$CPDPRG4= <mlev>
##$CPDPRG5= <mlev>
##$CPDPRG6= <mlev>
##$CPDPRG7= <mlev>
##$CPDPRG8= <mlev>
##$CPDPRGB= <>
##$CPDPRGT= <>
##$D= (0..31)
0 1.2 0 0 0 0 0 0 0 0.06 0 0.03 0 0 0 0 0.0002 0 0 0 0 0 0 0 0 0 0 0 0 
0 0 0 
##$DATE= 1629876914
##$DBL= (0..7)
120 120 120 120 120 120 120 120 
##$DBP= (0..7)
150 150 150 150 150 150 150 150 
##$DBP07= 0
##$DBPNAM0= <>
##$DBPNAM1= <>
##$DBPNAM2= <>
##$DBPNAM3= <>
##$DBPNAM4= <>
$$ [...]
##$SUBNAM3= <"">
##$SUBNAM4= <"">
##$SUBNAM5= <"">
##$SUBNAM6= <"">
##$SUBNAM7= <"">
##$SUBNAM8= <"">
##$SUBNAM9= <"">
##$SW= 20.0188882624521
##$SWIBOX= (0..15)
0 0 2 0 0 0 0 0 0 0 0 0 0 0 0 0 
##$SW_h= 4006.41025641026
##$TD= 16384
##$TD0= 1
##$TE= 0
##$TE2= 300
##$TE3= 300
##$TEG= 300
##$TL= (0..7)
0 120 120 120 120 120 120 120 
##$TP= (0..7)
150 150 150 150 150 150 150 150 
##$TP07= 0
##$TPNAME0= <>
##$TPNAME1= <>
##$TPNAME2= <>
##$TPNAME3= <>
##$TPNAME4= <>
##$TPNAME5= <>
##$TPNAME6= <>
##$TPNAME7= <>
##$TPOAL= (0..7)
0.5 0.5 0.5 0.5 0.5 0.5 0.5 0.5 
##$TPOFFS= (0..7)
0 0 0 0 0 0 0 0 
##$TUNHIN= 0
##$TUNHOUT= 0
##$TUNXOUT= 0
##$USERA1= <user>
##$USERA2= <user>
##$USERA3= <user>
##$USERA4= <user>
##$USERA5= <user>
##$V9= 5
##$VALIST= <valist>
##$VCLIST= <CCCCCCCCCCCCCCC>
##$VD= 0
##$VDLIST= <DDDDDDDDDDDDDDD>
##$VPLIST= <PPPPPPPPPPPPPPP>
##$VTLIST= <TTTTTTTTTTTTTTT>
##$WBST= 1024
##$WBSW= 4
##$XGAIN= (0..3)
0 0 0 0 
##$XL= 0
##$YL= 0
##$YMAX_a= 721564
##$YMIN_a= -992873
##$ZGOPTNS= <>
##$ZL1= 120
##$ZL2= 120
##$ZL3= 120
##$ZL4= 120
##$ABSF1= 17.49833
##$ABSF2= -2.520708
##$ABSG= 5
##$ABSL= 3
##$ALPHA= 0
##$AQORDER= 0
##$ASSFAC= 0
##$ASSFACI= 0
##$ASSFACX= 0
##$ASSWID= 0
##$AUNMP= <proc_1d>
##$AZFE= 0.1
##$AZFW= 0.1
##$BCFW= 0
##$BC_mod= 2
##$BYTORDP= 0
##$COROFFS= 0
##$CY= -3
##$DATMOD= 1
##$DC= 0
##$DFILT= <>
##$DTYPP= 0
##$F1P= 0
##$F2P= 0
##$FCOR= 1
##$FTSIZE= 16384
##$FT_mod= 6
##$GAMMA= 0
##$GB= 0
##$INTBC= 1
##$INTSCL= 1.334414e-10
##$ISEN= 128
##$LB= 0.24
##$LEV0= 0
##$LPBIN= 0
##$MAXI= 10000
##$MC2= 0
##$MEAN= 0
##$ME_mod= 0
##$MI= 1.114404
##$NCOEF= 0
##$NC_proc= -5
##$NLEV= 6
##$NOISF1= 3.799351
##$NOISF2= 2.8
##$NSP= 0
##$NTH_PI= 0
##$NZP= 0
##$OFFSET= 17.55209
##$PC= 1
##$PHC0= -13359.78
##$PHC1= 17.20099
##$PH_mod= 1
##$PKNL= yes
##$PPARMOD= 0
##$PSCAL= 0
##$PSIGN= 0
##$REVERSE= no
##$SF= 200.129996504836
##$SI= 16384
##$SIGF1= 3
##$SIGF2= 2
##$SINO= 5.538805
##$SIOLD= 16384
##$SREGLST= <1H.CDCl3>
##$SSB= 0
##$STSI= 16384
##$STSR= 0
##$SW_p= 4006.41025641026
##$SYMM= 0
##$S_DEV= 0
##$TDeff= 16384
##$TDoff= 0
##$TI= <>
##$TILT= no
##$TM1= 0
##$TM2= 0
##$TOPLEV= 0
##$USERP1= <user>
##$USERP2= <user>
##$USERP3= <user>
##$USERP4= <user>
##$USERP5= <user>
##$WDW= 1
##$XDIM= 16384
##$YMAX_p= 322948079
##$YMIN_p= -1236928
$$ End of Bruker specific parameters
$$ ---------------------------------
##NTUPLES= NMR SPECTRUM
##VAR_NAME=  FREQUENCY,     SPECTRUM/REAL,   SPECTRUM/IMAG
##SYMBOL=    X,             R,               I
##VAR_TYPE=  INDEPENDENT,   DEPENDENT,       DEPENDENT
##VAR_FORM=  AFFN,          ASDF,            ASDF
##VAR_DIM=   16384,         16384,           16384
##UNITS=     HZ,            ARBITRARY UNITS, ARBITRARY UNITS
##FACTOR=    0.24454680195387, 1,            1
##FIRST=     3512.69964854484, 0,            0
##LAST=      -493.710607865419, 0,           0
##MIN=       -493.710607865419, -1236928,    0
##MAX=       3512.69964854484, 322948079,    0
$$ Real data points
##PAGE= N=1
##DATA TABLE= (X++(R..R)), XYDATA
$$ [...]
8181B5747l8519K1632m405J1336L1442p482N3093n3967k4699N2462k9054K2744
$$ 25747 -12772 8860 4455 15791 47233 39751 92844 38877 14178 66640 37586 60330
8169F0330J9585n3725L20l8507j3661J3066O4641k9704k2381N705M8256m1845
$$ 60330 79915 26190 26510 -11997 -25658 -12592 52049 22345 -36 5669 53925 12080
8157A2080k1359M7811L361J0499j6146L8558l8564j0990Q36M7947K3872M488m4694
$$ 12080 -9279 38532 41893 52392 36246 74804 36240 25250 26086 74033 97905 102393 57699
8144E7699m5955M4264p360k4488l2836J3783N4657j4231L7170L608R285k4954
$$ 57699 11744 56008 48648 24160 -8676 5107 59764 45533 82703 86311 95596 70642
8132G0642m3061m9293N6473k5031k2113J65N4008j6358k1347j8053m3884N9652
$$ 70642 27581 -21712 34761 9730 -12383 -12218 41790 25432 4085 -13968 -57852 1800
8120A800P0535J798n5172o659P2278N274m2396K9641M176K1005K3123j5564l6908
$$ 1800 72335 74133 18961 12302 84580 89854 47458 77099 81275 102280 125403 109839 72931
8107G2931o2555j1317N8132p547j8805K6034K0271j3278n2582M3668L3408K3469
$$ 72931 10376 -941 57191 49644 30839 56873 77144 63866 11284 54952 88360 111829
8095A11829o5402m2078J0891R4843N346p175K419j2382n1102J2721J8724M7536
$$ 111829 46427 4349 15240 110083 115429 108254 110673 98291 47189 59910 78634 126170
8083A26170l3819o962P4364N572j06413j9530O0033j4466L4440j6276Q0836J9505
$$ 126170 92351 85389 159753 165325 58912 39382 99415 84949 119389 103113 183949 203454
8071B03454j2802k564M1934N563o497j1781n7453M3461J1455k1130M4527p6392
$$ 203454 190652 188088 230022 235585 229088 217307 159854 203315 214770 193640 238167 161775
8059A61775L5804L9628M9811o6901O2493j0629p875j3051K9049N7588J9752j9293
$$ 161775 197579 237207 287018 220117 282610 271981 264106 251055 280104 337692 357444 338151
8047C38151k5734P1223N8839k6883j6699k1014J3268o2878O5413N7622L0606k515
$$ 338151 312417 383640 442479 415596 398897 377883 391151 328273 393686 451308 481914 479399
8035D79399J4521J6233P548O0823l245N7259P0025j614J9904M2807P8890O4666
$$ 479399 493920 510153 517701 578524 575279 632538 702563 700949 720853 763660 842550 907216
8023I07216M5827J21172J46048J34925J12313K39438K56711K80067L64709M40616
$$ 907216 953043 1074215 1220263 1355188 1467501 1706939 1963650 2243717 2608426 3049042
8013C049042N49077P62563R74394J158165N97548q72901j251913j094291q85425
$$ 3049042 3598119 4360682 5335076 6493241 7090789 6217888 4965975 3871684 2986259
8004B986259o17431m07623k32619k92097j24526j38571j86220r2426r3486n9967
$$ 2986259 2368828 1961205 1728586 1436489 1311963 1173392 987172 894746 801260 741293
7994G41293j0545l9984n7830n4475n9950o9915l547J4040K8045r7830n1263j2174
$$ 741293 730748 690764 632934 578459 518509 448594 445047 459087 487132 389302 338039 325865
7982C25865l4469K335j6695j3351j8629l0059J7296M6609K0415n2501l5290L2301
$$ 325865 291396 293731 277036 263685 245056 214997 232293 278902 299317 246816 211526 243827
7970B43827o315M593O96n3653J2380O694k4868L364J7556q2476K1229p4957M408
$$ 243827 237512 242105 242801 189148 201528 208222 183354 186718 204274 121798 143027 68070 72478
7957G2478L9279M8752j7166l742j7522J3008k26k3545k521j2806L6143N56q82
$$ 72478 111757 160509 143343 139601 122079 135087 134861 111316 108795 95989 132132 132688 131806
7944A31806j9045k8640j7809j8938K5550J9038J0785l460K2770l8295J1950o0908
$$ 131806 112761 84121 66312 47374 72924 91962 102747 99287 122057 83762 95712 34804
7932C4804p291K8011q925K4108L7241l1823m1733M6584m5381N2827j7433m8104
$$ 34804 27513 55524 46599 70707 107948 76125 34392 80976 35595 88422 70989 22885
7920B2885M6816l4161J5074J9667m5284O531K4564K3059o3875J6478J5440k0706
$$ 22885 69701 35540 50614 70281 24997 31528 56092 79151 15276 31754 47194 26488
7908B6488j0888k9024M7469J7143O2540k1817l6072l5394K4386J7538O268Q34
$$ 26488 15600 -13424 34045 51188 113728 91911 55839 20445 44831 62369 68637 69471
7896F9471k1318J655r890l6174M1135P322k7987N9567m1552l1898j7635O9109
$$ 69471 48153 49808 39918 3744 44879 52201 24214 83781 42229 10331 -7304 61805
7884F1805M4197n5790L9234M1664j05758k0052j8814O1991j7169k2183Q574p30
$$ 61805 106002 50212 89446 131110 25352 5300 -13514 48477 31308 9125 17699 16969
7872A6969j1484n944J188L0782r951K196L9080K6575J0304O3003n5383p3551m3
$$ 16969 5485 -459 729 31511 21560 23756 62836 89411 99715 162718 107335 33784 33741
7859C3741L1042N1289j5733n5395j6884J3603q021q295N5946j5173j9787O260
$$ 33741 64783 116072 100339 44944 28060 41663 33642 25347 81293 66120 46333 52593
7847E2593k6350Q105K1079P5587m8210q4866K5603k0361K6887k1682m9604m4372
$$ 52593 26243 34348 55427 131014 82804 -2062 23541 3180 30067 8385 -41219 -85591
7835h5591O4636N6678o455K2824k7879m2178L3811n4053k7594N458O3143J9569
$$ -85591 -20955 35723 29268 52092 24213 -17965 15846 -38207 -65801 -60343 2800 22369
7823B2369k5574Q795J881M675k746j0049J4520P889l1176O0156n2868m4265K2702
$$ 22369 -3205 5590 7471 12146 9400 -649 13871 21760 -9416 50740 -2128 -46393 -23691
7810b3691N0212p448j6715j4253l7100k2929N0473o519k2103K8604k318M0439
$$ -23691 26521 19073 2358 -11895 -48995 -71924 -21451 -27970 -50073 -21469 -23787 16652
7798A6652N909l5324k818J0958L3970n1519m9200k016Q640M2148P870O239J6302
$$ 16652 22561 -12763 -15581 -4623 29347 -22172 -71372 -73388 -64748 -22600 -14730 -8491 7811
7785G811n4587j768N368K4866k1777k5706q029J929Q0027k3700J5620l599J6279
$$ 7811 -46776 -48544 -43176 -18310 -40087 -65793 -73822 -71893 8134 -15566 54 -3545 12734
7772A2734M9411r6397L4971l0322k2586O533J8117j3305m0033L3992M400j5648
$$ 12734 62145 -34252 719 -29603 -52189 -45656 -27539 -40844 -80877 -46885 -42485 -58133
7760e8133L7623M5350n5307K6840N6740j6491j504l2563k1040p579K8978l5729
$$ -58133 -20510 24840 -30467 -3627 53113 36622 35118 2555 -18485 -26064 2914 -32815
7748c2815l9797K9129J526J8735J3552m5063j865O4278M643M074L68k5318O692
$$ -32815 -72612 -43483 -41957 -23222 -9670 -54733 -56598 7680 12323 16397 16765 -8553 -1861
7735a861K5439m8593j8010L8200k760M3280j7021P935k9098m1872k5587L9393
$$ -1861 23578 -25015 -43025 -4825 -7585 35695 18674 26609 -2489 -44361 -69948 -30555
7723c0555Q683k1896k9441L6504K5681j8256p094J7025K6351Q678J6424k0937
$$ -30555 -21872 -43768 -73209 -36705 -11024 -29280 -36374 -19349 7002 15680 32104 11167
7711A1167K1355N8089p9802l3513N3614l7648M9753p3328L0244j0201j4813j4678
$$ 11167 32522 90611 10809 -22704 30910 -6738 43015 -30313 -69 -10270 -25083 -39761
7699c9761j1614J8970l881l8789K52O1123K8341M6756n0185o1192o3638p18O3358
$$ -39761 -51375 -32405 -36286 -75075 -74823 -13700 14641 61397 11212 -49980 -113618 -114336 -50978
7686e0978J104L6765k2776j2608o338m5139j0233K4545M108N9327M2314M901O419
$$ -50978 -49874 -13109 -35885 -48493 -54831 -99970 -110203 -85658 -81550 -22223 20091 24992 31411
7673C1411k9129o8461K2024Q164l9015K5381K3355L0574m15j4790o4623L3043
$$ 31411 2282 -66179 -44155 -35991 -75006 -49625 -26270 4304 3889 -10901 -75524 -42481
7661d2481r60k9450J3229l0285M4217J4325K9957m7094m3187R278O0504K7015
$$ -42481 -43441 -72891 -59662 -89947 -45730 -31405 -1448 -48542 -91729 -82451 -21947 5068
7649E068k4985J5292J3281r498J4741m5961m5691P5734o2574M0214Q715J5029
$$ 5068 -19917 -4625 8656 -842 13899 -32062 -77753 -2019 -64593 -24379 -15664 -635
7637f35M3340j2553m5519M5793j3348N236m1168j0629j1426k3463J4719n498j3325
$$ -635 42705 30152 -15367 30426 17078 22314 -18854 -29483 -40909 -64372 -49653 -55151 -68476
7624f8476L3325k1715j8472K6068k3619J4801M652L7605k8918L3592n7020L1397
$$ -68476 -35151 -56866 -75338 -49270 -72889 -58088 -53436 -15831 -44749 -11157 -68177 -36780
7612c6780M5054o630L744l4689P334k3527q842M7861l8878j704K6432J2618k0476
$$ -36780 8274 1644 5388 -29301 -21967 -45494 -54336 -6475 -45353 -47057 -20625 -8007 -28483
7599b8483l3577J796K2928L1569l2403K4705N7097n500o026l3510L976q515m7004
$$ -28483 -62060 -60264 -37336 -5767 -38170 -13465 43632 38132 32106 -1404 2572 -5943 -52947
7586e2947j1538r941k5718J6846j9765L0718L3245j7658O7935K1053q428k3659
$$ -52947 -64485 -74426 -100144 -83298 -103063 -72345 -39100 -56758 11177 32230 23802 143
7574A43o3228m212r431n156K9472P6943o5138n1910O3843l9232J2196L1914P272
$$ 143 -63085 -67297 -76728 -81884 -52412 24531 -40607 -92517 -28674 -67906 -55710 -23796 -16524
7561a6524j0335m3821M3766L5217j9923J2844j8487k3140j5609l0134N1252M5411
$$ -16524 -26859 -70680 -26914 8303 -11620 1224 -17263 -40403 -56012 -86146 -34894 10517
7549A0517p7709M7357k2805j9783K2408M9950O196j6456l0385k7230K3167n0458
$$ 10517 -67192 -19835 -42640 -62423 -40015 9935 16131 -325 -30710 -57940 -34773 -85231
7537h5231L1094J2665k7248L651k236l156m433J8134k926O5487N6060p7618m3952
$$ -85231 -54137 -41472 -68720 -65069 -67305 -70461 -74894 -56760 -59686 5801 61861 -15757 -59709
7524e9709j3699J2772J5611J5375o4317L7453L8617n1214M706O6226n3527q253
$$ -59709 -73408 -60636 -45025 -29650 -93967 -56514 -17897 -69111 -64405 1821 -51706 -59959
7512e9959q117M244M9783L0745l8215l8210j4997K2574O9l616J0605p343k0767
$$ -59959 -68076 -63832 -14049 16696 -21519 -59729 -74726 -52152 -52083 -55699 -45094 -52437 -73204
7499g3204p1920P4088L8238j5207n599l715K3968j358k7766k1035l9296M34J2334
$$ -73204 -145124 -71036 -32798 -48005 -53604 -57319 -33351 -34709 -62475 -83510 -122806 -122372 -110038
7486a10038L2699j3120L2969N3179l4331m8658J4768J1524J0379K2892L2741n532
$$ -110038 -77339 -90459 -57490 -4311 -38642 -87300 -72532 -61008 -50629 -27737 5004 -528
7474e28k3693j7318r971j0814N6194m083K5361L035J1109j6533k7726l704n077
$$ -528 -24221 -41539 -51510 -62324 -6130 -10213 15148 18183 29292 12759 -14967 -18671 -23748
7461b3748l3864Q313K8429j9281J7912k7615P353J2057L412n2211M7869J3895
$$ -23748 -57612 -49299 -20870 -40151 -22239 -49854 -42501 -30444 -27032 -79243 -31374 -17479
7449a7479k8348l8052l473K4534K7077L3450n8204M7067n941m0517N4288J7120
$$ -17479 -45827 -83879 -87352 -62818 -35741 -2291 -60495 -13428 -19369 -59886 -5598 11522
7437A1522k9530o730n0328J6284Q971j3354r674j6711M0795j2040J6385q08J399
$$ 11522 -18008 -24738 -75066 -58782 -49811 -63165 -72839 -89550 -48755 -60795 -44410 -45218 -43819
7424d3819J1825N146l105j845L6947r1433K1181N8800m2836J4981n3437M8532
$$ -43819 -31994 -26848 -29953 -31798 5149 -86284 -65103 -6303 -49139 -34158 -87595 -39063
7412c9063P9284k093n8888k5253K2117j1944j8319J4042n675j1368l4356N7418
$$ -39063 40221 38128 -20760 -46013 -23896 -35840 -54159 -40117 -45792 -57160 -91516 -34098
7400c4098K3965K0989K2357l4206l9843l2608J04151j7961n3353k5278M3730p87
$$ -34098 -10133 10856 33213 -993 -40836 -73444 30707 12746 -40607 -65885 -22155 -22942
7388b2942J0529Q126K8633l9567r991m1213L6572L7269n1711J864K6539o5985
$$ -22942 -12413 -4287 24346 -15221 -25212 -66425 -29853 7416 -44295 -42431 -15892 -81877
7376h1877L0555K2175l8651O6876p804m0833K7983M21J1789P30o2776J122K6670
$$ -81877 -51322 -29147 -67798 -922 -8726 -49559 -21576 -21155 -9366 -8636 -71412 -70290 -43620
7363d3620O5371l4640P3456r0319k7711M0701m1088m2270M0902j7883J3451j5967
$$ -43620 21751 -12889 60567 -29752 -57463 -16762 -57850 -100120 -59218 -77101 -63650 -79617
7351g9617K6654L370n642n3407N3033K3060j6636M8846j1159n5901k0824m0257
$$ -79617 -52963 -49593 -55235 -108642 -55609 -32549 -49185 -339 -11498 -67399 -88223 -128480
7339a28480Q9501O2353j9892m307k7357m0155J8272R3357p3822P723m7933J6618
$$ -128480 -38979 23374 3482 -825 -28182 -68337 -50065 43292 -30530 -22807 -70740 -54122
7327e4122O3749L412M22Q038q963j4439j4071Q266r141J1168K0646K9546j2933
$$ -54122 9627 13039 13461 21499 12536 -1903 -15974 -7708 -16849 -5681 14965 44511 31578
7314C1578k2048m1572O92j1750j0888l932j8451O292O1622k2937j5847K6746j0748
$$ 31578 9530 -32042 -31350 -43100 -53988 -57920 -76371 -70079 -8457 -31394 -47241 -20495 -31243
7301c1243L7208L7877n8959j0046L3884Q778P927m0367K0964k1540n0039m4111
$$ -31243 5965 43842 -15117 -25163 8721 17499 25426 -14941 6023 -15517 -65556 -109667
7289a09667P9574O4779l2530L2439Q0147n3380j8478l8374m1524J267M8944K4460
$$ -109667 -30093 34686 2156 34595 114742 61362 42884 4510 -37014 -35747 13197 37657
7277C7657j7435q7569n0878K9024L8712Q750k628m216P0735n1165M995O8735m4799
$$ 37657 20222 -67347 -118225 -89201 -50489 -41739 -44367 -48583 22152 -29013 -24018 44717 -82
7264h2K5122j3535K0098R312l5036o1493Q35m5834N5004p388N8865O628r5942
$$ -82 25040 11505 31603 40915 5879 -55614 -54779 -100613 -45609 -52997 5868 12496 -83446
7251h3446J643j5822J4011N4509k2098J9002L1677J1256l297l4073j907L6292
$$ -83446 -81803 -97625 -83614 -29105 -51203 -32201 -524 10732 7435 -26638 -28545 7747
7239G747o6796m740J0816k8440N1717n315j503K7768o7531O9105k7706k7718N2628
$$ 7747 -59049 -63789 -52973 -81413 -29696 -35011 -36514 -8746 -76277 -7172 -34878 -62596 -9968
7226i968m407o588l9530j6806k0397o93J00817m2165o506N3667O176L5958m3355
$$ -9968 -14375 -20963 -60493 -77299 -97696 -98389 2428 -39737 -46243 7424 13600 49558 6203
7213F203m6832P961k1749r276k4704K6166J8130J8988k13l1572K4624j2695n5089
$$ 6203 -40629 -32668 -54417 -63693 -88397 -62231 -44101 -25113 -25326 -56898 -32274 -44969 -100058
7200a00058j414R2352O8704j2205n8727m0892M8O920R766J3034O602q730k8080
$$ -100058 -101472 -9120 59584 47379 -11348 -52240 -52192 -45272 -35506 -22472 -15870 -24600 -52680
7187e2680M5293l6735K4202j1235K9767j1809k0708p740J1667k8149J1317q006
$$ -52680 -7387 -44122 -19920 -31155 -1388 -13197 -33905 -41645 -29978 -58127 -46810 -54816
7175e4816l5490M6312L9808m5555m139j4964L9784J2079p3626O8216M825k566
$$ -54816 -90306 -43994 -4186 -49741 -53880 -68844 -29060 -16981 -90607 -22391 -17566 -20132
7163b0132K8236J5383q9112r300L643j1991J1875J9724P21j8557K3626N661m666
$$ -20132 8104 23487 -65625 -74925 -71282 -83273 -71398 -51674 -50953 -69510 -45884 -40223 -44889
7150d4889m5067J6358j1864K5440L1410k0215J0509j5517P7024r704p7339O2312
$$ -44889 -89956 -73598 -85462 -60022 -28612 -48827 -38318 -53835 23189 13485 -63854 -1542
7138a542p233l3692j9290P9590N352k7548J1906M125j0063l1164N491Q605k2081
$$ -1542 -8775 -42467 -61757 17833 23185 -4363 7543 11668 1605 -29559 -24068 -15463 -37544
7125c7544q211k9340M0526Q5718p9385l9147J4423l9469r925K7107k3092M0529
$$ -37544 -45755 -75095 -34569 51149 -28236 -67383 -52960 -92429 -102354 -75247 -98339 -57810
7113e7810O1146l1650l2897m696O6871n347K6132m2234p5781L844J8142J7709
$$ -57810 3336 -28314 -61211 -65907 964 -4383 21749 -20485 -96266 -92422 -74280 -56571
7101e6571L1971j8623n172j464j0901M355M702m496j2602j1734j1299O0831k1193
$$ -56571 -24600 -43223 -48395 -49859 -60760 -56405 -51703 -56199 -68801 -80535 -91834 -31003 -52196
7088e2196k471L8846R115p822l7617n702k1607J4419J4543k99n7811K4813j0103
$$ -52196 -54667 -15821 -6706 -14528 -52145 -57847 -79454 -65035 -50492 -50791 -108602 -83789 -93892
7075i3892M9463P8043k2567n5141K1006k0457o3122Q2769J4590N067l3530m2013
$$ -93892 -44429 33614 11047 -44094 -23088 -43545 -106667 -23898 -9308 -4241 -37771 -79784
7063g9784N319J2148K9558k202K5325N329l6740J6325J8293m9415k9256O3735
$$ -79784 -74465 -62317 -32759 -34961 -9636 -4307 -41047 -24722 -6429 -55844 -85100 -21365
7051b1365N1968j6738m5515k4892r353L0721l1198J7274R72K9255o495m0000J3299
$$ -21365 30603 13865 -31650 -56542 -65895 -35174 -66372 -49098 -48126 -18871 -25366 -65366 -52067
7038e2067k756L57K7104m729N930j9753m4037l0785R2065k564j1061J6609J6375
$$ -52067 -54823 -54466 -27362 -32091 -26161 -45914 -89951 -120736 -28671 -31235 -42296 -25687 -9312
7025i312o8864L5982k0529J2954m7316O0717J2774k4014l5562j6659L8961l9850
$$ -9312 -78176 -42194 -62723 -49769 -97085 -36368 -23594 -47608 -83170 -99829 -60868 -100718
7013a00718K5875M6074Q100m5183J5356J2606R999J0183r9277K0779K4227J9876
$$ -100718 -74843 -28769 -20669 -65852 -50496 -37890 -27891 -17708 -116985 -96206 -71979 -52103
7001e2103J64J981l14n6278J961l8111K3452K8838N3253l9299J4694p3700L4897
$$ -52103 -51939 -49958 -50272 -106550 -104589 -142700 -119248 -90410 -37157 -76456 -61762 -135462 -100565
6988a00565j2779N5107N691J2711O7129k4258n6592j4378N8876L1656j0919L601
$$ -100565 -113344 -58237 -52546 -39835 27294 3036 -53556 -67934 -9058 22598 11679 15280
6976A5280j6621J3060j4396q216M0378r3113k6045K7827J2079J5559j9699J7755
$$ 15280 -1341 11719 -2677 -10893 29485 -63628 -89673 -61846 -49767 -34208 -53907 -36152
6964c6152j0649j4023l3900L7997J273J9078l0710n0329Q7517n1985K9368M717
$$ -36152 -46801 -60824 -94724 -56727 -55454 -36376 -67086 -117415 -29898 -81883 -52515 -47798
6952d7798J9727M05J6346n2223L440M2106n8287L7333K4713R581p2552M3318M2310
$$ -47798 -28071 -27666 -11320 -63543 -60103 -17997 -76284 -38951 -14238 -4657 -77209 -33891 8419
6939H419j2134n258k1432k1405K8777K824K975J1271m9818j3172M8667m3446k6029
$$ 8419 -3715 -8973 -30405 -51810 -23033 -20209 -17234 -5963 -55781 -68953 -20286 -63732 -89761
6926h9761P0311J0201L243j0300k8840j108n1165J7859L0315L9815J085q0525
$$ -89761 -19450 -9249 -6006 -16306 -45146 -46254 -97419 -79560 -49245 -9430 -8345 -88870
6914h8870n641n0917M3763J4219Q220R4309l9234Q587L7937l0917K5655J0747
$$ -88870 -94511 -145428 -101665 -87446 -79226 15083 -24151 -15564 22373 -8544 17111 27858
6902B7858o7842k6723m1084l7345M4350P5810m9812l6120Q1403L9338r16k4272
$$ 27858 -39984 -66707 -107791 -145136 -100786 -24976 -74788 -110908 -29505 9833 8917 -15355
6890a5355k4438n57o667j1194k351j2829n177M2373l7512L966L0900m8906K0149
$$ -15355 -39793 -40350 -47017 -58211 -60562 -73391 -78568 -36195 -73707 -69741 -38841 -87747 -67598
6877f7598J1855L8735M2372l2789l1360K9601N6426n1812p770k9555m7652K6462
$$ -67598 -55743 -17008 25364 -7425 -38785 -9184 47242 -4570 -12340 -41895 -89547 -63085
6865f3085K2981L0231k031j3739K6369L427P0786l0837l2361m1007K2932R365
$$ -63085 -40104 -9873 -11904 -25643 726 4153 74939 44102 11741 -29266 -6334 3031
6853C031l3943J4131M6417l7410P647L6005m9741k0314j3003P203k0586L305l8612
$$ 3031 -30912 -16781 29636 -7774 -127 35878 -13863 -34177 -47180 -39977 -60563 -57258 -95870
6840i5870J6789J1745M1103n5623J6316j2243K3016n456N3501Q698n4084J4638
$$ -95870 -79081 -67336 -26233 -81856 -65540 -77783 -54767 -60223 -6722 1976 -52108 -37470
6828c7470J0434k032j8452r244K29J606k0499j86k160J18634l7215n8895j0526
$$ -37470 -27036 -29068 -47520 -56764 -56535 -54929 -75428 -75614 -77774 40860 3645 -55250 -65776
6815f5776q547L4435K8023m1906n781M3217k692j7594n5033Q8769K8585n0131
$$ -65776 -74323 -39888 -11865 -53771 -59552 -16335 -19027 -36621 -91654 -2885 25700 -24431
6803b4431K4218q6319k6084M7674K969N1010N2583j0010j15371N0847l6523L4632
$$ -24431 -213 -86532 -112616 -64942 -61973 -10963 41620 31610 -83761 -32914 -69437 -34805
6791c4805O041j3106L2609k2931l807L0561k9769j9508J048J2567r296J3847l0800
$$ -34805 -28764 -41870 -9261 -32192 -35999 -5438 -35207 -54715 -53667 -41100 -50396 -36549 -67349
6778f7349M90m733N9360o0954J3415K4213m0961Q991J5961K4272k3027M4714l1492
$$ -67349 -66859 -71592 -12232 -73186 -59771 -35558 -76519 -67528 -51567 -27295 -50322 -5608 -37100
6765c7100k9372O991M4571j4317J3915o260J8110j3483m4217L1918l8376j104
$$ -37100 -66472 -59481 -14910 -29227 -15312 -21572 -3462 -16945 -61162 -29244 -67620 -68724
6753f8724m62j3929k1305N2724j2905J3154M0555L4369L917n5984j1345m5099
$$ -68724 -69186 -83115 -104420 -51696 -64601 -51447 -10892 23477 27394 -28590 -39935 -85034
6741h5034L8578m622M5543l8167J5692N4805j4566k7219K2962m154j0820k7975
$$ -85034 -46456 -51078 -5535 -43702 -28010 26795 12229 -14990 7972 3818 -7002 -34977
6729c4977J0125p1048l502K2223Q9392j0901l5017l3465o4833J9065J08888r174
$$ -34977 -24852 -95900 -99402 -77179 12213 1312 -33705 -67170 -132003 -112938 -4050 -13224
6717a3224p6567r668K5706k6114M7892L3192n0168K4839K7646K455j7921M68j4872
$$ -13224 -89791 -99459 -73753 -99867 -51975 -18783 -68951 -44112 -16466 -14011 -31932 -31464 -46336
6704d6336M3384j4210o7291M979J3508K3521l3397L3721L2184M7898j131k1325
$$ -46336 -2952 -17162 -84453 -79474 -65966 -42445 -75842 -42121 -9937 37961 36830 15505
6692A5505o099k5406r298L8348K4097L1374o4564j6658k9001J0413O7931j4191
$$ 15505 9406 -16000 -25298 13050 37147 68521 3957 -12701 -41702 -31289 36642 22451
6680B2451k36j9980Q652k8944N2204O2122p5934l4556J9161k535L1131p8991l142
$$ 22451 22215 2235 10887 -18057 34147 96269 20335 -14221 4940 2405 33536 -45455 -48597
6667d8597L2371o372r926P556M0338l1577j1577r976n0525Q1502O232k7661K426
$$ -48597 -16226 -22598 -32524 -24968 15370 -16207 -27784 -37760 -88285 -6783 -551 -28212 -25786
6654b5786J6636l5526o2710K4964L9107k0760M9426J6731J0557J4864m2736L774
$$ -25786 -9150 -44676 -107386 -82422 -43315 -64075 -14649 2082 12639 27503 -15233 -11459
6642a1459J1409l837j7056K5565k5490k5038O361K8291P187m3751m851L8886M9913
$$ -11459 -50 -3887 -20943 4622 -20868 -45906 -39545 -11254 -4067 -47818 -52669 -13783 36130
6629C6130k2381j0739L34m4480k2198L7520p969L2332l1350P4826j0466N470j4824
$$ 36130 13749 3010 3344 -41136 -63334 -25814 -33783 -1451 -32801 42025 31559 37029 22205
6616B2205l1496K6369N693K4736m3520k1823K8152J0165m7951j4286N4824l9123
$$ 22205 -9291 17078 22771 47507 3987 -17836 10316 20481 -27470 -41756 13068 -26055
6604b6055L7850o3216j5215q223M2341O888k9068M3241q897N7296j9552m3746
$$ -26055 11795 -51421 -66636 -74859 -32518 -25630 -54698 -11457 -20354 36942 17390 -26356
6592b6356j9828K7887J6612L4025m7673O0111q113q2065n096n215l0172r748J6070
$$ -26356 -46184 -18297 -1685 32340 -15333 44778 36665 -45400 -50496 -55711 -85883 -95631 -79561
6579g9561o263L4107Q0344j0153o8374M2458M566L656n2105M1838j0599l2860
$$ -79561 -85824 -51717 28627 18474 -49900 -7442 -2876 780 -51325 -9487 -20086 -52946
6567e2946L0712j5387J1469k732L0047k0835l1996j692K9388L562q155r540M3530
$$ -52946 -22234 -37621 -26152 -28884 1163 -19672 -51668 -53360 -23972 -20410 -28565 -38105 5425
6554E425j9981J4837Q054J0486l0963L3593o1616R884R7039n152p0105J2902l086
$$ 5425 -14556 281 8335 18821 -12142 21451 -40165 -30281 66758 61606 -8499 4403 1317
6541A317j7654K950l1301j7440K5228L4643m1248j7899O2647j1570K4159j9179
$$ 1317 -16337 -13387 -44688 -62128 -36900 -2257 -43505 -61404 1243 -10327 13832 -5347
6529e347L42l0523j359Q0536n8399q525J3375Q135k0013L0705l2267K8485K2041
$$ -5347 -5005 -35528 -36887 43649 -14750 -23275 -9900 -1765 -21778 8927 -23340 5145 27186
6516B7186m123p0863J383k1092K0912R3205Q167p4829r4143j8092P4575O1395
$$ 27186 23063 -47800 -46417 -67509 -46597 46608 54775 -20054 -114197 -132289 -57714 3681
6504C681l2656L5070j6897O6400j5483q4562P1636J6939k4521l9539L6998k4740
$$ 3681 -28975 6095 -10802 55598 40115 -44447 27189 44128 19607 -19932 17066 -7674
6492g674m6708L042n0032N7571Q4317m120J0704m1049k7858L8152O949n3886j33
$$ -7674 -54382 -51340 -101372 -43801 40516 36396 47100 6051 -21807 16345 23294 -30592 -30725
6479c0725M4892K5456J1777k459q857l0603j113j7540j4970L431K4768K2051j3869
$$ -30725 14167 39623 51400 48941 40084 9481 8368 -9172 -24142 -20711 4057 26108 12239
6466A2239m0484r539L602k5717L5181o582K7936J01642m8868l4745j1294m448
$$ 12239 -28245 -37784 -34182 -59899 -24718 -31300 -3364 98278 49410 14665 3371 -1077
6454a077J2497N882J756M1223n8068k9339N547k7912k9969Q7671m1227j5556N7944
$$ -1077 11420 17302 19058 60281 2213 -27126 -21579 -49491 -79460 8211 -33016 -48572 9372
6441I372j8292m4468K5037N9972l7582j1037q326n005k4473L6311j2505J7628
$$ 9372 -8920 -53388 -28351 31621 -5961 -16998 -25324 -30329 -54802 -18491 -30996 -13368
6429a3368N8021l2700m4746Q1708j5883l2579J6990K0608m8662m0294N5596k4252
$$ -13368 44653 11953 -32793 48915 33032 453 17443 38051 -10611 -50905 4691 -19561
6417a9561J3705M225j8164K9052l9198m0140L4331L1121k76M0400m3062J1562
$$ -19561 -5856 -1631 -19795 9257 -29941 -70081 -35750 -4629 -4905 35495 -7567 3995
6405C995l3663j902J0691r085K9428J8220K333m6835Q525J0832l4101o010N7683
$$ 3995 -29668 -31570 -20879 -29964 -536 17684 20017 -26818 -18293 -7461 -41562 -47572 10111
6392A0111k2790k6711k9283L9188R255j228j0259o870m3720K080L6131j1872J7776
$$ 10111 -12679 -39390 -68673 -29485 -20230 -21458 -31717 -38587 -82307 -80227 -44096 -55968 -38192
6379c8192L5101K4522L294Q347j3646l3163n7398M5371j9993j9115M1937r015
$$ -38192 -3091 21431 24725 33072 19426 -13737 -71135 -25764 -45757 -64872 -22935 -31950
6367c1950p855k8621K9512O8132o7166R470J1055R685J6915q899m5432K1316p053
$$ -31950 -39805 -68426 -38914 29218 -37948 -28478 -17423 -7738 9177 278 -45154 -23838 -30891
6354c0891j7714J1007n1391r124P1873O354l065k537J809K5299n095m4589K5624
$$ -30891 -48605 -37598 -88989 -98113 -26240 -19886 -22951 -25488 -23679 1620 -3475 -48064 -22440
6341b2440N1400p4827M0617j4819l1536J8582K3812m9896k2421r28K8182j3179
$$ -22440 28960 -45867 -5250 -20069 -51605 -33023 -9211 -59107 -81528 -82456 -54274 -67453
6329f7453J2170K0783j1723O1156k8398m8543k3360L795r387j4324P005p763K1759
$$ -67453 -55283 -34500 -46223 14933 -13465 -62008 -85368 -81573 -90960 -105284 -98279 -106042 -84283
6316h4283N0051L2492j4331M0959j5072o7212r629K428K8953O647K4814K9475
$$ -84283 -34232 -1740 -16071 24888 9816 -57396 -67025 -64597 -35644 -28997 -4183 25292
6304B5292r443R797M596k9531l0490o603j9203P3721j8513l2342R496K7888K8552
$$ 25292 15849 25646 30242 711 -29779 -36382 -55585 18136 -377 -32719 -23223 4665 33217
6291C3217l4841M682k9815K3358o921n7877M9650L8145J3138j2790l4654r637
$$ 33217 -1624 3058 -26757 -3399 -10320 -68197 -18547 19598 32736 19946 -14708 -24345
6279b4345j2799M9942k6041L7422J5090O0265q8599j1236L8991n2891L739K0830
$$ -24345 -37144 12798 -13243 24179 39269 99534 10935 -301 38690 -14201 -10462 10368
6267A0368K1222l8831J7343k8131n0656K9341K1063l3601l4383K9666L8238M4103
$$ 10368 31590 -7241 10102 -18029 -68685 -39344 -18281 -51882 -86265 -56599 -18361 25742
6255B5742O8727m3204j3201l0843K6652o0067O7744k2939m6958R980k6726L3867
$$ 25742 94469 51265 38064 7221 33873 -26194 41550 18611 -28347 -18367 -45093 -11226
6243a1226j98n0036K8401J5701l9271Q600l1385J9229L5554L737n8316J0187J3699
$$ -11226 -11424 -61460 -33059 -17358 -56629 -48029 -79414 -60185 -24631 -20894 -79210 -69023 -55324
6230e5324K3079K2508n2044J0596M8552L9147p6353o0992L0327p470Q0595K3587
$$ -55324 -32245 -9737 -61781 -51185 -2633 36514 -39839 -100831 -70504 -77974 2621 26208
6218B6208J2957j6876k409J2626o03J1595o510k3417M8213J6709j6572k5823L2913
$$ 26208 39165 22289 19880 32506 31903 43498 36988 13571 61784 78493 61921 36098 69011
6205F9011J5429k3036l8695P098L5282o2588j5004K9994M853j7165K2907L8187
$$ 69011 84440 61404 22709 29807 65089 2501 -12503 17491 22344 5179 28086 66273
6193F6273K5633o4075k5847K1854K4457l1139J3357Ll8035P0153k3311l257J9015
$$ 66273 91906 27831 1984 23838 48295 17156 30513 30516 -7519 62634 39323 36066 55081
6180E5081m2149R088j0855k3709r037J5655O493M2224j8958m3795m2433J1072
$$ 55081 12932 22020 11165 -12544 -21581 -5926 567 42791 23833 -19962 -62395 -51323
6168e1323M7856j3149l9182N4311j1534J8108K7353j0987K4K1835l6656J0422
$$ -51323 -3467 -16616 -55798 -1487 -13021 5087 32440 21453 21477 43312 6656 17078
6156A7078J0312m0911k1548M7208M658L1593l3936K5570l9264j3509J5186k5156
$$ 17078 27390 -13521 -35069 12139 16797 48390 14454 40024 760 -12749 2437 -22719
6144b2719L2278K5630J5630l8393K5974m8991P5073m7743m4902n3116N4641j0925
$$ -22719 9559 35189 50819 12426 38400 -10591 64482 16739 -28163 -81279 -26638 -37563
6132c7563K107K8027N454o1688k437J660j873M2325L0784n426j4033j1991k3928
$$ -37563 -35456 -7429 -1975 -63663 -66100 -64440 -66313 -23988 6796 1370 -12663 -24654 -48582
6119d8582M4533J12977q3950n1863k74P5584J4418o305L858P113m093m9368L3633
$$ -48582 -4049 108928 24978 -26885 -27159 48425 62843 56538 60396 67509 63416 14048 47681
6106D7681l7268k3642k2127O6491k0747l0338K7908J3548k758k6053p158L9392
$$ 47681 10413 -13229 -35356 31135 10388 -19950 7958 21506 18748 -7305 -14463 24929
6094B4929n4619K1497J2019l527L3752j2061l6911l662j0668j9064L0186N1986
$$ 24929 -29690 -8193 3826 299 34051 21990 -14921 -18583 -29251 -48315 -18129 33857
6082C3857O229k0388M191k2435l981J1486L8128n3785k8132L5271j1946q8631
$$ 33857 40086 19698 23889 1454 -2527 8959 47087 -6698 -34830 441 -11505 -100136
6070a00136L1732R4723l0968M0429k1966N154o683n835N143M194J1266l9264n1908
$$ -100136 -68404 26319 -4649 35780 13814 18968 12285 6450 11593 15787 27053 -12211 -64119
6057f4119R9574l7472j4241K1057j4770J6100L6167m540o7925M7683l0042J0126
$$ -64119 35455 -2017 -16258 4799 -9971 6129 42296 37756 -30169 17514 -12528 -2402
6045b402M6186j7197K5949l4325l4904j5760k265j5862k2833O7958j2765l8092
$$ -2402 43784 26587 52536 18211 -16693 -32453 -34718 -50580 -73413 -5455 -18220 -56312
6033e6312j9635k3596L3690K13n772M3547o1715R7772l749m1161P3962k1678K0123
$$ -56312 -75947 -99543 -65853 -65640 -71412 -27865 -89580 8192 4443 -36718 37244 15566 35689
6020C5689K7884j11020R526O8836k8599K834j6326O1578l8893Q354l5253L2392
$$ 35689 63573 -47447 -37921 30915 2316 5150 -11176 50402 11509 19863 -15390 17002
6008A7002k2321K2052m129m6457L7226j0508l4965p663M5459L8593K2644n0816
$$ 17002 -5319 16733 12604 -33853 3373 -7135 -42100 -49763 -4304 34289 56933 6117
5996F117K2068Q167j2956j8199m998j8676J2266J784K0813n500M4209k0957K8294
$$ 6117 28185 36352 23396 5197 199 -18477 -6211 -4427 16386 10886 55095 34138 62432
5983F2432K9466n358n5071j5747j6752J2847K0703n706J776k6627j3070L4572
$$ 62432 91898 86540 31469 15722 -1030 11817 32520 26814 28590 1963 -11107 23465
5971B3465J307j91M2165n1512j2065M4381K4470p4063j3690J5458J5845m655N435
$$ 23465 24772 24581 66746 15234 3169 47550 72020 -2043 -15733 -275 15570 10915 16350
5958A6350K5231p9638o144L8020L806K4186R95K8686p3828o4946L6685K9077J6830
$$ 16350 41581 -38057 -44201 -6181 -2375 21811 22806 51492 -22336 -87282 -50597 -21520 -4690
5945d690J5089k5045M3307r704M9038n9165j0798L4716o071M1173p0960l364R2787
$$ -4690 10399 -14646 28661 18957 67995 8830 -1968 32748 26677 67850 -3110 -6474 86313
5932H6313J2303m9322K544m2836K6306l2220k6939K4376l7804L0344M4707L8705
$$ 86313 98616 49294 51838 9002 35308 3088 -23851 525 -37279 -6935 37772 76477
5920G6477N488q239j2733n2995k3300l5833O6511M4516l660J7506j8065K1357
$$ 76477 81965 73726 60993 7998 -15302 -51135 15376 59892 56232 73738 55673 77030
5908G7030l5070J9532m4460K162O0624J9503n1086K8012l1606n2259Q5333r9281
$$ 77030 41960 61492 17032 19194 79818 99321 48235 76247 44641 -7618 77715 -21566
5896b1566M4172J12880l6675n858R07n4804K6572M9781n7237l3514p000P2931
$$ -21566 22606 135486 98811 92953 93860 39056 65628 115409 58172 24658 17658 90589
5884I0589k1220P630M4290j4709j1708J6252j2022Q904M5465j2636l5086k1847
$$ 90589 69369 76999 121289 106580 94872 111124 99102 108006 153471 140835 105749 83902
5872H3902Q317q766Q9890r8780L9712K5159M3522j8057o6144k3749L7719j2181
$$ 83902 92219 83453 173343 74563 114275 139434 182956 164899 98755 75006 112725 100544
5860A00544l268M448l5547K3324r355J7379J698J0060O2460l4219o3458l9736
$$ 100544 97276 101724 66177 89501 80146 97525 99223 109283 171743 137524 74066 34330
5848C4330j5759r371R708N759K6508L3410R00O81l7639o033K9074M8541j5455
$$ 34330 18571 9200 18908 24667 51175 84585 85485 86166 48527 42494 71568 120109 104654
5835A04654L3071o5635o5024L6606L7311M6578J6280q2260O008M2372J9839J8275
$$ 104654 137725 72090 7066 43672 80983 127561 143841 61581 67589 109961 129800 148075
5823A48075J7747j6061k0484N404L381k8011M487L0640m170Q581q055l6855m239
$$ 148075 165822 149761 129277 134681 138062 110051 114538 145178 141008 149589 141534 104679 100440
5810A00440M4276M477j8966K7627k0880J6224m9848j1275P4355N1949J2416m3888
$$ 100440 144716 149193 130227 157854 136974 153198 103350 92075 166430 218379 230795 186907
5798A86907r197M2457J8985m393J2476k6975J5845O3999K9645q451N2456M9954
$$ 186907 177710 220167 239152 234759 247235 220260 236105 300104 329749 321298 373754 423708
5786D23708R673R7360M8130J4940J3984q772j26J9858L9471R365r312R90J7185
$$ 423708 433381 530741 578871 593811 607795 599023 598897 618755 658226 667591 658279 659269 676454
5773F76454N1744L0515N5916J3683K5940Q3368O2266p1190J8707j0988p3341j9050
$$ 676454 728198 758713 814629 828312 854252 937620 999886 928696 947403 936415 863074 844024
5761H44024q7021k5393p2102L5279J0406l663j6022N697m8840m9111K0797k9287
$$ 844024 757003 731610 659508 694787 705193 701530 685508 691205 642365 593254 614051 584764
5749E84764k7086n7250L4742o6003n3021j346k2757J1899o4438l3855l2982k1639
$$ 584764 557678 500428 535170 469167 416146 414800 392043 403942 339504 305649 272667 251028
5737B51028n575q758J4309l7824q946J5803k0769k963Q767j5752K2098K2450o9736
$$ 251028 245453 236695 251004 213180 204234 220037 199268 196305 205072 189320 211418 233868 164132
5724A64132K4893K3367p790R065R530J374Q0552k8376q0772o07N2796j7730P31
$$ 164132 189025 212392 204602 213667 223197 224571 305123 276747 195975 195368 248164 230434 231165
5711B31165M5152j1992O600m132N1675l263n242K1811O0418n0558j352m1245j0820
$$ 231165 276317 264325 270925 266793 318468 315205 309963 331774 392192 341634 340282 299037 288217
5698B88217M8027j0713m6249P685J4137n7274J9445m9087L210l0155L3917J1513
$$ 288217 336244 325531 279282 286967 301104 243830 263275 214188 217398 187243 221160 232673
5686B32673j6257o074r228J6941j4224J8760O5035N8328m4410M0524K2393L8808
$$ 232673 216416 210342 201114 218055 203831 222591 287626 345954 301544 342068 364461 403269
5674D03269k0291k7921m4575j1520n0702j1081o453k0830P202k4544J3033K1026
$$ 403269 382978 355057 310482 298962 248260 237179 230726 209896 217098 192554 205587 226613
5662B26613N07J9934p1234L5887N5898m4562Q678q725M8683m8141Q252J3835k9007
$$ 226613 227120 247054 175820 211707 267605 223043 231721 222996 271679 223538 231790 245625 216618
5649B16618n063m348L4827O007K9811k5325o9744r44K4330J7275n0891L652K8222
$$ 216618 211555 207207 242034 248041 277852 252527 182783 181839 206169 223444 172553 176205 204427
5636B04427L8252j0392n105n9354K4651m3877Q479k4507J5446L0808n492o1068
$$ 204427 242679 232287 227182 167828 192479 148602 157081 132574 148020 178828 173336 112268
5624A12268N9816j7894l6008L4490J9959L6458k479j7733J4352K1877l0665k0135
$$ 112268 172084 154190 118182 152672 172631 209089 206610 188877 203229 225106 194441 174306
5612A74306J7931L9641R997k869m6739J3774m1717J9969j248J2114o826L8942
$$ 174306 192237 231878 241875 239006 192267 206041 164324 184293 183045 195159 188333 227275
5600B27275K0495K5291o4850n6534N9639l3048k6496M1998K9143n1511K36N5571
$$ 227275 247770 273061 208211 151677 211316 178268 151772 193770 222913 171402 171638 227209
5588B27209N60j096L5867O1298j5679k7719l8980q016O4367l962n0088L7845L1917
$$ 227209 227769 226673 262540 323838 308159 280440 241460 233444 297811 293849 243761 281606 313523
5575C13523j9162n6557L0803L1746l0625j4992K3063l49k6495Q9137k3021j6931
$$ 313523 294361 237804 268607 300353 269728 254736 277799 277450 250955 340092 317071 300140
5563C00140K4513l4561n0048N3310R817M246L3334k2000L7651J6902p912o0407
$$ 300140 324653 290092 240044 293354 303171 307417 340751 318751 356402 373304 365392 304985
5551C04985L0084K1385K3142m102P3433p9511k9464K2216K4418M030M6489L99
$$ 304985 335069 356454 379596 375494 448927 369416 339952 362168 386586 390616 437105 437504
5539D37504k1103m0680j1118M3407M1654N31k8910N1020L2395j9033l343L8862
$$ 437504 416401 375721 364603 408010 449664 450195 421285 472305 504700 485667 482324 521186
5527E21186o7324k0372L1845L9619k4860j0838n693N5372N9837N2467L9932l5107
$$ 521186 453862 433490 465335 504954 480094 469256 463563 518935 578772 631239 671171 636064
5515F36064q4383L2615L8706O6216k9323M065K1021n590k8732L4934j2450o8j5828
$$ 636064 551681 584296 623002 689218 659895 663960 684981 679391 650659 685593 673143 673075 657247
5502F57247L9299N0460L6445n094J3574J06017l4775k8294J3115P6535J4347n2421
$$ 657247 696546 747006 783451 778357 791931 897948 863173 834879 847994 924529 938876 886455
5490H86455j6944N7010N2208M4227j1410K4075M4358M5793O9423Q3595n5715l4252
$$ 886455 869511 926521 978729 1022956 1011546 1035621 1079979 1125772 1195195 1278790 1223075 1188823
5478A188823N2923O0478J629M371Q2743J9061M8000N7258J2516k606N6415J07973
$$ 1188823 1241746 1302224 1303853 1308224 1390967 1410028 1458028 1515286 1527802 1525196 1581611 1689584
5466A689584P8394J14571p30j2603P7872M1954L8665J25616O8391M5938R9872
$$ 1689584 1767978 1882549 1881819 1869216 1947088 1989042 2027707 2153323 2221714 2267652 2367524
5455B367524J34708R9793R2347Q2433J09928J06838J25017J87354J51741K14164
$$ 2367524 2502232 2602025 2694372 2776805 2886733 2993571 3118588 3305942 3457683 3671847
5445C671847L23415J73930L38826M34611M66645N97930O24519P70716R67000J189371
$$ 3671847 3995262 4169192 4508018 4942629 5409274 6007204 6631723 7402439 8369439 9558810
5435I558810J285506J119659K58908p77233j374859j251347r31021n89098m05633
$$ 9558810 10844316 11963975 12222883 11445650 10070791 8819444 7888423 7299325 6893692
5426F893692k12517j75945n6524J1275M3041J26755J15188K30006L51377M40120
$$ 6893692 6681175 6505230 6448706 6459981 6503022 6629777 6744965 6974971 7326348 7766468
5416G766468N86287O84601Q45392J005269J252731J380372J658937K123239K701681
$$ 7766468 8352755 9037356 9882748 10888017 12140748 13521120 15180057 17303296 20004977
5407B0004977L246594L726736L377162J377196k067528m437881m479370l462964
$$ 20004977 23251571 26978307 30355469 31732665 29665137 25227256 20747886 17284922
5399A7284922k328122j644900j152277r00698o35023n52867m27280l60640j40314
$$ 17284922 14956800 13311900 12159623 11258925 10623902 10071035 9643755 9283115 9142801
5390I142801n478K1485L02978M02692M80413O66152Q45458J072400J275962J541646
$$ 9142801 9137323 9158808 9461786 9864478 10344891 11011043 11856501 12928901 14204863 15746509
5380A5746509J995616K432890L023618L635888L517528J883882j438183m341518
$$ 15746509 17742125 20175015 23198633 26834521 30352049 32235931 30797748 26456230
5372B6456230m930777l948933k728829j960682j530352j130468q35316o84676
$$ 26456230 21525453 17576520 14847691 12887009 11356657 10226189 9390873 8706197
5364H706197o02373m91751l84058k80587k06565j40428j31928K6951P1854J33786
$$ 8706197 8103824 7612073 7228015 6947428 6740863 6600435 6468507 6495458 6567312 6701098
5354F701098K14900L20705M39701N34030P17235R54574J086445J125316O82455
$$ 6701098 6915998 7236703 7676404 8210434 8927669 9882243 10968688 12094004 12776459
5345A2776459l41895j387772j695794j487739j123254p65521n60788m75209m07873
$$ 12776459 12434564 11046792 9350998 7863259 6740005 5974484 5413696 4938487 4530614
5336D530614l43276k57104j97735k44815k11628j84554o3399m0718j42454j40408
$$ 4530614 4187338 3930234 3732499 3487684 3276056 3091502 3028103 2987385 2844931 2704523
5326B704523q5901o3082O676p9439j16790j12741l47o1449K9634l4406r4762J9215
$$ 2704523 2618622 2555540 2562216 2482777 2365987 2253246 2252899 2191450 2221084 2186678 2091916 2111131
5314B111131j9598j6991o0136l1321M632L3110o340L6661l2842O0184L6928k72
$$ 2111131 2091533 2074542 2014406 1983085 1987717 2020827 2014487 2051148 2018306 2078490 2115418 2115146
5302B115146k3056o052k9744p3836M4118q4730k7817m182k5979L3495J3161O1130
$$ 2115146 2092090 2086038 2056294 1982458 2026576 1941846 1914029 1909847 1883868 1917363 1930524 1991654
5290A991654L7719k2459L376N9348L9210M6932K2279Q1343N4579Q5810R1070J9967
$$ 1991654 2029373 2006914 2010290 2069638 2108848 2155780 2178059 2259402 2313981 2399791 2490861 2510828
5278B510828O7624k8330j44640j26596j55279j47938n5152K5348k1989n1813p358
$$ 2510828 2578452 2550122 2405482 2278886 2123607 1975669 1920517 1945865 1923876 1872063 1864705
5267A864705k4175o0599j4866N7388m0617j7720J0526N1806O6486K950k7320j8907
$$ 1864705 1840530 1779931 1765065 1822453 1781836 1764116 1774642 1826448 1892934 1895884 1868564 1849657
5255A849657N7359O3532N5752l3978m8011l9742j25118m4624m2245L148q771j4319
$$ 1849657 1907016 1970548 2026300 1992322 1944311 1904569 1779451 1734827 1692582 1695730 1686959 1672640
5243A672640N274k7561k9686j9391o662L2624K8971J5057M2751K2214K0184l8190
$$ 1672640 1677914 1650353 1620667 1601276 1594614 1627238 1656209 1671266 1714017 1736231 1756415 1718225
5231A718225j9999L4683k8135K9845R7545m4345n221M2698Q606P4934K6514j0698
$$ 1718225 1698226 1732909 1704774 1734619 1832164 1787819 1782598 1825296 1833902 1908836 1935350 1924652
5219A924652l7089J8190j5810l9972Q9630j8197L9113l182n0118P3700l1189L9992
$$ 1924652 1887563 1905753 1889943 1849971 1939601 1921404 1960517 1957335 1907217 1980917 1949728 1989720
5207A989720j8852o22L352M093K0087J7214M0248l5122L1785O9448j5407K4091
$$ 1989720 1970868 1970246 1973598 1977691 1997778 2014992 2055240 2020118 2051903 2121351 2105944 2130035
5195B130035L7572N2471L3688L0006Q0681K6928K1145M5690Q6905R9550N9581
$$ 2130035 2167607 2220078 2253766 2283772 2364453 2391381 2412526 2458216 2545121 2644671 2704252
5184B704252K5860k2734m9771P7759L628j2961j1597L0980n2580M6113M0274K635
$$ 2704252 2730112 2707378 2657607 2735366 2738994 2726033 2714436 2745416 2692836 2738949 2779223 2781858
5172B781858M0866K2177J16600N5269L4305O4445J00679J19200J20345J51460
$$ 2781858 2822724 2844901 2961501 3016770 3051075 3115520 3216199 3335399 3455744 3607204
5162C607204J02917R8497J24148K4613j07866j09182o8762k3501R422o9308p174
$$ 3607204 3710121 3808618 3932766 3957379 3849513 3740331 3671569 3648068 3657490 3588182 3581008
5151C581008m304M6054J8537K7376n7088R5979Q5603R9306L0596K7478J21335
$$ 3581008 3576704 3622758 3641295 3668671 3611583 3707562 3793165 3892471 3923067 3950545 4071880
5140D071880K07449J38200J57361J45421J17973J99587K19254K43730M4042q1561
$$ 4071880 4279329 4417529 4574890 4720311 4838284 5037871 5257125 5500855 5544897 5463336
5130E463336j97015k21672j33959j63972k0860m1035j949O2509K314K1860R0493
$$ 5463336 5266321 5044649 4910690 4746718 4725858 4684823 4682874 4745383 4747697 4769557 4860050
5119D860050R1678K2550Q8360J10925L5034M8343J56804J50487J10614N2204J19362
$$ 4860050 4951728 4974278 5062638 5173563 5208597 5256940 5413744 5564231 5674845 5727049 5846411
5108E846411K25965K11121J47549J16073Q003L5432J9513L1141Q150N8486M254
$$ 5846411 6072376 6283497 6431046 6547119 6555122 6590554 6610067 6641208 6649358 6707844 6712098
5097F712098K9198J51621J37786J28661J76750J10419J24983J71089J94072J34644
$$ 6712098 6741296 6892917 7030703 7159364 7336114 7446533 7571516 7742605 7936677 8071321
5087H071321J51251J90164J55788J81940J92016J75129K01070J16900K39733K59710
$$ 8071321 8222572 8412736 8568524 8750464 8942480 9117609 9318679 9435579 9675312 9935022
5077I935022K51189K04600L32023K91736L54619L37308L61771L41257L10480L65604
$$ 9935022 10186211 10390811 10722834 11014570 11369189 11706497 12068268 12409525 12720005 13085609
5067A3085609L74144K84594K28880K24881K78681K63932J84994K62033L24961
$$ 13085609 13459753 13744347 13973227 14198108 14476789 14740721 14925715 15187748 15512709
5058A5512709L09295L69646L50503L77922M58407M53956N00283M96696N79900
$$ 15512709 15822004 16191650 16542153 16920075 17378482 17832438 18332721 18829417 19409317
5049A9409317O35737O64450P16479P22800Q21652Q75930Q61631R26098J022663
$$ 19409317 20045054 20709504 21425983 22148783 22970435 23846365 24707996 25634094 26656757
5040B6656757J122155J083756J145123J359430J498801J709493J850413K063080
$$ 26656757 27778912 28862668 30007791 31367221 32866022 34575515 36425928 38489008
5032C8489008K307987K465736K706841K938678L331031L795043M362312N046511
$$ 38489008 40796995 43262731 45969572 48908250 52239281 56034324 60396636 65443147
5024F5443147O083259P405584Q918135J0660722J2173988J2841342J1262495N202521
$$ 65443147 71526406 78931990 87850125 98510847 110684835 123526177 134788672 139991193
5016A39991193j829262n297400n497360m643082m293242l969816l154964j688699
$$ 139991193 138161931 132864531 127367171 122724089 118430847 114461031 111306067 109617368
5008A09617368j54240J238325K307057L369918M586730N869921P327929Q709443
$$ 109617368 109463128 110701453 113008510 116378428 120965158 126835079 134163008 142872451
5000A42872451J0030124J1404661J3450677J5429739J6523849J7815208J7876275
$$ 142872451 152902575 164307236 177757913 193187652 209711501 227526709 245402984
4993B45402984J4405310O746013j2058980k8046406l0404150k5151834j9000962
$$ 245402984 259808294 266554307 254495327 226448921 196044771 170892937 151891975
4986A51891975j4776512j1615643r108983o844414n372829m153344l149539j886122
$$ 151891975 137115463 125499820 116390837 109546423 104173594 100020250 96870711 94984589
4978I4984589q72327L81011J353048K402091L647943N395601P094261Q618083
$$ 94984589 94112262 94493273 95846321 98248412 101896355 107291956 114386217 123004300
4970A23004300R397703R070852O978452L312854k855208j2403760j8646580j8107129
$$ 123004300 132402003 141472855 148451307 151764161 148908953 136505193 117858613 99751484
4962I9751484j4302935j0331247p716083o019460m794677l949119l438211l128078
$$ 99751484 85448549 75117302 67401219 61381759 56587082 52637963 49199752 46071674
4954D6071674k775869k454594k164572j878828j695830j478992j365010j268492
$$ 46071674 43295805 40841211 38676639 36797811 35101981 33622989 32257979 30989487
4946C0989487j192903j138645j029216q71697q20333p23880o82412o10839n34899
$$ 30989487 29796584 28657939 27628723 26757026 25936693 25212813 24530401 23919562 23384663
4937B3384663m67523m84654m46247m79262m18777l67127l57697l89425l79558
$$ 23384663 22917140 22432486 21986239 21506977 21088200 20721073 20363376 19973951 19594393
4928A9594393l18122k49707k83604k95672k10773j84960j84524j44614k45252
$$ 19594393 19276271 19026564 18742960 18447288 18236515 18051555 17867031 17722417 17477165
4919A7477165j49943j45923r1688N0419L2968j4703k1463m7898n7548j7182o3274
$$ 17477165 17327222 17181299 17089611 17140030 17172998 17158295 17136832 17088934 17031386 17014204 16950930
4908A6950930Q892N7967J04543J49740P1686J41051R1438M0439J08330J46363
$$ 16950930 16959822 17017789 17122332 17272072 17343758 17484809 17576247 17616686 17725016 17871379
4898A7871379J48135J92793J01981J46966J56971K59499K32380K69605L77182
$$ 17871379 18019514 18212307 18314288 18461254 18618225 18877724 19110104 19379709 19756891
4889A9756891M28877M73076M20874N00480O29440O30918N67552O11253O02574
$$ 19756891 20185768 20658844 21079718 21580198 22209638 22840556 23408108 24019361 24621935
4880B4621935O95812P57637P84743Q66887R02045J028687J024084J114278J159603
$$ 24621935 25317747 26075384 26860127 27727014 28629059 29657746 30681830 31796108 32955711
4871C2955711J248086J435355J735511K057830K447714L030769L557802M244632
$$ 32955711 34203797 35639152 37374663 39432493 41880207 44910976 48468778 52713410
4863E2713410M942282N782114O616579P824807R461180J1667558J4412573J7575202
$$ 52713410 57655692 63437806 70054385 77879192 87340372 99007930 113420503 130995705
4855A30995705J9360972J6824791N282568j1728265k0139111j9119011j4403883
$$ 130995705 150356677 167181468 172464036 160735771 140596660 121477649 107073766
4848A07073766r712632o490437m406125k993596j952734j235859o01333M13798
$$ 107073766 97361134 90870697 86464572 83470976 81518242 80282383 79681050 80094848
4840H0094848J576317K911512M250756N755686P267731Q784793J0710756J2666010
$$ 80094848 81671165 84582677 88833433 94589119 101856850 110641643 121352399 134018409
4832A34018409J5721449J9557135K4452990L0746329L6796522L7241173K4414072
$$ 134018409 149739858 169296993 193749983 224496312 261292834 298534007 322948079
4825C22948079q958769l8138414m5462082l8736605k7791521j9685524j4523549
$$ 322948079 313989310 275850896 230388814 191652209 163860688 144175164 129651615
4818A29651615j1622519r483768q008069o737260n539743m084555k771535j422146
$$ 129651615 118029096 108545328 100537259 93799999 88260256 84175701 81404166 79982020
4810G9982020k70539O95302J736528K879555M062475N539595P364141R806651
$$ 79982020 79711481 80406783 82143311 85022866 89085341 94624936 101989077 111795728
4802A11795728J2699369J6171816J8355104J6158348M866098j2570516k3100945
$$ 111795728 124495097 140666913 159022017 175180365 180046463 167475947 144375002
4795A44375002k3468873j8758867j3666177j0104490q185401o920900n789217
$$ 144375002 120906129 102147262 88481085 78376595 70191194 63270294 57481077
4788E7481077n085216m414266l835625l271606k735897k378774k090764j909012
$$ 57481077 52395861 47981595 44145970 40874364 38138467 35759693 33668929 31759917
4780C1759917j817591j665458j538735j265090j147490j031891r13302q88613
$$ 31759917 29942326 28276868 26738133 25473043 24325553 23293662 22380360 21491747
4772B1491747p07969o52198o45424o61653n95669o15396n16686m77821n57768
$$ 21491747 20783778 20131580 19486156 18824503 18228834 17613438 17096752 16618931 16061163
4763A6061163m49182m99761n15699n36196m63321m57561l71596k80710l63073
$$ 16061163 15611981 15112220 14596521 14060325 13597004 13139443 12767847 12487137 12124064
4754A2124064l95455k95336l11502l23403l63961l37977l23957j96739k12903
$$ 12124064 11728609 11433273 11121771 10798368 10434407 10096430 9772473 9575734 9362831
4745I362831k19327j84978k07212k25983k16081j73511j80243k57052j79392j21338
$$ 9362831 9143504 8958526 8751314 8525331 8309250 8135739 7955496 7698444 7519052 7397714
4735G397714j44295j63587j64227j81408p8492q5507m1584m4737j12965j66472
$$ 7397714 7253419 7089832 6925605 6744197 6665705 6580198 6538614 6493877 6380912 6214440
4725F214440r4227j13946m8258j62672j55472j37970j27340p9837n0659r9527
$$ 6214440 6120213 6006267 5958009 5795337 5639865 5501895 5374555 5294718 5244059 5144532
4715E144532q5849m1262j07168M464o6778m8155J2382j12484m4906N2254o436
$$ 5144532 5058683 5017421 4910253 4914717 4847939 4799784 4812166 4699682 4654776 4707030 4700594
4704D700594j712k4055n9828j54222k28842k29905k02730o9736j24530j20213
$$ 4700594 4698882 4674827 4614999 4460777 4231935 4002030 3799300 3729564 3605034 3484821
4694C484821j08323j7082p0693j22170q2447q4556j8620L496P7221q395l9137
$$ 3484821 3376498 3359416 3288723 3166553 3084106 2999550 2980930 2984426 3061647 3053252 3014115
4683C014115J4250k6355p0215o7343J0071J1851l1287q1287j28922j14249j81805
$$ 3014115 3028365 3002010 2931795 2864452 2874523 2886374 2855087 2773800 2644878 2530629 2348824
4672B348824j19476j94675k5502o6389p7654n7791M5672n9262n2215l4406m2543
$$ 2348824 2229348 2034673 2009171 1942782 1865128 1807337 1853009 1793747 1741532 1707126 1664583
4661A664583q1473l2576l0263P515K5707r042p1733p7351N7426j462n2067m2039
$$ 1664583 1583110 1550534 1520271 1527786 1553493 1544451 1472718 1395367 1452793 1451331 1399264 1357225
4649A357225m962o2298k6985l4328l551l5074o0755j5732j6306o1903n8161l971
$$ 1357225 1352263 1289965 1262980 1228652 1225101 1190027 1129272 1113540 1097234 1035331 977170 973199
4637I73199k0779L0794n2626K9963j3324j2769J5356K422j2260k9765L2477J3530
$$ 973199 952420 983214 930588 960551 947227 934458 949814 952236 939976 910211 942688 956218
4625I56218l8256j6679n4702l1313J3651m0122r177K1856j3469K0722j6877m1021
$$ 956218 917962 901283 846581 815268 828919 788797 779620 801476 788007 808729 791852 750831
4613G50831L1975K1386l1388n1222L7658o7333l0872J8773m4919j5448k2038n3287
$$ 750831 782806 804192 772804 721582 759240 691907 661035 679808 634889 619441 597403 544116
4601E44116K9804J1707K1162q409M2837l7096j0j770L294J4069k1511k4768m718
$$ 544116 573920 585627 606789 598380 641217 604121 604111 602341 605635 619704 598193 573425 568707
4588E68707j3523J031q009L5498K6032m7258J0687j7496j9970L9023k4515l5248
$$ 568707 555184 556215 548206 583704 609736 562478 573165 555669 535699 574722 550207 514959
4576E14959N1179p349r4960L2314L895J4939j4283k9352L954J4357L4204j3046
$$ 514959 566138 558789 463829 496143 500038 514977 500694 471342 475296 489653 523857 510811
4564E10811L0381l2028M0735k6875J4639K5336j9051L3234N3471p1538r5M9440
$$ 510811 541192 509164 549899 523024 537663 562999 543948 577182 630653 559115 559020 608460
4552F08460j979L6515M4918R5150J8597K055P8696J02987J25766l096K4866k7092
$$ 608460 606481 642996 687914 783064 801661 803716 882412 985399 1111165 1108069 1132935 1105843
4540A105843k00361q3637N559p2436m8668k9831j8061L6274k0376p2221K4272
$$ 1105843 905482 821845 827404 754968 706300 676469 658408 694682 674306 602085 626357
4529F26357j2129K0589J02738J9463J9920Q4827L6553K7688J88601Q7866O2778
$$ 626357 614228 634817 737555 757018 776938 861765 898318 926006 1114607 1202473 1265251
4518A265251K27031K43040J54620J6176j23410k16516k55743j86665j27774q5633
$$ 1265251 1492282 1735322 1889942 1906118 1782708 1566192 1310449 1123784 996010 910377
4508I10377n3289p4530o7327J265K40j8719o8630m9391k5667M1566l0607P638
$$ 910377 857088 782558 715231 716496 716736 698017 629387 579996 554329 595895 565288 572926
4496E72926k0913M0637L2269k8659O1449O7515J26594J24885M2710K5235q1918
$$ 572926 552013 592650 624919 596260 657709 725224 851818 976703 1019413 1044648 962730
4485I62730j62222n0098r1543o6913k8342r1455m1299J3620n6953K4984q9408
$$ 962730 800508 750410 658867 591954 563612 472157 430858 444478 387525 412509 323101
4474C23101r864K2202L159q1974o7825O6561K1148m0532o4014O1695m152m4759
$$ 323101 313237 335439 338598 256624 188799 255360 276508 235976 171962 233657 229505 184746
4462A84746k8267m616M0116J402o897K5735j4023K3171k5274k1015J1736M6794
$$ 184746 156479 151863 191979 193381 186484 212219 198196 221367 196093 175078 186814 233608
4450B33608r104r1855n317Q711j8016L9507l9119k3612O7615j3318m2596K0628
$$ 233608 224504 132649 127332 136043 118027 157534 118415 94803 162418 149100 106504 127132
4438A27132Q515M1529k765l9645k9280j7201R697J1270k6654L4598k2316n1232
$$ 127132 135647 177176 174411 134766 105486 88285 97982 109252 82598 117196 94880 43648
4426D3648P6131K8824n8133P680M8658j8617p2491k1848l6620j9367L2513J6566
$$ 43648 119779 148603 90470 98150 146808 128191 55700 33852 -2768 -22135 10378 26944
4414B6944L1762k4973j7791l4849O6426L8202K8266O477j2028l7020p1222L0800
$$ 26944 58706 33733 15942 -18907 47519 85721 113987 120464 108436 71416 194 30994
4402C0994L3516n5039N4551K4839k8126m180j3111K1294j5806m690J9628N8809
$$ 30994 64510 9471 64022 88861 60735 56555 43444 64738 48932 44242 63870 122679
4390A22679K0545m4082J0455J9308k6724m8007J8834m926l4133K124O4990K1992
$$ 122679 143224 99142 109597 128905 102181 54174 73008 68082 33949 36073 101063 123055
4378A23055j0410M0615j9373k6780j104K6641L1313J8073j5463l3903L534J0839
$$ 123055 112645 153260 133887 107107 106003 132644 163957 182030 166567 132664 136198 147037
4366A47037N5972j8287J5778P872l8697j5806L3785k0676r614K2861M435K1696
$$ 147037 203009 184722 200500 208372 169675 153869 187654 166978 157364 180225 184660 206356
4354B06356r630j5182j5344R425K7427J6959P83R504Q508L5451K4396q612l4782
$$ 206356 196726 181544 166200 175625 203052 220011 220794 230298 238806 274257 298653 290041 255259
4341B55259K0563K9583L0441j4762k5030O4541l9129k4604K6567J4259m8195j2168
$$ 255259 275822 305405 335846 321084 296054 360595 321466 296862 323429 337688 289493 277325
4329B77325M3233K3244N658l7679J7584m2891J6826R2626l7452J2292Q4169R634
$$ 277325 320558 343802 349460 311781 329365 286474 303300 395926 358474 370766 454935 464569
4317D64569m695l8913J9675N6921k081k2775l4579Q2699J47248K0500m5364J2320
$$ 464569 459874 420961 440636 497557 495476 472701 438122 520821 668069 688569 643205 655525
4305F55525N4574k7343j2372L7699o239k6693L1899J742P3603J2430N5959M495
$$ 655525 710099 682756 670384 708083 701844 675151 707050 708792 782395 794825 850784 855279
4293H55279M983Q1232J2852n6634J1805J8439q373N7353o227J8269l56J4838N4461
$$ 855279 860262 941494 954346 897712 909517 927956 919583 976936 970709 988978 988622 1003460 1057921
4280A057921L4116K1948O25m2603N1190K2215P54L5950J432N250J9140l0207J1943
$$ 1057921 1092037 1113985 1114610 1072007 1123197 1145412 1146166 1182116 1183548 1188798 1207938 1177731 1189674
4267A189674N0650K2991j3157n8507M8759Q0313l6353m591P375j6106P0674J6939
$$ 1189674 1240324 1263315 1250158 1191651 1240410 1320723 1284370 1279779 1287154 1271048 1341722 1358661
4255A358661K5713L1326P0327N5510K7790l177M8679j6548Q3334K7287J7171R0487
$$ 1358661 1384374 1415700 1486027 1541537 1569327 1566150 1614829 1598281 1681615 1708902 1726073 1816560
4243A816560L5382J11459Q669P3054j27L5388P8366M7682P8085J433N0801P2185
$$ 1816560 1851942 1963401 1972070 2045124 2044997 2080385 2158751 2206433 2284518 2285951 2336752 2408937
4231B408937K9147L4926R806Q8079J33903M1680n27J18712J40395R8974J10413
$$ 2408937 2438084 2473010 2482816 2570895 2704798 2746478 2745951 2864663 3005058 3104032 3214445
4220C214445J03168J74379J06257J18709J36471J40179K41308J38572R1791J09345
$$ 3214445 3317613 3491992 3598249 3716958 3853429 3993608 4234916 4373488 4465279 4574624
4210D574624K9709R6308J08083J29412J53112J68117J36352J40614J45637J23991
$$ 4574624 4604333 4700641 4808724 4938136 5091248 5259365 5395717 5536331 5681968 5805959
4200E805959R6667J03633J17749J27204J08284Q9501J20989N9974J43849J10093
$$ 5805959 5902626 6006259 6124008 6251212 6359496 6448997 6569986 6629960 6773809 6883902
4190F883902M8849P3226J17672Q4726M3872J48870R9421P6509J00931J06729J41018
$$ 6883902 6932751 7005977 7123649 7208375 7252247 7401117 7500538 7577047 7677978 7784707 7925725
4179G925725J11052Q3342J10419K21964J96534J37029J76406J63625J39775K47401
$$ 7925725 8036777 8120119 8230538 8452502 8649036 8786065 8962471 9126096 9265871 9513272
4169I513272K24220K10121J73812L39261K91646K49578K68177K90539L50459M09353
$$ 9513272 9737492 9947613 10121425 10460686 10752332 11001910 11270087 11560626 11911085 12320438
4159A2320438M45139M22109N82434O06093O36559O15715O07081N49046N40482
$$ 12320438 12765577 13187686 13770120 14376213 15012772 15628487 16235568 16784614 17325096
4150A7325096O25142O09530O64824O77944P87964P01669P65391Q55836R78892
$$ 17325096 17950238 18559768 19224592 19902536 20690500 21392169 22157560 23013396 23992288
4141B3992288J064050J091539J274110J532831J787978K034174K325913K852787
$$ 23992288 25056338 26147877 27421987 28954818 30742796 32776970 35102883 37955670
4133C7955670L443344M216460M750881N166565O049615O546206N839142M667752
$$ 37955670 41399014 45615474 50366355 55532920 61582535 68128741 73967883 78635635
4125G8635635M640181N710675O406533O806297P630202R978312J3838474J9257967
$$ 78635635 83275816 88986491 95393024 102199321 109829523 119807835 133646309 152904276
4117A52904276K0356993J0251616p431107j7653468j4618920p830368k985993
$$ 152904276 173261269 183512885 176081778 158428310 143809390 135979022 132993029
4110A32993029m94165J81934r06900n939184j2392214j3512220j1985803j0434648
$$ 132993029 132498864 132680798 131773898 125834714 113442500 99930280 87944477 77509829
4102G7509829r269452p919702o734769n657851m563500l719858l038170k615564
$$ 77509829 68240377 60320675 53585906 47928055 43364555 39644697 36606527 33990963
4094C3990963k380061k090947j926968j860796j639942j482636j340579j126009
$$ 33990963 31610902 29519955 27592987 25732191 24092249 22609613 21269034 20143025
4086B0143025r95685r54910q32494p72496p36217o23522o14130n06183m62332
$$ 20143025 19147340 18192430 17359936 16587440 15851223 15227701 14613571 14107388 13645056
4077A3645056l80364l94245l66359l47928l15746l31326l35448k91902k93895
$$ 13645056 13264692 12870447 12504088 12156160 11840414 11509088 11173640 10881738 10587843
4068A0587843j96695k17364k73114j65037k10283j59378j85770j61348k10671
$$ 10587843 10391148 10173784 9900670 9735633 9525350 9365972 9180202 9018854 8808183
4059H808183k13133j38579k02153j46904k39390l16598k00692j81788j92961k11209
$$ 8808183 8595050 8456471 8254318 8107414 7868024 7551426 7350734 7168946 6975985 6764776
4049F764776j73818j48510k33483n9389j85447j60130j66469j80645j33391j39012
$$ 6764776 6590958 6442448 6208965 6149576 5964129 5803999 5637530 5456885 5323494 5184482
4039E184482p1356r2485o5850p5425j52713n9972m4488o2005q7366r9435j11327
$$ 5184482 5113126 5020641 4954791 4879366 4726653 4666681 4622193 4560188 4472822 4373387 4262060
4028D262060q5142m0223m2229j18142j08719m3371l7232o3090n8071j13677l7534
$$ 4262060 4176918 4136695 4094466 3976324 3867605 3824234 3787002 3723912 3665841 3552164 3514630
4017C514630n8344l2052O583m5344o1026m8140p4439o6190l6317P231j9243n6237
$$ 3514630 3456286 3424234 3430817 3385473 3324447 3276307 3201868 3135678 3099361 3106592 3087349 3031112
4005C031112j1116q6406q6147q4764m0367p3901p4705j11886n0005p6997q4048
$$ 3031112 3019996 2933590 2847443 2762679 2722312 2648411 2573706 2461820 2411815 2334818 2250770
3994B250770j9808k6046n2602n2769k5327k5764k3299o0128J82q2652K7818o3581
$$ 2250770 2230962 2204916 2152314 2099545 2074218 2048454 2025155 1965027 1965209 1882557 1910375 1846794
3982A846794o2213K2930K4979L8603m4444j7773o9971L2659Q3963p9709K2196
$$ 1846794 1784581 1807511 1832490 1871093 1826649 1808876 1738905 1771564 1855527 1775818 1798014
3971A798014j13884M0842L0710q2313k4409k2380J0316J38252K7602K2167M0785
$$ 1798014 1684130 1724972 1755682 1673369 1648960 1626580 1636896 1775148 1802750 1824917 1865702
3960A865702L422N5693j21503j05865j20116j39965n1318o9885n8312l0629O687
$$ 1865702 1869124 1924817 1803314 1697449 1577333 1437368 1386050 1316165 1257853 1227224 1233911
3949A233911n700j9896J0676k4213K4475o9560n0782J3248k1465m2454j5723q844
$$ 1233911 1228211 1208315 1218991 1194778 1219253 1149693 1098911 1112159 1090694 1048240 1032517 1023673
3937A023673P611L8183K6357N4716J6569r4894L543M3952n3400l6083L6713m273
$$ 1023673 1031284 1069467 1095824 1150540 1167109 1072215 1075758 1119710 1066310 1030227 1066940 1062667
3925A062667k3946L6585P5200O623K693j9045j8040J7747n8769l9151o1787j0368
$$ 1062667 1038721 1075306 1150506 1157129 1159822 1140777 1122737 1140484 1081715 1042564 980777 970409
3913I70409M2108k1406r396J7076o587M320N6612j5180J3892J242j7066o8356
$$ 970409 1012517 991111 981715 998791 992204 996524 1053136 1037956 1051848 1053090 1036024 967668
3901I67668L6549L1444J4365L4072P4925k3624m3190M4988N1041K1954Q893j9057
$$ 967668 1004217 1035661 1050026 1084098 1159023 1135399 1092209 1137197 1188238 1210192 1219085 1200028
3889A200028K6063Q5206j7188k3773k606r4346m8819J0508K6883r287M5640j341
$$ 1200028 1226091 1311297 1294109 1270336 1267730 1173384 1124565 1135073 1161956 1152669 1198309 1196968
3877A196968l1777L2939K7738K7969K5719L3354M4180K4705j3118k842N5987O1841
$$ 1196968 1165191 1198130 1225868 1253837 1279556 1312910 1357090 1381795 1368677 1365835 1421822 1483663
3865A483663J0599J2035K5105r104Q7517J24282J4849l5567o4333j4481l6932
$$ 1483663 1494262 1506297 1531402 1522298 1609815 1734097 1748946 1713379 1649046 1634565 1597633
3854A597633j0618k7091o8914m0362l8588l81l6010N9911K7576j00875O9886K9271
$$ 1597633 1587015 1559924 1491010 1450648 1412060 1411679 1375669 1435580 1463156 1362281 1432167 1461438
3842A461438j0693K1746L7731Q5509K2922M6932J10247M0490M4479P9023M3530
$$ 1461438 1450745 1472491 1510222 1595731 1618653 1665585 1775832 1816322 1860801 1939824 1983354
3831A983354M7614n3319K1598L6930J1260L3863o3624m7882m4626K9711j0372
$$ 1983354 2030968 1977649 1999247 2036177 2047437 2081300 2017676 1969794 1925168 1954879 1944507
3820A944507o2715K4594m5459K6716O6889m138Q5578j1573L1934M3144J13947
$$ 1944507 1881792 1906386 1860927 1887643 1954532 1950394 2035972 2024399 2056333 2099477 2213424
3809B213424M1319M3990J91064J71064Q7675P5445j04363j17212L1828J4662j11788
$$ 2213424 2254743 2298733 2489797 2660861 2748536 2823981 2719618 2602406 2634234 2648896 2537108
3798B537108o7874j8317m1588K7183k3738m562j3885q2520j430K8515J03191R1443
$$ 2537108 2469234 2450917 2409329 2436512 2412774 2408212 2394327 2311807 2310377 2338892 2442083 2533526
3786B533526m4701l9449L0274O6426L0450K8652R6906O1160Q9223P9809P7113
$$ 2533526 2488825 2449376 2479650 2546076 2576526 2605178 2702084 2763244 2852467 2932276 3009389
3775C009389J8950J24099R8888K8799Q6971N4608J9033k1574N0319R0248P1693
$$ 3009389 3028339 3152438 3251326 3280125 3367096 3421704 3440737 3419163 3469482 3559730 3631423
3764C631423L7838J23763O4359P693Q4596J50682J09092L7688P4260J42015J04435
$$ 3631423 3669261 3793024 3857383 3865076 3949672 4100354 4209446 4247134 4321394 4463409 4567844
3753D567844J13727Q1513J19903L8134P9675J56305Q8816N5654J01623J53632
$$ 4567844 4681571 4763084 4882987 4921121 5000796 5157101 5245917 5301571 5403194 5556826
3743E556826J30663J32707Q2261O0759J25449J52693J67595J91284J68880K37147
$$ 5556826 5687489 5820196 5902457 5963216 6088665 6241358 6408953 6600237 6769117 7006264
3733G006264J56209K19568K57719K72109L65984M23746L51886L56585M24218L78004
$$ 7006264 7162473 7382041 7639760 7911869 8277853 8701599 9053485 9410070 9834288 10212292
3723A0212292N32049M55430M90251M81661M90310N29271P49570P27674Q17505
$$ 10212292 10744341 11199771 11690022 12171683 12661993 13191264 13940834 14668508 15486013
3714A5486013Q78549R50424J108174J382654J770302K088112K350018K920171
$$ 15486013 16364562 17314986 18423160 19805814 21576116 23664228 26014246 28934417
3706B8934417L550331M172157M828965N837355P113356R024454J1402385J4746477
$$ 28934417 32484748 36656905 41485870 47323225 54436581 63461035 74863420 89609897
3698H9609897J7361590J6344379N126481j3712348k2165180k0112185j4622136
$$ 89609897 106971487 123315866 128442347 114729999 92564819 72452634 57830498
3691E7830498r674532o778446m965823l693395k844821k348177k019735j735590
$$ 57830498 48155966 41377520 36411697 32718302 29873481 27525304 25505569 23769979
3683B3769979j452354j132153j056466j006427r73704q60344o61261n67153m56070
$$ 23769979 22317625 21185472 20129006 19122579 18148875 17288531 16627270 16060117 15604047
3674A5604047l67896k63446l77132j80327p5344k7422j39507p1408k0562l3375
$$ 15604047 15236151 14972705 14595573 14415246 14339902 14312480 14172973 14101565 14081003 14047628
3664A4047628k1681J8007N3106j465M640M0611M0062Q9211J63290J86590J36329
$$ 14047628 14025947 14043954 14097060 14095595 14100235 14140846 14180908 14270119 14433409 14619999 14756328
3653A4756328K74109L05296K04938K96393L33542K74529L34177L14846M62178
$$ 14756328 15030437 15335733 15540671 15837064 16170606 16445135 16779312 17094158 17556336
3644A7556336N16120N88544O92566O81151R31617J028393J121555J302751J479879
$$ 17556336 18072456 18661000 19353566 20034717 20966334 21994727 23116282 24419033 25898912
3635B5898912J689750K042737K414467K780377L104953L299447K855939J856320
$$ 25898912 27588662 29631399 32045866 34826243 37931196 41230643 44086582 45942902
3627D5942902N88598o64499j368273j643744j528817j106901p25702l99060K2352
$$ 45942902 46531500 45867001 44498728 42854984 41326167 40219266 39493564 39094504 39116856
3618C9116856K47587O46797R75258J338613J759875K140607K608990K983212L370913
$$ 39116856 39364443 40011240 40986498 42325111 44084986 46225593 48834583 51817795 55188708
3609E5188708L714659M276027M931698N651277O599900P316325P574919P000659
$$ 55188708 58903367 63179394 68111092 73762369 80362269 87678594 95253513 102254172
3601A02254172N790317M577154K357968n82665k917417m486971m709975m326017
$$ 102254172 108044489 112621643 114979611 114396946 111479529 106992558 102282583 97956566
3593I7956566m014556l830355l369919k394698j451187m74376J34246P78296J582148
$$ 97956566 93942010 90111655 86741736 84347038 82895851 82421475 82555721 83334017 84916165
3584H4916165K275310K806341L164332L753299M498015N187124O083693O985044
$$ 84916165 87191475 89997816 93162148 96915447 101413462 106600586 112684279 119669323
3576A19669323P686337P899754P536303P057626O077151L998035R28502k538929
$$ 119669323 127355660 135255414 142791717 149849343 155926494 159924529 160853031 158314102
3568A58314102n420379o880341p973253q764928q630906p463374n959894m441626
$$ 158314102 152893723 146013382 138040129 129275201 120644295 113180921 107221027 102779401
3560A02779401l552489k752842k015787j309630o50076m14675j1182M93852J206754
$$ 102779401 99226912 96474070 94458283 93148653 92498577 92083902 92072720 92566572 93773326
3551I3773326J873846K623931L578076M355228M536753M376918L970199L328781
$$ 93773326 95647172 98271103 101849179 106204407 110741160 115118078 119088277 122417058
3543A22417058K181444L84730k641379n795509q154841r155183q695984p572091
$$ 122417058 124598502 124983232 122341853 116546344 108391503 99236320 90540336 82968245
3535H2968245o225145n011406m088517l541344k942046k406545k102329j887662
$$ 82968245 76743100 71731694 67643177 64101833 61159787 58753242 56650913 54763251
3527E4763251j739614j561774j214748q13446m55966l1333K88815M44731M63291
$$ 54763251 53023637 51461863 50247115 49433669 48977703 48946370 49235185 49679916 50143207
3518E0143207L77062L53846K93410P0622n18900j890865l205726l966996l782680
$$ 50143207 50520269 50874115 51167525 51238147 50719247 48828382 45622656 41655660 37872980
3509C7872980l138047k420988j909731j512051j309926j125304j157400j039554
$$ 37872980 34734933 32313945 30404214 28892163 27582237 26456933 25299533 24259979
3501B4259979q57235q10632p34548p11152o48067o20526n54381n64655n42525
$$ 24259979 23402744 22592112 21857564 21146412 20498345 19877819 19323438 18758783 18216258
3492A8216258n71180m40134l50879l80562l20223k45171k93899k87348k07260
$$ 18216258 17645078 17204944 16854065 16473503 16153280 15908109 15614210 15326862 15119602
3483A5119602k16031j89302j55090k36436k02628k42661k63012j62454k57821
$$ 15119602 14903571 14714269 14559179 14322743 14120115 13877454 13614442 13451988 13194167
3474A3194167k42431j67645j48059q2722q4618o4272j46300j68374j22070j29421
$$ 13194167 12951736 12784091 12636032 12553310 12468692 12404420 12258120 12089746 11967676 11838255
3464A1838255j34953j50417j23010k0892o3166n2503j06908o4052j31379j56265
$$ 11838255 11703302 11552885 11429875 11408983 11345817 11293314 11186406 11122354 10990975 10834710
3454A0834710m1869l5722j08188n4897K9093p02m4856r4202k644l5745k1124K7033
$$ 10834710 10792841 10757119 10648931 10594034 10623127 10622425 10577569 10483367 10480723 10444978 10423854 10450887
3442A0450887N8815J06987R8265J50236J22696Q0215q3974L8565R9255J30783
$$ 10450887 10509702 10616689 10714954 10865190 10987886 11068101 10984127 11022692 11121947 11252730
3432A1252730J63765Q1575N762o1545l9513k9577P691L2331J5888N3277J68901
$$ 11252730 11416495 11498070 11503832 11442287 11402774 11373197 11380888 11413219 11429107 11482384 11651285
3421A1651285J35117J81413J76385J27529J73284J46308K18222K23587K38470
$$ 11651285 11786402 11967815 12144200 12271729 12445013 12591321 12809543 13033130 13271600
3412A3271600L24626K93433J51818K02366J57565J94258J92860K56202L05954
$$ 13271600 13596226 13889659 14041477 14243843 14401408 14595666 14788526 15044728 15350682
3403A5350682K93643K48751L69103L81800M83673N18042N48513O35598P20018
$$ 15350682 15644325 15893076 16262179 16643979 17127652 17645694 18194207 18829805 19549823
3394A9549823Q22339Q59033J015978J118424J227820J334966J443459J329740
$$ 19549823 20372162 21231195 22247173 23365597 24593417 25928383 27371842 28701582
3386B8701582R67417L98278K5292j3174K83276O48006R83406J308369J576665
$$ 28701582 29668999 30067277 30092569 30079395 30362671 31010677 31994083 33302452 34879117
3377C4879117J580320J532437J051574M83692J99234K13895M20648O80853J087453
$$ 34879117 36459437 37991874 39043448 39527140 39726374 39940269 40360917 41041770 42129223
3368D2129223J444802J756395K083297K423609K670811K641180K350979K037999
$$ 42129223 43574025 45330420 47413717 49837326 52508137 55149317 57500296 59538295
3360E9538295J716495J638257J820903K085623K153220K069475J927917J906408
$$ 59538295 61254790 62893047 64713950 66799573 68952793 71022268 72950185 74856593
3352G4856593K222997K646412L145633L071888K410622J579520Q31724K88405
$$ 74856593 77079590 79726002 82871635 85943523 88354145 89933665 90765389 91053794
3344I1053794m8190k90154l05834K44938J219669K167116K732426K681290K459368
$$ 91053794 91005604 90715450 90409616 90654554 91874223 94041339 96773765 99455055 101914423
3335A01914423K253927K394479K730411L216235L762576L981956L928224M270018
$$ 101914423 104168350 106562829 109293240 112509475 116272051 120254007 124182231 128452249
3327A28452249M875142N207265N501832O031456N865520M715222K861508J666758
$$ 128452249 133327391 138534656 144036488 150067944 155933464 160648686 163510194 165176952
3319A65176952J183182J006881J50535p25849K73826K118069L827199M984176
$$ 165176952 166360134 167367015 167517550 166791701 167065527 169183596 173010795 177994971
3311A77994971N429948N998413O344651O485954O959922P465720P448668O983074
$$ 177994971 183424919 189423332 195767983 202253937 209213859 216679579 224128247 231111321
3303B31111321O074837N479844N379358M806820L622932K274211J983418K229892
$$ 231111321 237186158 242666002 248045360 252852180 256475112 258749323 260732741 262962633
3295B62962633J930805M20556r33460k61737Q47181l79991n532564j1990229j3414336
$$ 262962633 264893438 265313994 264380534 264118797 264965978 264585987 259053423 247063194 233648858
3286B33648858j0597714o565124l176075j356328j48041J594447L543545M931557
$$ 233648858 223051144 216486020 213309945 211953617 211805576 213400023 216943568 221875125
3278B21875125M766168K380608j230934m429907o845020p781306p670404p248873
$$ 221875125 226641293 229021901 227790967 223361060 216516040 208734734 201064330 193815457
3270A93815457p181721q099798r612515j0170086q799296o180989l763828k469808
$$ 193815457 186633736 178533938 168921423 158751337 149952041 143771052 140007224 137537416
3262A37537416k329905k801978k749151k260510j540655m76569P01547J526295
$$ 137537416 135207511 132405533 129656382 127395872 125855217 125378648 126080195 127606490
3254A27606490J661302J204217L58406r51561k144793l404186m551181n063968
$$ 127606490 129267792 130472009 130830415 129878854 127734061 124329875 119778694 114714726
3246A14714726m894044m882068n299132n346405m686227l572412k504285j605617
$$ 114714726 109820682 104938614 99639482 94293077 89606850 86034438 83530153 81924536
3238H1924536o47021J25826N91127M87838j78388j415628k725501l039025k623116
$$ 81924536 81277515 81403341 81994468 82482306 82303918 80888290 78162789 75123764 72500648
3229G2500648j838416j142294r38368j089018j561587k010009k382843k438792
$$ 72500648 70662232 69519938 68581570 67492552 65930965 63920956 61538113 59099321
3221E9099321k096141j392462n99904M4616J75411k42520j125135j760043j784057
$$ 59099321 57003180 55610718 55010814 55055430 55230841 54988321 53863186 52103143 50319086
3212E0319086j346575r86282r26649j198125j633795k046793k164068j894287
$$ 50319086 48972511 47986229 47059580 45861455 44227660 42180867 40016799 38122512
3204C8122512j651453j231067r61341p36870n46286m13013m11231m96152q83651
$$ 38122512 36471059 35239992 34278651 33541781 32995495 32582482 32171251 31675099 30791448
3195C0791448j242733j410050j392784j069399q36547o73396m53116k49408k6902
$$ 30791448 29548715 28138665 26745881 25676482 24839935 24166539 23713423 23464015 23437113
3186B3437113P1867J19722p313l57546r10238j179800j196763j062604q89210
$$ 23437113 23508980 23628702 23621389 23263843 22353605 21173805 19977042 18914438 18025228
3177A8025228p17674o57957n00656m87634m59735m13564m21015l82275k96132
$$ 18025228 17307554 16649597 16148941 15661307 15201572 14788008 14366993 13984718 13688586
3168A3688586l06814l49749k44543l31462l15073k13057k27748j95812j70987
$$ 13688586 13381772 13032023 12787480 12456018 12140945 11927888 11700140 11504328 11333341
3159A1333341j41237j86000k35205j79100j88519j57023o8212j60374j62099q9416
$$ 11333341 11192104 11006104 10770899 10591799 10403280 10246257 10178045 10017671 9855572 9766156
3149I766156j40065j30002p1668l9986o8329j06309j02858m2322j26963m5868
$$ 9766156 9626091 9496089 9424421 9384435 9316106 9209797 9106939 9064617 8937654 8891786
3139H891786o4153q4737o6804o1424l1168q5051j05269k0752j7564O666l8905
$$ 8891786 8827633 8742896 8676092 8614668 8583500 8498449 8393180 8372428 8354864 8361530 8322625
3128H322625j8712n1469q1627M26K6402n2864K2168R5293K1057k509M0312P4466
$$ 8322625 8303913 8252444 8170817 8171243 8197645 8144781 8166949 8262242 8283299 8280790 8321102 8395568
3116H395568O5522N7841M6283R396M9350J00630J23518R7982N6434J52371J47404
$$ 8395568 8461090 8518931 8565214 8574610 8623960 8724590 8848108 8946090 9002524 9154895 9302299
3105I302299J11390K05089K01001J95817K43298K27386K64006L23826K86145L60307
$$ 9302299 9413689 9618778 9819779 10015596 10258894 10486280 10750286 11074112 11360257 11720564
3095A1720564M04729M96092O55065P52678Q49309J081691J205544J307619J455611
$$ 11720564 12125293 12621385 13276450 14029128 14878437 15960128 17165672 18473291 19928902
3086A9928902J847287K264172K875176L609039M511117M540936K904531k285791
$$ 19928902 21776189 24040361 26915537 30524576 35035693 39576629 42481160 40195369
3078D0195369n232539m825177l720309k364035j534954r95415o51517k76587j82952
$$ 40195369 34962830 30137653 26417344 24053309 22518355 21522940 20871423 20594836 20411884
3069B0411884J3832l079K67347M50189P41474R78631J260614J566085J844421
$$ 20411884 20425716 20422637 20689984 21140173 21881647 22860278 24120892 25686977 27531398
3060B7531398K094947K557852K726101L250906L977565N067533O217060Q177169
$$ 27531398 29626345 32184197 34910298 38161204 42138769 47206302 53423362 61600531
3052F1600531Q574236O791759k960248j0498793j0586627q553414n649613m199927
$$ 61600531 70174767 76966526 74006278 63507485 52920858 44367444 38717831 34517904
3044C4517904l045136k539048k061360j768469j477193j410423j168332q63650
$$ 34517904 31472768 28933720 26872360 25103891 23626698 22216275 21047943 20184293
3036B0184293n69257m97664j58463j24294J71409L68077O75392Q08627J119658
$$ 20184293 19615036 19117372 18958909 18834615 19006024 19374101 20049493 20858120 21977778
3027B1977778J475691J982164K541531L532292L785047L372834l56968m837960
$$ 21977778 23453469 25435633 27977164 31509456 35294503 38667337 38310369 33472409
3019C3472409n503492m709830l156876k259385j717456j286724j028007q35211
$$ 33472409 27968917 23259087 20102211 17842826 16125370 14838646 13810639 12975428
3011A2975428o92745o79091n41611m64619n50330n12572m60183l48471l00906
$$ 12975428 12282683 11603592 11061981 10597362 10047032 9534460 9074277 8725806 8424900
3002H424900k60940k61710j94343j25744j81417j19710j60874j97456k13784k16065
$$ 8424900 8163960 7902250 7707907 7582163 7400746 7281036 7120162 6922706 6708922 6492857
2992F492857j97622k04701q4918j52141j21340N417k2167p6518p4789j31680j48099
$$ 6492857 6295235 6090534 6005616 5853475 5732135 5737552 5715385 5638867 5564078 5432398 5284299
2981E284299k80443j55239p1668j01689j30465p0741p4229j13420j05704j02001
$$ 5284299 5003856 4848617 4776949 4675260 4544795 4474054 4399825 4286405 4180701 4078700
2971D078700k8777j41879r3613o6302q263r2777r2567k1832p5506q8261p3879
$$ 4078700 4049923 3908044 3814431 3748129 3739866 3647089 3554522 3532690 3457184 3368923 3295044
2960C295044j9615p1523p2247q8556j04556p7395K633k7570q4445j3876l7431
$$ 3295044 3275429 3203906 3131659 3043103 2938547 2861152 2863785 2836215 2751770 2737894 2700463
2949B700463j22079q8060m4808m7005m5812J4551l2986q6450K7224n6853k6232
$$ 2700463 2578384 2490324 2445516 2398511 2352699 2367250 2334264 2247814 2275038 2218185 2191953
2938B191953L202n0263o8765p776j02153l4068M7204j1667m9049o8436q7133r2259
$$ 2191953 2195155 2144892 2076127 2068351 1966198 1932130 1979334 1967667 1918618 1850182 1763049 1670790
2926A670790K4734k50j2455l4603J097M997k1266k3175q199n9778k9716K5983
$$ 1670790 1695524 1695274 1682819 1648216 1649313 1654310 1633044 1609869 1601670 1541892 1512176 1538159
2914A538159J0820m3009j8882l0267k0595M2406K0430J0340k2731m2662k231n7083
$$ 1538159 1548979 1505970 1487088 1456821 1436226 1478632 1499062 1509402 1486671 1444009 1441778 1384695
2902A384695O1964k9473o6516o905m1216r300m0773m6293o5726K1366k8221m975
$$ 1384695 1446659 1417186 1350670 1343765 1302549 1293249 1252476 1206183 1140457 1161823 1133602 1128627
2890A128627K7512o002p39j9073J8525n501L2073N4860L3861O4134j5522l0574
$$ 1128627 1156139 1150137 1149398 1130325 1148850 1143349 1175422 1230282 1264143 1328277 1312755 1282181
2878A282181J5252n5818l625K0097m8696l4695n4600l0085J1455m6099n2930N91
$$ 1282181 1297433 1241615 1237990 1258087 1209391 1174696 1120096 1090011 1101466 1055367 1002437 1003028
2866A003028K6931N369p863q7329q7923N1394J790M2744l472o2809j1076Q1622
$$ 1003028 1029959 1035328 1027465 940136 852213 903607 905397 948141 944669 881860 870784 952406
2854I52406M6759J7487l1412o832M5155k6441k3571n955J7773k4275J7314j0688
$$ 952406 999165 1016652 985240 978408 1023563 997122 973551 967596 985369 961094 978408 967720
2842I67720n4582J3363l6874Q315m452m449J0486J2623J5531O040J3918k0065
$$ 967720 913138 926501 889627 897942 893490 889041 899527 912150 927681 933721 947639 927574
2830I27574J340M4693L5526L0497k4178N8005l3550k76P6726M6481P2540K8349
$$ 927574 928914 973607 1009133 1039630 1015452 1073457 1039907 1039631 1116357 1162838 1235378 1263727
2818A263727j7648o6428L3080M2549m7313j4059L6043k3931M9904N0726M5208
$$ 1263727 1246079 1179651 1212731 1255280 1207967 1193908 1229951 1206020 1255924 1306650 1351858
2807A351858J7923J1011Q887M8792O3536J2066R6666Q6078O2529R7222J84232
$$ 1351858 1369781 1380792 1389679 1438471 1502007 1514073 1610739 1696817 1759346 1856568 2040800
2796B040800J01595J30459M9953Q625J3620q6973K2069q6854o8577j4237l5226
$$ 2040800 2142395 2272854 2322807 2331432 2345052 2258079 2280148 2193294 2124717 2110480 2075254
2785B075254n4643K459N4783O2914M2638J23737O7213M1377J0061R4443J54713
$$ 2075254 2020611 2023070 2077853 2140767 2183405 2307142 2374355 2415732 2425793 2520236 2674949
2774B674949Q5160J43013J52887J61341J82156J60035J36458J56766J0874j05487
$$ 2674949 2760109 2903122 3056009 3217350 3399506 3559541 3695999 3852765 3863639 3758152
2764C758152o6567n3292l7779j0684n2625l7454n2374n0524n5687R014j2290K4470
$$ 3758152 3691585 3638293 3600514 3589830 3537205 3499751 3447377 3396853 3341166 3350180 3337890 3362360
2752C362360M6277J03765N6591O4296J51360R9924J52383K58176K78768K43490
$$ 3362360 3408637 3512402 3568993 3633289 3784649 3884573 4036956 4295132 4573900 4817390
2742D817390K70654J88787J0040k98881m06063m31080l65673l68292j87593j53007
$$ 4817390 5088044 5276831 5286871 4987990 4581927 4150847 3785174 3416882 3229289 3076282
2732C076282j29934j51482r2991n6266j40204r0111n5771K7090K2434j14537R646
$$ 3076282 2946348 2794866 2701875 2645609 2505405 2415294 2359523 2386613 2409047 2294510 2304156
2721B304156J00370j04275M1618k001L5760q714R1184r228m6460n775j02472j33412
$$ 2304156 2404526 2300251 2341869 2339868 2375628 2366914 2458098 2448870 2402410 2396635 2294163 2160751
2709B160751j35878j03990k19653j27638n8642m2388l0669n7309r2336n2360o7194
$$ 2160751 2024873 1920883 1701230 1573592 1514950 1472562 1441893 1384584 1292248 1239888 1172694
2698A172694n1074m8181o3820o6579J5135K1884m8077o3168R234o1348k5143o4304
$$ 1172694 1121620 1073439 1009619 943040 958175 980059 931982 868814 878048 816700 791557 727253
2686G27253M808j1189j9993n1682o0768N2586l9656K109l9440N792l6305J3973
$$ 727253 732061 720872 700879 649197 588429 641015 601359 603468 564028 569820 533515 547488
2674E47488l05m4014p210K1110k78n6514k7936k7064R07K8624l613r306o74j8661
$$ 547488 547183 503169 495959 517069 516791 460277 432341 405277 406184 434808 431195 421889 421215 402554
2660D02554j3339j1276m5069q279j1433R85K7862l1813n40J6802k6313j6676m1990
$$ 402554 389215 377939 332870 324591 313158 314143 342005 310192 309652 326454 300141 283465 241475
2647B41475J9342M5476O030P835m0636P839k5872l3424o48r429K3549k3837m4036
$$ 241475 260817 306293 312323 320158 279522 287361 261489 228065 227417 217988 241537 217700 173664
2634A73664k1088L9096j7303l2496k2933K7202K7921O5937l6483o1504L7689J5458
$$ 173664 152576 191672 174369 141873 118940 146142 174063 240000 203517 142013 179702 195160
2622A95160m3871N55J4371k9001j867J8776K572j0330j9330q278M8671M032J5856
$$ 195160 151289 151844 166215 137214 135347 154123 156695 146365 127035 118757 167428 171460 187316
2609A87316L585l5464m2473N150L2456m2526n2070K2692K3325K81K6126j5164
$$ 187316 190901 155437 112964 118114 150570 108044 55974 78666 101991 102272 128398 113234
2597A13234J9657J075K0108m504l7783n626r981k1403l3793M0155J5835K320j0190
$$ 113234 132891 133966 154074 149570 111787 106161 96180 74777 40984 81139 96974 99294 89104
2584H9104K8511K3544r014N871j6994n8529J212K1851L6039p493N411k006p3240
$$ 89104 117615 141159 132145 138016 121022 62493 63705 85556 121595 114102 119513 117507 44267
2571D4267J1310q694r354N1255j0653r101K7859J1196r548Q723k5032l6978J5671
$$ 44267 55577 46883 37529 88784 78131 69030 96889 108085 98537 107260 82228 45250 60921
2558F0921k6054j4138O4561K9285J0598o8419q431p723j0734n155K8564L8093
$$ 60921 34867 20729 85290 114575 125173 56754 48323 40600 29866 24711 53275 91368
2546I1368K8564l214m5776j6173p560l0119K4574N2835L5286o470p7341q043L8968
$$ 91368 119932 116718 70942 54769 47209 17090 41664 94499 129785 123315 45974 37931 76899
2533G6899P5697l6378l3776j3623o1345O679L3165N8984J9896p1236k4486J9571
$$ 76899 152596 116218 82442 68819 7474 14153 47318 106302 126198 54962 30476 50047
2521E0047j4388J3905M075j897j1079J8503j0802j2788M8976l6356n395M8167
$$ 50047 35659 49564 53639 51742 40663 59166 48364 35576 84552 48196 42801 90968
2509I0968N583j1186q4197k241K1463M897K9511k1011P0315p6988J7288J9371
$$ 90968 96551 85365 1168 -1073 20390 25287 54798 33787 104102 27114 44402 63773
2497F3773l0445L5964l3123K8589n309k4608L6888k268J1392L6345Q614n3858
$$ 63773 33328 69292 36169 64758 59449 34841 71729 69461 80853 117198 125812 71954
2485G1954q0991m5586N5242k0120K1071L8475J5338k675m1410K3852k5388M3648
$$ 71954 -9037 -54623 619 -19501 1570 40045 55383 52708 11298 35150 9762 53410
2473E3410L3847l6773l7350l013N778o945L792k900K4078o744j511L6820n4742
$$ 53410 87257 50484 13134 10121 15899 8954 12746 9846 33924 27180 25669 62489 7747
2460G747L2206k173J9489J9329P295n4191N4640j5854N131k3165p6280K3209Q274
$$ 7747 39953 37780 57269 76598 83893 29702 84342 68488 73619 50454 -25826 -2617 5657
2447E657L9539k2436j0883m2985N6394n097j2700l26k3856K0550K7532M8753N34
$$ 5657 45196 22760 11877 -31108 25286 20189 7489 7163 -16693 3857 31389 80142 80676
2434H0676k625l3642m3820l0J3816J7352j5461L5368j4878N155p4624n57J3955
$$ 80676 78051 44409 589 559 14375 31727 16266 51634 36756 41911 -32713 -33270 -19315
2421a9315K5882J1461o362Q4125k4062k528r8837J2582N1211L5034N12o6313k3412
$$ -19315 6567 18028 11666 95791 71729 69201 -29636 -17054 34157 69191 69703 3390 -20022
2408b0022l1467l6161J2005K3781J4105J4672L7506j1675m5360p954j2208L3433
$$ -20022 -51489 -87650 -75645 -51864 -37759 -23087 14419 2744 -42616 -50570 -62778 -29345
2396b9345k2536L7623J7255j6011n616j5334o120K5947p1827J8159L0342O0035
$$ -29345 -51881 -14258 2997 -13014 -18630 -33964 -40084 -14137 -85964 -67805 -37463 22572
2384B2572k2463k598R96k481O651K0154k2979K8585m7174r335M6759n1962O846
$$ 22572 109 -2489 -1493 -3974 2677 22831 -148 28437 -18737 -28072 18687 -33275 -26429
2371b6429m5085O5543J179M9739j9301n6072P777K6310l6688J4720J9866m3021
$$ -26429 -71514 -5971 -4792 44947 25646 -30426 -22649 3661 -33027 -18307 1559 -41462
2359d1462k1141m740L1633J6041J0901j9238j0120p1432O3276J8475l5943L8964
$$ -41462 -62603 -67343 -35710 -19669 -8768 -28006 -38126 -109558 -46282 -27807 -63750 -24786
2347b4786J070K1527P447l8887j251O61n5761L0122J0632j7496M0908K3542k1840
$$ -24786 -23716 -2189 5258 -33629 -34880 -34219 -89980 -59858 -49226 -66722 -25814 -2272 -24112
2334b4112r471k1177J4205j5490K3298O737M8814n1581o0265N9482k014l5729
$$ -24112 -33583 -54760 -40555 -56045 -32747 -26010 22804 -28777 -89042 -29560 -31574 -67303
2322f7303K6135N652j6561n8479M6475N3582k2168J5702R409J4174p186k56l9836
$$ -67303 -41168 -35516 -52077 -110556 -64081 -10499 -32667 -16965 -7556 6618 -568 -824 -40660
2309d0660J2991L1876m8902r131R575K9146K7408l655m0767j5717Q990o192L1135
$$ -40660 -27669 4207 -44695 -53826 -44251 -15105 12303 8648 -32119 -47836 -38846 -45038 -13903
2296a3903j1952J2608l893l1154L8059M8320n6584k8690j4266M5352P6974o9802
$$ -13903 -25855 -13247 -17140 -48294 -10235 38085 -18499 -47189 -61455 -16103 60871 -8931
2284h931j4957J7217q0q8337M1530J5638K696O497J9011k6967L1161q18K7557
$$ -8931 -23888 -6671 -6751 -95088 -53558 -37920 -35224 -28727 -9716 -36683 -5522 -6340 21217
2271B1217r951K4810k1883K979K8578L7279l5888o3201O1051P0115k096l3641
$$ 21217 11266 36076 14193 17172 45750 83029 47141 -16060 44991 115106 113010 79369
2259G9369m5509L5513R2711n7850m2039p6384L5267M588j7552N486l5603J4178
$$ 79369 33860 69373 162084 104234 62195 -14189 21078 25666 8114 13600 -22003 -7825
2247g825J1087K2688M0537n9042N924l8722J0072n439k1974n962M8586j8260M9475
$$ -7825 3262 25950 66487 7445 13369 -25353 -15281 -20720 -42694 -48656 -70 -18330 31145
2234C1145K3390m4399m0019J4163k4373k416J8033M8025J8354j3725J9945m299
$$ 31145 54535 10136 -29883 -15720 -40093 -42509 -24476 23549 41903 28178 48123 43824
2222D3824k9812j9388l0581l0470L5141j0716K6478N9551m9091L875l4376J7968
$$ 43824 14012 -5376 -35957 -66427 -31286 -42002 -15524 44027 -5064 -1189 -35565 -17597
2210a7597J8976K2360K75j3717K2549j5440m6662J687M24o658M2534K7465o8878
$$ -17597 1379 23739 24014 10297 32846 17406 -29256 -27569 -27145 -33803 8731 36196 -32682
2197c2682K3321J1183K2177l6356J578M0626l6684J3740L6540p427k6047k0431
$$ -32682 -9361 1822 23999 -12357 -10779 29847 -6837 6903 43443 36016 9969 -10462
2185a0462N8104m4486r311M8548n0156K6821N0442l2581l702L0661P282k7446
$$ -10462 47642 3156 -6155 42393 -7763 19058 69500 36919 33217 63878 71160 43714
2173D3714k2484J2306J3484O109j9180K912J186O4778p0214j4047J3069k9045
$$ 43714 21230 33536 47020 53129 33949 36861 38047 102825 32611 18564 31633 2588
2161B588N284K4275L6373L8351J077m6483l129o8616j6410K0081P3727M6316k8995
$$ 2588 7872 32147 68520 106871 107948 61465 58336 -10280 -26690 -6609 67118 113434 84439
2148H4439j5966k8341M9022m4632N226J6009O0630m9250M4824k5204L4635l5090
$$ 84439 68473 40132 89154 44522 49748 65757 126387 77137 121961 96757 131392 96302
2136I6302j1242L4746j4358p0694K1020K5228l5596K6657K9173K728j3230O6153
$$ 96302 85060 119806 105448 34754 55774 81002 45406 72063 101236 103964 90734 156887
2124A56887l0944m8066n811K6971M6279l1461N526P410O711J705q729O6140J3548
$$ 156887 125943 77877 72066 99037 145316 113855 119381 126791 133502 135207 126478 192618 206166
2111B06166k7638P000K2154J7566l1425M2920K1143O682M7960l3310Q252L3291
$$ 206166 178528 185528 207682 225248 193823 236743 257886 264568 312528 279218 287470 320761
2099C20761L0020l3014L3428L0686l3893K5565q007K9789M8539K8979J8618P059
$$ 320761 350781 317767 351195 381881 347988 373553 365546 395335 443874 472853 491471 498530
2087D98530p0154K0111J0048L1638L6026K4804M5934M4462L3128K9443n064M4457
$$ 498530 428376 448487 458535 490173 526199 551003 596937 641399 674527 703970 698906 743363
2075G43363n547J8037L057K8144N0416N382j5841O8983M2046L7076J3665Q580
$$ 743363 737816 755853 758910 787054 837470 842852 827011 895994 938040 975116 988781 997361
2063I97361r15k575P8475L7515N5848K3289N5206L924N7993J05618O356Q2626
$$ 997361 996446 993871 1072346 1109861 1165709 1188998 1244204 1248128 1306121 1411739 1418095 1500721
2051A500721J18549Q1373J61300J31191M7507R4806J35702J73778J22478J35200
$$ 1500721 1619270 1700643 1861943 1993134 2040641 2135447 2271149 2444927 2567405 2702605
2041B702605J91319J89101K63192K65880K48423K42854L81184M38329N54590N36472
$$ 2702605 2893924 3083025 3346217 3612097 3860520 4103374 4484558 4922887 5477477 6013949
2031F013949N23029O28386P99157J071141J210895J467298J870538K250385K952504
$$ 6013949 6536978 7165364 7964521 9035662 10246557 11713855 13584393 15834778 18787282
2022A8787282L602199M826051M974853M360760k334241o607275n972090m783545
$$ 18787282 22389481 27215532 32190385 36551145 34216904 27609629 21637539 16853994
2014A6853994k932923k256585j575398j194287q30416p79896n38926n23718l94835
$$ 16853994 13921071 11664486 10089088 8894801 8064385 7284489 6745563 6221845 5827010
2005E827010l93165m58117m52876l52302l81199l12768k52062k07004k28849j10309
$$ 5827010 5433845 4975728 4522852 4170550 3789351 3476583 3224521 3017517 2788668 2678359
1995B678359j48631r0552j66815o2093r6252m0209p6609r5547l4062n1708j90220
$$ 2678359 2529728 2439176 2272361 2210268 2114016 2073807 1997198 1901651 1867589 1815881 1625661
1984A625661n6322n1468o5700q7113l4409q3199m390o4877n8816j2887l1032o6912
$$ 1625661 1569339 1517871 1452171 1365058 1330649 1247450 1243060 1178183 1119367 1106480 1075448 1008536
1972A008536k0903o2928n5203J0325M440l6457l2034k1059k6209r404l1795J6587
$$ 1008536 987633 924705 869502 879827 884267 847810 815776 794717 768508 759104 727309 743896
1960G43896k5362k2532l8775m5903l0264P8867m6683l7211K8992M1722k6423p8466
$$ 743896 718534 696002 657227 611324 581060 659927 613244 576033 605025 646747 620324 541858
1948E41858m4041k1611k6467k6375K8641L0293p7316k551J8518m0852L0018o5872
$$ 541858 497817 476206 449739 423364 452005 482298 404982 402431 420949 380097 410115 344243
1936C44243M3219k858q2343M0334m1995K6787k9787n5625J8443L5979k7730j01818
$$ 344243 387462 384604 302261 342595 300600 327387 297600 241975 260418 296397 268667 166849
1924A66849Q194J3119K1260l153j746j6666l1890N1068r223k1556M691k996m7510
$$ 166849 175043 188162 209422 206269 204523 187857 155967 207035 197812 176256 180947 177951 130441
1911A30441m1189N2989L3517Q943o1298L4435J4980l8717L4787L6016q4577j0320
$$ 130441 89252 142241 175758 184701 123403 157838 172818 134101 168888 204904 120327 110007
1899A10007M1701j2607r921l6174p8528L7842O7277N5223p0985k1745r976L9714
$$ 110007 151708 139101 129180 93006 14478 52320 119597 174820 103835 82090 72114 111828
1887A11828l1877k5254l155J7853L6027l0457l398j7438K6451o223J0017P178
$$ 111828 79951 54697 51542 69395 105422 74965 71567 54129 80580 74357 84374 91552
1875I1552k1049l9591J3180N054K0038J2357l6746O762J477n8751k7514k3655
$$ 91552 70503 30912 44092 49146 69184 81541 44795 51557 53034 -5717 -33231 -56886
1863e6886R6061M7046p7283j7751N1119j660p230K3243l7563q836L0523o3033
$$ -56886 39175 86221 8938 -8813 42306 40646 33416 56659 19096 10260 40783 -22250
1851b2250k1992q479j6512K8673Q2536q449k0359J3148k7958m98K0053M7158k6643
$$ -22250 -44242 -52721 -69233 -40560 41976 33527 13168 26316 -1642 -2140 17913 65071 38428
1838C8428m4561N5205l2408j6743p01J9216k808l21k1849m398R413J8397l4162
$$ 38428 -6133 49072 16664 -79 -780 18436 15628 15307 -6542 -10940 -1527 16870 -17292
1825a7292J5921P590j8342J2981P323J6915K6172j1710j6707n2684O3190J3830
$$ -17292 -1371 6219 -12123 858 8181 25096 51268 39558 22851 -29833 33357 47187
1813D7187o028m1491L378K4422l7791K8902L1386o7161L3413L2237m4356K5587
$$ 47187 41159 -332 3046 27468 -10323 18579 49965 -17196 16217 48454 4098 29685
1801B9685J3220J0566j2222J2097l0231l5486L350Q332L413N8933J1506k108m3248
$$ 29685 42905 53471 41249 53346 23115 -12371 -9021 -689 2724 61657 73163 71055 27807
1788B7807L8544k4436J033l9330P778N9954l307P5932m0227n64K4217K7584J5969
$$ 27807 66351 41915 42948 3618 11396 71350 68043 143975 103748 103184 127401 154985 170954
$$ [...]
##END NTUPLES=NMR SPECTRUM
##END=
