##TITLE=1H_EC-3261(1)
 CDCl3, 8 sc, 
 25.08.2021
##JCAMPDX= 6.0         $$ Bruker NMR JCAMP-DX V2.0
##DATA TYPE= NMR SPECTRUM
##DATA CLASS= NTUPLES
##ORIGIN= UXNMR, Bruker Analytische Messtechnik GmbH
##OWNER= root
$$ XWIN-NMR		Version 3.5
$$ Wed Aug 25 11:32:07 2021 Russian Standard Time (UT+4h)  she@DPX200
##.OBSERVE FREQUENCY= 200.131506
##.OBSERVE NUCLEUS= ^1H
##.ACQUISITION MODE= SIMULTANEOUS
##.ACQUISITION SCHEME= undefined
##.AVERAGES= 8
##.DIGITISER RES= 18
##SPECTROMETER/DATA SYSTEM= spect
##.PULSE SEQUENCE= zg30
##.SOLVENT NAME= CDCl3
##.SHIFT REFERENCE= (INTERNAL, CDCl3, 0, 17.4983)
##AUDIT TRAIL= $$ (NUMBER, WHEN, WHO, WHERE, WHAT)
$$ ##TITLE= Audit trail, XWIN-NMR		Version 3.5
$$ ##JCAMPDX= 5.01
$$ ##ORIGIN= Bruker BioSpin GmbH
$$ ##OWNER= she
$$ F:/spectra/data/she/nmr/H-F/1/pdata/1/auditp.txt
$$ ##AUDIT TRAIL=  $$ (NUMBER, WHEN, WHO, WHERE, WHAT)
(   1,<2021-08-25 11:30:30.06 +0400>,<she>,<DPX200>,
      <created by zg, POWCHK disabled, PULCHK disabled
       configuration hash MD5:
       00 E9 B6 7A A2 85 ED C7 34 08 36 98 17 FE 4E 26
       data hash MD5: 16K
       20 E5 9E 10 C6 B0 09 CC FA 31 BB 05 CE 6C 52 EC>)
(   2,<2021-08-25 11:30:32.54 +0400>,<she>,<DPX200>,
      <Start of raw data processing
       efp BC_mod = 2 LB = 0.24 FT_mod = 6 PKNL = 1 PHC0 = -13363.54 PHC1 = 22.80099 SI = 16K 
       data hash MD5: 16K
       41 B2 24 E9 E7 4B 46 32 E7 28 C3 06 5D DB A4 FD>)
(   3,<2021-08-25 11:31:01.67 +0400>,<she>,<DPX200>,
      <pk PHC0 = 5.610851 PHC1 = -8.4 
       data hash MD5: 16K
       55 2C 80 3D 88 AB 48 06 52 56 D7 6F FA 8B 3B BE>)
(   4,<2021-08-25 11:31:05.59 +0400>,<she>,<DPX200>,
      <abs ABSG = 5 
       data hash MD5: 16K
       65 D6 0E 53 68 6B B1 46 FF C4 7F A4 5C 31 A9 BB>)
$$ ##END=
$$ 
$$ hash MD5
$$ 29 B3 1B 53 64 39 27 19 05 4B EC 7E 0B BB CA 59
##$RELAX= 
##$RELAX= 
##$RELAX= 
##$RELAX= 
##$RELAX= 
##$RELAX= 
$$ Bruker specific parameters
$$ --------------------------
##$DU= <F:/spectra>
##$EXPNO= 1
##$NAME= <H-F>
##$PROCNO= 1
##$TYPE= <nmr>
##$USER= <she>
##$AMP= (0..31)
100 100 100 100 100 100 100 100 100 100 100 100 100 100 100 100 100 100 
100 100 100 100 100 100 100 100 100 100 100 100 100 100 
##$AQSEQ= 0
##$AQ_mod= 1
##$AUNM= <au_zg>
##$AUTOPOS= <>
##$BF1= 200.13
##$BF2= 200.13
##$BF3= 200.13
##$BF4= 200.13
##$BF5= 200.13
##$BF6= 200.13
##$BF7= 200.13
##$BF8= 200.13
##$BYTORDA= 1
##$CFDGTYP= 0
##$CFRGTYP= 5
##$CHEMSTR= <none>
##$CNST= (0..31)
1 1 145 1 1 1 1 1 1 1 1 1 1 1 1 1 1 1 1 1 1 1 1 1 1 1 1 1 1 1 1 1 
##$CPDPRG= <>
##$CPDPRG1= <>
##$CPDPRG2= <>
##$CPDPRG3= <>
##$CPDPRG4= <mlev>
##$CPDPRG5= <mlev>
##$CPDPRG6= <mlev>
##$CPDPRG7= <mlev>
##$CPDPRG8= <mlev>
##$CPDPRGB= <>
##$CPDPRGT= <>
##$D= (0..31)
0 1.2 0 0 0 0 0 0 0 0.06 0 0.03 0 0 0 0 0.0002 0 0 0 0 0 0 0 0 0 0 0 0 
0 0 0 
##$DATE= 1629876629
##$DBL= (0..7)
120 120 120 120 120 120 120 120 
##$DBP= (0..7)
150 150 150 150 150 150 150 150 
##$DBP07= 0
##$DBPNAM0= <>
##$DBPNAM1= <>
##$DBPNAM2= <>
##$DBPNAM3= <>
##$DBPNAM4= <>
$$ [...]
##$SUBNAM3= <"">
##$SUBNAM4= <"">
##$SUBNAM5= <"">
##$SUBNAM6= <"">
##$SUBNAM7= <"">
##$SUBNAM8= <"">
##$SUBNAM9= <"">
##$SW= 20.0188882624521
##$SWIBOX= (0..15)
0 0 2 0 0 0 0 0 0 0 0 0 0 0 0 0 
##$SW_h= 4006.41025641026
##$TD= 16384
##$TD0= 1
##$TE= 0
##$TE2= 300
##$TE3= 300
##$TEG= 300
##$TL= (0..7)
0 120 120 120 120 120 120 120 
##$TP= (0..7)
150 150 150 150 150 150 150 150 
##$TP07= 0
##$TPNAME0= <>
##$TPNAME1= <>
##$TPNAME2= <>
##$TPNAME3= <>
##$TPNAME4= <>
##$TPNAME5= <>
##$TPNAME6= <>
##$TPNAME7= <>
##$TPOAL= (0..7)
0.5 0.5 0.5 0.5 0.5 0.5 0.5 0.5 
##$TPOFFS= (0..7)
0 0 0 0 0 0 0 0 
##$TUNHIN= 0
##$TUNHOUT= 0
##$TUNXOUT= 0
##$USERA1= <user>
##$USERA2= <user>
##$USERA3= <user>
##$USERA4= <user>
##$USERA5= <user>
##$V9= 5
##$VALIST= <valist>
##$VCLIST= <CCCCCCCCCCCCCCC>
##$VD= 0
##$VDLIST= <DDDDDDDDDDDDDDD>
##$VPLIST= <PPPPPPPPPPPPPPP>
##$VTLIST= <TTTTTTTTTTTTTTT>
##$WBST= 1024
##$WBSW= 4
##$XGAIN= (0..3)
0 0 0 0 
##$XL= 0
##$YL= 0
##$YMAX_a= 123182
##$YMIN_a= -179776
##$ZGOPTNS= <>
##$ZL1= 120
##$ZL2= 120
##$ZL3= 120
##$ZL4= 120
##$ABSF1= 17.42746
##$ABSF2= -2.591578
##$ABSG= 5
##$ABSL= 3
##$ALPHA= 0
##$AQORDER= 0
##$ASSFAC= 0
##$ASSFACI= 0
##$ASSFACX= 0
##$ASSWID= 0
##$AUNMP= <proc_1d>
##$AZFE= 0.1
##$AZFW= 0.1
##$BCFW= 0
##$BC_mod= 2
##$BYTORDP= 0
##$COROFFS= 0
##$CY= -3
##$DATMOD= 1
##$DC= 0
##$DFILT= <>
##$DTYPP= 0
##$F1P= 0
##$F2P= 0
##$FCOR= 1
##$FTSIZE= 16384
##$FT_mod= 6
##$GAMMA= 0
##$GB= 0
##$INTBC= 1
##$INTSCL= 1.334414e-10
##$ISEN= 128
##$LB= 0.24
##$LEV0= 0
##$LPBIN= 0
##$MAXI= 10000
##$MC2= 0
##$MEAN= 0
##$ME_mod= 0
##$MI= 1.114404
##$NCOEF= 0
##$NC_proc= -7
##$NLEV= 6
##$NOISF1= 3.799351
##$NOISF2= 2.8
##$NSP= 0
##$NTH_PI= 0
##$NZP= 0
##$OFFSET= 17.49833
##$PC= 1
##$PHC0= -13357.93
##$PHC1= 14.40099
##$PH_mod= 1
##$PKNL= yes
##$PPARMOD= 0
##$PSCAL= 0
##$PSIGN= 0
##$REVERSE= no
##$SF= 200.130007264492
##$SI= 16384
##$SIGF1= 3
##$SIGF2= 2
##$SINO= 5.538805
##$SIOLD= 16384
##$SREGLST= <1H.CDCl3>
##$SSB= 0
##$STSI= 16384
##$STSR= 0
##$SW_p= 4006.41025641026
##$SYMM= 0
##$S_DEV= 0
##$TDeff= 16384
##$TDoff= 0
##$TI= <>
##$TILT= no
##$TM1= 0
##$TM2= 0
##$TOPLEV= 0
##$USERP1= <user>
##$USERP2= <user>
##$USERP3= <user>
##$USERP4= <user>
##$USERP5= <user>
##$WDW= 1
##$XDIM= 16384
##$YMAX_p= 346548388
##$YMIN_p= -608006
$$ End of Bruker specific parameters
$$ ---------------------------------
##NTUPLES= NMR SPECTRUM
##VAR_NAME=  FREQUENCY,     SPECTRUM/REAL,   SPECTRUM/IMAG
##SYMBOL=    X,             R,               I
##VAR_TYPE=  INDEPENDENT,   DEPENDENT,       DEPENDENT
##VAR_FORM=  AFFN,          ASDF,            ASDF
##VAR_DIM=   16384,         16384,           16384
##UNITS=     HZ,            ARBITRARY UNITS, ARBITRARY UNITS
##FACTOR=    0.24454680195387, 1,            1
##FIRST=     3501.94074242714, 0,            0
##LAST=      -504.469513983119, 0,           0
##MIN=       -504.469513983119, -608006,     0
##MAX=       3501.94074242714, 346548388,    0
$$ Real data points
##PAGE= N=1
##DATA TABLE= (X++(R..R)), XYDATA
$$ [...]
7985B075910k23402k16639j67365L980M3895m6103k68184j9104K5314n5149J25374
7974A278527O9091n5278N573R2773l13380k01256R2601K18615k01257l23738j22295
7963E39976J25807J15956k5943k23216j25990J0353J72052N8600j17486N9643
7953E89752J00519q9793j7036n1483P1285R2077J1053n6485q1201q9948k07902
7942B70838l8752j30471O4410J71384n1229j2830K92599l9994o5393J48160p7331
7931E31391l29348j16522J81213J30691N059p2768r5666Q6573l2562r9162k6424
7920A62475N6180J3026j40249O5093K50365o2735j12055j7362J0352p2895J14493
7909B66688J21128p8181l2385q0547L6811o3731J36768k55324j06739J50265K8657
$$ y = [2075910, 1852508, 1635869, 1468504, 1472484, 1516379, 1470276, 1202092, 1182988, 1208302, 1153153, 1278527, 1347618, 1292340, 1297913, 1390686, 1077306, 876050, 968651, 1187266, 986009, 662271, 539976, 665783, 781739, 755796, 532580, 406590, 416943, 588995, 647595, 530109, 589752, 690271, 600478, 583442, 531959, 603244, 695321, 706374, 649889, 568688, 478740, 270838, 232086, 101615, 166025, 337409, 286180, 273350, 565949, 525955, 460562, 608722, 531391, 202043, 85521, 266734, 397425, 402484, 329716, 234050, 320623, 288061, 188899, 162475, 218655, 231681, 91432, 156525, 406890, 344155, 232100, 214738, 225090, 152195, 266688, 387816, 309635, 277250, 196703, 233514, 169783, 306551, 51227, -55512, 94753, 123410]
7898A23410n2620m2509K40887q1692l7654N453k9870J4489Q1520j47984L2420
7887A05850J07400j26410m3915J89584l8013P3732K466J9304K09354k72918P2910
7876B99344k38955O7304P975K03454k48108j60372j11778O490J70934r5092J48888
7865E0084J22827k21954O7248J82073j07017P5567j97512J16830J2950P2719j30094
7854D3721r436r0337p4786J11908N9467n3415j12558J38249r6607L7309J80051
7843A33566k07710n4735L15145j54135j30786K0093P4349O5136j84572j65957
7833b89606J53194Q6617j00631q9812o8083J10523J46296M5454o4035J62932Q1494
7822A74343k7791J12125m1091p4129J187r824o5272p1681p6129k47859m9173L8708
$$ y = [123410, 70790, 28281, 269168, 187476, 149822, 155275, 125405, 139894, 221414, 73430, 105850, 213250, 86840, 42925, 232509, 194496, 268228, 270694, 289998, 499352, 226434, 299344, 60389, 127693, 135668, 339122, 91014, -69358, -181136, -174646, -3712, -98804, 50084, 172911, -49043, 18205, 200278, 93261, 168828, -28684, 88146, 101096, 173815, 43721, 34285, -56052, -130838, -18930, 40537, -12878, -125436, 12813, -83794, -46485, 133566, -74144, -128879, 186266, 32131, -98655, -78562, -4213, 60923, -123649, -289606, -136412, -49795, -150426, -240238, -308321, -197798, -51502, -6048, -70083, 92849, 174343, 146552, 258677, 217586, 143457, 144644, 134820, 69548, -2133, -78262, -326121, -375294, -336586]
7810c36586L58049K943j42136J5716O662p6563q705j88656J12476K79800o7771
7799d4771j34345K7054J54525J02663k43474J4321o719J23075K08248j81557K21751
7788B40771k09902M5676j19370l1555j38865j20447K48463N1828j44351R5221
7778h2531m2823m400k5340J8034n2016l0436J47318J50175j26469j48396L6057
7767a60827j92157J27826K37537J32602Q3513l0587j04018J76103k05668j27717
7757f3393j49700J51613j18708J65012J49135k10514J08039P6023j7577N6706
7747A46636N2117k05251r3621J4877P1472r6909K32913j74201M6424L5520l4951
7736d974j28186p22o3997J66160l1273l3275J70353J48269R3821l17663M5897
$$ y = [-336586, 21463, 24406, -117730, -102014, -95352, -171915, -180620, -369276, -256800, 23000, -44771, -179116, -152062, 2463, 105126, -138348, -124027, -130746, -7671, 200577, 19020, 240771, 30869, 76545, -42825, -74380, -213245, -333692, -85229, -33401, -177752, -82531, -125354, -129754, -155094, -137060, -189076, -219512, -72194, 77981, -48488, -196884, -160827, -352984, -225158, 12379, 144981, 228494, 197907, 93889, 269992, 64324, -63393, -213093, -61480, -180188, -15176, 133959, -76555, 31484, 107507, 89930, 146636, 198753, -6498, -100119, -85242, -13770, -110679, 122234, -51967, -5543, 29977, -4974, -133160, -133882, -197879, -31719, -62992, -96267, 74086, 222355, 316176, -1487, 44410]
7725D4410j03256P84k8958M2191J23426Q9164j59073k3650l7240o5566J48873
7714C1105N7741j22682j71542L56715L437j51923K37207j99313N9175k86015J46214
7703c9881K9464o4556N3128J94024k2671j00883K0211m04317K45628l4752J98298
7692G3693J49159k55207R8512J53831r9154j59555N5523j39536M2931k3008J19369
7681A6558J21633j5213j16045o0934J08425J30896m4587k02629m3975K06174J44047
7670B44350o3749q2701K7538l40720r853J80268m3236J50691q8827p865L9337
7659E233j35388p9769L35794j44787j70641K28336K97322M7505j86644k98555
7649a01594L2469j13589R079J68003J89143r195k29286L4368J45248M835K0389
$$ y = [44410, -58846, -58062, -87020, -44829, 78597, 167761, 8688, -14962, -52202, -117768, 31105, 88846, -33836, -205378, 151337, 154774, 2851, 240058, 40745, 99920, -186095, -39881, -10417, -74973, -21845, 172179, 149508, 48625, 68836, -335481, -89853, -124605, 73693, 222852, -32355, 66157, 219988, 120834, -38721, 16802, -122734, -79803, -102811, 16558, 138191, 122978, 6933, -54001, 54424, 185320, 140733, -61896, -105871, 100303, 244350, 180601, 97900, 125438, -215282, -225135, -44867, -88103, 62588, -26239, -34104, 5233, -130155, -209924, 125870, -18917, -189558, 38778, 336100, 383605, 196961, -101594, -69125, -182714, -173635, -5632, 183511, 174316, -54970, -20602, 124646, 129481, 149870]
7638A49870j51887l9638J01711J52656r0455q8514j49563J96845K76263j29077
7628B28211j25922j02419J19366k04671J8008J62346J39920j35070j7966M966
7618H6769J01754Q4919k04428j98277R8026q3355K12658m7436j75594L63312k25700
7607A2648O6534Q1174r7176j31269L7671p2805K20203o763k60499J7695N1489
7596h1098k26730m9270K74431K04084j73629k33546p8365J63508L6862l8419J18340
7585h3832k97896K53829Q3568j82299L35544J5838M0320R7820j62615j35113r5076
7574a29912m4014n3867K0897k5893j047K59822O4347n0926p3055R0902j10699
7563e3445k3011Q6549j36213Q1528l6941M2128L822R7668n3915j09223L9567j10062
$$ y = [149870, -2017, -41655, 60056, 212712, 122257, 33743, -115820, 81025, 357288, 228211, 102289, -130, 119236, -85435, -67427, 94919, 234839, 99769, 81803, 86769, 188523, 273442, 69014, -129263, -31237, -114592, 98066, 50630, -124964, 238348, 12648, 79182, 160356, 63180, -68089, -30418, -103223, 116980, 110217, -150282, -132587, -81098, -307828, -357098, -82667, 121417, -52212, -285758, -364123, -200615, -163753, -202172, -83832, -381728, -127899, -44331, -226630, 108914, 124752, 165072, 262892, 100277, -34836, -129912, -173926, -227793, -206896, -232789, -233836, 25986, 90333, 39407, -33648, 57254, -53445, -76456, 10093, -126120, -44592, -81533, -39405, -35583, 62085, 8170, -101053, -61486, -171548]
7551a71548k8412J06578J68240J595m61353K31934P22J47990J30683n5513P2340
7540A43256k45425j07229J34447K6244J6582r7388j06855P4962J22221j15906
7530a55091N7286J21995l9260r7907J26752n2758j972J07481k37117Q4608k7578
7519a13561O2694l5734J56851O4872j34386P8676o0886j46179r973J39240p1311
7508f9697r0384J0776K21356o6917j32819L3223M4050L186L0724j01104n2518
7497a70124r402M7693q1429L165l4198n253J17829j16313J08508J40073k81594
7486b81045j69081K68491j85435K39960J41532n6550J16252j44833k6908N2340
7476d5277K69745j54129k17770J10348k53979l9800K47878M1538K27147P3294
$$ y = [-171548, -199960, -93382, 74858, 76453, -384900, -152966, -152244, -4254, 126429, 70916, 143256, -102169, -209398, -74951, -48707, -32125, -129513, -236368, -161406, -39185, -155091, -97805, 24190, -15070, -112977, 13775, -38983, -40955, 66526, -170591, -85983, -113561, -50867, -86601, 70250, 135122, 736, 79412, 18526, -127653, -137626, 1614, -69697, -160081, -149305, 72051, 5134, -127685, -94462, -50412, -47226, -16502, -117606, -170124, -179526, -131833, -213262, -210097, -244295, -249548, -131719, -248032, -139524, 549, -281045, -450126, -181635, -367070, -127110, 14422, -42128, 74124, -70709, -97617, -45277, 224468, 70339, -147431, -37083, -291062, -330862, -82984, -41446, 185701, 258995]
7466B58995k46418M6530p493j24675j03232j51027K21236K45098k12064j70816
7456b43866k5938J59306l10994K43165j26919j18949J61380M2843J77772q763
7446e0963p601l2144Q537M3784j84232O4621N2715K15187J60437k52466j6048
7435A827j31721J4304J62293j41479J80131p5920q3714r095P8261k11659J74517
7424d2255P9895j49927L2726j97248L53887j28154j18896q2621j84349J07139
7414c29803k6083K47340J68476j32062o456n1990P6173m5369J78186N1362j12368
7403A7406q8877R9153J72635m877m14722K5984K85168l2322l1917m7300r1818
7392a11487J94918n1457j72025L8716Q0303N9039Q1871j6358J1719j36356M8604
$$ y = [258995, 12577, 59107, 51614, -73061, -176293, -327320, -106084, 139014, -73050, -243866, -269804, -110498, -421492, -178327, -305246, -424195, -262815, -219972, -42200, -50963, -58564, -90708, -82171, -38387, -222619, -157998, -105283, 109904, 270341, 17875, 1827, -129894, -115590, 46703, -94776, 85355, 9435, -74279, -83374, -5113, -216772, -42255, 37640, -112287, -79561, -276809, 77078, -51076, -169972, -252593, -436942, -329803, -355886, -108546, 59930, -72132, -78588, -130578, -54405, -99774, 78412, 129774, 17406, -71471, 27682, 200317, 195440, -219282, -193298, 91870, 59548, 27631, -19669, -111487, 83431, 31974, -140051, -101335, -21032, 38007, 119878, 103520, 115239, -21117, 27487]
7381B7487k85203J07853L69701q6690m0647L0506N455o7101k03240N6621o63k7780
7369a13701P3635K59697m0667j58806j8623k30134j13493J32477K94494K1456
7359A06335k03671k37782J91117J6932o48j8720J7986J91015j13867J17922k05608
7348a38989k2282q1834j35238L83433O4219j39733l16662J93439K9429R5177L06932
7337B37891k40640m8206K0722J1466J38462k7304J37781j39405J02280j70549
7327B2498M0221P3305l3521j41108J19465r4847l1375o6047K00444K58944k20097
7316A27882j39778k2398l3006m7793J07098R4125N901q2404K5956K0039R1524
7305A47146J8227l00076L0222K09346j9496l0989j07495l4559J10963k06155J13518
$$ y = [27487, -257716, -149863, 219838, 133148, 92501, 123007, 128462, 61361, -141879, -85258, -85921, -113701, -40066, 219631, 178964, 20158, 1535, -228599, -342092, -209615, 84879, 106335, -97336, -335118, -144001, -127069, -127717, -146437, -128451, 62564, -51303, 66619, -138989, -161271, -243105, -378343, 5090, 69309, -70424, -387086, -193647, -164218, -69041, 237891, -2749, -50955, -30233, -18767, 119695, 92391, 230172, 90767, 193047, 22498, 62719, 136024, 102503, -38605, 80860, -13987, -45362, -111409, 89035, 347979, 127882, -11896, -34294, -67300, -115093, -7995, 86130, 92031, 9627, 35583, 55622, 147146, 165373, -134703, -104481, 104865, 85369, 54380, -53115, -87674, 23289, -182866, -69348]
7294f9348K63977l06061j10165J27078K54688k21180K14819k49175O9578j01639
7284a27428o2753J03830M5716J72014j92368k1095L9700J9831l369K56391j13748
7273A16721n5357p145n0568j33320L18953M4904j43310q4205p7892P319j95474
7262b59374J66461R1559j2100j5991R419M96p9028L4267q7749j83122K42529J08701
7250A6068J63998l50558P0561p0343N5494k11694J01569N02075j0339k24812p4412
7239c2393k9751j21783K53535r1325Q5157J48374l0778j8556k83716J22651N4326
7228E5741k69622j31437J46988L47954o7332j8388n5493M9003P9625l44742j12435
7217c20138J08952J22453L07516k55333K0395k8243j99782J76068O6321j61544
$$ y = [-69348, 194629, -111432, -221597, -94519, 160169, -61011, 153808, -95367, -25789, -127428, -190181, -86351, -40635, 131379, -60989, -82084, -42384, -22553, -25922, 230469, 116721, 61364, 54219, 3651, -129669, 189284, 234188, 90878, 6673, -71219, -63900, -259374, -92913, -1354, -13454, -29445, -20026, -19530, -98558, -64291, -152040, -335162, -92633, 16068, 180066, -170492, -99931, -170274, -114780, -326474, -224905, 277170, 266831, 42019, -32393, -62144, -183927, 69608, -21717, 63440, 211814, 181036, 162480, -121236, 1415, 55741, -213881, -345318, -198330, 149624, 82292, 63904, 8411, 57414, 137039, -207703, -320138, -211186, -88733, 218783, -36550, -16155, -44398, -244180, -68112, -1791, -163335]
7207a63335r553O6911J96723j27234n5014L2077J38643j8003j79105J47633K31580
7196B61323k48266k99406j11862J85742P0131M2414m3271O7528n4312j04710J58382
7185g6307p0644m9228J78918J78K28375j89506j957J93634j40424j38215L9677
7174b5499J69355n3178k23424q4773J31751p0112l7Q5021K43406l80070J62777
7163d4783K70301j15265N5668j51916j59628J96745N032j18483N5594j01576J77401
7152F9090J96583j93524j49624m883J28304K8523q1273J29023l64017J10178O4263
7141f7357k53065Q8307j65480R6574O4035O7348j5650K10305k39763j14763L94470
7130F4961Q960k96076P9194J78489m1993J83751n7794k14755J16036L7706L3905
$$ y = [-163335, -172888, -105977, 90746, -36488, -91502, -59425, 79218, 61215, -117890, 29743, 261323, 13057, -286349, -398211, -212469, -142338, -99924, -143195, -75667, -129979, -234689, -76307, -146951, -196179, -17261, -17083, 211292, 21786, 19829, 213463, 73039, -65176, -25499, 143856, 90678, -132746, -217519, -85768, -155880, -155917, -70896, 172510, -207560, -44783, 225518, 110253, 165921, 14005, -145623, 51122, 56154, -62329, -6735, -108311, 69090, 265673, 72149, -77475, -82358, 45946, 74469, -6804, 122219, -241798, -131620, -67357, -320422, -232115, -397595, -301021, -236986, -169638, -185288, 25017, -214746, -329509, 64961, 73921, -222155, -142961, 35528, -6465, 177286, 119492, -95263, 20773, 58479, 92384]
7119I2384Q0905j38636l87072J69807J60730J62576m9586q4851r8008L4156K27897
7108A70302j61631j09097O5713K20471m9477l74339n7885J61219l2218j30354
7098b97296J21429M4740j15778J59629k32407J33193N0594L3637O8927P8675o7852
7087b2509n088m9266J72372o7050Q65R0491o2589j49104k50662R8935k3768J36582
7075a30791J17681j7038N947R6710j55400p1406j75009M07546J10987j79536l0481
7064b0790K3696r2400P1359P8641k04648J60043J16388q3771M3182k17806J50000
7053B3894o0508r4739p6222L113J36405O0290j84731p3631j40719R3405K12773
7042a00670j64110J59136k67516Q0290J0728J06360j2077O0582l09235L70259
$$ y = [92384, 173289, 34653, -352419, -182612, -21882, 140694, 91108, 6257, -91751, -57595, 170302, 8671, -100426, -34713, 185758, 136281, -238058, -295943, -134724, -166942, -297296, -175867, -131127, -246905, -87276, -319683, -186490, -135896, -102259, -33332, 45343, -22509, -27597, -76863, 95509, 28459, 29324, 119815, 57226, -91878, -342540, -243605, -267373, -130791, -13110, -30148, -24201, 72509, -82891, -154297, -329306, 78240, 189227, 9691, -20790, 2906, -89494, -18135, 60506, -144142, 15901, 132289, 48518, 91700, -126106, 23894, -36614, -131353, -207575, -204462, -68057, -7767, -192498, -266129, -406848, -313443, -100670, -264780, -105644, -373160, -292870, -282142, -175782, -187859, -127277, -436512, -66253]
7032f6253j4R042R4384k47872K00537l3790K42569k46081k50131R2677n768N1368
7020a59332l5092Q1506M6050m8782n2482L27423k81894j07527K82771j15299K067
7009f0591Q605l3735N5952K08490j22587J9107m6013k57860L485P9272j14734
6998b60609J04742R2919K27684K0295o4018q8926j27486J6897p621O3827m3707
6987f6003n7469P0038P9650J22178k85649k70232O1586O4407K20766j7440L5762
6976d2406l1676M0185J41102q0168l46221K63871J81376j8187L4381j254j57491
6965a6488k8796L629o7558j43125J08392J40486o7741J80908j34391J69479k68801
6954a24006Q4362J56426k07977J97291q1643Q3085O8896k25327j21492L1117j4115
$$ y = [-66253, -66267, -57225, 37159, -210713, -10176, -43966, 198603, -47478, -297609, -204932, -210700, -159332, -194424, -112918, -66868, -115650, -168132, 159291, -122603, -230130, 52641, -62658, -60591, -51986, -85721, -29769, 178721, 56134, 75241, 29228, -228632, -225147, -145875, -260609, -155867, -62948, 164736, 185031, 121013, 32087, -95399, -78502, -86123, -22296, -66003, -123472, -53434, 26216, 148394, -137255, -407487, -345901, -281494, -60728, -78168, -42406, -74082, -33897, 107205, 27037, -319184, -55313, 126063, 107876, 142257, 141003, -16488, -45284, -41655, -109213, -252338, -143946, -3460, -71201, 109707, -24684, 144795, -124006, -39644, 116782, -91195, 106096, 24453, 107538, 176434, -48893, -170385, -139268, -153383]
6943a53383o0679J15810R1673L40274l22425j17844J50812N3595k89298j09983
6933c01448J59877J51361K49369j93020J77171L3714j33614j28802p0395n1114
6923a06901N6024r8279J19934N2182K06542J32875n8385J03456k77385j33318
6913c255K1144J4702J68924l09163k0792p5804J71026N2222j66048J53542j47526
6902a41028J80882k26532J62406P0863J23287k58011K5515J48760N7917p1226
6892G2833j81456j66386J51976L61348m908k7552o5235N2004k3619p6516r0950
6881A539j24606l4835P9506j32417J57365j21737L6357J1191j09902J45764J16915
6870B5140q5698J22992R6207k08654j90348J61594K19678k47861J23683J5655
$$ y = [-153383, -214062, -98252, -6579, 333695, 11270, -106574, 44238, 97833, -191465, -301448, -141571, 9790, 259159, 66139, 243310, 277024, 143410, 14608, -55787, -106901, -50877, -149156, -29222, 22960, 229502, 362377, 303992, 407448, 130063, -3255, 17889, 32591, 201515, -107648, -128440, -204244, -33218, 19004, -147044, 6498, -141028, 39854, -186678, -24272, 46591, 169878, -88133, -62618, 86142, 144059, 72833, -108623, -275009, -123033, 238315, 233407, 205855, 140620, 192624, 169005, 92489, 1539, -123067, -157902, -78396, -210813, -53448, -175185, -138828, -127637, -237539, -91775, 25140, -60558, 62434, 158641, -50013, -240361, -78767, 140911, -106950, 16733, 32388]
6860C2388k3186J4077k14691Q6303J87273r8931K6246J18486k0264q2391p1938
6849d6628p3986P5135p9428l9844j27218K36703l5750j79561J72964j66100K32767
6838c0946j3419m166p9628k5603Q6472J10731r7056J02364O9417j31585P3563
6827F0144O4305J65066j90361k43241M6213Q7247j27444P3235Q7015k34263r6990
6816c09074q5859J68094K17122K30497J14418l88110J08243Q7282j45255K3230
6806B0588N3923l8200j13313J8363P2663J1655L4768J0897q4938k18953j56262
6795c88809J32778p0600N0269m0900J25797J11933K4268J38444J74862k81053
6785b3011p4725j9157N5036K40J28970J36814j57234J683J838n7221l39461K19796
$$ y = [32388, 9202, 23279, -191412, -105109, 82164, -16767, 9479, 127965, 107701, 25310, -46628, -120614, -45479, -124907, -164751, -291969, -55266, -91016, -270577, -97613, -263713, -30946, -44365, -48531, -128159, -153762, -67290, 43441, -53615, 48749, 118166, -13419, 60144, 124449, 289515, 99154, -144087, -97874, -10627, -138071, -64836, 22179, -212084, -309074, -394933, -226839, -9717, 220780, 335198, -52912, 55331, 142613, -2642, 20588, 74511, 36311, -77002, -58639, 14024, 25679, 60447, 71344, -13594, -232547, -388809, -256031, -326631, -276362, -317262, -191465, -79532, -55264, 83180, 258042, -23011, -97736, -116893, -61857, -61617, 67353, 204167, 46933, 48616, 50454, -6767, -346228, -126432]
6773a26432K52620j34275m00n8577N6736j05341l4463J69792J23007L9380k12877
6762c0830M4425Q8884L5843k02256j48381L29387l4270L4125J80615l00397J58912
6751A56057q1981j24970J83442k04055O5959K35999Q4268O685j60558j36179J91746
6740B16413k34664k00669J25051P4510O6547L5395p0223k2668J38313j3701j36651
6729b2347j87229J04997j76147M7600K03960o9627k5140k93J36534q2984k20198
6718b90874J8977J16709j2193P0490K88526R8433r7908l59311N8157J82885K2605
6707I6496J05767j11916j16418j45393K1936R4131J03633k0300r3688l3883J09016
6696I381o9683k0105N6689N1288p66j26913J17089K2243J29777j06006J98581
$$ y = [-126432, 126188, -8087, -8487, -67064, -10328, -115669, -150132, 19660, 142667, 182047, -30830, 13595, 102479, 138322, -63934, -212315, 117072, 82802, 116927, 297542, -2855, 156057, 74076, -50894, 132548, -71507, -5548, 230451, 314719, 321404, 160846, 24667, 216413, -18251, -218920, -93869, -19359, 47188, 82583, 12360, -10308, 128005, 114304, -22347, -209576, -104579, -280726, -233126, -29166, -98793, -123933, -124226, 12308, -70676, -290874, -271897, -155188, -167381, -96891, 191635, 290068, 192160, -167151, -108994, 73891, 96496, 202263, 90347, -26071, -171464, -149528, -55397, 48236, 27936, -65752, -99635, 9381, -60302, -80407, -23718, 27570, 26804, -100109, 16980, 39223, 169000, 62994, 261575]
6685B61575K2831j98548j18605P0750j64662J09899q0388l8000r0229J39936J11911
6674B6470n4612k7345J36097M1152q2412j30234j95902M0514N9687J70873j15283
6663a30995K23978J43916p9737l76600o9733m1259L21209m2973j2462J23654k0068
6652C8930J61546J7077k21755k43034L31082K8371O3046n6312K1888J02989k96621
6641e2793R7264K2982J72916L6294k03746o1575j00958Q8625n9487p5152K29798
6630I4168K7534M2121m0230k50084o4186J97858k6852K1801R5922o9227J9382
6619D8207l9259M1319m3422l5767J29544k28378n2114o7834P4884J54085k2899
6608d1634J93530k0599n7877r6484N5769J34080L7076k32419p5198L07875j54964
$$ y = [261575, 284406, 85858, -32747, 38003, -126659, -16760, -97148, -135148, -225377, -85441, 26470, -28142, -55487, 80610, 121762, 39350, -90884, -286786, -246272, -186585, -15712, -130995, 92983, 236899, 157162, -219438, -289171, -330430, -9221, -52194, -64656, 58998, 38930, 200476, 217553, -4202, -247236, 83846, 112217, 175263, 118951, 140839, 243828, -52793, 44471, 67453, 240369, 276663, 72917, 11342, -89616, -991, -60478, -135630, 94168, 121702, 163823, 123593, -126491, -190677, 7181, -19671, 2130, 98052, 28825, 48207, 8948, 50267, 6845, -28922, 100622, -127756, -179870, -247704, -172820, -18735, -41634, 151896, 131297, 73420, -23064, 32705, 166785, 203861, -28558, -103756, 204119, 49155]
6597D9155j75829k7843n5436J07231J34719n4642K43112Q2919r1203j31482j45372
6586f4671j61698J30659M5275k93863q1130K12530j974K04090m2311k10673N5520
6575b08246K42179Q9983q1486m0812J04458o6155K960j2978k15952M0009j57815
6564c03855K27148J30082k45293q8153J00179K63716J32118J9039o1397p7623
6554I5961J48359m09573j18167J92004l9573p2885j05227J85642l9228j41978
6544c04665J33418Q2265k9496o5974n9577J6881J86503P749M1893M3337m2588
6533I746R9352L7650k32434J01753Q6662Q6648j41117k05620J6587J91949J61065
6522B12241k68504Q225J98674j12771q0119l4184L6706q7117J24672J55034j37156
$$ y = [49155, -126674, -154517, -209953, -102722, 31997, -22645, 220467, 303386, 212183, 80701, -64671, -226369, -95710, -50435, -344298, -425428, -212898, -214872, -10782, -53093, -263766, -208246, 33933, 123916, 42430, 1618, 106076, 39921, 42881, 29903, -186049, -146040, -303855, -76707, 53375, -191918, -280071, -179892, 83824, 215942, 234981, 173584, 95961, 244320, -165253, -283420, -91416, -130989, -203874, -309101, -123459, -162687, -304665, -171247, -88982, -118478, -184452, -244029, -227148, -40645, -32896, 8997, 52334, 9746, 109098, 146748, -85686, 16067, 102729, 189377, 48260, -157360, -140773, 51176, 212241, -56263, -48038, 150636, 37865, -42254, -76438, -39732, -126849, -2177, 152857, 15701]
6511A5701j21261q0761M266J45504o3302J27760j33756K04157J444k24034k75130
6500c99412J09699L66051k7623M5441k48425j35452N9027J52639J61511Q5887
6490A69343k15436n8237L16689j40121p8576R4020k21702K36176r5486k2834P7838
6479F1674q8910q2140j27824J84877J21639k1821j1914J66051k63909p0792R2413
6468d0656j40364j0468J60894M5470J4069p7920j39717J85092J7842j24773j32047
6457b42578J31365J92909m0590J7845j9429L3332K64703k62903k51767J50331
6447b6782J58229j20216j37757k15794O8587J06412J71756j71036q1012J17203
6437a30410K30565k3074j63748M2527L7419m1421n2398n1022P0724j42016j39641
$$ y = [15701, -105560, -186321, -182055, -36551, -99853, 27907, -105849, 98308, 99752, -124282, -399412, -289713, 76338, 48715, 94156, -154269, -289721, -230694, -78055, 83456, 169343, -46093, -104330, 212359, 72238, -6338, 87682, -134020, 102156, 6670, -16164, 61674, -27236, -109376, -237200, -52323, 69316, 47495, 35581, 201632, -62277, -133069, -40656, -181020, -191488, -30594, 14876, 28945, -48975, -188692, -3600, 14242, -110531, -242578, -111213, 81696, 41106, 58951, 39522, 72854, 337557, 74654, -177113, -26782, 131447, 11231, -126526, -342320, -273733, -167321, 4435, -166601, -247613, -130410, 100155, 77081, -86667, -44140, -6721, -48142, -100540, -151562, -80838, -222854, -362495]
6426c62495O3600K79986P829j54387j12901K05384K9753j08609n6912Q12K87050
6415G9110k9587m480j70831j36179p9944K87756Q4730K4152j0896j43328J71695
6404G2198K8749l17102m0041K13563J04766K4362P9532k46244n3490N7403J18958
6393D2654R6312k02579K7213j56929M9742K36471K6947j71837j89149K09903m0696
6382g1948j08239J22504K24503p1927K46736J1988l50055j14175K23983K2310
6372A35680o7580R8738k19545j25998J05574L2322l6015J1363j0456L34909k37041
6361B1951m7140O9548j13764J02053j16199N1737R875p8038J43579q6859o6057
6350a09314k8261l3873J65971l2447N7361q6373q8803k6906k300J66708K58935
$$ y = [-362495, -298895, -18909, -11080, -165467, -278368, -72984, -43231, -151840, -208752, -207940, 79110, 49523, 45043, -125788, -261967, -341911, -54155, 30575, 54727, 43831, -99497, 72198, 100947, -216155, -256196, -42633, 62133, 86495, 166027, -80217, -133707, -76304, 42654, 138966, -63613, -36400, -193329, -143587, 92884, 119831, -52006, -241155, -31252, -71948, -180187, -57683, 166820, 94893, 341629, 353617, 3562, -110613, 113370, 135680, 68100, 166838, -52707, -178705, -73131, -40809, -76824, -65461, -75917, 258992, 21951, -25189, 44359, -69405, 32648, -83551, -31814, -21939, -99977, 43602, -43257, -109314, -137575, -171448, -5477, -37924, 19437, -66936, -155739, -182645, -184945, -18237, 240698]
6339B40698o4572k34779j02314N9701J72922M9696K8097k2591n4083q2652J24915
6328A15038j86744J56697m3501k95940J52420o8005m8604J59661J32075q1521
6318h424p5192n4315N1403R7165K4540P0229n773k67852j26872k37713L60588
6307a72216j880J22577J48091K634K04752k91741k28855L1898R2663m1741O3538
6296g0280J45345j7724p8305K32636O0004j58886l45144j25580K27492P2980J10931
6285E3469N349j40417K09641o6099j8965J13594j73938r3281j34639J01832O6408
6274g7046J96115j91859j97606J73893j55242J7948N818P2456K5650L68524l4467
6263B04184j1982j15164j53534n5365j2404k3596k8741J56789M3969m9286k33841
$$ y = [240698, 176126, -58653, -160967, -101266, 71656, 121352, 149449, 126858, 72775, -9877, 115038, -71706, 84991, 41490, -254450, -102030, -170035, -218639, -58978, 73097, -8424, -83616, -137931, -86528, 10637, 35177, 105406, 99633, -168219, -295091, -532804, -172216, -174096, -51519, 96572, 99206, 303958, 12217, -216638, -184740, -92077, -133818, -70280, 75065, 57341, -20964, 211672, 271676, 112790, -232354, -357934, -130442, -57462, 53469, 58818, -81599, 128042, 61943, 42978, 156572, -17366, -110647, -245286, -143454, -77046, 119069, -72790, -270396, -96503, -251745, -233797, -227979, -155523, -129873, 238651, 204184, 192202, 77038, -76496, -131861, -144265, -167861, -196602, -39813, 4156, -45130, -278971]
6252b78971q128j5634J41200m28q1333P4285j18183J05772J89164P3640j31796
6241e0412q0504J86598O674n3656K7505q2978J72007J56585m49424J03049K76951
6230B12395N4958m7330J34514k92012j30966j01985j91169L86225k4701r8578
6220i8649L6814L3105J39869l954j92962P5547p9733J03317j38983j5248K04051
6209F3174j09420n415K8852K9966j12499Q8741R5130k99605J11674K4318K9034
6198e6050J49746l08338K6636J85583k3550n6768R8492K20483l1466m2176j46256
6187A6336j213J36047Q170j04267J21443n9236j54066j3904k2871J54945N8140
6176A39524m8628l7892R4746L2699n8163p9981j43539r4775j10948K52935J22572
$$ y = [-278971, -287099, -302733, -161533, -161961, -243294, -169009, -287192, -181420, 7744, 81384, -50412, -130916, 55682, 62356, 8700, 36205, -46773, 125234, 281819, -167605, -64556, 212395, 267353, 220023, 354537, 62525, -68441, -170426, -361595, 24630, -71, -98649, -61835, -28730, 111139, 107185, -85777, -10230, -89963, 13354, -125629, -140877, 63174, -46246, -51661, -22809, 7157, -105342, -16601, 78529, -221076, -109402, -85084, -56050, 93696, -214642, -188006, -2423, -25973, -82741, 15751, 236234, 204768, 162592, 16336, 15123, 151170, 159340, 55073, 176516, 117280, -36786, -50690, -73561, 81384, 139524, 90896, 53004, 147750, 180449, 122286, 42305, -101234, -196009, -306957, -54022, 68550]
6165F8550k16735k9881K21044J88136j09906j57952k16667p021j49318J32859
6155b76891K80387R334j29217l7568j10946J00670L788J93350m3627r3421N6676
6144d7465N2368k6002J92369p148l07030J01031J24798K8830m2941q7314J74425
6133A55921j68111j27497O2838M8970j576j99571k9978J32182K03936k17102O1316
6122g8672N1500Q5475K45442j18432k16634l57385K65015K10101J42152p0751
6112A57811l22964o139J84634J49095j00675J85735J28456k84928o3676K1479
6102D8828j77207l9426M1884J38136k02313J42927j97104m8650R8693n5359K18698
6091c0893N1499o5084K30928j19685j9724k0962o6083J47357L8534K877k66383
$$ y = [68550, -148185, -178066, 42978, 231114, 121208, -36744, -253411, -260432, -409750, -276891, 3496, 12830, -116387, -153955, -264901, -164231, -160443, 32907, -10720, -104141, -47465, 4903, -21099, 171270, 164122, -142908, -41877, 82921, 111751, 68810, -18504, 155921, -12190, -139687, -76849, -27879, -29455, -229026, -259004, -126822, 77114, -139988, -78672, -27172, 58303, 303745, 185313, -31321, -388706, -123691, 86410, 228562, 157811, -165153, -171292, 13342, 162437, 61762, 247497, 375953, 91025, 27349, 48828, -128379, -167805, -125921, 12215, -190098, -47171, -244275, -292925, -194232, -249591, -30893, 20606, -44478, 186450, 66765, 47041, 26079, -40004, 107353, 145887, 148764, -117619]
6080a17619N797L32215j26132M7710j7146L1494k9650r892O361l100k9861p0565
6068A9612j737r4351J36413k4189k8146K70294j74263R4277J27840l35366k45996
6057b55612J39191J41699n5012P5083j75318j08426K3284J44524J75290P1800
6047A76503l28725J34378J19733j62299j33899O5121M0749J29402j53995J33196
6037B0164N1988j45382J22618r2128r2239R1609J40879k17876N6588j09596K22234
6026D8859N7859j61613K1408L73Q8506J92029o7290j06793j91469k42075L49140
6015a1066l0333M2203P4560J0974o4350k5139m9416K1135R2196l5480o3174N8162
6003B0272j06231r7052J39419J55756J05825r3208J36345L2512R4106k97727L7994
$$ y = [-117619, -111822, 220393, 94261, 141971, 124825, 156319, 126669, 116777, 123138, 120038, 90177, 19612, 17875, -76476, 59937, 35748, 7602, 277896, 103633, 197910, 325750, -9616, -255612, -116421, 25278, -29734, 45349, -129969, -238395, -215111, -70587, 104703, 176503, -152222, -17844, 101889, -60410, -194309, -129188, -88439, 40963, -113032, 20164, 72152, -73230, 49388, -42740, -134979, -43370, 97509, -120367, -63779, -173375, 48859, 106718, -54895, -33487, -33114, 55392, 247421, 180131, 73338, -118131, -360206, -11066, -41399, 804, 75364, 86338, 21988, -3151, -52567, -31432, 60764, 25284, -37890, 20272, -85959, -183011, -43592, 112164, 217989, 124781, 261126, 293638, 387744, 90017, 128011]
5992A28011K4810p608l2896o1358J76698M5586m0918k51427j22213J42084P7227
5981G7996j50397L9516J12945q0964j57689j00060J44479j04222n7379J21089
5971a54686J099L26639L9065K4815j87770P5566j01382l2372M2108J66496l2692
5960A66886k41482k03715M57297j7611j60994r0435J76139M715k1696N3432n4822
5949F7714K3372p5751o1781J12676R4910k44621j7992p297r9228J56118J32084
5938H0204k18375O8338J15653P8040j16347n1362p032o6255J5099J87336n0511
5927C4788m3010k5991K9393j21951J2640J24832R4298j10731k5459l5357K11220
5916A44672J51998j02620p3334K18141j06099M0710J38241O6935k19313k33063
$$ y = [128011, 152821, 145213, 112317, 50959, 227657, 273243, 232325, -19102, -141315, 769, 77996, -72401, -32885, 80060, -904, -158593, -258653, -114174, -218396, -275775, -154686, -153587, 173052, 212117, 236932, 49162, 124728, 23346, -9026, 33082, 199578, 166886, -74596, -278311, 178986, 161375, 381, -90054, 86085, 90800, 69104, 122536, 67714, 91086, 15335, -46446, 66230, 161140, -83481, -101473, -108770, -207998, -51880, 80204, -138171, -69833, 45820, 123860, 7513, -43849, -50881, -117136, -102037, 85299, 34788, -8222, -34213, -4820, -126771, -114131, 10701, 104999, -5732, -31191, -66548, 144672, 296670, 194050, 120716, 338857, 232758, 273468, 411709, 478644, 259331, 26268]
5906B6268M4498J28335n5885j13232n1061P4148J24555q3725Q750j159n1503K0619
5894G0608j22857J4811R7713k9401O7988J55075O2347j35871p4094j47103M7750
5883F966r1424R9572J78903j04486P0460l19987P5807K8433j67088J63290k306
5872f1860j217K36598k07350j72594N7972l6915K17041J62730j12065n469m0661
5861C6210m8766k6236k97422K99457N6321K39570L4078j63920N0793j81590M0940
5850C9435K54299j50950k10798j98768j27126J31206Q6729K47363J23071O8509
5840B62970n9207n6121j8779j07862m2183J76051o8711k31928K7306J50735k08005
5829a75734K95127J10101j70858n0411o4501J34798j93431P8628K63801L2784
$$ y = [26268, 70766, 199101, 143216, 29984, -21077, 53071, 177626, 93901, 102651, 101492, 49989, 70608, -52249, -37438, 60275, 30874, 98862, 253937, 316284, 180413, 106319, -40784, 6966, -84458, 15114, 194017, 89531, 159991, -159996, -84189, -55756, -222844, -59554, -61860, -63077, 173521, -33829, -206423, -148451, -185366, 31675, 194405, 82340, 76871, 36210, -12556, -38792, -336214, -36757, 19564, 259134, 293212, 129292, 180085, -1505, 39435, 293734, 142784, -68014, -266782, -393908, -262702, -175973, 71390, 194461, 262970, 203763, 147642, 128863, 21001, -21182, 154869, 86158, -145770, -118464, 32271, -175734, 119393, 229494, 58636, 8225, -56276, 78522, -114909, -36281, 227520, 260304]
5819B60304l09390k00317J62916M3806J0454J83951M4037j80840N1324J55659
5809B21904l3116n4627P3521J12405q2772o3445R6686O542k36900J29608j82763
5798a2957K55120r911p6982J37053m5910j35301K3004K0784P4304J00364q5983
5787B43585o8289j87944j6348j0988r378K61515m70K46493o3348l30658M2283
5776A06453l5882n5018O7859j22828L9564K941p0985j12280q9072K93434J8108
5765D2294j29827Q7335k10175J28013J84421j1760J87197j28814m0734L1244J4849
5754A54043j30382J70800l6292J02592l1763l55012N6570J51306J73023o9040
5744A85845r8249k1531Q4219J20863j99148j9117n3516J17144K39946m7975j36766
$$ y = [260304, -49086, -249403, -86487, -42681, -32227, 151724, 195761, 14921, 66245, 221904, 188788, 134161, 207682, 320087, 237315, 173870, 270556, 277098, 40198, 169806, -12957, 242163, 232252, 155270, 292323, 246413, 111112, 134116, 154900, 229204, 329568, 243585, 175296, -12648, -28996, -39984, -49362, 212153, 211683, 458176, 394828, 64170, 106453, 70571, 15553, 83412, -39416, 148, 3089, -67896, -180176, -269248, 24186, 42294, -87533, -198, -210373, -82360, 102061, 90301, 277498, 148684, 107950, 139194, 154043, 23661, 194461, 158169, 260761, 228998, -126014, -69444, 81862, 254885, 185845, 87596, 66065, 150284, 271147, 71999, 52882, -634, 116510, 356456, 308481, 171715]
5733A71715n1894R7028k4856r4876j6278q2320Q4253M8845N9020j31243j55625
5722i6231M292R4202P8314K8420p7318r8154j53318J24954m2904Q6912J73378
5711A22547J35940m8244m6325j14918L6460J06143k70376j06209K01285J15573
5701A31876o4913r3738k60425J62798J24750m270J48061j67569m4577J17068R6696
5690A45757q8989j91545K77222O3286p6054k3714j33326J36969r8768j91171J11158
5679f9175P4643M5153O3664j0782J09915m2927j55614Q6047K8569k6121j41009
5668c7637k41966R0745K9247N5834K31801m4872j49605M0496Q6011J8455m5592
5657C2917n8523j82465O9203K40492r1942K2413K9375q5055j17699j19677K52495
$$ y = [171715, 119821, 216849, 191993, 97117, 80839, -1481, 82772, 131617, 190637, 59394, -96231, -91939, 2263, 80577, 108997, 31679, -66475, -219793, -94839, -137743, -50831, 122547, 258487, 210243, 163918, 49000, 85460, 191603, -78773, -184982, 16303, 131876, 66963, -26775, -287200, -124402, 348, -3922, 144139, -23430, -68007, 49061, 145757, 56768, -134777, 142445, 205731, 129677, 105963, -27363, 109606, 10838, -180333, -69175, 5468, 50621, 114285, 103503, 213418, 170491, 14877, 100924, 129493, 103372, -37637, -279603, -188858, -159611, -103777, 128024, 83152, -66453, -25957, 60054, 78509, 32917, -25606, -208071, -138868, 101624, 9682, 32095, 61470, -23585, -141284, -260961, -8466]
5646h466K85321n1478j06471J02749M6414n9577r2177r0210k0863j8746J21498
5635A07994N7453o7396K2805m7428r1752R1405J07914j10302K9095M8035j31270
5624A6553J96640m0157j79519p7327J93841j28113j5978K3565j66554K43031J39721
5613B05703J16294j1718j76593J24889J14465m04539p4960J30266Q7689n0762
5603F0734J78387R2441k36154K3545N0075l477o6795Q748j35919K03575k0594
5592A54566k08622K6602J53595j80969J28063q0148o8475j61755K46454J72450
5582A81761J49038p0997J43630q8805k48517L6663N1731l6928j72776J63374o76
5571A07498k01042l1210J08287j0328K32661j81870n3314M8843m8995Q1339j05015
$$ y = [-8466, 276855, 225377, 118906, 221655, 268069, 208492, 116315, 26105, 5242, -13504, 107994, 165447, 98051, 120856, 73428, -18324, 73081, 180995, 70693, 99788, 147823, 16553, 213193, 173036, -6483, -83810, 110031, -18082, -34060, -10495, -177049, 65982, 205703, 321997, 310279, 133686, 258575, 373040, -31499, -106459, 23807, 111496, 60734, 239121, 331562, 95408, 118953, 169028, 165551, 98756, 107504, -28415, 175160, 154566, -54056, -27454, 126141, -54828, 73235, -6913, -75388, -237143, 9311, 181761, 330799, 259802, 403432, 314627, 66110, 102773, 154504, 117576, -55200, 108174, 107498, -93544, -124754, -16467, -26795, 205866, 23996, -29318, 19525, -29470, 51869, -53146]
5560e3146J03944P0469n8666J37029j63930J37933o5250L0092r4748m8004Q237
5549C960J69334j37632j76243K12724J38393o9607j2360j18629j55070K66510
5539A21380J96633p2902l4045r7230n9121K0742N3246o627K5784n997J48868j11096
5527A79635k63134l097m1077K65927R9573Q6908k25819k11651J0004K37655L5492
5516A70416j38874j456j05836K3934J66015Q6493J13387N306j3465O5494q1481
5505B89933r7214K10087P1194k18990n40q3664r930p713K82658k21217L766j76586
5493D1784J91391R2297k6934J26029j29181p7602J53173L05643O6187k48765J73034
5482F67056k37065J72195J72304l36857M9207K02742R5108k97803M3658M5962
$$ y = [-53146, 50798, 121267, 62601, 199630, 35700, 173633, 108383, 138475, 43727, -4277, 3960, 173294, 35662, -140581, 72143, 210536, 140929, 128569, 9940, -145130, 121380, 318013, 245111, 211066, 113836, 54715, 75457, 128703, 122076, 147860, 141863, 290731, 179635, -83499, -86596, -127673, 138254, 237827, 324735, 98916, -112735, -102731, 134924, 170416, 31542, 30086, -75750, -51816, 114199, 200692, 314079, 319385, 305920, 371414, 289933, 192719, 402806, 474000, 255010, 254470, 170806, 160876, 153163, 435821, 214604, 218370, 41784, 233175, 325472, 298538, 424567, 295386, 217784, 370957, 676600, 742787, 494022, 667056, 429991, 602186, 774490, 437633, 486840, 689582, 784690, 486887, 530545, 576507]
5472E76507K2429O5153k7274j41897J38397j53903j99560J97295M2758j40493
5462C79412J38723j9725R8694J45946J61808l1934L10892J81526J73017l5879
5452A502480K85430P5281p7454j20461l77489j06008n5236j70161K515k74275
5442F84622L519j15040P1262P3056J0983J78737M556J03388j21672j49058J84082
5431I28435j13606J45015L10182j31099n2371J64829L07176m4677K84466j1354
5421A786996K96349l48468m36061j17866j76626j82952K17360j33697j97221O4536
5411G72350L35479j15105l26235K79367k54267N3735K49164j80280l79901Q4393
5401E18700K01339J20232K17971J05782j27295J67808j51528p8652K97814q8907
$$ y = [576507, 598936, 664089, 636815, 494918, 633315, 479412, 279852, 477147, 519905, 379412, 518135, 498410, 597104, 743050, 904858, 872924, 1183816, 1365342, 1538359, 1502480, 1787910, 1863191, 1785737, 1665276, 1287787, 1181779, 1126543, 956382, 958897, 684622, 688141, 573101, 644363, 717419, 728402, 907139, 911695, 1015083, 893411, 744353, 928435, 814829, 959844, 1270026, 1138927, 1086556, 1251385, 1558561, 1513884, 1798350, 1786996, 2083345, 1734877, 1298816, 1180950, 1004324, 821372, 1038732, 905035, 707814, 772350, 1107829, 992724, 666489, 945856, 691589, 745324, 994488, 814208, 434307, 518700, 720039, 840271, 1058242, 1164024, 1036729, 1204537, 1053009, 974357, 1272171, 1183264]
5391A183264o9351k99761k34810J3292j27605p845Q5447j1330J81552K0546o2870
5380F70529j42800J41087J79970m24584j31819J90580j95517p416J88087J57381
5370F25498m4137j81580J84547J0569L6935j90078K30541j13251k15611j30491
5360B12942q8786L50558k31780L6390n316R6056L7773q1947K61576l346o8808
5349E15312j61481J95049o1324j61441K74409k60591K7316Q0481N3395K11096
5339G12221J01887j49336j31461R0327j28309j00936O694r3193J92900J08029
5329F08823n2232n6107p0539J25868j16120K09439j32734r7969K1522K13979J28308
5318G82238L6001j02976k01123J23302k3908k06347J29788j50104j58919J23549
$$ y = [1183264, 1113913, 814152, 579342, 592634, 465029, 457184, 542631, 531301, 712853, 733399, 670529, 527729, 668816, 848786, 424202, 292383, 482963, 287446, 280030, 468117, 625498, 581361, 399781, 584328, 594897, 631832, 441754, 672295, 559044, 343433, 212942, 124156, 474714, 242934, 279324, 274008, 370064, 407837, 325890, 587466, 584120, 515312, 353831, 548880, 487556, 326115, 600524, 339933, 367249, 447730, 501125, 712221, 814108, 664772, 533311, 623638, 495329, 394393, 401087, 307894, 500794, 608823, 556591, 500484, 429945, 555813, 439693, 649132, 516398, 418429, 439951, 653930, 782238, 818239, 715263, 514140, 637442, 613534, 407187, 536975, 386871, 227952, 351501]
5308C51501K75733k1063j22512j16683J33332M2856J31265j738K3453J21255l21688
5297D95711J14364k00548Q1713M5099J3871j15312L058J948J15705J63881j43114
5286E76376j42606M9651M6965J64746j35111j25066p5375J00646K70292j16522
5276F13996l3693q3408j7430Q603K31996J62970m71550O7041J62482L025l12837
5265C31195K91137k3572j15081J61103k2598M4356k1241j91995R7403j17782L46041
5254G78966O5253j96177R7465n460j34998j58000Q8437j39773L0786K12768L70759
5243A010026l50125N458L6030J59440j12819r880J37761k09226l6334j15612q686
5232E06033J23811J31382n909P653P1494P023r7703j1790J84660P8671j17900
$$ y = [351501, 627234, 606171, 483659, 366976, 500308, 543164, 674429, 672691, 696144, 817399, 495711, 610075, 409527, 491240, 536339, 550210, 434898, 437956, 439904, 555609, 719490, 576376, 433770, 483421, 530386, 695132, 560021, 434955, 359580, 460226, 730518, 613996, 580303, 496895, 479465, 488068, 720064, 883034, 411484, 478525, 641007, 644032, 331195, 622332, 598760, 483679, 644782, 622184, 666540, 645299, 453304, 550707, 432925, 778966, 844219, 648042, 745507, 740047, 605049, 447049, 535486, 395713, 426499, 639267, 1010026, 659901, 665359, 701389, 860829, 748010, 738130, 875891, 666665, 630331, 514719, 506033, 629844, 761226, 755317, 762970, 834464, 841487, 743784, 731994, 916654, 995325, 877425]
5221H77425n3808J5442j39499J24775J17064j58961L4794J85684n811R0409j73275
5210I14239m6932J00071J14545j55797J31563p8052J68751J50531j13596K64821
5200A450144K04491p4784n1951j81247o9091K50933q8302l3939k0212J9523j70313
5189A235252l1130j3822L4314J80790j10345j11985q5431R9865J04033L44372
5179A645913L1404N9971J07354m6386J46293L63781R5977J41241K08461r5550
5169B658459p5761j20532k90966q3634r1183k20033M8556j26022o1860j4630l2396
5158A589998p3971J0890n2816j04817j67160K7372J75061J22534J04561K09679
5148A841331m6575j91158L02342J86671j06693m4741j1891l5608k21579l9272
$$ y = [877425, 823617, 839059, 699560, 824335, 941399, 782438, 817232, 1002916, 997105, 1087514, 914239, 867307, 967378, 1081923, 926126, 1057689, 979637, 1148388, 1298919, 1185323, 1450144, 1654635, 1579851, 1527900, 1346653, 1277562, 1528495, 1440193, 1406254, 1386042, 1405565, 1235252, 1204122, 1190300, 1224614, 1405404, 1295059, 1183074, 1097643, 1197508, 1301541, 1645913, 1677317, 1737288, 1844642, 1798256, 1944549, 2308330, 2404307, 2545548, 2754009, 2658459, 2582698, 2462166, 2171200, 2087566, 1996383, 1776350, 1824906, 1698884, 1637024, 1622394, 1589998, 1516027, 1526917, 1474101, 1369284, 1202124, 1229496, 1404557, 1527091, 1631652, 1841331, 1794756, 1603598, 1905940, 2092611, 1985918, 1941177, 1929286, 1893678, 1672099, 1632827]
5138A632827j7011J01045j24146o2812j6255j16398M013K41549q1946p4993J50079
5127A635952K00366j70386J34405J25514k5784k49674j49632P7982j28943Q6770
5117A536570J79934J32731k46132K4032L5946L4297J99195m7677j49956Q7084
5107A786024J08240j0499m1090J83880k2056m325P4121Q9457P6356k9753j98216
5096B012139k55237L1844K47124L28155q1068J48032j58703M8910M5832o3469
5086B303559J06319M2617J35437P4957L3669j94220R2311p8590O4809J33210n6201
5075B657877j33033J64160J64307J01600m6378j2117J6572J86494J02432j67127
5065C034787p1654l8757K85076K5404j1429j82838P204J21561J42174J9166k32227
$$ y = [1632827, 1615816, 1716861, 1592715, 1529903, 1513648, 1397250, 1401263, 1642812, 1560866, 1485873, 1635952, 1836318, 1665932, 1800337, 1925851, 1900067, 1650393, 1500761, 1578743, 1449800, 1536570, 1716504, 1849235, 1603103, 1627135, 1663081, 1697378, 1896573, 1848896, 1698940, 1786024, 1894264, 1883765, 1842675, 2026555, 2004499, 2000174, 2074295, 2163752, 2240108, 2210355, 2012139, 1756902, 1788746, 2035870, 2364025, 2282957, 2430989, 2272286, 2321196, 2367028, 2303559, 2409878, 2452495, 2587932, 2662889, 2696558, 2502338, 2594649, 2516059, 2580868, 2714078, 2657877, 2524844, 2689004, 2853311, 2954911, 2908533, 2896416, 2912988, 3099482, 3201914, 3034787, 2963133, 2924376, 3209452, 3234856, 3223427, 3040589, 3047793, 3169354, 3311528, 3330694, 3098467]
5054C098467K17504N8039K6924r9439J08899Q8389k5330K3425L9118m8680j5075
5043C472241M15092n2280j27707K52794j61430k516J55593k5758p8791J38184
5033C985422J82745j21704p5933p9111j02060j00627J30150J21566J04703j3911
5023D031240j2780J23654J06826j62550l191K39920K23613J84858R4290j37656
5013D688224p9835J98660J93331m8724K08922q1694k28530J02152J5010K53352
5003E220868J96682J08068k40053J04178m6737R0633K25814J69375P0624O641
4993E906093j11959K20342K23760j09635p8171K53851O8414L8952O3388P2074
4983F547109M4767j00651L32411J85670M26120O6406o4738j022M57785K26990
$$ y = [3098467, 3315971, 3374010, 3400934, 3301495, 3410394, 3498783, 3473453, 3496878, 3535996, 3487316, 3472241, 3887333, 3835053, 3707346, 3960140, 3798710, 3796194, 3951787, 3926029, 3847238, 3985422, 4168167, 4046463, 3970530, 3891419, 3789359, 3688732, 3818882, 3940448, 4045151, 4031240, 4018460, 4142114, 4248940, 4086390, 4083199, 4323119, 4546732, 4731590, 4825880, 4688224, 4608389, 4807049, 5000380, 4951656, 5160578, 5078884, 4850354, 4952506, 4967516, 5220868, 5417550, 5525618, 5285565, 5389743, 5343006, 5433639, 5659453, 5828828, 5899452, 5906093, 5794134, 6014476, 6238236, 6128601, 6050430, 6304281, 6372695, 6411647, 6475035, 6547109, 6591876, 6491225, 6823636, 7009306, 7435426, 7501832, 7437094, 7436072, 7893857, 8120847]
4973H120847J22748j4363J17042K26723l2302J93542P7196L32801J71732q6291
4963I229675R2392K50367J56068M09728J03671K36670L26598N749K25754J86956
4953A1223628K41017L74546Q1605J38263K46398J69062N06148K65138L52695L11824
4943A3910324L36497J44725K19013K93718J66391M61643N45073K20119P21363
4934A7018866L14401L91100M74705K57512L60638N55236P47545L30313M06122
4925B0856438R01409N71108Q32654P18558N27176Q37578J035686R97646J024996
4916B8303249J378735R04069J087441J246556J232105J328038J759849J733230
4908C8973272J923147K411176K997890L319700L796457L887325M791306N689250
$$ y = [8120847, 8243595, 8229232, 8346274, 8572997, 8540695, 8734237, 8811433, 9144234, 9315966, 9229675, 9322067, 9572434, 9728502, 10138230, 10241901, 10478571, 10805169, 10810918, 11036672, 11223628, 11464645, 11839191, 11920796, 12059059, 12305457, 12474519, 12980667, 13245805, 13598500, 13910324, 14246821, 14391546, 14610559, 14904277, 15070668, 15532311, 16077384, 16297503, 17018866, 17333267, 17724367, 18199072, 18456584, 18817222, 19372458, 20120003, 20450316, 20856438, 21757847, 22328955, 23161609, 23880167, 24407343, 25244921, 26280607, 27278253, 28303249, 29681984, 30586053, 31673494, 32920050, 34152155, 35480193, 37240042, 38973272, 40896419, 43307595, 46305485, 49625185, 53421642, 57308967, 62100273, 67789523]
4900F7789523O873635P655102Q968430J0115251J1671156J3338733J4985926J7211873
4892A58609629J6048421R996895m50206j1816726j7058557j6033446j2101572
4885A27194438q720800o476917m778377k809385j531401J16125J741308K678680
4877A07413671L693061N274877P089494Q516593J0986757J3190472J5603117J8728751
4869A90496793K1643811K4993149K7802396L1043006L0667803J9901430m35295
4862C46113093k6008995m0575556m0644949l2490343k4026343j7814495j3865503
4855A50686909j0725317q517732o831104n102154m059719k828298j492140n1391
4847A11079054J122809K652954L781244N189218O814025Q797629J1042124J2974521
$$ y = [67789523, 74663158, 82318260, 91286690, 101401941, 113073097, 126411830, 141397756, 158609629, 174658050, 184654945, 184204739, 172388013, 155329456, 139296010, 127194438, 118473638, 111996721, 107218344, 104408959, 102877558, 102993683, 104734991, 107413671, 111106732, 116381609, 123471103, 131987696, 142974453, 156164925, 171768042, 190496793, 212140604, 237133753, 264936149, 295979155, 326646958, 346548388, 346113093, 320104098, 279528542, 238883593, 206393250, 182366907, 164552412, 150686909, 139961592, 131443860, 124612756, 119510602, 115450883, 112622585, 111130445, 111079054, 112201863, 114854817, 118636061, 123825279, 130639304, 139436933, 150479057, 163453578]
4839A63453578J5168921J4961220J0078567L55379j1887970k1468127k3216546
4832A47445022j9675804j4879573j1229999q823736p076949o389336n217041m525653
4824F9626931m147278l742122l390180l118584k735152k134915k158877j961344
4816D6238479j531291j680283j432973j508921j468823j029789r17744q43144
4808C5825511q74435q80197o15152q87796o54918o39778r24142q13569n63647
4799B8971877m35354q46914o64658n15880m70612m65604o63780o85533m82439
4790B3741103o24717j76326m07264p78617l44874k55399n32975k55408l68108
4781A9997415k25998k80483m66146p01317m09480l62956m44606l90428m40557
$$ y = [163453578, 178622499, 193583719, 203662286, 204017665, 192129695, 170661568, 147445022, 127769218, 112889645, 101659646, 92835910, 85758961, 79369625, 74152584, 69626931, 65479653, 61737531, 58347351, 55228767, 52493615, 50358700, 48199823, 46238479, 44707188, 43026905, 41593932, 40085011, 38616188, 37586399, 36668655, 35825511, 34951076, 34070879, 33455727, 32567931, 31913013, 31273235, 30349093, 29535524, 28971877, 28536523, 27689609, 27024951, 26509071, 26038459, 25572855, 24909075, 24223542, 23741103, 23116386, 22940060, 22532796, 21754179, 21409305, 21153906, 20620931, 20365523, 19997415, 19771417, 19490934, 19024788, 18323471, 17913991, 17551035, 17106429, 16716001, 16275444]
4772A6275444k02605m24972j49611n32266o9320k87084j58062j42606l11913k69230
4762A3727775k48419k15579l88315k50062k77187j59769j71901l39970J51014
4753A1827587k24305k10757l25228k06975m02851o2592m47788L1338k10233r4385
4743I673811j55225j78779k72388o7654j28153l14067R0613r6379k57983m74731
4733G819065L5473j64345o0497n2917k15514k91446P1259j19811j36280k03724
4723F681263r2825j38928n6275k45590p1257J07841j46880k12346n519o9374j48682
4712E601428j79853j09601N8261r026j30192J44644o9988l08286r524k0600k01576
4701D765687j01715O3077K09463j65757j5902k74309j52327m3530j9306m3089
$$ y = [16275444, 16072839, 15647867, 15498256, 14965990, 14896670, 14609586, 14451524, 14308918, 13997005, 13727775, 13479356, 13263777, 12875462, 12625400, 12348213, 12188444, 12016543, 11676573, 11827587, 11603282, 11392525, 11067297, 10860322, 10457471, 10394879, 9947091, 9978429, 9768196, 9673811, 9518586, 9339807, 9067419, 8999765, 8871612, 8557545, 8648158, 8551779, 8293796, 7819065, 7854538, 7690193, 7629696, 7576779, 7361265, 7069819, 7141078, 7021267, 6884987, 6681263, 6588438, 6449510, 6393235, 6147645, 6076388, 6184229, 6037349, 5825003, 5819484, 5750110, 5601428, 5421575, 5311974, 5370235, 5361209, 5231017, 5375661, 5305673, 4997387, 4987863, 4967263, 4765687, 4663972, 4727049, 4936512, 4770755, 4754853, 4480544, 4328217, 4284687, 4265381, 4222292]
4691D222292k5381n1712q5245J66391r0865j30660J64795q4976k30145k45247
4681C609247K6367N4510l17691L117K30329j2891j29639k28947q5969l1708J53813
4670C270538q09P1758J67833j86054r3698n1425k10345N6215m0516j55446l3675
4659B794376J3316p2997j88636J55740Q5957j11645J15061L7581j24928m7781
4649B656044M8769L8757j42720k0018K9912j04749q4199r3089j22406l4994q0731
4638B090576j24612O1296O6453j13640j64135R5483m1487K07309j73094j71953
4628A732196L3754L33687j08936k16993K07965n1951r3839k43054J41430R622
4618A743881O7185k09571J4007q6581J72413j74311J4657J32193j48388J66109
$$ y = [4222292, 4196911, 4145199, 4059954, 4226345, 4135480, 4004820, 4169615, 4084639, 3854494, 3609247, 3635614, 3690124, 3372433, 3375550, 3605879, 3592988, 3463349, 3234402, 3148433, 3116725, 3270538, 3269729, 3341487, 3509320, 3323266, 3229568, 3178143, 2967798, 3024013, 2983497, 2828051, 2794376, 2807692, 2734695, 2546059, 2701799, 2787756, 2676111, 2791172, 2828753, 2703825, 2656044, 2704813, 2743570, 2600850, 2580832, 2610744, 2505995, 2421796, 2328707, 2206301, 2171307, 2090576, 1965964, 2027260, 2093713, 1980073, 1815938, 1911421, 1869934, 2077243, 1904149, 1732196, 1765950, 2099637, 1990701, 1773708, 1981673, 1929722, 1835883, 1592829, 1734259, 1743881, 1811066, 1601495, 1615502, 1528921, 1701334, 1527023, 1541680, 1673873, 1525485, 1691594]
4608A691594J33926k35239m7099n7872k9665J72403j8962K9443j09853q148J62152
4597A682680L9087j3420j15002N7071J04704n1777M0840L7711m269m655J30142
4586A903112L9609P260M4782j60091J42362k7005o5626j99326K49373M9630l29926
4575A654154R0512j98984n0276l7441J99314J27791m07823N3196J09522k65394
4565A274571L24292O5213n5157P7281O9574J30933j01239P7572J94599J73570
4555B231209j26226L82136p0419j27123j06777J73156l02438j67682k24317k40136
4545A421383k8308j490J52824l01763l5164J89722o101q5379j49243J79188Q7920
4534A423589P349J00611l4676k2897j69580J51122l703J21237n2084J73706o8422
$$ y = [1691594, 1825520, 1590281, 1543182, 1485310, 1455645, 1628048, 1609086, 1638529, 1528676, 1520528, 1682680, 1721767, 1708347, 1593345, 1650416, 1755120, 1703343, 1744183, 1781894, 1777625, 1772970, 1903112, 1942721, 1949981, 1994763, 1834672, 1977034, 1950029, 1884403, 1685077, 1934450, 1984080, 1654154, 1744666, 1545682, 1495406, 1457965, 1657279, 1785070, 1377247, 1430443, 1539965, 1274571, 1598863, 1664076, 1608919, 1686200, 1755774, 1886707, 1785468, 1863040, 2057639, 2231209, 2104983, 2487119, 2416700, 2289577, 2182800, 2355956, 2053518, 1885836, 1661519, 1421383, 1393075, 1391585, 1544409, 1242646, 1207482, 1397204, 1391103, 1305724, 1156481, 1335669, 1423589, 1430938, 1531549, 1496873, 1473976, 1304396, 1455518, 1451815, 1573052, 1520968, 1694674, 1626252]
4523A626252j69191q6358Q9384k67043l4569j32302j04569j50793R6493J98347
4513A065651m4016k38353j27096O9970L9226k07962M2800M5143P1692M93j08199
4502F09349O6942p4103j2806n0649N5795J8022k03064Q0939J32802N413k9973
4491E98667r0292Q1829j225J40073j47347q523k83155M7839J78643k1478K5962
4480E20993k46467J31279j22189N3506j37996J00285K65555K7888j52159M0313
4470D81008M4662K4600n6648J7794j05044k50157k09223J67801J93176L6284L598
4459C47851k1285n7835j0198L41635K5320r3712l17677R7580J46519o0940r9321
4448B97937N7765o2975J20337K24262j41707l1936j0555q4671j20421j5720J19920
$$ y = [1626252, 1457061, 1370703, 1460087, 1193044, 1158475, 1026173, 921604, 770811, 867304, 1065651, 1021635, 783282, 656186, 726156, 765382, 557420, 600220, 645363, 717055, 717548, 609349, 676291, 602188, 589382, 538733, 594528, 612550, 409486, 490425, 623227, 628640, 598667, 508375, 590204, 588979, 729052, 581705, 573182, 290027, 337866, 516509, 495031, 520993, 274526, 405805, 283616, 337122, 199126, 299411, 564966, 592854, 440695, 481008, 525670, 550270, 493622, 511416, 406372, 156215, -53008, 114793, 307969, 344253, 347851, 326566, 268731, 258533, 600168, 625488, 531776, 214099, 311679, 458198, 397258, 297937, 355702, 292727, 413064, 637326, 495619, 463683, 453128, 368457, 248036, 232316, 352236]
4437C52236m1698l9588O1227J2587j78804O1973J5875k09980k1354m2801R4059
4426F3732J93234o8164J45540n2794R0893j67350j97983K6200J70576J20559j27534
4415A96909l174n0226J61231J44222k52505j23533J09645j25404J17636J46349
4405C21150j6789j13563j5574p8628Q5108J21715j49603j10745P2886J39211j86233
4394F8935j24672P9390J15151K3914j79458N8031K02624J2837j42112j71469n5412
4383a12241J23686O6271l1259N9491J2510j03750l4578J25159J87354R3369o1812
4372C24200Q6988o9224k29908Q9594J2394j32443M2227k18918n1644N8130K78657
4361A90053M2292n0986J33127j04411o3721j14481j63463L49951j83491J05904
$$ y = [352236, 310538, 270950, 332177, 344764, 165960, 227933, 243808, 33828, 12474, -30327, 63732, 256966, 188802, 334342, 281548, 372441, 205091, 7108, 33308, 203884, 324443, 196909, 193735, 143509, 304740, 448962, 196457, 72924, 182569, 57165, 174801, 321150, 304361, 190798, 175224, 96596, 181704, 303419, 153816, 43071, 115957, 255168, 68935, -55737, 23653, 138804, 162718, -16740, 41291, 243915, 256752, 114640, -56829, -112241, 11445, 77716, 46457, 105948, 118458, 14708, -19870, 105289, 292643, 386012, 324200, 411188, 341964, 112056, 201650, 214044, 81601, 123828, -95090, -146734, -88604, 190053, 232345, 181359, 314486, 210075, 146354, 31873, -131590, 218361, 34870, 140774]
4351A40774K74543j60706k03322R0205L0747k04029K704l240j10384Q3081J99560
4340A39933j49281J92748p2150k71202J53916J494K7933J95661j5967l24900N0306
4329g1509n5434K46931J35612k86285J58050j3517j13801m2242P2627R100O8697
4318A08229k12795R6604K07592Q8364r5603k83209K47724O7388j02798J4312J10383
4307B46191l1792l1643J43374M4785j81358N1945k2275j75964j10454Q7120J87510
4296B07439o2971j0383l49415J00827n9737K68169J06748j71793N3912L7103R4311
4285B14210K25706k81900j96508K72412j03124j05325n6610j31432j0734M5910
4275a27395M6478q9125K56506j1714j19790o8098K31572J07075k5316j24511j39311
$$ y = [140774, 415317, 254611, 51289, 141494, 172241, -31788, -29084, -32324, -142708, -59627, 139933, -9348, 183400, 111250, -159952, -6036, -4542, 23391, 219052, 203085, -121815, -71509, -126943, 119988, 255600, -30685, 127365, 113848, 47, -42195, 30432, 39532, 108229, -104566, -7962, 199630, 287994, 192391, -90818, 156906, 224294, 121496, 135808, 246191, 214399, 182756, 326130, 370915, 189557, 241502, 219227, 43263, -67191, 19929, 207439, 144468, 134085, -215330, -114503, -174240, 93929, 200677, 28884, 82796, 119899, 214210, 439916, 158016, -38492, 233920, 130796, 25471, -31139, -162571, -173305, -127395, -80917, -170042, 86464, 74750, -45040, -113138, 118434, 225509, 200193, 75682, -63629]
4264f3629J98508J65496L9298J16754j58550l7359j24364k67708k9444J26965
4254c4033K08604l31481q3198M23493J28817Q1891o5117k56740J15858p2262R4517
4243B10349k06227j42957P6737J98385j6195j24150J48051K1071j53896o5003
4233e3835K43722l7320k034o8813M3891K21612p527k02932j04146j906K47532
4222B78244j43122k25287L6334O0456J91989J97017j98679k6648j9158P8104j56545
4211G2705j67676K35861j99880J67178J50772j41957k00595J32058K33544o3862
4201B18148J90548J07732k96444j09462j80890J07216Q9205j2778p5090q1360
4191d3175l6709Q9059Q8225M1348p8641J45075K3273q2345L1014q6913j35738
$$ y = [-63629, 134879, 300375, 339673, 456427, 297877, 260518, 136154, -131554, -160998, -34033, 174571, -156910, -240108, 183385, 312202, 394093, 328976, 72236, 188094, 115832, 210349, 4122, -138835, -62098, 136287, 120092, -4058, 143993, 165064, 11168, -53835, 189887, 152567, 150533, 81720, 125611, 347223, 339696, 136764, 32618, 30712, 278244, 135122, -90165, -53831, 6625, 198614, 395631, 196952, 170304, 151146, 229250, 72705, -94971, 140890, -58990, 108188, 258960, 117003, -83592, 48466, 282010, 218148, 408696, 516428, 219984, 110522, -70368, 36848, 126053, 113275, 38185, -43175, -79884, 9175, 97400, 138748, 60107, 205182, 228455, 146110, 177124, 90211, -45527]
4180d5527Q7121r5123J73837K3348L6140n2545j31678J61380L8200j53678J50409
4169A91884J6319j25063K3286p5977J58452J86780K8924o4436j99980j6204P800
4158A31785o0152j77465r0196R2263M3872K21873n3384m6188L36182m8072O2753
4147D13271j02775j63087k35501K73170J6434O9625N383k47499K39405j7640n3758
4136A97028K6737l0512q4031K3154P7023k10315J29134J44644k39931l3907J17055
4125A16079J21143J43968p7223r9883J00000K77632j20477j02812m1111j60838
4115A56478J27089k37888N3995J80823N9383j21368p9011J20226j81465K2351
4105A00613J09789j46769J96775M2370j7163l432K25076L8294j03706j92078K58169
$$ y = [-45527, 41594, -53529, 120308, 143656, 179796, 127251, -4427, 156953, 195153, 41475, 191884, 208203, 83140, 106426, 30449, 188901, 375681, 404605, 340169, 140189, 123985, 131785, 71633, -105832, -196028, -103765, -59893, 161980, 108596, 62408, 398590, 350518, 413271, 310496, 147409, -88092, 185078, 201512, 271137, 276520, 29021, 268426, 250786, 197028, 223765, 193253, 109222, 132376, 209399, -916, 128218, 272862, 32931, -976, 116079, 237222, 381190, 303967, 204084, 304084, 581716, 461239, 358427, 317316, 156478, 283567, 45679, 99674, 280497, 339880, 218512, 139501, 259727, 78262, 100613, 210402, 63633, 260408, 302778, 285615, 282183, 507259, 545553, 441847, 249769, 507938]
4094E07938m68984J87839J27732j90672K1922j63869o1235J08688K60401J2184
4084C41944M8129L3330j44281J4910J12461L0074m01736J23733P7141J07544K14991
4073E58240j9675k76464L2862r3274N3119n0029K2624J19147r8659m4151j59913
4062D3827J55124j4361j70049K4959J64986j14989j8278K79847j8224L9008J48742
4051E20592Q0746l27144q1674J9347k55137Q4818J54777L4355j00681K79916j41570
4040B68345M457N5359r3659J64122M9181k43157K46778n7806j59694K16840M598
4029D55364j69179M2185J47570k5287q8459J56079J65687k74821N4412K09465
4019F73016k22270k35226J9040J23315J41958J94582j91288j41819j23462J12304
$$ y = [507938, 38954, 226793, 354525, 163853, 185775, 21906, -39329, 69359, 329760, 341944, 390073, 423403, 279122, 294032, 406493, 436567, 34831, 158564, 235705, 343249, 558240, 538565, 262101, 294963, 201689, 254808, 204779, 227403, 346550, 247891, 203740, 43827, 198951, 184590, 14541, 39500, 204486, 89497, 71219, 351066, 332842, 371850, 520592, 601338, 274194, 192520, 211867, -43270, 41548, 196325, 230680, 129999, 409915, 268345, 272802, 328161, 234502, 398624, 447805, 204648, 451426, 393620, 233926, 450766, 455364, 286185, 328370, 475940, 450653, 362194, 518273, 683960, 409139, 463551, 673016, 450746, 215520, 234560, 357875, 499833, 694415, 503127, 361308, 237846, 350150]
4009C50150J89484P0310k54534L0464N1255K6437J20912j13153j48850J7577n3941
3998B86111J73730q5523J0385l3649J67957o4893l6741j258l1159K3204j78672
3987B29492k2630P0601R8906r0477P0392J25241j734J03046R9728j60019J60037
3976F82583j97452j63336j38247P6451K23061J1457q3921J02911j54827J40113
3966D98793j93204j38105K09772J7081J89519j01617O1403k19477N7256K41465
3956F22886k10704j06587K62621J12296P6673j73496J41300o0512l5802J87163
3946H15838L6838m6866N2937j71835j20443K97350R3551j65785P3311N1374J34277
3935A050547J88626l65922j43585J39319J87673R4559k84701M4171M9825J07096
$$ y = [350150, 539634, 609944, 355410, 385874, 437129, 463566, 584478, 471325, 322475, 340052, 286111, 459841, 374318, 384703, 351054, 519011, 454118, 417377, 416119, 384960, 408164, 229492, 206862, 277463, 376369, 285892, 356284, 481525, 479791, 582837, 682565, 522546, 682583, 485131, 321795, 183548, 259999, 483060, 494517, 410596, 513507, 358680, 498793, 305589, 167484, 377256, 394337, 583856, 482239, 543642, 324165, 381421, 622886, 412182, 305595, 568216, 680512, 757185, 583689, 724989, 664477, 628675, 815838, 852676, 805810, 858747, 686912, 566469, 863819, 957370, 791585, 864896, 916270, 1050547, 1239173, 873251, 729666, 868985, 1056658, 1151217, 866516, 910687, 960512, 1067608]
3925A067608k33943p7319R1922J60021L03539j71170j22774J95912L546k2950
3915A194392k8703L9340K9403M2247K43109j34822J11739k0343j07375m6624L37475
3904A659838N5572j32568o1706m4161j72663J79661J29920j09067j37665L03868
3894A671029j74205k62765J02124K02792P0857L0717J12242m1623J26131k04428
3884A632871n1721J98277J27947L8162j05179K51740J06580M3282l8884J66402
3874B369477l0616J03902k41136n3657j14631j19330J03358j61330M2295P0022
3864A968354j06093J44570j88659J4591J21151K0546K02446q43j69272P4816p1858
3853B009749M2174K70881j07643K46920J42408P768o2571Q3799j12621K24604
$$ y = [1067608, 833665, 756346, 848268, 1008289, 1311828, 1140658, 1017884, 1213796, 1217342, 1194392, 1165689, 1205029, 1234432, 1276679, 1519788, 1384966, 1496705, 1476362, 1368987, 1322363, 1659838, 1715410, 1582842, 1521136, 1476975, 1304312, 1483973, 1613893, 1504826, 1367161, 1671029, 1496824, 1234059, 1336183, 1538975, 1609832, 1640549, 1752791, 1711168, 1837299, 1632871, 1581150, 1779427, 1907374, 1945536, 1840357, 2092097, 2198677, 2241959, 2203075, 2369477, 2338861, 2442763, 2201627, 2147970, 2033339, 1914009, 2017367, 1856037, 1898332, 1968354, 1862261, 2006831, 1818172, 1832763, 1953914, 1974460, 2176906, 2176063, 2006791, 2081607, 2009749, 2051923, 2322804, 2215161, 2462081, 2604489, 2612257, 2549686, 2633485, 2520864, 2745468]
3843B745468J27265J2849k83704j70645k9903P5959O9241j81950M6057K85381
3833B696018p1119j37636J22015J05035k09973k0877K51267k8444r4994j19017
3823B492275M761Q0072O211L26867j5236m353L5882p4257j61411p3928K39946
3812B856829K4633m9034Q9920q9946J76180o2774k113J55411k70038J06691K2692
3801B958451K66155K2971N6274J88902l02065J97493j7054M2646J48945M9135
3791C611853J5122j9426J54944P3022Q8010j80513o0194O6670J23635j98132L5862
3780C710853J07552K74529J97810l6744m2119O164q0444J85537R7385J20925O5699
3769D607147J1532L50932R1058L26373K50159k12822j43802R9815J50415K58198
$$ y = [2745468, 2872733, 2885582, 2601878, 2431233, 2401330, 2477289, 2546530, 2364580, 2410637, 2696018, 2624899, 2487263, 2609278, 2714313, 2504340, 2483463, 2734730, 2706286, 2611292, 2492275, 2497036, 2577108, 2583319, 2910186, 2894950, 2890597, 2926479, 2852222, 2690811, 2616883, 2856829, 2881462, 2832428, 2922348, 2832402, 3008582, 2945808, 2943695, 3099106, 2829068, 2935759, 2958451, 3224606, 3247577, 3303851, 3492753, 3190688, 3388181, 3371127, 3413773, 3562718, 3611853, 3626975, 3607549, 3762493, 3835515, 3923525, 3743012, 3682818, 3749488, 3873123, 3674991, 3710853, 3818405, 4092934, 4290744, 4254000, 4211881, 4218045, 4137601, 4323138, 4420523, 4541448, 4607147, 4618679, 4969611, 5060669, 5387042, 5637201, 5424379, 5280577, 5380392, 5530807, 5789005]
3759E789005o0726k5528m8641K02696J78995K93893P2029K74187Q4555K99660
3749G060125J55537J57092L65144O85143M59780M53597P89830O93364J001978
3740A1821590J120569M45157m29842r10842r60611q44026m56494j44512j21336
3731I519653k05012l8581k47300J73777J20532L0355J54041j1821K29132j17597
3721I607179K6966J32733J52384K82424n7193J73871L58955O2592K21121K38920
3711A1199952J36015K25153L59891J97263N10041J05323K61722M91741M61472
3702A3948573K54861K79793M72488M94750J58970L27669M49233N56946M88495
3693A7431778N99516M29094Q21907Q68267Q83339J203605J250911J290333J619495
$$ y = [5789005, 5728279, 5702751, 5654110, 5856806, 6035801, 6329694, 6401723, 6675910, 6760465, 7060125, 7215662, 7372754, 7737898, 8423041, 8882821, 9336418, 10126248, 10819612, 11821590, 12942159, 13387316, 12957474, 12046632, 11086021, 10241995, 9785501, 9640989, 9519653, 9314641, 9276060, 9028760, 9202537, 9323069, 9353424, 9507465, 9495644, 9724776, 9607179, 9634145, 9766878, 9919262, 10201686, 10144493, 10318364, 10677319, 10739911, 10961032, 11199952, 11335967, 11561120, 11921011, 12118274, 12628315, 12733638, 12995360, 13487101, 13948573, 14203434, 14483227, 14955715, 15450465, 15609435, 15937104, 16386337, 16943283, 17431778, 18031294, 18460388, 19282295, 20150562, 21033901, 22237506, 23488417, 24778750, 26398245]
3684B6398245J710948J990115K158740K479441K665752L290241L475400L460629
3676D7629511K627223J204913o1590p77767j074446j832214k072708j502993j055118
3667D3084811m39760k770O58577J396169J186210J951061K356865K819225L424409
3658E6434797L755321M622016N845552O242970O699299O955735P425038P525287
3650A05506015P349787O871201N622288M248281K397644q5053l050350n580640
3642A23279173o953960o716729n537676m253482k892945j047581q4685M93390
3634I6285505P63784M79019J106037K157803L436664M900399O087574O458189
3626A21674974P218648P818893Q508183Q719744Q055278P749615P291348O372190
$$ y = [26398245, 28109193, 30099308, 32258048, 34737489, 37403241, 40693482, 44168882, 47629511, 50256734, 51461647, 51400057, 50622290, 49547844, 47715630, 45642922, 44139929, 43084811, 42645051, 42642281, 43300858, 44697027, 45883237, 47834298, 50191163, 53010388, 56434797, 60190118, 64812134, 70657686, 76900656, 83599955, 90555690, 97980728, 105506015, 112855802, 119727003, 125349291, 129597572, 131995216, 131910163, 128859813, 123279173, 116325213, 109608484, 104070808, 99817326, 96924381, 95876800, 95792115, 96285505, 97049289, 97528308, 98634345, 100792148, 104228812, 109129211, 115216785, 121674974, 128893622, 136712515, 145220698, 153940442, 161995720, 169745335, 177036683, 183408873]
3618A83408873N080073L261727Q02964k498885n339016p365775q392610q465748
3610A60491603q503883p667411o157959n557980n514790n294461m439005k822699
3602A14533415j654562k47478P49148J088802K021896K350346L038887M001097
3594A25881551M841510N484990N906813O188717O664611P133983N877833K867477
3586A70847485j165133n763607r082695j1334877j1772770j0610356r226655p972771
3578A03918621p281846o716299n350917m246878l576789k808928k098015j817442
3570G0021507j690343j306262l73611J80801N60939J180207J576550K642064L420321
3561G6212173L752050L080875J376193j299407m010156o015842o887763o106631
$$ y = [183408873, 188488946, 191750673, 192553637, 190054752, 184715736, 177349961, 168957351, 160491603, 151987720, 144320309, 138162350, 132604370, 127089580, 121795119, 117356114, 114533415, 112878853, 112631375, 113380523, 114469325, 116491221, 118841567, 121880454, 125881551, 130723061, 136208051, 142114864, 148303581, 154968192, 162102175, 167980008, 170847485, 169682352, 163918745, 154836050, 143501173, 131728403, 121118047, 111891392, 103918621, 96636775, 89920476, 84569559, 80322681, 76745892, 73936964, 71838949, 70021507, 68331164, 67024902, 66651291, 66832092, 67393031, 68573238, 70149788, 72791852, 76212173, 79964223, 83045098, 84421291, 83121884, 79111728, 73095886, 66208123, 60101492]
3553F0101492m906895m077656l279249k471094k136523j744321j563527j735200
3545C8187027j295242j159713j039437j092614j029477p28549q23119o95881n81298
3536B9741697m92872p02645p83317m59147k69405n17290n67551n16190l98228
3527B5035052l94917m63963m61279n40410l54327k81205j30604J45991m87608
3518B2066730k37359j00854j30079j30367j34113J8245m08833k15027j12588j27814
3508B0487941k68165n72767j15889l07605n11537j97248k37359k09338k83788
3499A7784245m5092Q869k18694k17304n3755r4408M2756q6314J12147J21932r4211
3488A7260171n2153r2273p8894L2925j78555k95357j13165J7690k36917m7854
$$ y = [60101492, 55194597, 51116941, 47837692, 45366598, 43230075, 41485754, 39922227, 38187027, 36891785, 35732072, 34692635, 33600021, 32570544, 31841995, 31018876, 30322995, 29741697, 29248825, 28546180, 27762863, 27303716, 27034311, 26517021, 25949470, 25433280, 25035052, 24640135, 24176172, 23714893, 23174483, 22820156, 22538951, 22408347, 22554338, 22066730, 21829371, 21728517, 21598438, 21468071, 21333958, 21352203, 20943370, 20728343, 20615755, 20487941, 20219776, 19647009, 19531120, 19223515, 18711978, 18514730, 18277371, 18068033, 17784245, 17739153, 17748022, 17529328, 17312024, 17258269, 17163861, 17206617, 17120303, 17232450, 17354382, 17260171, 17208018, 17115745, 17036851, 17069776, 16891221, 16595864, 16482699, 16500389, 16263472, 16215618]
3478A6215618j42595J1437K8022J06622j04698k56068p4763J02059J12860J08975
3468A6107469P1132K03643R1517j54633J41595J95161P6560N83162K81329J43751
3458A7740686K39109J65621R7387K94658J39185K77026P83001L70128L44906O33716
3448B1085423R55339R89277J077981Q84590J516101J872426J851465K488593K631236
3439C5352431L098734L221479K322009R54515k78480l75123L52350M42295k97905
3430D4792305j184775j996304j843288j411893m20771J62227Q08217P67689J066992
3421D0740399J745770K404662K457822K670417K584188K681688K678398K045313
3413F0008657P70717l98393o41271J2721J164107K095984K841653L226001L656873
$$ y = [16215618, 16073023, 16084460, 16112482, 16219104, 16114406, 15858338, 15783575, 15885634, 15998494, 16107469, 16178601, 16382244, 16473761, 16319128, 16460723, 16655884, 16732444, 17315606, 17596935, 17740686, 17979795, 18145416, 18242803, 18537461, 18676646, 18953672, 19736673, 20106801, 20451707, 21085423, 22040762, 23030039, 24108020, 24992610, 26508711, 28381137, 30232602, 32721195, 35352431, 38451165, 41672644, 43994653, 44949168, 44670688, 44295565, 44647915, 45090210, 44792305, 43607530, 41611226, 39767938, 38356045, 37935274, 38097501, 38905718, 39673407, 40740399, 42486169, 44890831, 47348653, 50019070, 52603258, 55284946, 57963344, 60008657, 60779374, 60380981, 59739710, 59752431, 60916538, 63012522, 65854175, 69080176, 72737049]
3404G2737049L619599L377828K876721J829175M3321j398947k779883l273520
3396G7031343k782273k645809k209797j518059j005409J54717k24733l41900p18007
3387F5740073j338649j129572k69511N95805J368305J842526J808297K553792
3379G1171066L610641M050061M493067M574818M068801K934362R26570j618800
3371I4210586m271130n076247m533161k829547j500990j191551j390692k001114
3363G1416154k528771k303408j858428j570853j014167n61089j26141L55809N27120
3354F2336226N64297M26517L28467K55074N74195O05380J321675J993787K868773
3345G1274391L253448L796912L637775J956446J394222j784117n496176n125972
$$ y = [72737049, 76356648, 79734476, 82611197, 84440372, 84483693, 83084746, 80304863, 77031343, 74249070, 71603261, 69393464, 67875405, 66869996, 67024713, 66799980, 66458080, 65740073, 64401424, 63271852, 63002341, 63598146, 64966451, 66808977, 68617274, 71171066, 74781707, 78831768, 83324835, 87899653, 91968454, 94902816, 95829386, 94210586, 89939456, 84863209, 80330048, 77500501, 75999511, 74807960, 73417268, 71416154, 68887383, 66583975, 64725547, 63154694, 62140527, 61579438, 61453297, 61809106, 62336226, 62900523, 63327040, 63655507, 63910581, 64484776, 65090156, 66411831, 68405618, 71274391, 74527839, 78324751, 81962526, 83918972, 85313194, 83529077, 78032901, 72906929]
3337G2906929m319407m107643l876337l832360l477131l730732m095839l390046
3329D2077434k595199j938466j538542j435766j392194r14037o74512n83412o54178
3320C0351128k32317P4112r9328L82773K9739l14947o60942o47567p30447o09604
3310B7542600j49657m19523k67668q38211j408146j467403j354540r13513r04533
3301A9819406o76588l85449p41891o99052k13158l96477l45165k33156l47819
3292A5780651k72108l06355r5650m37119l17126k59456k43575j28695m02577l93604
3282A2924386k52219o2232k01646k90412k6653k18957l45378L1958l33495o6025
3272A1159327k73104j00111k37655J59438j76518l13046p8044R3833j53975o48398
$$ y = [72906929, 68587522, 64479879, 60603542, 56771182, 53294051, 49563319, 45467480, 42077434, 39482235, 37543769, 36005227, 34569461, 33177267, 32263230, 31588718, 31005306, 30351128, 30118811, 30192923, 30093595, 30476368, 30506107, 30191160, 29530218, 28882651, 28152204, 27542600, 27392943, 26973420, 26705752, 25867541, 24459395, 22991992, 21637452, 20723939, 19819406, 19142818, 18757369, 18015478, 17316426, 17103268, 16706791, 16361626, 16128470, 15780651, 15508543, 15202188, 15106538, 14669419, 14352293, 14092837, 13849262, 13720567, 13317990, 12924386, 12672167, 12609935, 12408289, 12117877, 12091224, 11872267, 11526889, 11558847, 11225352, 11159327, 10886223, 10786112, 10548457, 10707895, 10531377, 10218331, 10140287, 10234120, 10080145, 9431747]
3262I431747j10962P5208J3917j34413m1252Q4120j62924k87457O6214K1496j02574
3251H853120m1671m02375r967k3530J80061O6590K8260l65778m0680J89287L6612
3240H469929j67995R5186Q0954K4518L42955K78953L94279K94798N52580N70307
3230A0936464L99622k10040m05206p84871p28440o31417l76905j84130j37745
3221G877332j04679k39821m2873J9065l45401J96066q8292j51099m5444J06561
3211G181415k87242k08042m3192j61409Q5377Q9792n9503K0852j1893K6382p8670
3200F553867j8409J25417j14733r402O4151N0235K64893J4991j31K9954j64523
3189F796310K21342L48119K4305n41J02738K51171j18486j9131J85211J73622
$$ y = [9431747, 9320785, 9395993, 9409910, 9275497, 9234245, 9318365, 9155441, 8867984, 8934198, 8955694, 8853120, 8811449, 8409074, 8399107, 8375577, 8555638, 8622228, 8650488, 8284710, 8244030, 8433317, 8469929, 8301934, 8397120, 8478074, 8502592, 8845547, 9124500, 9518779, 9813577, 10366157, 10936464, 11336086, 11126046, 10720840, 9935969, 9207529, 8576112, 8199207, 8015077, 7877332, 7772653, 7532832, 7489959, 7509024, 7163623, 7359689, 7271397, 7120298, 7074854, 7181415, 6894173, 6686131, 6642939, 6481530, 6566907, 6656699, 6597196, 6618048, 6606155, 6632537, 6553867, 6535458, 6660875, 6546142, 6536740, 6600891, 6651126, 6916019, 6931010, 6930879, 6960833, 6796310, 7017652, 7365771, 7390076, 7389535, 7492273, 7743444, 7624958, 7605827, 7791038, 7964660]
3179G964660J18378R21J19907R1158L39026J20826J44571Q8600K43291J38059
3169I369397J26292O7546K53560Q7683K35045n20M2293L30259m0706J32691J85494
3158A0789034J59467K7920L85723k0358K57074M1860K59169M06813N67745M36483
3148A3310930L75711Q09757K74382K42315K29535M60757Q0965M17777N97430O08755
3138A7408314L05158M28739L88378L19736M30405K82665O11609K44883P65297
3129B1185184R31485M41981P02530J025882Q53713R30609P60875Q91958P84511
3120B8508728O96499Q57755N68201J022803J360952Q96629J067164J410544J271611
3111C7660886J807156K131192K425972K346640K678013K897841K756081K721280
$$ y = [7964660, 8083038, 8083959, 8203866, 8295024, 8634050, 8754876, 8899447, 8988047, 9231338, 9369397, 9495689, 9563235, 9816795, 9904478, 10139523, 10139003, 10181296, 10511555, 10470849, 10603540, 10789034, 10948501, 10976421, 11362144, 11341786, 11598860, 11640720, 11899889, 12306702, 12874447, 13310930, 13686641, 14496398, 14770780, 15013095, 15242630, 15703387, 15784352, 16202129, 16799559, 17408314, 17713472, 18142211, 18530589, 18850325, 19280730, 19563395, 20175004, 20419887, 21185184, 22116669, 22558650, 23261180, 24287062, 25140775, 26071384, 26832259, 27724217, 28508728, 29205227, 30062982, 30631183, 31653986, 33014938, 33911567, 34978731, 36389275, 37660886, 39468042, 41599234, 44025206, 46371846, 49049859, 51947700, 54703781, 57425061]
3103E7425061K121471J949673J326191Q09386k45125q47133j367173j585629j698378
3094E7888344k089684k178442k330169j904425j912683k051932j955204j760136
3086D1705669j809484k174429k068845j605020j740846j769473j615834j219870
3078B7701868j196179j378777j127323r62040r15120q31906q02781r79109m92626
3069A9016007k64491m59284m96379n28776j44034m56670q77630m04208p33795
3060A4650740m70101m32508n95165j70420m30435j19243o50342l21747l21570
3051A1139209j58855m39776k74671l33801k84631j13323j85288j67487k1732l24011
3041H835634l74252n2299l35582l65389o4611O2782k05010l38615J59564j01972
$$ y = [57425061, 59546532, 61496205, 62822396, 63631782, 63386657, 62539524, 61172351, 59586722, 57888344, 55798660, 53620218, 51290049, 49385624, 47472941, 45421009, 43465805, 41705669, 39896185, 37721756, 35652911, 34047891, 32307045, 30537572, 28921738, 27701868, 26505689, 25126912, 23999589, 23037549, 22122429, 21290523, 20487742, 19508633, 19016007, 18751516, 18292232, 17795853, 17267077, 17123043, 16666373, 15788743, 15384535, 14650740, 14180639, 13748131, 13152966, 12982546, 12552111, 12432868, 11782526, 11460779, 11139209, 10980354, 10540578, 10265907, 9932106, 9647475, 9534152, 9348864, 9181377, 9159645, 8835634, 8461382, 8409083, 8073501, 7708112, 7643501, 7706283, 7501273, 7162658, 7322222, 7220250]
3031G220250l78291k90296M263L48825l01069L099k0152l41778j70628J6159k7758
3020F062624k11754r5217j7345m0416j18806j3388r8400m84250Q8342r3287m3071
3009D935032q9597R8880o9250j26584J07555j05391o6985j49707j53268L3580
2999D414265J04127J0453o6415j48674j48061j7596j43261O355j44602N2936j55415
2988C764112j68556K4697o5562j52653r3014r8258o44j679P4091K13639k17553
2977C278620M6437k0809n4556j84809J6435q679O6107J52853k78685J30465R1628
2966C235007n3645q6788Q8403r6914o2758R2607j92778J30940j49778m7761P4514
2955B931049k9683J46931m20990Q0693K12532l4404N382j88743k18983K03206
$$ y = [7220250, 6841959, 6551663, 6555926, 6904751, 6603682, 6606781, 6586629, 6244851, 6074223, 6090382, 6062624, 5850870, 5755653, 5738308, 5697892, 5579086, 5565698, 5467298, 4983048, 5071390, 4978103, 4935032, 4845435, 4944315, 4875065, 4748481, 4856036, 4750645, 4683660, 4533953, 4380685, 4414265, 4518392, 4528845, 4462430, 4313756, 4165695, 4148099, 4004838, 4011193, 3866591, 3919527, 3764112, 3595556, 3620253, 3554691, 3402038, 3309024, 3210766, 3210122, 3208443, 3282534, 3496173, 3278620, 3325057, 3304248, 3249692, 3064883, 3081318, 3072639, 3138746, 3291599, 3012914, 3143379, 3235007, 3181362, 3094574, 3182977, 3086063, 3023305, 3115912, 2923134, 3054074, 2904296, 2856535, 2931049, 2901366, 3048297, 2627307, 2708000, 2920532, 2886128, 2891510, 2702767, 2483784, 2686990]
2945B686990q894k9452O8197M6725j4013N4761L1956M1657J95246r3182o6510
2934B913481k10986j22895J66125Q9006j1818J3721k2915r00j800r2743j60331
2923B557945K38214J07572p5753N0793J07687r3637j36101o9321J173l5380M8612
2912B701804J15766P9243q4686L00391J22823j38752n4433O4119L2159L6763j30691
2901C044506M7521J53018j73917K28770J18559K25065N6775j507j33775J20212
2891C685227P3712K21904m0611L419R1069J67570J49969P9521J25447n4938K40531
2880D742820M2964M36063J66510K37107L44789N0081L71886M15333K96763L01515
2870G405831K94718J43224J36992L07657q3831j8117q3384k63181p6217L0211
$$ y = [2686990, 2678096, 2648644, 2716841, 2763566, 2749553, 2804314, 2836270, 2877927, 3073173, 2979991, 2913481, 2702495, 2579600, 2745725, 2834731, 2822913, 2836634, 2813719, 2812819, 2811019, 2718276, 2557945, 2796159, 2903731, 2827978, 2878771, 2986458, 2892821, 2756720, 2687399, 2688572, 2653192, 2701804, 2817570, 2896813, 2812127, 3112518, 3235341, 3096589, 3042156, 3106275, 3138434, 3175197, 3044506, 3092027, 3245045, 3071128, 3299898, 3418457, 3643522, 3700297, 3698790, 3565015, 3685227, 3758939, 3980843, 3940232, 3943651, 4034720, 4202290, 4352259, 4431780, 4557227, 4502289, 4742820, 4785784, 5221847, 5388357, 5625464, 5970253, 6020334, 6392220, 6807553, 7104316, 7405831, 7700549, 7843773, 7980765, 8288422, 8204591, 8186474, 8103090, 7839909, 7763692, 7793903]
2860G793903l5204Q7613R2033J31682N1901M3701K45960Q5312O1891K46853J59781
2849H965426K74826J17870L17266O88755N93234L53713K04281P26849J105067
2840A3347287N87633O35996M35718M40604M06027O6049O0114q9256l70464r7929
2830A5421779j24193J08689L08054r7673j72670J77378L74103L95359M95039M99785
2820A7385650R43498J003742Q32478Q70540J134817J493273J066462J019076Q67522
2811B6617058P93317L06382J45702O27705N25911K6573L19220K62809J55598k5653
2801B9754622j4197J32557j57232K48152M57457L05912N06820P21173P03991J055221
2791C3714476J404163J489767J963666L060676K643589K104722J24645k068528
$$ y = [7793903, 7758699, 7846312, 7938345, 8070027, 8121928, 8165629, 8411589, 8496901, 8558792, 8805645, 8965426, 9240252, 9358122, 9675388, 10364143, 10957377, 11311090, 11515371, 12242220, 13347287, 13934920, 14570916, 15006634, 15447238, 15853265, 15919314, 15979428, 15890172, 15519708, 15421779, 15297586, 15406275, 15714329, 15616656, 15443986, 15621364, 15995467, 16390826, 16885865, 17385650, 18329148, 19332890, 20165368, 21035908, 22170725, 23663998, 24730460, 25749536, 26617058, 27410375, 27716757, 27862459, 28490164, 29016075, 29042648, 29361868, 29624677, 29780275, 29754622, 29740425, 29872982, 29715750, 29963902, 30421359, 30727271, 31234091, 31955264, 32659255, 33714476, 35118639, 36608406, 38572072, 41632748, 44276337, 46381059, 46505704, 44437176]
2783D4437176l491403l581647l077554k517845k203284j635631j293720r59997
2775B5676095r51522r38960n46126n81878m71545l39594j94144L3064j20349l9210
2765B1525831K82259K8027J81444L94350Q4565O8742L18126j49819p61129o05520
2755B1366876j001895j228511j357686j301984q52597o82487q28061n49837o55540
2746A2908278n50481o11652l18326n59747k78339m07433m95379l06083o08068
2737H772770j88063k50179j28760j93866k92584j55678j68816k75863k48633K3875
2727F894203k14048m03985k18937L1740j5380l56713K5479l58403j81733j27733
2717E074490l50579O0531K28208j77550r4046j17306k08020j34278o9314j85694
$$ y = [44437176, 40945773, 37364126, 34286572, 31768727, 29565443, 27929812, 26636092, 25676095, 24724573, 23785613, 23239487, 22657609, 22186064, 21846470, 21652326, 21685390, 21565041, 21525831, 21808090, 21836117, 22017561, 22411911, 22496476, 22565218, 22883344, 22733525, 21972396, 21366876, 20364981, 19136470, 17778784, 16476800, 15624203, 14941716, 14113655, 13563818, 12908278, 12357797, 11746145, 11427819, 10868072, 10589733, 10182300, 9686921, 9380838, 8772770, 8584707, 8334528, 8205768, 8011902, 7719318, 7563640, 7394824, 7118961, 6870328, 6894203, 6680155, 6276170, 6057233, 6088973, 6073593, 5716880, 5742359, 5383956, 5202223, 5074490, 4723911, 4784442, 5012650, 4835100, 4741054, 4623748, 4415728, 4281450, 4212136, 4026442]
2707D026442n8004P4174k42232N2930j56107p182j59886L8863N1324n5130k63419
2696C301773j24088J26413j98390J07381j52673k0371j72992o6663j45945j78127
2686B476318J06498O9560n7604J46002O9528M0832k07102j34558o8247q4999k903
2675B353325l5678J66403k01814j28763j17698j7821N276o8284K19977k18383
2665A956540k34299n5717R8504p4018o8758k33548L69713j0183k14193M4760q2951
2654A495850R6323j19160j20743J94542M500P8164l6109k20941K0001p0433q0525
2643A241469p9437O6759K4992j6284R1520j22670Q062k01370l1662J66546K47423
2632A395348j09460J3943p9839j57472l0509J97297k8258p6126q5316m3287J9557
$$ y = [4026442, 3968438, 4042612, 3800380, 3853310, 3697203, 3690021, 3530135, 3568998, 3620322, 3565192, 3301773, 3177685, 3304098, 3105708, 3213089, 3060416, 3040045, 2867053, 2800390, 2654445, 2476318, 2582816, 2652376, 2594772, 2740774, 2810302, 2851134, 2644032, 2509474, 2441227, 2356228, 2353325, 2317647, 2484050, 2282236, 2153473, 2035775, 2017954, 2023230, 1954946, 2174923, 1956540, 1722241, 1666524, 1765028, 1691010, 1622252, 1388704, 1758417, 1748234, 1534041, 1578801, 1495850, 1592173, 1473013, 1352270, 1546812, 1551312, 1629476, 1593367, 1372426, 1392427, 1321994, 1241469, 1162032, 1228791, 1253783, 1237499, 1329019, 1206349, 1214411, 1013041, 981379, 1147925, 1395348, 1285888, 1299831, 1219992, 1062520, 1032011, 1229308, 1201050, 1124924, 1039608, 996321, 1015878]
2621A015878J10047q7505n9077O885q4579J40864j1186o5067j65221K92841j74151
2610I19729j594J28931k05421k15164K70224P5364J99033m7653j79759J45615
2600A089305j1774j2338K88636l37464n6234n3387N9952J74763j72010n6544P7594
2589I90499o1047M996O2911o416q999N3869J1099j81616J5832K45461q9618j96876
2577H40095P9477K00767J47987J9786j46723n9742q4237k5147M5877K77516q1219
2566A214437o6056j11508m846K57303J44604o6595m2626J92301J14084j69879
2556A461219r6467J43707J76855Q6542o5940j14397r7864L68828J62939j40029
2546A885393J96121l8266k23150J49210J19404r49O484l3542J12523J55862o6061
$$ y = [1015878, 1125925, 1038420, 979343, 986228, 901649, 1042513, 1031327, 966260, 801039, 1093880, 919729, 918135, 1047066, 841645, 626481, 896705, 972069, 1171102, 1123449, 943690, 1089305, 1077531, 1065193, 1353829, 1016365, 960131, 906744, 966696, 1141459, 969449, 912905, 990499, 929452, 934448, 997359, 990943, 981944, 1035813, 1046912, 865296, 881128, 1126589, 1036971, 840095, 919572, 1120339, 1268326, 1288112, 1141389, 1081647, 997410, 972263, 1018140, 1295656, 1214437, 1148381, 1036873, 1032027, 1289330, 1433934, 1367339, 1324713, 1517014, 1631098, 1461219, 1364752, 1508459, 1685314, 1771856, 1705916, 1591519, 1493655, 1862483, 2025422, 1885393, 2081514, 2043248, 1820098, 1969308, 2088712, 2087763, 2094247, 2060705, 2173228, 2329090, 2263029]
2535B263029Q9571J4677P2456J52749K12835J03048J16659K02339M3964J62998
2525C434325K7025k40384J21201j26267k33790J93973M9112o1813K355K16520
2515C382257r5506l77856o4622L62744K01591J7164j73522M1723K24282k23572
2505C294683j77060K50212Q3671K2062P5836P1298L62532J30590j49218K17089
2495D181695K09014m11940p9685J58306k56053q7696J17698l54150j98505k3296
2485C255388N3958K2582j20347j5401l4956M2194p1090j68163q6284M9653K74978
2474C202512k73064L8064m5641J7522L4619N7405r1674K31891J38557j07695J12907
2463C315403j19528j3535J583k93373R0224k11164r7570k44968j99083k62864
$$ y = [2263029, 2352600, 2367277, 2439733, 2592482, 2805317, 2908365, 3025024, 3227363, 3271327, 3434325, 3461350, 3220966, 3342167, 3215900, 2982110, 3176083, 3225195, 3163382, 3165737, 3382257, 3286751, 2908895, 2844273, 3207017, 3408608, 3425772, 3252250, 3293973, 3518255, 3294683, 3117623, 3367835, 3451506, 3473568, 3549404, 3620702, 3983234, 4113824, 3964606, 4181695, 4390709, 3978769, 3899084, 4057390, 3801337, 3713641, 3831339, 3477189, 3278684, 3255388, 3309346, 3331928, 3211581, 3196180, 3161224, 3203418, 3132328, 2964165, 2877881, 2927534, 3202512, 2929448, 2967512, 2921871, 2939393, 2974012, 3031417, 2939743, 3171634, 3310191, 3202496, 3315403, 3195875, 3182340, 3183923, 2890550, 2980774, 2769610, 2672040, 2427072, 2227989, 1965125]
2453A965125k47220J42963Q4624j78739k5149R067k7253M5510p8655J70817K6913
2442A888003j44101l97121J6712J89565k7830J7544m15116p0112J87683Q5431
2432A330658q823l8956O5761l38044J1430M1251J25591l7866q7930q9814l3743
2421I39515l9343K3133M2993k32648m2417J43658J3681M3807j77490j78249K20897
2410G57537r3655o7730R2379j63270J8007k19888J44835K71153J20170k12366
2400F47172j76024j08720J27823J72998k18309l32233O14435j72965k56024j7380
2390B80773j1589j7456L73201J21386k30976j41484l1991k4499K6251Q5316p096
2379D21836M0271k03229o3764K80284N1486l09702J18602R1161j08451j10725
$$ y = [1965125, 1717905, 1860868, 1945492, 1766753, 1741604, 1750671, 1723418, 1768928, 1690273, 1861090, 1888003, 1743902, 1346781, 1363493, 1553058, 1525228, 1542772, 1127656, 1057544, 1245227, 1330658, 1321835, 1282879, 1348640, 1010596, 1022026, 1063277, 1188868, 1151002, 1063072, 973258, 939515, 900172, 923305, 966298, 733650, 691233, 834891, 848572, 892379, 714889, 536640, 757537, 663882, 596152, 688531, 525261, 543268, 323380, 468215, 739368, 859538, 647172, 471148, 362428, 490251, 663249, 444940, 112707, 727142, 554177, 298153, 280773, 269184, 251728, 624929, 746315, 515339, 373855, 341864, 317365, 343616, 428932, 421836, 462107, 258878, 195114, 475398, 526884, 217182, 335784, 426945, 318494, 207769]
2369B07769K51645o3034q1245k21628P8697K38151k51177j12751J13585l465j03692
2358E2855K44903J54871k04000k24080K21974L15138j82679j5548k15855J9688
2348A67267o6492Q5489N7853j93854O5309J81296m5376J15766l9186j50189j38888
2337C8995J16925M019n3447Q8734N4288m2481l7154J4806r2066L7278L6068M8069
2325B14034o1459N9236J72620j08493j04976p2098L25247L4737k91140j33936
2315C3772K44558J11697l5569J77536j12017M816K59818N3360j29372L350K36777
2304H48726O2461K9208J89963k22964k53545q3689k31889m0889n9666L7559J90473
2293D65748j75020N1403M5273r6601O035P5693k10357k4746R6220N9847K8607
$$ y = [207769, 459414, 396380, 315135, 93507, 172204, 410355, 159178, 46427, 160012, 156547, 52855, 297758, 452629, 248629, 24549, 246523, 561661, 378982, 363434, 147579, 167267, 100775, 186264, 244117, 50263, 115572, 296868, 251492, 367258, 328072, 177883, 38995, 155920, 159939, 106492, 195226, 249514, 207033, 169879, 184685, 92619, 129897, 165965, 214034, 152575, 211811, 384431, 275938, 170962, 98864, 424111, 458848, 167708, 33772, 278330, 390027, 354458, 531994, 419977, 424793, 684611, 737971, 608599, 611949, 848726, 911187, 940395, 1130358, 907394, 653849, 570160, 338271, 297382, 237716, 275275, 465748, 290728, 342131, 387404, 290803, 296838, 372531, 162174, 137428, 233648, 293495, 322102]
2282C22102q9311J70877Q6305p5377k32854m2353K19114J09479o6762j04750k9078
2271B67392P0416m7677K8847J37194j54578J65236L5160q5419J5217k109N3705
2260D83384n1206k00543Q3332j24791K13507J32605l74971J20594m0289M7754
2250B89376K40317M7953k16617o6717K19234j12991j37025M8328P5203k41092
2240A45969P6784J10306m7754p4098r5525J03773m506n1616j91624L35850K98962
2229F06521j53137j72639n9842Q5266O0528J70235Q2524Q0233k91617k9246J71754
2218E50580R506N2307k41068m7701K05249J37997K76873j28515m8131j02877R7356
2207G61576k38401j7517P7294j9394L10003j95388J228m3536p1903q2298J10515
$$ y = [322102, 232791, 403668, 489973, 414596, 181742, 139389, 358503, 467982, 401220, 296470, 267392, 337808, 290131, 318978, 456172, 301594, 466830, 501990, 416571, 431788, 429679, 483384, 432178, 231635, 314967, 190176, 403683, 536288, 161317, 281911, 241622, 289376, 529693, 577646, 361029, 294312, 513546, 400555, 263530, 311858, 387061, 145969, 222753, 333059, 285305, 211207, 115682, 219455, 214949, 163333, -28291, 307559, 606521, 453384, 280745, 220903, 306169, 366697, 536932, 619456, 699689, 408072, 378826, 550580, 560086, 612393, 371325, 323624, 528873, 666870, 943743, 815228, 767097, 664220, 761576, 523175, 505658, 582952, 563558, 873561, 678173, 679401, 635865, 563962, 481664, 592179]
2196E92179K49557n3381j6104o9326j67162K73367J02912N9141j34044K27926
2186A065065k17846j62151J20894K55697k5761r8516Q808j32664m5453Q5861K58180
2175A112114j28674J24156J3846J33359r3799k97524J69779N8128k34390J42059
2165I99054K05176R2390O5837N436r0691q3845j97096J38008K06226j05963O1279
2154A295811K99409J19519M8099M4560K0358K1516K334J5162k0686K73817J15849
2143B235748N0002j15332k5411J20074J82122K73091J875K5255J89378p6072K9353
2132B890083J45828M0533p5848J21489J11108K8145o1208j0913J32207O6096J30456
2121C517976p485J18006R8973j08650L26117R0097L4687r4577N5300J1975R557
$$ y = [592179, 841736, 788355, 772251, 702925, 535763, 809130, 912042, 971183, 837139, 1065065, 847219, 685068, 805962, 1061659, 1035898, 937382, 946190, 813526, 768073, 853934, 1112114, 983440, 1107596, 1121442, 1254801, 1161002, 863478, 1033257, 1091385, 856995, 999054, 1204230, 1296620, 1362457, 1367893, 1277202, 1193357, 996261, 1134269, 1340495, 1234532, 1295811, 1595220, 1714739, 1762838, 1807398, 1827756, 1849272, 1851606, 1866768, 1846082, 2119899, 2235748, 2285750, 2170418, 2145007, 2265081, 2447203, 2720294, 2722169, 2747424, 2936802, 2860730, 2890083, 3035911, 3076444, 3000596, 3122085, 3233193, 3261338, 3200130, 3189217, 3321424, 3387520, 3517976, 3510491, 3628497, 3727470, 3618820, 3944937, 4035034, 4069721, 3975144, 4030444, 4042419, 4051976]
2110D051976p6544L74329L07940J41815J73662J40939R6004J85359J11356L09562
2100E816398K29129L93400N13429J66549J30649M23643L23157L00273M35742N42679
2090I275048M68930P45420P53418N18327P25269O95762Q52217R21439R54417J039829
2080A6950076J209119K024757K392849K066373K210798K507292K675075L106412
2072C5142751M175019N346912N972130P316950R596403J0949775J2328177J7196055
2064A08024172K1699588J4261854K811047j8392570k7898902k2315884j4711178
2057F3478127r771701p620119n411875m491804l157050k750604k199653j849485
2049B6225836j360149j930805k024068k001640j371778j359172r73510q60720
$$ y = [4051976, 3975432, 4349761, 4657701, 4799516, 4973178, 5114117, 5210121, 5395480, 5506836, 5816398, 6045527, 6438927, 6952356, 7118905, 7249554, 7673197, 7996354, 8296627, 8732369, 9275048, 9743978, 10489398, 11242816, 11761143, 12486412, 13182174, 14034391, 14955830, 15910247, 16950076, 18159195, 20183952, 22576801, 24643174, 26853972, 29361264, 32036339, 35142751, 39317770, 44664682, 50636812, 57953762, 67550165, 78499940, 90828117, 108024172, 129723760, 143985614, 146796661, 128404091, 100505189, 78189305, 63478127, 53706426, 46086307, 40674432, 36182628, 33025578, 30274974, 28075321, 26225836, 24865687, 22934882, 20910814, 18909174, 17537396, 16178224, 15204714, 14343994]
2041A4343994j172066j153892o77620o96906l84378o06944m51456m55769l48527
2032H396436k13791k13293l23642k03725m90205k87498k85461r5713j50972r3248
2022F038888k32605n5793k30986m48035r2433j69230l06798k96575P657l01122
2012C912968j6038k10342j38673P0130j69430l4638O4624j23831k71153j9868
2002C063749j29636j69447R9420l475L7448j21678j94233j10893Q5698q8711j02056
1991B366186n5920k12908K9723J8615K4443k78577o2234l1593l616o0133m6214
1980A687772N8613O9539n6999j08015J95581j47090j21749m6836j51266j79849
1970A199701p6727Q3794K10446O6225m09895R5429N4490o4885J4762j1387k9632
$$ y = [14343994, 13171928, 12018036, 11340416, 10643510, 10259132, 9652188, 9200732, 8744963, 8396436, 8182645, 7969352, 7645710, 7441985, 6951780, 6664282, 6378821, 6283108, 6132136, 6038888, 5806283, 5750490, 5519504, 5071469, 4979036, 4809806, 4503008, 4206433, 4214090, 3912968, 3896930, 3686588, 3547915, 3618045, 3448615, 3413977, 3478601, 3354770, 3083617, 3063749, 2934113, 2764666, 2864086, 2860611, 2898059, 2776381, 2582148, 2471255, 2556953, 2468242, 2366186, 2310266, 2097358, 2127081, 2145696, 2170139, 1891562, 1829328, 1797735, 1794119, 1733986, 1687772, 1746385, 1815924, 1758925, 1650910, 1846491, 1699401, 1577652, 1530816, 1379550, 1199701, 1122974, 1206768, 1417214, 1483439, 1073544, 1168973, 1223463, 1158578, 1173340, 1161953, 1132321]
1959A132321N5868j36152J7041k49360L30704J03270j53516j26111n3451R7544
1949A018158O1863j05581j37562j97960m1017p62K88003J76m0162j84272J1115
1938F71999m7950j17655K29124o0833k15290K42651p3647J19415J7964r7953K44725
1927I12550l1637q9905r5148l4401k5217J04207j48365J50062j95085J3125L764
$$ y = [1132321, 1188189, 1052037, 1069078, 819718, 1150422, 1253692, 1100176, 974065, 920614, 1018158, 1080021, 974440, 836878, 638918, 597901, 597139, 885142, 885318, 845156, 660884, 671999, 624049, 506394, 735518, 674685, 459395, 702046, 628399, 747814, 765778, 667825, 912550, 880913, 791008, 695860, 661459, 636242, 740449, 592084, 742146, 547061, 560186, 563950]
$$ [...]
##END NTUPLES=NMR SPECTRUM
##END=
