##TITLE=1H_EC-3260(III-12)
 CDCl3,8 sc, 
 20.9.2021
##JCAMPDX= 6.0         $$ Bruker NMR JCAMP-DX V2.0
##DATA TYPE= NMR SPECTRUM
##DATA CLASS= NTUPLES
##ORIGIN= UXNMR, Bruker Analytische Messtechnik GmbH
##OWNER= root
$$ XWIN-NMR		Version 3.5
$$ Mon Sep 20 10:54:17 2021 Russian Standard Time (UT+4h)  she@DPX200
##.OBSERVE FREQUENCY= 200.1314
##.OBSERVE NUCLEUS= ^1H
##.ACQUISITION MODE= SIMULTANEOUS
##.ACQUISITION SCHEME= undefined
##.AVERAGES= 8
##.DIGITISER RES= 18
##SPECTROMETER/DATA SYSTEM= spect
##.PULSE SEQUENCE= zg30
##.SOLVENT NAME= CDCl3
##.SHIFT REFERENCE= (INTERNAL, CDCl3, 0, 16.9705)
##AUDIT TRAIL= $$ (NUMBER, WHEN, WHO, WHERE, WHAT)
$$ ##TITLE= Audit trail, XWIN-NMR		Version 3.5
$$ ##JCAMPDX= 5.01
$$ ##ORIGIN= Bruker BioSpin GmbH
$$ ##OWNER= she
$$ F:/spectra/data/she/nmr/H-F/1/pdata/1/auditp.txt
$$ ##AUDIT TRAIL=  $$ (NUMBER, WHEN, WHO, WHERE, WHAT)
(   1,<2021-09-20 10:52:33.43 +0400>,<she>,<DPX200>,
      <created by zg, POWCHK disabled, PULCHK disabled
       configuration hash MD5:
       00 E9 B6 7A A2 85 ED C7 34 08 36 98 17 FE 4E 26
       data hash MD5: 16K
       E8 5D 91 99 66 AD 58 B5 5F 82 DD 77 E3 0C B5 5A>)
(   2,<2021-09-20 10:52:37.82 +0400>,<she>,<DPX200>,
      <Start of raw data processing
       efp BC_mod = 2 LB = 0.24 FT_mod = 6 PKNL = 1 PHC0 = -13720.88 PHC1 = 20.4009 SI = 16K 
       data hash MD5: 16K
       04 04 FA BA 31 BF 27 33 2C C9 98 54 23 4E 70 2B>)
(   3,<2021-09-20 10:53:09.84 +0400>,<she>,<DPX200>,
      <pk PHC0 = 8.78455 PHC1 = -13.4 
       data hash MD5: 16K
       ED 6A D1 0E 7F EC 2E 4B B8 2E 31 A0 E8 15 0F 5C>)
(   4,<2021-09-20 10:53:12.87 +0400>,<she>,<DPX200>,
      <abs ABSG = 5 
       data hash MD5: 16K
       DC B2 C2 12 81 09 05 41 1B 2C E5 66 FD 60 F7 EB>)
$$ ##END=
$$ 
$$ hash MD5
$$ AE 68 16 A8 04 D2 E6 04 F1 B6 BC 9B FA 92 E2 F6
##$RELAX= 
##$RELAX= 
##$RELAX= 
##$RELAX= 
##$RELAX= 
##$RELAX= 
$$ Bruker specific parameters
$$ --------------------------
##$DU= <F:/spectra>
##$EXPNO= 1
##$NAME= <H-F>
##$PROCNO= 1
##$TYPE= <nmr>
##$USER= <she>
##$AMP= (0..31)
100 100 100 100 100 100 100 100 100 100 100 100 100 100 100 100 100 100 
100 100 100 100 100 100 100 100 100 100 100 100 100 100 
##$AQSEQ= 0
##$AQ_mod= 1
##$AUNM= <au_zg>
##$AUTOPOS= <>
##$BF1= 200.13
##$BF2= 200.13
##$BF3= 200.13
##$BF4= 200.13
##$BF5= 200.13
##$BF6= 200.13
##$BF7= 200.13
##$BF8= 200.13
##$BYTORDA= 1
##$CFDGTYP= 0
##$CFRGTYP= 5
##$CHEMSTR= <none>
##$CNST= (0..31)
1 1 145 1 1 1 1 1 1 1 1 1 1 1 1 1 1 1 1 1 1 1 1 1 1 1 1 1 1 1 1 1 
##$CPDPRG= <>
##$CPDPRG1= <>
##$CPDPRG2= <>
##$CPDPRG3= <>
##$CPDPRG4= <mlev>
##$CPDPRG5= <mlev>
##$CPDPRG6= <mlev>
##$CPDPRG7= <mlev>
##$CPDPRG8= <mlev>
##$CPDPRGB= <>
##$CPDPRGT= <>
##$D= (0..31)
0 1.2 0 0 0 0 0 0 0 0.06 0 0.03 0 0 0 0 0.0002 0 0 0 0 0 0 0 0 0 0 0 0 
0 0 0 
##$DATE= 1632120752
##$DBL= (0..7)
120 120 120 120 120 120 120 120 
##$DBP= (0..7)
150 150 150 150 150 150 150 150 
##$DBP07= 0
##$DBPNAM0= <>
##$DBPNAM1= <>
##$DBPNAM2= <>
##$DBPNAM3= <>
##$DBPNAM4= <>
$$ [...]
##$SUBNAM3= <"">
##$SUBNAM4= <"">
##$SUBNAM5= <"">
##$SUBNAM6= <"">
##$SUBNAM7= <"">
##$SUBNAM8= <"">
##$SUBNAM9= <"">
##$SW= 20.0188988654967
##$SWIBOX= (0..15)
0 0 2 0 0 0 0 0 0 0 0 0 0 0 0 0 
##$SW_h= 4006.41025641026
##$TD= 16384
##$TD0= 1
##$TE= 0
##$TE2= 300
##$TE3= 300
##$TEG= 300
##$TL= (0..7)
0 120 120 120 120 120 120 120 
##$TP= (0..7)
150 150 150 150 150 150 150 150 
##$TP07= 0
##$TPNAME0= <>
##$TPNAME1= <>
##$TPNAME2= <>
##$TPNAME3= <>
##$TPNAME4= <>
##$TPNAME5= <>
##$TPNAME6= <>
##$TPNAME7= <>
##$TPOAL= (0..7)
0.5 0.5 0.5 0.5 0.5 0.5 0.5 0.5 
##$TPOFFS= (0..7)
0 0 0 0 0 0 0 0 
##$TUNHIN= 0
##$TUNHOUT= 0
##$TUNXOUT= 0
##$USERA1= <user>
##$USERA2= <user>
##$USERA3= <user>
##$USERA4= <user>
##$USERA5= <user>
##$V9= 5
##$VALIST= <valist>
##$VCLIST= <CCCCCCCCCCCCCCC>
##$VD= 0
##$VDLIST= <DDDDDDDDDDDDDDD>
##$VPLIST= <PPPPPPPPPPPPPPP>
##$VTLIST= <TTTTTTTTTTTTTTT>
##$WBST= 1024
##$WBSW= 4
##$XGAIN= (0..3)
0 0 0 0 
##$XL= 0
##$YL= 0
##$YMAX_a= 105119
##$YMIN_a= -193868
##$ZGOPTNS= <>
##$ZL1= 120
##$ZL2= 120
##$ZL3= 120
##$ZL4= 120
##$ABSF1= 16.9546
##$ABSF2= -3.064438
##$ABSG= 5
##$ABSL= 3
##$ALPHA= 0
##$AQORDER= 0
##$ASSFAC= 0
##$ASSFACI= 0
##$ASSFACX= 0
##$ASSWID= 0
##$AUNMP= <proc_1d>
##$AZFE= 0.1
##$AZFW= 0.1
##$BCFW= 0
##$BC_mod= 2
##$BYTORDP= 0
##$COROFFS= 0
##$CY= -3
##$DATMOD= 1
##$DC= 0
##$DFILT= <>
##$DTYPP= 0
##$F1P= 0
##$F2P= 0
##$FCOR= 1
##$FTSIZE= 16384
##$FT_mod= 6
##$GAMMA= 0
##$GB= 0
##$INTBC= 1
##$INTSCL= 1.334414e-10
##$ISEN= 128
##$LB= 0.24
##$LEV0= 0
##$LPBIN= 0
##$MAXI= 10000
##$MC2= 0
##$MEAN= 0
##$ME_mod= 0
##$MI= 1.114404
##$NCOEF= 0
##$NC_proc= -7
##$NLEV= 6
##$NOISF1= 3.799351
##$NOISF2= 2.8
##$NSP= 0
##$NTH_PI= 0
##$NZP= 0
##$OFFSET= 16.97048
##$PC= 1
##$PHC0= -13712.1
##$PHC1= 7.0009
##$PH_mod= 1
##$PKNL= yes
##$PPARMOD= 0
##$PSCAL= 0
##$PSIGN= 0
##$REVERSE= no
##$SF= 200.130006901873
##$SI= 16384
##$SIGF1= 3
##$SIGF2= 2
##$SINO= 5.538805
##$SIOLD= 16384
##$SREGLST= <1H.CDCl3>
##$SSB= 0
##$STSI= 16384
##$STSR= 0
##$SW_p= 4006.41025641027
##$SYMM= 0
##$S_DEV= 0
##$TDeff= 16384
##$TDoff= 0
##$TI= <>
##$TILT= no
##$TM1= 0
##$TM2= 0
##$TOPLEV= 0
##$USERP1= <user>
##$USERP2= <user>
##$USERP3= <user>
##$USERP4= <user>
##$USERP5= <user>
##$WDW= 1
##$XDIM= 16384
##$YMAX_p= 447048407
##$YMIN_p= -610694
$$ End of Bruker specific parameters
$$ ---------------------------------
##NTUPLES= NMR SPECTRUM
##VAR_NAME=  FREQUENCY,     SPECTRUM/REAL,   SPECTRUM/IMAG
##SYMBOL=    X,             R,               I
##VAR_TYPE=  INDEPENDENT,   DEPENDENT,       DEPENDENT
##VAR_FORM=  AFFN,          ASDF,            ASDF
##VAR_DIM=   16384,         16384,           16384
##UNITS=     HZ,            ARBITRARY UNITS, ARBITRARY UNITS
##FACTOR=    0.244546801953871, 1,           1
##FIRST=     3396.30227256557, 0,            0
##LAST=      -610.107983844703, 0,           0
##MIN=       -610.107983844703, -610694,     0
##MAX=       3396.30227256557, 447048407,    0
$$ Real data points
##PAGE= N=1
##DATA TABLE= (X++(R..R)), XYDATA
$$ [...]
7335D60200K90655P9972j81619l70084K1492k65416J91112R1184j67826m2563
7325A07107M3145N7496k38996J71191Q2858k0207l5515k15667l113K03277J35417
7314B86993k51615k53234M1277L69580o0512r5262L82569L1333k06099K1774j47004
7303A19800k47352R2170P8501j78650j1587P5494K74319j96092j5430K8368N1181
7292G0722J36428j26886j50886J13663P6717P2424L7522l31771N3247K20869k45563
7281g3514o5855M537P7448K62916j10223J12497j16883N7143j01708j3648j42703
7270a09993N7248P6125o009l6867P6790r4680K14537k19581Q2673L0171J7229
7259H7643L65867j98850j80042K11097J1404k04855j27305k39144L1541K96951
$$ y = [460200, 750855, 830827, 649208, 279124, 300616, 35200, 226312, 317496, 149670, 107107, 150252, 207748, -31248, 139943, 222801, 202594, 167079, -48588, -51701, 151576, 286993, 35378, -217856, -176579, 193001, 132489, 37227, 419796, 451129, 245030, 266804, 119800, -127552, -35382, 43119, -135531, -147118, -71624, 202695, 6603, -8827, 19541, 70722, 207150, 80264, -70622, 43041, 119758, 192182, 229704, -102067, -48820, 172049, -73514, -139369, -134832, -57384, 205532, 95309, 207806, 90923, 148066, 46358, 32710, -109993, -52745, 23380, 17371, -19496, 57294, -37386, 177151, -42430, 40243, 70414, 87643, 453510, 254660, 74618, 285715, 297119, 92264, -35041, -274185, -242644, 54307]
7249E4307J49199N9076m6556J1283J12043K7646j08367K04944n9052j60720m2425
7238B01378l84962J23963K20194k07119k23086J24840m7952m5600J76621R7146
7228C5423J11916j47486p9206J62169k07413N7312J30354n2344o7959J69530l3924
7217G8372J14609J25135j64137Q0072l9533k439k26023J3015J55355r3802k01088
7206a60464J84934L98150k74348n7168j33229Q8259K7943Q4220m1781L36664l08826
7195A44354j47177M6208j02403o2691K18980K84361j52597o0745j94235P0876
7185D4931J17795r8393J55648j37623J67961J64253l43890j0045J22401k16923
7175c3885M4139J40894j86306J82024O8255J16901k31385m2306J20534J9531j34137
$$ y = [54307, 203506, 262582, 216026, 227309, 339352, 366998, 258631, 463575, 404523, 243803, 201378, -183584, -59621, 160573, -46546, -269632, -144792, -192744, -238344, -61723, 35423, 147339, -147, -79353, 82816, -124597, -67285, 63069, 10725, -57234, 112296, 78372, 192981, 318116, 153979, 234051, 194518, 192079, -33944, -20929, 134426, 40624, -160464, 24470, 422620, 148272, 91104, -42125, 46134, 74077, 158297, 116516, 453180, 144354, -2823, 43385, -59018, -121709, 97271, 381632, 229035, 168290, -25945, 44931, 162726, 64333, 219981, 82358, 250319, 414572, 70682, 60637, 183038, -33885, 10254, 151148, -35158, 146866, 215121, 332022, 100637, 58331, 178865, 198396, 64259]
7164F4259j51390K88360Q2919k62640J67369N838N2006q6441J13792j77475j17572
7153b0975M9662J38645k7002O9151K59699k54118K9359l7693M2691j20350J16800
7142B45869L11742K8298l17224j16349J63786m90578K00396J16887L1860Q5466
7132B60153J31028j09299k1879J11254j73410o9788M2065K48835o1338j15376
7122B42245m7663j22599J67243J76665J47467o5558j37442J61380q6709j35324
7112B99705j78982P176k9372r5968J80048N3833L0117J29117l2933J7905J90044
7101E70690J9532j09045J08871j946j4458J2958m4362J90632O631k27134K50765
7090G63134j24186J69344j65053J32294Q1608k33063r3866j89054J4762j84740
$$ y = [64259, -87131, 201229, 284148, 21508, 188877, 194715, 246721, 160280, 274072, 96597, -20975, 28687, 167332, 140330, 209481, 469180, 215062, 244421, 206728, 249419, 129069, 245869, 557611, 585909, 268685, 152336, 316122, -174456, 25940, 142827, 174687, 260153, 391181, 281882, 260003, 371257, 197847, 128059, 170124, 418959, 357621, 242245, 194582, 71983, 239226, 415891, 563358, 497800, 360358, 521738, 435029, 299705, 120723, 127899, 98527, 2559, 182607, 236440, 266557, 395674, 362741, 380646, 570690, 590222, 481177, 590048, 588102, 573644, 586602, 542240, 732872, 739503, 512369, 763134, 638948, 808292, 643239, 775533, 857141, 624078, 530212, 341158, 355920, 171180]
7080A71180K42058N1094k17687L3415j43145K99970J19844J03561o8310n6173
7070E35807M2511k7144N7214q4461J36394J07192l0167p5466Q9810K0659K0734
7059G93083J6737J39884j64113L8802J43345p1915J92501R777p3237R8126O4777
7048A187767j34074J5518K32165K76830N7948j96706o2951N9831K53918L259j8288
7037A675217M0713P1133J79603Q9088L19276L4883J32844J62710l5926K76845
7027B946386j97105K39277J63308p0968J2800L54393M9826j039L29169K16660
7017D042707K09623l4378R3780L9981O745N92523N5940J17667J77222P0185J36616
7006E508611K87889N02850L57431J25808L64033L79447L54599O83202O08388R58678
$$ y = [171180, 413238, 464332, 246645, 280060, 136915, 436885, 556729, 660290, 591980, 535807, 578318, 551174, 608388, 523927, 660321, 767513, 737346, 661880, 751690, 772349, 793083, 809820, 949704, 785591, 824393, 967738, 895823, 1088324, 1098101, 1024864, 1122990, 1187767, 1053693, 1069211, 1301376, 1578206, 1636154, 1439448, 1376497, 1436328, 1690246, 1693505, 1675217, 1715930, 1787063, 1966666, 2055754, 2375030, 2409913, 2542757, 2705467, 2669541, 2946386, 2749281, 2988558, 3151866, 3080898, 3093698, 3448091, 3497917, 3496878, 3826047, 4042707, 4252330, 4217952, 4311732, 4351713, 4358458, 4950981, 5006921, 5124588, 5301810, 5371995, 5508611, 5796500, 6299350, 6656781, 6782589, 7146622, 7526069, 7880668, 8563870, 9172258, 10130936]
6996A0130936P14907J191928J098240Q04122J097674J590038J309778J909264
6988A9846887K401676K825756M069657N293368O799334R032019J1855582J4868081
6980G6992360J7630492J7796412J3520428L678898o372125j4482013j7658305
6973I1106147j6284264j4235264j0822494p702598n841963m764681l562321l030522
6965B4862040k857562k321568j726409j739790j394705j072562q86681r47142
6957A1915621l91135m10996q02814o26868l75091n62163p26546l60402l30238
6948G329368m33352l14672j40830k10682n13832j56044k86006l37561k61756k97754
6938D376879J95987l06316l44623J2572l26949k54845q3113j03838N2008J86555
$$ y = [10130936, 10845843, 12037771, 13136011, 13940133, 15037807, 16627845, 17937623, 19846887, 22248563, 25074319, 29143976, 34437344, 41236678, 50268697, 62124279, 76992360, 94622852, 112419264, 125939692, 129618590, 123246465, 108764452, 91106147, 74821883, 60586619, 49764125, 42061527, 36219564, 31454883, 27892562, 24862040, 22004478, 19682910, 17956501, 16216711, 14822006, 13749444, 12862763, 11915621, 11524486, 11113490, 10310676, 9683808, 9308717, 8746554, 8020008, 7659606, 7329368, 6896016, 6581344, 6440514, 6229832, 5716000, 5559956, 5273950, 4936389, 4674633, 4376879, 4572866, 4266550, 3921927, 3934499, 3607550, 3352705, 3269592, 3165754, 3217762, 3404317]
6928C404317j09469j58804J8028l18967j11825O8401r8233k00852P3927J79887
6918B746410j21845l31130J69547j7783j83122j49920O683N3442j46663k08659
6908A816960J57888Q2606k27811j85799J05822j61081n4289j44865o5167M1950
6898A366214r3722R7044r3747J53194o3208O348j48352j7726r6740q2376K6846
6887A053775k2261M0387k07228k78346K36291j13633j18570J52559k71696j35398
6877C35880J86604K47702M5465m0372j37346l9773M1937j26377J52092j18713
6867E47099l78377J67070J29225J8537m5494J68792l939K23294k62602n4170R8938
6856F08373m6394P4037L9523m3618l4453L10018j73898k30193l3965J11339L22386
$$ y = [3404317, 3294848, 3136044, 3154072, 2835105, 2723280, 2791681, 2693448, 2492596, 2566523, 2746410, 2624565, 2293435, 2462982, 2445199, 2262077, 2112157, 2118840, 2172282, 2025619, 1816960, 1974848, 2057454, 1829643, 1643844, 1749666, 1588585, 1534296, 1389431, 1324264, 1366214, 1272492, 1369536, 1275789, 1428983, 1365775, 1372123, 1223771, 1206045, 1109305, 1026929, 1053775, 1031514, 1071901, 864673, 586327, 822618, 708985, 590415, 742974, 471278, 335880, 522484, 770186, 815651, 775279, 637933, 598160, 640097, 513720, 665812, 547099, 168722, 335792, 465017, 483554, 438060, 606852, 602913, 826207, 563605, 509435, 608373, 561979, 636016, 675539, 631921, 597468, 907486, 733588, 503395, 469430, 580769, 903155]
6845I03155j88513k75865J20857Q5708l1137Q2095K74507J20892M7563L6017j6014
6834A159265p7786Q0166m4413J17731M0393L20411Q3920n37844l8501J48753o8932
6823A183163k7581L3030l30919J36245j27458M7310j63266k69831L68654k85823
6813E63524l5248R7624p9281j90047J47057Q96j44445J22901J20842l3952k48960
6802C20911O184K03251j68886r6160q3188J86314l9281M873L9561j21516k2115
6791B29948J03916j28501K2345k21818K94923K07871j16138J06569l46939j92069
6781c9893K11688J42536j41499J00990K44409P791k13652n2340J76986j4134j42761
6770B80121j92477L0009N6409o585K21764q1657J80009R6549l25934j86942K00120
$$ y = [903155, 714642, 438777, 559634, 645342, 614205, 696300, 970807, 1091699, 1139262, 1175279, 1159265, 1081479, 1161645, 1117232, 1234963, 1275356, 1595767, 1679687, 1141843, 1103342, 1252095, 1183163, 1155582, 1188612, 857693, 993938, 866480, 913790, 750524, 480693, 849347, 563524, 528276, 625900, 546619, 356572, 503629, 504525, 360080, 482981, 603823, 569871, 320911, 327095, 530346, 361460, 265300, 182112, 368426, 329145, 334018, 373579, 252063, 229948, 333864, 205363, 227708, 5890, 300813, 508684, 392546, 499115, 152176, -39893, 171795, 314331, 172832, 273822, 518231, 526022, 312370, 260030, 437016, 422882, 280121, 87644, 117653, 174062, 167477, 389241, 307584, 487593, 584142, 258208, 71266, 271386]
6759B71386J45292J03351p8590k2779j48067n8432j00549m7115l1308O929J98147
6748B38265j93209j18755K52133r5594j84159p5829J91582j71698J66817L04169
6738C13722L0304k5405j92840o3818j24644j9209J49515L0750K09860m3206k13731
6727E1298Q3361J13148J11174j28319j99462K07460R6681o9334l23599R0773K38019
6716B71200j31645q7939K4544R6501q0436J35123k6065j28260K35833J9489J91915
6705E20260j72400l37847m0763O3609J92345m3552Q3148O4979j84172j09654O8577
6694A04530k30114R3569J76335K8630j98679J17522k6330l6557J70247o1168J4883
6683A52868p4595L3728N6980j6142K0834m4387j95343K84938Q8283m08994K19219
$$ y = [271386, 416678, 520029, 441439, 418660, 270593, 212161, 111612, 64497, 33189, 40118, 238265, 45056, -73699, 178434, 82840, -101319, -177148, 14434, -157264, 9553, 313722, 344026, 318621, 125781, 61963, -62681, -81890, 67625, 98375, 308235, 265029, 51298, 134659, 247807, 358981, 230662, 31200, 238660, 335341, 266007, -57592, 33181, 271200, 139555, 51616, 76160, 172661, 92225, 227348, 201283, 73023, 308856, 328345, 520260, 347860, 10013, -30750, 32859, 225204, 181652, 264800, 329779, 145607, 35953, 104530, -125584, -32015, 144320, 172950, -25729, 91793, 65463, 28906, 199153, 137985, 152868, 78273, 112001, 168981, 152839, 173673, 129286, -66057, 218881, 307164, -101830, 117389]
6672A17389J40380k76685j24556K02600Q2255J61919o0504m1198l20643j2552
6662a31595L7880k8797q8429R3552K69763j1117P4359R3554l1854r7874q7797
6651I1645j35778Q1651J3546j30524j09273R0813O8089K3025J33099p3771J9408
6640G1930r1160l5560R2788O5847Q3925j14330M1929k1557J80506J21284j65968
6629B29634k32739j1720K58010j64900J51770J01768o2740K24072k5809j53745
6619C13601J01701K25306r2842K39287R8632L7830k37235j35717K2399j38859
6609D34103j36388r4244l1629j27291K55111r3024k82628L10223p2630k01637
6599d0034K8116o0317K3700J12702K522p1020M6059K47409q8591N0602l35475
$$ y = [117389, 257769, -18916, -143472, 59128, 141383, 303302, 242798, 201600, -119043, -131595, -93715, -122512, -210941, -117389, 152374, 141257, 215616, 309170, 277316, 179442, 91645, -44133, 37518, 51064, -79460, -188733, -97920, -29831, -6806, 126293, 52522, 71930, -19230, -54790, 37998, 103845, 187770, 73440, 115369, 93812, 274318, 395602, 229634, -3105, -14825, 243185, 78285, 230055, 331823, 269083, 493155, 467346, 313601, 415302, 640608, 547766, 787053, 885685, 923515, 686280, 550563, 572962, 434103, 297715, 203471, 171842, 44551, 299662, 206638, -75990, 234233, 161603, -40034, -11918, -72235, -48535, 64167, 66689, -4331, 41728, 289137, 200546, 251148, -84327]
6588h4327J48120K68051j95814n8828J01691O4344N9343J79613k45995n3054j11688
6577G1456J98049l582k87896q5445M8426K05201K9536n4643J05026j66171j34741
6566g4784J45564K93525l76695O5697K55988K4542J08985k92168n7915j04227
6556a1488J68034j42736j03718n0848l8651q0543L40211m290k2383J11806M7379
6545B12773j79460j57395K03779o4280j87654k20879J66109K02507K48956N9087
6535B83543r175j25131k5309M8286p0275j31286O6195q8043J21558j77944P5010
6524c2571J52907j18572K28050P0298j92727J53124M505q5942n0262n1099K6631
6513A04342J2231j50720J37047K98978j75619r4737m9044l52339n9259J54473
$$ y = [-84327, 63793, 331844, 136030, 77202, 178893, 243237, 302580, 482193, 236198, 183144, 71456, 269505, 265923, -21973, -107418, -58992, 146209, 175745, 121102, 226128, 59957, -74784, 70780, 364305, -12390, 53307, 309295, 333837, 442822, 150654, 92739, -11488, 156546, 13810, -89908, -140756, -179407, -259950, 80261, 75971, 53588, 165394, 212773, 33313, -124082, 79697, 15417, -172237, -393116, -227007, -24500, 224456, 283543, 274368, 149237, 123928, 172214, 101939, -29347, 36848, -51195, 70363, -107581, -32571, 120336, 1764, 229814, 300112, 107385, 260509, 265014, 179072, 128810, 77711, 104342, 116573, -34147, 102900, 401878, 226259, 131522, 82478, -269861, -329120, -174647]
6503a74647K72378J89629r4358j2538L1564R8871j29442k77806L8432J88927n002
6492A26008K6110j25780R7149Q7437P4000l43813R8566P1745J52233J2624k44320
6481C1959l47590o332N34914q789J449j83984j29150J9573K03491J64901j83462
6470I6980j67939L10626k4788j15620J63646n4435l27345j1728J92223n9111K1123
6459B3632j07142O4704K2347j2473K4794r2794L00865r5971q0648J8772J30117
6448A96203O356j1123k35608j6959K68805j10581m5041J6337M0544J38297N9871
6437C07101m8398m4410k46747J48975o4371L0118O3176P9043o6874O3864R8721
6426C20198p7283k3616M9356q5620k11007L35233j74393J50908N677m37041r3428
$$ y = [-174647, 97731, 287360, 193002, 180464, 212028, 310899, 181457, -96349, -57917, 131010, 126008, 152118, 26338, 123487, 210924, 284924, -58889, 39677, 111422, 263655, 276279, 31959, -315631, -321963, 212951, 204162, 205611, 21627, -107523, -87950, 115541, 280442, 96980, -70959, 239667, 214879, 99259, 262905, 208470, -118875, -130603, 61620, 2509, 23632, -83510, -18806, 3541, -8932, 15862, -76932, 223933, 127962, 47314, 66086, 196203, 202559, 191436, -44172, -61131, 207674, 97093, 52052, 68389, 108933, 247230, 307101, 258703, 214293, -32454, 116521, 52150, 82268, 145444, 224487, 157613, 221477, 320198, 242915, 219299, 268655, 183035, -27972, 307261, 132868, 283776, 289453, -147588, -241016]
6415b41016J66473R7292L49981K6441k62017J23204k71509M11503J59816k05772
6405C54396L3968k9256O5234j14689O6885K15856l42817m1016J31192q1289o9366
6394A89098J42106k1008L01814M275k79628l93086J67001J46566j42473l8264
6384G6401J47673O7595j74474O8828P6593J02532j12911o3784K2734k89190L89036
6373C11033J64358q8378j54083K0143o670l27164K19749k10057K84846j70864
6363D2913j56416P3328L6567j13375J47720O3305J16179k7899N306j64233J0964
6352C4359J63757P6595K088j46094j19809R4937l5120L6127J63991r5696q19L23355
6340D97671N4083l93904J07812K47952K1935j48947k23319P5574K11274J50957
$$ y = [-241016, -74543, 22749, 372730, 399171, 137154, 260358, -11151, 400352, 560168, 354396, 388364, 359108, 424342, 309653, 376538, 592394, 249577, 208561, 339753, 258464, 189098, 331204, 310196, 612010, 616285, 336657, -56429, 110572, 257138, 114665, 76401, 224074, 291669, 117195, 186023, 262616, 365148, 252237, 188453, 211187, -78003, 311033, 475391, 387013, 232930, 253073, 246403, -80761, 138988, -71069, 213777, 42913, -113503, -40175, -3608, -116983, 30737, 94042, 210221, 182322, 187628, 23395, 34359, 198116, 274711, 276799, 130705, 10896, 105833, 70713, 106840, 270831, 175135, 174316, 497671, 551754, 157850, 265662, 513614, 535549, 386602, 163283, 238857, 450131, 601088]
6330F01088k20363m8743K01357k94249l0883l3661L9535p3128n4792O8539m0734
6319A13966j16431L28974l36587J27521J7305R0321L16268l72681L3233j31760
6309G0129J55610o5569J36440k67499M2316M53215j72334K2098j25438Q5180J10295
6298D44443l04907j6156j084Q5418k6818J92503L0508J00019j78536j58342O3499
6287B30547M460J68246N4295K59725L5873M4192k77514r0764m3959J41353L6918
6276E63372J5503J09790j11499O8812Q5202o2765j94759O1190J90789J0247P2691
6265H08573j26090q3277O5842j61457r0892p881p9865L9993L89812j7351j75317
6254E62090j7449J51773J56448J82692j918K6145J31840n05643o1357J08392K31416
$$ y = [601088, 380725, 331982, 533339, 239090, 208207, 174546, 214081, 140953, 86161, 154700, 113966, -2465, 326509, -10078, 117443, 134748, 225069, 541337, 168656, 201889, 70129, 225739, 160170, 296610, 29111, 71427, 524642, 352308, 374406, 248968, 334148, 444443, 139536, 123380, 122296, 207714, 180896, 373399, 403907, 503926, 325390, 167048, 230547, 235007, 403253, 457548, 717273, 753146, 797338, 519824, 429060, 385101, 526454, 563372, 578875, 688665, 577166, 645978, 731180, 668415, 473656, 534846, 725635, 735882, 808573, 682483, 599206, 665048, 503591, 412699, 404818, 324953, 364946, 754758, 737407, 562090, 544641, 696414, 852862, 1035554, 1033636, 1059781, 1191621, 685978, 624621, 733013, 964429]
6243I64429j08890j36578o5050K44428l54511j22024L49430k48301M13931m75885
6233D60979p3569K40950J02496Q3949l11473J41123m8288K10816r1648j59067
6223E56268K3044P044J90027j08705m33195O1721L2762J49073Q0635j95439K20072
6212E83307m7988k18582j12314J6696J92151q8219l8499N7147P7760o85J09501
6201E30275j22157k73949J45529K00023j13665k4053M5485J30106K55307n08510
6191B64391j21697M3329p0361K18400J62257j00324K78406O1365q2779j92405
6181D60582j35542L2222N4285k49603N08577o4944l87468K78046J13330Q4740
6171F94225q7991n1342k18385n9745Q0051L84751k1271l70848N2331P6700L3770
$$ y = [964429, 855539, 718961, 653911, 898339, 543828, 421804, 771234, 522933, 936864, 460979, 387410, 628360, 730856, 814805, 503332, 644455, 596167, 806983, 715335, 556268, 579312, 586356, 776383, 667678, 234483, 296204, 328966, 478039, 558674, 363235, 583307, 535319, 316737, 204423, 221119, 413270, 325051, 286552, 343699, 421459, 420774, 530275, 408118, 134169, 279698, 479721, 366056, 342003, 387488, 517594, 772901, 264391, 142694, 186023, 115662, 334062, 496319, 395995, 674401, 735766, 652987, 460582, 325040, 357262, 411547, 161944, 670521, 605577, 218109, 496155, 609485, 694225, 606234, 554892, 336507, 276762, 356813, 741564, 720293, 349445, 401776, 478476, 512246]
6160E12246L46164j62984q6693J52683m5697J70626r440p2717J09792M3367J6515
6149I73862n1916j52963o3234r7981J31792j08593N8016J27340L35231K753l06659
6138H47648K14389k11918m131l8360J96517r920R1188J12278k6710L1516p0521
6127A131976q76j03689J57588L8269j152j59212j3601K74016p0069M8517m0911
6116A260856q5008j26282j66198o6044J15337r9063K3183J86558k07393J4044
6106H49990M8257J27433J04309J77107j1826k81399K87082J40165l47442k0814
6096A072862K54146j72044Q1957k731j18277K3189k8540K35469r889p1308P5215
6085A340049j7713j93126R2733J69246j5913m6493j72569r590J04172Q2445K36308
$$ y = [512246, 858410, 695426, 608733, 761416, 715719, 886345, 876905, 804188, 913980, 957347, 973862, 921946, 768983, 705749, 607768, 739560, 630967, 688983, 816323, 1151554, 1154307, 847648, 1062037, 850119, 845988, 807628, 1004145, 994225, 1085413, 1197691, 1170981, 1202497, 1131976, 1131100, 1027411, 1184999, 1223268, 1222116, 1062904, 1049303, 1323319, 1253250, 1301767, 1260856, 1175848, 1049566, 883368, 817324, 932661, 833598, 856781, 1043339, 835946, 849990, 898247, 1025680, 1129989, 1307096, 1295270, 1013871, 1300953, 1441118, 1093676, 1072862, 1327008, 1154964, 1236921, 1234190, 1115913, 1139102, 1110562, 1346031, 1336142, 1264834, 1340049, 1322336, 1129210, 1221943, 1391189, 1375276, 1328783, 1156214, 1146624, 1250796, 1333241, 1569549]
6074A569549j06900o9289J84323J87221k98534J30000L30186k72251k53234o274
6064A394797L43498J03486Q520N0268J71418N4184N1671n8247k50029L05041m5488
6053B129119k98035L74694l9787j61109K40046J0962M8736J11505r3210J54893
6043B477814m6079J69666o2472N2698m1470P0362K34835L5289L46018p5814J65556
6032C326403K22301K84268K16011N90241K11856r9860k61142j90341k52779o1607
6022C985351K15529l36587L8066J35937J76714R3760k5656K76322K49385J7637
6012D826458K29754L10965l7949K51248J59206J80347M23553M66304K27405N41486
6002G578777N46011N17293N23680N51840L14736Q24K00020K24324K67191N90772
$$ y = [1569549, 1462649, 1393360, 1577683, 1764904, 1466370, 1596370, 1926556, 1654305, 1401071, 1394797, 1738295, 1841781, 1850301, 1900569, 2071987, 2126171, 2177842, 2119595, 1869566, 2174607, 2129119, 1831084, 2205778, 2165991, 2004882, 2244928, 2255890, 2304626, 2416131, 2322921, 2477814, 2431735, 2601401, 2538929, 2591627, 2550157, 2620519, 2855354, 2890643, 3236661, 3160847, 3326403, 3548704, 3832972, 4048983, 4639224, 4851080, 4751220, 4490078, 4299737, 4046958, 3985351, 4200880, 3864293, 3902359, 4038296, 4215010, 4308770, 4283114, 4559436, 4808821, 4826458, 5056212, 5367177, 5329228, 5580476, 5739682, 5920029, 6343582, 6809886, 7037291, 7578777, 8124788, 8642081, 9165761, 9717601, 10032337, 10033161, 10233181, 10457505, 10724696, 11315468]
5992A1315468N50365M17649P43996M05260N22903O68634Q61996J038237J108049
5983A7632557J372466J813956K192897K659235L195029M123012N211896O648683
5975D4849731P534401P661736O736747L093173k151783m982218n571265n441266
5967E1729256m301640l140725k112001j660038j331396p60750q76255j8980P11855
5958C8239326R65155K017741K706169M241255N408827P130888R312031J1870915
5950H1892307J4185024J5834624J4687798P769377l571591j2854156j5206535
5943A02736848j4062548j2203444r522214p040732n284016m090595l566673k959231
5935D4007395k597185j930852j715717r65083l01311P04671J492193K460153L253407
$$ y = [11315468, 11865833, 12283482, 13027478, 13432738, 13955641, 14624275, 15486271, 16524508, 17632557, 19005023, 20818979, 23011876, 25671111, 28866140, 32989152, 38201048, 44849731, 52384132, 60045868, 66782615, 69875788, 67724005, 62741787, 57170522, 51729256, 47427616, 44286891, 42174890, 40514852, 39183456, 38422706, 37546451, 37527471, 38239326, 39204481, 41222222, 43928391, 48169646, 53578473, 60709361, 70021392, 81892307, 96077331, 111911955, 126599753, 134369130, 130797539, 117943383, 102736848, 88674300, 76470856, 66948642, 59907910, 54623894, 50533299, 46966626, 44007395, 41410210, 39479358, 37763641, 36798558, 36497247, 37201918, 38694111, 41154264, 44407671]
5926D4407671M497355N727980O876375P350150N930134K314706l805658p640255
5918F5658458q093743p321153o336814n300777l928918k882254k540113k359884
5910B6894802j991039j889161j526366j576028j178173q18393l56399l36839m54493
5901A6767911k54409j96687j25044m89703k15130l87496k31353J278L33759J31032
5891A5334158J03106K14393n5779l15915o13546j95461j43482q3138J54531N0467
5881A4449334j14002J15450L28669J28905L70064Q03539P86882N23546P28723
5872A8121110O03686P12637Q48073J123574J480769J593641K021645K715508L416998
5863C2637641L957215N201845O047116O551564O859513N658199K611089j561216
$$ y = [44407671, 48905026, 54633006, 61509381, 68859531, 74789665, 77104371, 73298713, 65658458, 57564715, 50243562, 43906748, 38605971, 34677053, 31794799, 29254686, 26894802, 24903763, 23014602, 21488236, 19912208, 18734035, 17915642, 17559243, 17222404, 16767911, 16513502, 16316815, 16191771, 15702068, 15486938, 15099442, 14868089, 14869367, 15203126, 15334158, 15437264, 15651657, 15595878, 15279963, 14666417, 14470956, 14327474, 14244336, 14398867, 14449334, 14335332, 14450782, 14779451, 14908356, 15278420, 16081959, 16868841, 17392387, 18121110, 18724796, 19437433, 20285506, 21409080, 22889849, 24483490, 26505135, 29220643, 32637641, 36594856, 41796701, 47843817, 54395381, 61254894, 66913093, 69524182, 67962966]
5855F7962966m384332n425116n159785m348670l417214k545346k005284j310218
5847C9367001n16985J85523J24174P60680J380206J975502K960801L803103N918190
5838E5958195P531275R517216J1444857J3960270J5278055J3494111Q003612j532820
5830A33654771r766874j3281343j3845155j2989770j0743785q465544o468156
5823E8094144n149303m249137l297034k629869j899519j395285n78992j80884
5815C8714121P35666J650937K520751L411588M555199N494174O212359N951838
5807F9246633L942225P5919m119463p188986p200610o801880o095202m977393
5799C6881243l995158l244430k520959k455531k120408j844685j898766j245283
$$ y = [67962966, 63578634, 58153518, 52993733, 48645063, 45227849, 42682503, 40677219, 39367001, 38850016, 39035539, 39159713, 39920393, 41300599, 43276101, 46236902, 50040005, 55958195, 63489470, 73006686, 84451543, 98411813, 113689868, 127183979, 135187591, 133654771, 123887897, 110606554, 96761399, 83771629, 73027844, 64562300, 58094144, 52944841, 48695704, 45398670, 42768801, 40869282, 39473997, 38895005, 38714121, 39449787, 41100724, 43621475, 47033063, 51588262, 57082436, 63294795, 69246633, 73188858, 73264777, 69145314, 61956328, 54755718, 47953838, 41858636, 36881243, 32886085, 29641655, 27120696, 24665165, 22544757, 20700072, 18801306, 17556023]
5791A7556023r74722q88448q73290o69894m26853l86007m49997m58317j02861
5782A2325634l51328l38311m20240m86483P5787m96903j67348m85745l13648m02139
5772H939276p7340p40742k29936l88117l40872q2307j01046k02782Q6384j98531
5762F663987n4994j40991j14432N29306K01198j14243J72666m4291l38858l74605
5752F384743k4651l11902m92377o0912k35243k27410k70345k70968k26132k67498
5742C997305j73232l9587j02485K9858j95823j72018p2599m8109M7237J92265
5732C462812M7803K1499j07704J29697n4093M799m23883m45256k4556j22041J8316
5721B507393l77798j86179k2194J17178j97949N5392l40490K33283J31878k97453
$$ y = [17556023, 16581301, 15692853, 14819563, 14149669, 13722816, 13336809, 12886812, 12428495, 12325634, 11974306, 11635995, 11215755, 10729272, 10805059, 10308156, 10140808, 9655063, 9341415, 8939276, 8861936, 8121194, 7891258, 7503141, 7162269, 7079962, 6978916, 6776134, 6862518, 6663987, 6608993, 6468002, 6353570, 6882876, 7084074, 6969831, 7142497, 7098206, 6759348, 6384743, 6360092, 6048190, 5555813, 5494901, 5259658, 5032248, 4761903, 4490935, 4264803, 3997305, 3824073, 3784486, 3682001, 3711859, 3516036, 3344018, 3271419, 3223310, 3270547, 3462812, 3510615, 3532114, 3424410, 3554107, 3500014, 3504813, 3080930, 2635674, 2611118, 2489077, 2507393, 2129595, 1943416, 1921222, 2038400, 1840451, 1895843, 1555353, 1788636, 1920514, 1623061]
5711A623061K18755j50996j66997O8290p1392q9547Q4988J36160M3196r94j47820
5700A546704Q1399j42655j88960J46351o6459K29397j76911N6209n9589j15511
5690A309975j69105J69093j47659R9463N3528k39126l0174J82013K05326j27339
5680A305995j22710J00391K10723j03306j46461K09126l18835K18521L1391K53807
5670A638642P0563J90408J29658P7573K48138J18093M4664n9453l1314Q2135J26773
5659B635880p9697K77873j44469j77637R4927j62871j81674j51716o4425J55131
5649B201322J88576J88598j16974j6405Q7285J78599L22644Q0713K04624J15425
5639C434407K50323j94546M3848J43627J81834J14774k2772j4424m1634j40399
$$ y = [1623061, 1841816, 1690820, 1523823, 1592113, 1520721, 1431174, 1516162, 1652322, 1695518, 1694524, 1546704, 1628103, 1485448, 1296488, 1442839, 1376380, 1605777, 1428866, 1485075, 1425486, 1309975, 1140870, 1309963, 1162304, 1261767, 1315295, 1076169, 1045995, 1228008, 1433334, 1305995, 1183285, 1283676, 1494399, 1391093, 1244632, 1453758, 1134923, 1353444, 1384835, 1638642, 1709205, 1899613, 2029271, 2106844, 2354982, 2473075, 2517739, 2458286, 2426972, 2509107, 2635880, 2556183, 2834056, 2689587, 2511950, 2606877, 2444006, 2262332, 2110616, 2046191, 2201322, 2389898, 2578496, 2461522, 2445117, 2532402, 2711001, 3033645, 3114358, 3318982, 3434407, 3684730, 3490184, 3534032, 3677659, 3859493, 3974267, 3951495, 3937071, 3895437, 3755038]
5629C755038j63170j53086k26873k28451m37996R8681K45616N6644R687j26633
5619B829457L20943n8810J98150L47137j75913K17536N6960M60785M09111M96547
5609E101903L99455R05874R93687J260619J776934J618254J172431j22111j914349
5600A1192697j937593j606986j366501j196240n47406n28462j76333l66423k83417
5591C183336l36121l23528j29775j22094k55188n7689K13537k95936O4010l7866
5581A902686K39777M39443M42120q9776J48317J90727n34738k46545j61605l45940
5571A984466j71743j78954k57426K6644J40910J77339l66957M5716L03840m0731
5561A663104q3711p7493p7870K19161K9175J0525l72488k11654j74291Q2625j23287
$$ y = [3755038, 3591868, 3438782, 3211909, 2983458, 2545462, 2644143, 2889759, 2946403, 2956090, 2829457, 3150400, 3091590, 3289740, 3636877, 3460964, 3678500, 3735460, 4196245, 4605356, 5101903, 5501358, 6407232, 7400919, 8661538, 10438472, 12056726, 13229157, 13107046, 11192697, 9255104, 7648118, 6281617, 5085377, 4537971, 4009509, 3833176, 3466753, 3183336, 2847215, 2523687, 2393912, 2271818, 2016630, 1958941, 2172478, 1876542, 1940552, 1902686, 2142463, 2581906, 3024026, 2934250, 3082567, 3273294, 2738556, 2492011, 2330406, 1984466, 1812723, 1633769, 1376343, 1402987, 1543897, 1721236, 1354279, 1399995, 1703835, 1663104, 1579393, 1501900, 1424030, 1643191, 1672366, 1682891, 1310403, 1098749, 924458, 1007083, 883796]
5550H83796p0916K55923n0726q6586j39988J21554K0359O2840Q187m4307q931
5539I51205K22197M598k37455R2835J92870J67378M0217j4883J11049k37171m2522
5528A250318j61502l05727J59470R3105r6095k34507R2929J06288J815j35323
5518G70771l5105j51954K44629L8807j38855K74513q3119K17444j79406m146k93059
5507F60520L04908l5301P5845R9953n7159m3059P9649o7594M1447j2385J9483
5496A066307j00645j37246m6268J9458j31507J18985o6436j45825J92160J16899
5486H85882q7318j82800L710M4113K913k25861M4307L10674N0169k29097O0913
5475F77605J24795Q0071j14349j97016J12321j78596K23829J20418j56626p9145
$$ y = [883796, 812880, 1068803, 1018077, 931491, 791503, 913057, 933416, 996256, 1004443, 960136, 951205, 1173402, 1178000, 940545, 1033380, 1226250, 1393628, 1433845, 1418962, 1530011, 1292840, 1250318, 1088816, 783089, 942559, 1035664, 939569, 705062, 797991, 904279, 906094, 770771, 735666, 583712, 828341, 867148, 728293, 1002806, 919687, 1137131, 957725, 953579, 660520, 965428, 930127, 1005972, 1105925, 1048766, 1005707, 1085356, 1017762, 1059209, 1046824, 1066307, 965662, 828416, 782148, 801606, 670099, 789084, 722648, 576823, 768983, 885882, 798564, 615764, 619474, 663587, 666500, 440639, 484946, 795620, 845789, 616692, 677605, 802400, 882471, 768122, 571106, 683427, 504831, 728660, 849078, 692452, 613307]
5465F13307q9163q3265L705L01471K01748j50475n0421j88398l2834K50054N2900
5454H28629J5091l30555k81470J84662L20112j28598k65898J13515M2204j83702
5444C13990J40586M5775k0391p4181K60997q9732K2025O3077j46244L8402J09212
5433F63516r9148M7908k7143j34492M6332k3681q3477L77887k57712P7988k04861
5422C83117p212M0514N2096J52021R2851j43056N5549j96319l0049J31684k38097
5411B93099J45028N2943J97892q8861r1212q6193M7369j82820q1519J51218L8108
5400C95052R8596j0050k0410L090J01415O0245m8184k00405k21803j00676K40231
5389B97101q456R2314K69228J42540q2153n8595j18968o6478K12768J21896J98863
$$ y = [613307, 524144, 440879, 444584, 746055, 947803, 797328, 746907, 558509, 525675, 775729, 828629, 843720, 513165, 231695, 416357, 736469, 607871, 341973, 455488, 497692, 313990, 454576, 500351, 479960, 405779, 666776, 577044, 599069, 662146, 515902, 554304, 663516, 564368, 612276, 585133, 450641, 496973, 473292, 389815, 767702, 509990, 587978, 383117, 375905, 416419, 468515, 620536, 713387, 570331, 625880, 429561, 399512, 531196, 293099, 438127, 491070, 688962, 600101, 508889, 422696, 470065, 287245, 205726, 356944, 395052, 493648, 483598, 463188, 466278, 567693, 627938, 579754, 379349, 157546, 56870, 297101, 288645, 380959, 650187, 792727, 710574, 651979, 533011, 466533, 679301, 801197, 1000060]
5378A000060k42280J23222k31445p3560R3132R0842j10710j30918J77208M9504
5368G45055N8110M5372p0977k67552p3847J77160J2967o2564J22006m6178j02752
5357E36800J08106k3500l41793J99684J70249L21174j37807j05933O0306k9991
5347G57295n2571k40216J80390n6475L5218r0988K81775J55087k07402R0560K02773
5336A055446j69651J25043M5502P9459j2977j1647k08593J22192J26175O0616
5326A211565l1114K52553J91296K58731p2516J07809L18639M19851M68024M7641
5316C172479j21297k64308j93267j53882l03297k31815J85953J52949m078J92015
5306B431452K35038N6691K19777J77775k02770j02972K18202k09499k28040M5232
$$ y = [1000060, 757780, 881002, 649557, 575997, 669129, 759971, 649261, 518343, 695551, 745055, 803165, 848537, 777560, 510008, 436161, 613321, 626288, 563724, 685730, 639552, 536800, 644906, 621406, 279613, 479297, 649546, 970720, 832913, 726980, 787286, 757295, 704724, 464508, 644898, 588423, 623641, 532653, 814428, 969515, 762113, 852673, 1055446, 885795, 1010838, 1056340, 1135799, 1122822, 1111175, 902582, 1024774, 1150949, 1211565, 1180451, 1433004, 1624300, 1883031, 1810515, 1918324, 2236963, 2656814, 3124838, 3172479, 3051182, 2786874, 2593607, 2439725, 2136428, 1904613, 2090566, 2243515, 2239437, 2431452, 2666490, 2723181, 2942958, 3120733, 2917963, 2814991, 3033193, 2823694, 2595654, 2640886]
5296B640886o9162p2732N5167J0132M7400j73623J37272k7875P5165L26219K99325
5285C248174N9394J66235M72490M25829L80247L13080J65519J15753l40506o0978
5275D945237m37489m96507o17931m15829M6291l08684K4570q9603N5938m3512
5265B662481q2773r158k62821r1934N520K19313o9461K28406J51219n0785J69886
5254B869893K61774J08380L0234j59389m8931n7539k18921j77970m33205j20610
5244B053716k08864k4559J27751L7320k1420k01484k3118K6079n2851M7990J04567
5233A865127l7196k63673k31234L9603R0869j02254N1679p5743J28989j91155
5223A275012l29371L8146k6608N4053j2401M49247j45147n0618J19368j80551
$$ y = [2640886, 2571724, 2498992, 2554159, 2564291, 2611691, 2438068, 2575340, 2547465, 2622630, 2948849, 3248174, 3307568, 3473803, 3946293, 4372122, 4752369, 5065449, 5230968, 5346721, 5006215, 4945237, 4507748, 4011241, 3393310, 2977481, 3023772, 2715088, 2739658, 2650055, 2705993, 2662481, 2579708, 2570550, 2307729, 2215795, 2221315, 2440628, 2371167, 2599573, 2750792, 2700007, 2869893, 3131667, 3240047, 3270281, 3110892, 3061961, 3004422, 2785501, 2607531, 2174326, 2053716, 1844852, 1820293, 1948044, 1985364, 1963944, 1762460, 1739342, 1765421, 1712570, 1760560, 1865127, 1827931, 1564258, 1333024, 1372627, 1463496, 1361242, 1412921, 1337178, 1466167, 1275012, 945641, 983787, 957179, 1011232, 998831, 1448078, 1302931, 1252313, 1371681, 1191130]
5213A191130j38195J71856N5030L2141J24566J83601M36734L30056K77787L48709
5203C013415L4201k14966k85458o10331k37334k22601J25530j35378l5123R16
5193A432871k82697K37139k30612n1537N0003J36787Q9452j31539k25303p6765
5183I47799N0526r8856J19708q565K51147r8184r1388k35968k54097j3425O4808
5172F33505K06795r1417m4533J47147K6371j94712k76054J17881J64593j27183
5162E62393J46002o4664q6710K1479N4883J43983P1827K1684R3750k8018k57855
5151F78754j42165o94M1630O8022J65543j79153K9641j52845Q2734K81987Q9229
5140I62683k18221K66443P1357k43083J89130O9176j18971r0357k1944N5136P1010
$$ y = [1191130, 1052935, 1224791, 1279821, 1311962, 1436528, 1620129, 2056863, 2386919, 2664706, 3013415, 3047616, 2832650, 2547192, 1936861, 1699527, 1476926, 1602456, 1467078, 1431955, 1432871, 1150174, 1387313, 1156701, 1105164, 1155167, 1291954, 1381406, 1249867, 1024564, 947799, 998325, 899469, 1019177, 1010612, 1261759, 1163575, 1072187, 836219, 582122, 568697, 633505, 840300, 748883, 704350, 851497, 877868, 683156, 407102, 524983, 689576, 562393, 708395, 643731, 557021, 578500, 633383, 777366, 849193, 870877, 964627, 936609, 678754, 536589, 535895, 577525, 645547, 811090, 631937, 661578, 508733, 591467, 873454, 962683, 744462, 1010905, 1082262, 839179, 1028309, 1097485, 978514, 888157, 866213, 921349, 992359]
5129I92359l6335J09K562O9582j93005o1771j39386R0706j49938J72121J90147
5118I37151k81657R6435j21023K68746j13575n9148J62876j28034j2481q1497
5108F67793J32230M7440J53858k50820j53101l5925K44149J16071j86839J39467
5098H74323j6269K83572l33204J71J23002J26827J56937j48768j04047J69449
5088A131993J67711J127P0255j42802o0650j94619j1074P0891L1627l8108N4472
5077A080823j92894k04056q6914L37672J35343n3699J13060O1088j61171M5599
5067A074851L10672j49571k28641J33984J98923j40528J15629K3452j13343J50840
5057A376268J57467o9026Q5382j36228P9949K5796q5334K19452K71533M2265J07478
$$ y = [992359, 956024, 956133, 958695, 1028277, 835272, 773501, 634115, 724821, 574883, 747004, 937151, 655494, 751929, 630906, 899652, 786077, 726929, 889805, 761771, 749290, 667793, 800023, 847463, 1001321, 750501, 597400, 561475, 805624, 921695, 734856, 874323, 858054, 1141626, 808422, 808593, 931595, 1058422, 1215359, 1066591, 962544, 1131993, 1299704, 1300831, 1371086, 1228284, 1167634, 973015, 961941, 1032832, 1064459, 1026351, 1080823, 887929, 683873, 596959, 934631, 1069974, 1016275, 1129335, 1190423, 1029252, 1074851, 1385523, 1235952, 1007311, 1141295, 1340218, 1199690, 1315319, 1338771, 1225428, 1376268, 1533735, 1464709, 1550091, 1413863, 1493812, 1519608, 1434274, 1653726, 1925259, 1967524, 2075002]
5046B075002j75149j0262Q3128K25383k69013j62710J86154J17922N5700j8750
5036B107405K11577O9033L26119J54642j10549l35815M123J97058j53126j62430
5026B308037L2890K61102k14317K09322K8789j57212n6614L2562K5669k56388
5016B213840K32718l7195K46482j5279m1360Q9129O6924j64837J19217R7940J41391
5005B948970L13901J17828O8191J27916R8165K07807J00455P9826O9707J47912
4995D280678n8564J99419J81050K19406Q9576j01485Q8956N73513J53919K90777
4985E917245J78366M3039K63341K66153O0513M73587O90143K23549Q429M04836
4975H529201L74269L87469J14332P4692K99584L65063M78421N37305O46690O84974
$$ y = [2075002, 1899853, 1889591, 1972719, 2198102, 1929089, 1766379, 1952533, 2070455, 2126155, 2107405, 2318982, 2388015, 2714134, 2868776, 2758227, 2422412, 2426535, 2623593, 2470467, 2308037, 2340927, 2602029, 2387712, 2597034, 2625823, 2468611, 2411997, 2444559, 2470228, 2213840, 2446558, 2409363, 2655845, 2640566, 2599206, 2688335, 2755259, 2590422, 2709639, 2807579, 2948970, 3262871, 3380699, 3448890, 3576806, 3674971, 3882778, 3983233, 4063059, 4132766, 4280678, 4222114, 4421533, 4602583, 4821989, 4911565, 4810080, 4899036, 5472549, 5626468, 5917245, 6095611, 6138650, 6401991, 6668144, 6728657, 7202244, 7892387, 8115936, 8124365, 8529201, 8903470, 9290939, 9405271, 9479963, 9779547, 10144610, 10623031, 11160336, 11807026, 12492000]
4965A2492000N03585N38212O69708P43596L47859N21936L60477Q62489Q11563
4956A7851425J122407J184551J380536J392184K307667K701914L157241L172273
4948C4270198K778054R42288r27164j280143l08783K38558J344111J950926K439617
4939D1447662L447845M273977M080914L904114M081795M985726N569202O360844
4931G8152079Q493094J0857973J4703851J9781822K6458595L5375552M7485824
4924B41308790O1591725O8797149N8177124J7173619o3297382p2711531n4636406
4917B56403088n4057294m0262722k8036737j9035808j4687465j1302860r850273
4910G9169929p599088o249099m877975l920243k798945k697894l064294l393428
$$ y = [12492000, 12995585, 13533797, 14203505, 14947101, 15294960, 15816896, 16177373, 17039862, 17851425, 18973832, 20158383, 21538919, 22931103, 25238770, 27940684, 31097925, 34270198, 37048252, 37990540, 37063376, 35783233, 35474450, 35713008, 37057119, 39008045, 41447662, 44895507, 49169484, 53250398, 57154512, 61236307, 66222033, 71791235, 78152079, 86645173, 97503146, 112206997, 131988819, 158447414, 193822966, 241308790, 302900515, 371697664, 429874788, 447048407, 383751025, 311039494, 256403088, 202345794, 162083072, 134046335, 115010527, 100323062, 89020202, 79169929, 71570841, 65321742, 60443767, 56523524, 53724579, 51026685, 47962391, 44568963]
4902D4568963k678081l198149k295954k617185k039488j882675j652327j702015
4894B6503089j295831j589533j029198j177927q83802j314441r55988r52506p60998
4885A6542865p20209l93212p94240l76499m71233o62698m31990j6166j58822J36995
4875A2654791K53863R1162K54175M31633M05944O07116R59698J361831J87808
4866A7208021n26116j344584j368566r04844j461142j097032m49769p64797n55632
4857H735539k42146n09575m91615J5651m02886n59933j14436r7747j19536k39094
4847E974222n11641l45314o2047r1329j06881j06644j87320k04849k31891m833
4837D121473k92135J84449k84200k38636J25030j90421k44184n7347p8706r4027
$$ y = [44568963, 41890882, 38692733, 36396779, 33779594, 31740106, 29857431, 28205104, 26503089, 25207258, 23617725, 22588527, 21410600, 20526798, 19212357, 18256369, 17303863, 16542865, 15822656, 15429444, 14635204, 14258705, 13787472, 13124774, 12692784, 12676618, 12517796, 12654791, 12908654, 12999816, 13253991, 13685624, 14091568, 14698684, 15658382, 17020213, 17208021, 16681905, 15337321, 13968755, 13063911, 11602769, 10505737, 10055968, 9291171, 8735539, 8493393, 7983818, 7492203, 7507854, 7104968, 6545035, 6430599, 6332852, 6213316, 5974222, 5462581, 5117267, 5055220, 4963891, 4857010, 4750366, 4563046, 4358197, 4126306, 4121473, 3829338, 4013787, 3729587, 3490951, 3615981, 3425560, 3181376, 3124029, 3045323, 2951296]
4827B951296j87003p5979Q1369m91737r4336r0100K0048k21428l66548M5439L36335
4816A907356n9187k251J74699n6577j29505p1946l47900j44399J12077J3623J73225
4805A569215M70300J72628l49612j32670k38950k71990J0100J0478j55992K07643
4795A291150L2017J60495p5698r1633k7029k95542j50821k20730M5668M61380
4785A129257J8332l33843J20999J76258o4295p864j72529p5803K11271J92139
4775A193922K19894k74176o1195J57579j1240j03494J43776k4384k2296j99468
4765A018918J95905j09930j99123K0156k99586p7790j44349K56374N2446n843
4755G07178N392k46464Q7323J60045J7107k08098J10171K31531O4625m6585j15226
$$ y = [2951296, 2764293, 2688314, 2769683, 2277946, 2183610, 2093510, 2113558, 1892130, 1525582, 1571021, 1907356, 1848169, 1845918, 2020617, 1964040, 1834535, 1762589, 1414689, 1270290, 1382367, 1395990, 1569215, 2039515, 2212143, 1862531, 1729861, 1490911, 1218921, 1229021, 1239499, 1083507, 1291150, 1323167, 1483662, 1407964, 1316331, 1289302, 993760, 842939, 622209, 667877, 1129257, 1147589, 813746, 934745, 1111003, 1046708, 1038844, 866315, 790512, 1001783, 1193922, 1413816, 1139640, 1078445, 1236024, 1224784, 1121290, 1265066, 1240682, 1218386, 1018918, 1214823, 1104893, 905770, 925926, 626340, 548550, 404201, 660575, 713021, 707178, 712570, 466106, 553429, 713474, 730581, 522483, 632654, 864185, 928810, 882225, 766999]
4744G66999J94478q314k84937j61556J06738R0569J4776P1033r4560K6235j44668
4733E76793r2878r1960J03540J20980J10590k71277k4556k2578n9889M8794O4664
4722D62223k4734R3775l5767N8989j39793K33623N5864j09041R6951K33482k5489
4711I00083j90283o1381J82343n9402j101j27032k06455O8829J33042j18740o6074
4700D53829p2048J74851J26786n2248j14790j71604J4145L20485k44169k48887
4690A86350K90582P0831R0817p8911P6450j33022M7532q8547J09870j41156K74224
4679G05020K17123l21457l03726p8395L42945r3688O9507J14829R4617m0632K1680
4668G27823K67649j90777K00638j28070o2033r8202j60590K71681J6913P8418
$$ y = [766999, 961477, 953163, 668226, 506670, 613408, 703977, 718753, 789786, 695226, 721461, 576793, 483915, 391955, 495495, 616475, 727065, 455788, 431232, 408654, 348765, 397559, 462223, 437489, 531264, 495497, 554486, 414693, 648316, 704180, 595139, 692090, 925572, 900083, 709800, 648419, 830762, 771360, 770259, 643227, 436772, 505601, 638643, 519903, 453829, 381781, 556632, 683418, 631170, 516380, 344776, 358921, 679406, 435237, 186350, 476932, 547763, 638580, 559669, 636119, 503097, 550629, 462082, 571952, 430796, 705020, 922143, 600686, 296960, 218565, 561510, 467822, 537329, 652158, 746775, 706143, 727823, 995472, 804695, 1005333, 877263, 815230, 717028, 556438, 828119, 845032, 923450]
4658I23450j43674L1276O8775L6601k71765K734K405K27135J65554k72778J89701
4647I59414K01392k55707j43910K45146J50913L17723K8191J77870K81346K81580
4637B243958M00074L27066l56038k9460k60664l16242m23091q1083l4300J21727
4627A591947O1130j23825j28673P0656q2206N4020r0872q0158J65385L77957J66562
4616A981923L59553J83877K94609J16282K01169K76581j51779n34444m32533k72155
4606B023083P0980j40335m18319p0299J48330j7891j78980j34203k23082J4047
4596A073331k2385k9853Q603j77039K44235k50403J35781L2742j81566j1428j8260
4585H03758q012K64635L72344R2804R73R2171P3631j12070l30153r7441J24549
$$ y = [923450, 779776, 811052, 879827, 916428, 644663, 647397, 649802, 876937, 1042491, 769713, 959414, 1160806, 905099, 761189, 1006335, 1157248, 1474971, 1503162, 1681032, 1962378, 2243958, 2644032, 2971098, 2615060, 2585600, 2324936, 2008694, 1585603, 1504520, 1470220, 1591947, 1653077, 1529252, 1400579, 1471235, 1389029, 1443049, 1352177, 1272019, 1437404, 1815361, 1981923, 2341476, 2525353, 2819962, 2936244, 3137413, 3413994, 3262215, 2727771, 2295238, 2023083, 2094063, 1953728, 1535409, 1465110, 1613440, 1595549, 1416569, 1282366, 1059284, 1073331, 1050946, 1021093, 1029696, 852657, 1096892, 846489, 982270, 1015012, 833446, 822018, 803758, 795746, 1060381, 1432725, 1525529, 1526502, 1618673, 1692304, 1580234, 1250081, 1152640, 1277189]
4574A277189l6551L4845j5235p0749r3114J26772r6685k03904N4571M16670k30355
4563A163454j1661k01811M7678l29553J02730K31087j25188K02083M23110k97177
4553A204752k66888Q5J34004j18814K48005j69253r9150K30633L1104j55725Q533
4542A047286p9548J92995j64904j40052K58917J50356j12480J8117o4352R1966
4532A198301p8126K97455J7026j16748n9515j58770J79050K22385J26096j36680
4522A490474k96377q2086O4081q9962K18289p9739j6561J88554K75601r1871p9524
4511A500879r2532L7538l9328k65590J67939L8197l1730m8087j04378J15979o1312
4500A217575K91212J80049J9822m2353J1114m5332n2761K70651K70487p2472J5201
$$ y = [1277189, 1240638, 1275483, 1260248, 1189499, 1096385, 1223157, 1126472, 922568, 977139, 1393809, 1163454, 1151793, 949982, 997660, 668107, 770837, 1001924, 876736, 1078819, 1501929, 1204752, 937864, 937949, 1071953, 953139, 1201144, 1031891, 932741, 1163374, 1194478, 1038753, 1047286, 967738, 1160733, 995829, 855777, 1114694, 1265050, 1152570, 1170687, 1106335, 1198301, 1120175, 1417630, 1434656, 1317908, 1258393, 1099623, 1278673, 1501058, 1627154, 1490474, 1194097, 1112011, 1176092, 1086130, 1304419, 1224680, 1208119, 1396673, 1672274, 1580403, 1500879, 1408347, 1445885, 1406557, 1140967, 1308906, 1347103, 1315373, 1267286, 1162908, 1278887, 1217575, 1508787, 1688836, 1708658, 1666305, 1677419, 1632087, 1579326, 1849977, 2120464, 2047992, 2063193]
4489B063193l5283K00884K39919L3818P7191J29577K97572k4127N2927L8308l219
4478C070760J69861J00962p824n0416M8226j39253o7068P3247m414K12730J6110
4467C422921j73989M4697L78432J42496M9800P3606j84522K09836L54748J11814
4457D429839k3133l8094K11610J16130N1642P7484n4473K40423L46291o6252j01878
4446E189589j53217J09963n3472k32055O5201K6023J72378j89733J2345J84059
4436E131081k06375J55947n6554J64152K8429L20427K24778j58872J10875J96076
4426E909964L54505J3357K06371K2784L46318K30121K99517j455J73309R0722
4416G645513j38481J36748K10124L16717K36402K48342K80284l7881J53807L37237
$$ y = [2063193, 2027910, 2228794, 2468713, 2502531, 2579722, 2709299, 3006871, 2982744, 3035671, 3073979, 3070760, 3240621, 3341583, 3333759, 3283343, 3331569, 3192316, 3125248, 3198495, 3194081, 3406811, 3422921, 3248932, 3293629, 3672061, 3814557, 3864357, 3937963, 3753441, 3963277, 4318025, 4429839, 4406706, 4368612, 4580222, 4696352, 4747994, 4825478, 4771005, 5011428, 5357719, 5291467, 5189589, 5036372, 5146335, 5092863, 4860808, 4926009, 4952032, 5124410, 4934677, 4947022, 5131081, 4924706, 5080653, 5024099, 5188251, 5216680, 5537107, 5761885, 5603013, 5713888, 5909964, 6264469, 6277826, 6484197, 6506981, 6853299, 7083420, 7382937, 7381482, 7554791, 7645513, 7507032, 7643780, 7853904, 8170621, 8407023, 8655365, 8935649, 8897768, 9051575, 9388812]
4406I388812K47230Q6152K97459M3890P5493L95732L23649K45170O02607P25064
4396A2431258N67213J66314M39123K95089L30066J8393Q53173M00083K72713M53567
4386A6226992M21220O16104P04555R59941P37468Q84483J059128R90545O46632
4377B3247068J096026J691082J181369J605286K265569K744854K832521L337573
4369D0001348L768507L817490L744707M074593M543659N657778P670351J0509700
4361H3788133J3840724J8134620K3359399L0171910L8874638M9843914N7323236
4354C15336574N6404591L4438253p770653m2801691n8512027n3328819m5192986
4347A98573242l6109573k6672467j9192972j4857543j2206341r993400q349601
$$ y = [9388812, 9636042, 9722194, 10019653, 10063543, 10139036, 10534768, 10858417, 11103587, 11706194, 12431258, 12998471, 13164785, 13603908, 13898997, 14229063, 14247456, 15100629, 15500712, 15773425, 16226992, 16648212, 17264316, 17968871, 18928812, 19666280, 20550763, 21609891, 22600436, 23247068, 24343094, 26034176, 27215545, 28820831, 31086400, 33831254, 36663775, 40001348, 43769855, 47587345, 51332052, 55406645, 59950304, 65608082, 73278433, 83788133, 97628857, 115763477, 139122876, 169294786, 208169424, 258013338, 315336574, 371741165, 406179418, 398408765, 355607074, 297095047, 243766228, 198573242, 162463669, 135791202, 116598230, 101740687, 89534346, 79540946, 71191345]
4340G1191345p315145o429068n069679m438517l725339k633175k204185k187309
4332C7188928j471813j382451j628882j588802j483788j188979j268932r88214
4324B6187067n78550k30462m59342q4049M03976L95372L86147O34091k78188j585740
4314B4790322j867657j948683j906826j419032j181443j314481o05711m97145
4306A4049344n33271j15379p23026n96649l88358o42258m47743k54178k91785
4297A0056697j05048j13665k08203j04457j74511R9934k30623q8705L53l89798
4287H741974J26030Q341k65150k30857n1666J42876j906J43331M77630M56727
4277I547330N88225J025662Q73601O80279P49375n05849j096256r91353j108954
$$ y = [71191345, 63876200, 57447132, 52377453, 47938936, 44213597, 41580422, 39376237, 37188928, 35717115, 34334664, 32705782, 31116980, 29633192, 28444213, 27175281, 26187067, 25608517, 25378055, 24918713, 24834664, 25238640, 25634012, 26020159, 26654250, 26376062, 24790322, 22922665, 20973982, 19067156, 17648124, 16466681, 15152200, 14546489, 14049344, 13516073, 13400694, 12677668, 12081019, 11692661, 11050403, 10602660, 10348482, 10056697, 9951649, 9837984, 9629781, 9525324, 9350813, 9450747, 9220124, 9131419, 9131772, 8741974, 8868004, 8876345, 8611195, 8380338, 8328672, 8471548, 8469642, 8612973, 9090603, 9547330, 10135555, 11161217, 12034818, 12715097, 13464472, 12958623, 11862367, 10871014, 9762060]
4268I762060r22878o91925n36851o83846o13258l53283K18797l81471j55589j87513
4258E454243k68439n17053j05435K0702m08700j08333n1342J296l72981k35641
4248C408317N4700K202j3428j9778j64769j05080l3128k58434J19280K65702l9491
4237C216093j85852J45957r158J18696J39689K3329p4847k1070O5990j89656O95
4226C229866K63511j01590J30232k75292J80168j74503J3287j33304K7073p0951
4216C088497r5713R333J3768j5532Q7441L81187k006K03283r1932J39631M43730
4205D161687j48459J8388P3627K57554J98746N81680M48769L08771R71157O84531
4195G556451J291381J085024J162607M83920o1190p15509r98176q95144p30159
$$ y = [9762060, 8839182, 8147257, 7610406, 6926560, 6313302, 5960019, 6178816, 5797345, 5641756, 5454243, 5185804, 4668751, 4563316, 4584018, 4175318, 4066985, 4015643, 4016939, 3643958, 3408317, 3463017, 3465219, 3451791, 3432013, 3267244, 3162164, 3129036, 2870602, 2989882, 3255584, 3216093, 3030241, 3176198, 3167040, 3285736, 3425425, 3448754, 3373907, 3352837, 3418827, 3229171, 3229866, 3493377, 3391787, 3522019, 3246727, 3426895, 3252392, 3265679, 3132375, 3159448, 3088497, 2992784, 3002117, 3015885, 3000353, 3087794, 3468981, 3466975, 3670258, 3578326, 3717957, 4161687, 4013228, 4031616, 4105243, 4362797, 4561543, 5143223, 5591992, 5900763, 6871920, 7556451, 8847832, 9932856, 11095463, 11579383, 11518193, 10802684, 9804508, 8909364, 8179205]
4186H179205m36907o91515m80112j83152k25608j60443K35307L20361r6690N02569
4176F963015O95966N68338O58658L43632n57639o35767o4375p9118r7020J65090
4166G960780M62484Q41360P84200J029817R71390N17680n28609j48216L07810
4157A2198696J36237N26845M51412o317r51211j295386j059726j128812r46790
4148G924948p10096n43683j50714l05637j76220j13696J36144J08820k6620L14155
4138F457401M14904M73498Q28966Q30480J314275J167267J099547L04262r17958
4129A1972642j451837j223661j131597p98449p68331o60810k21967o03320m2569
4120E070101l6725k35197m1043O6656q0850j9290P7323j407P7776J2650l5248
$$ y = [8179205, 7742298, 7050783, 6570671, 6387519, 6161911, 6001468, 6236775, 6557136, 6460446, 6963015, 7658981, 8227319, 8885977, 9229609, 8671970, 8036203, 7971828, 7892710, 7795690, 7960780, 8423264, 9264624, 10048824, 11078641, 12050031, 12567711, 12039102, 11890886, 12198696, 12334933, 12861778, 13313190, 13306873, 12355662, 11060276, 10000550, 8871738, 7924948, 7214852, 6671169, 6520455, 6214818, 6038598, 5924902, 6061046, 6169866, 6143246, 6457401, 6872305, 7345803, 8174769, 9005249, 10319524, 11486791, 12586338, 12890600, 11972642, 10520805, 9297144, 8165547, 7367098, 6598767, 5937957, 5715990, 5112670, 5070101, 5033376, 4798179, 4757136, 4823792, 4742942, 4723652, 4800975, 4799568, 4877344, 4889994, 4854746]
4109D854746J83949j30423j5901J14404k2408j71744m7178J18771J13137J60622
4099E157975J5831r4780M65857L80239J50405K68712L22800N73039k403m5746
4089G191929J00335l35824K42576k43623j30480J88038M63859L34207j70931K80699
4079G920785K8913K32976K00360L79561L19983L13492Q25123M91573N25668P37205
4069A1975639Q32788J223565J316758J259150J279373O60505J94434P1566j10841
4060A8702937j30647n10031m66568l13023j2298j21927J25902N14536L41736M05504
4050A8536121Q09280J015239J362767J743641J470425K219649K603052K740688
4042C2500862L315275L143278K538059K098949K080515J703252J708243J261722
$$ y = [4854746, 5038695, 4908272, 4892371, 5006775, 4984367, 4812623, 4765445, 4884216, 4997353, 5157975, 5173806, 5079026, 5544883, 5925122, 6075527, 6344239, 6667039, 7240078, 7237675, 7191929, 7292264, 6956440, 7199016, 6955393, 6824913, 7012951, 7476810, 7811017, 7640086, 7920785, 7949698, 8182674, 8383034, 8762595, 9082578, 9396070, 10221193, 10712766, 11238434, 11975639, 12808427, 14031992, 15348750, 16607900, 17887273, 18547778, 18742212, 18813778, 18702937, 18572290, 18062259, 17595691, 17282668, 17270370, 17148443, 17274345, 17788881, 18130617, 18536121, 19345401, 20360640, 21723407, 23467048, 24937473, 27157122, 29760174, 32500862, 35816137, 38959415, 41497474, 43596423, 45676938, 47380190, 49088433, 50350155]
4034E0350155M02732k81612m92739m04379n99046k96836J49817R3222J51070O33549
4024D9705933L41351L94296L29847J10868P53252J131276J760404K075607K533921
4015E9136755K640687K936754L151080L314859L314174L355235L531014L286835
4007H4667393L098958K928958L256929L413649L282798K775428K290392J979700
3999A07694205J325353Q79562j76720j618815l077694m162826m263149m258806
3991I2341110l352962k876938k539927j865159q36994j19592L30385R58672J546492
3982H3585087K383808L078334L939010M505738M502234M173101K305256N96429
3974A09068997j100088k012566k566892k703292k562555k603481k628931k511088
$$ y = [50350155, 50752887, 50471275, 49978536, 49574157, 48975111, 48678275, 48828092, 48921314, 49072384, 49705933, 50047284, 50441580, 50771427, 50882295, 51635547, 52766823, 54527227, 56602834, 59136755, 61777442, 64714196, 67865276, 71180135, 74494309, 77849544, 81380558, 84667393, 87766351, 90695309, 93952238, 97365887, 100648685, 103424113, 105714505, 107694205, 109019558, 109899120, 109722400, 108103585, 105025891, 100863065, 96599916, 92341110, 88988148, 86111210, 83571283, 81706124, 80869130, 80749538, 81079923, 82038595, 83585087, 85968895, 89047229, 92986239, 97491977, 101994211, 106167312, 108472568, 109068997, 107968909, 105956343, 103389451, 100686159, 98123604, 95520123, 92891192, 90380104]
3966I0380104k435141k564830k991383k999004k520461k870287k822492k312629
3958F8863877j966388j686242j081022m54961M18983J044603Q12141M04317j70766
3949F6184542o85298j216012j330856p22306k19632M44770J000578J934934K211175
3940F7601895J961977J171715l78764k544020l845754m904275m986945m669257
3932D9406572m337650l618948l065769k512520j927675j858743j427200j263534
3924B9394533j170484o39375l40332l5919J32156L59408P42696J406953J556162
3915C1405798J220395J177785k15332q50226j299980j801105k007889j920589
3907B5708857j576698j544826j436667j336393j231498q76400n45942q90315q66198
$$ y = [90380104, 87944963, 85380133, 82388750, 79389746, 76869285, 73998998, 71176506, 68863877, 66897489, 65211247, 64130225, 63675264, 64094247, 65138850, 65950991, 66355308, 66184542, 65499244, 64283232, 62952376, 62230070, 62010438, 62455208, 63455786, 65390720, 67601895, 69563872, 70735587, 70356823, 67812803, 63967049, 59062774, 54075829, 49406572, 45068922, 41449974, 38384205, 35871685, 33944010, 32085267, 30658067, 29394533, 28224049, 27584674, 27244342, 27208423, 27340579, 27699987, 28442683, 29849636, 31405798, 32626193, 33803978, 33588646, 32738420, 31438440, 29637335, 27629446, 25708857, 24132159, 22587333, 21150666, 19814273, 18582775, 17706375, 17160433, 16270118, 15403920]
3898A5403920m32322l21660l48455l96618m1868j00223K7512j27882Q2991J93882
3888A3939277k15392j50981k74113k20395o2994j58970l59453j48152J54795J49777
3878A2653399L5651o5597k8922l460o6805J07620j30093K00370J56359J20782
3868A2979304P904M45639J49153P5712K58976J02311j11434K75884L1686K47722
3858A4462857K44940J06853K86129L29279K4284M08771P95266O17446O67319P50915
3848A8694059P44521J182656J214455J209904J052447J067500J329048J592175
3840B8086765J496841J288660J113056M21428P68914P87367O56783j03053j046495
3831C3470266j244534j262054p98252o15477m65775j43285Q25762J357027J502470
$$ y = [15403920, 14971598, 14649938, 14301483, 13904865, 13862997, 13762774, 13790286, 13662404, 13745395, 13939277, 13723885, 13572904, 13298791, 13078396, 13015402, 12856432, 12496979, 12348827, 12503622, 12653399, 12689050, 12623453, 12594531, 12591071, 12524266, 12631886, 12501793, 12702163, 12858522, 12979304, 12987208, 13432847, 13582000, 13657712, 13916688, 14018999, 13907565, 14183449, 14215135, 14462857, 14707797, 14814650, 15100779, 15430058, 15454342, 15863113, 16658379, 17275825, 17943144, 18694059, 19438580, 20621236, 21835691, 23045595, 24098042, 25165542, 26494590, 28086765, 29583606, 30872266, 31985322, 32406750, 33175664, 33963031, 34619814, 34516761, 33470266, 32225732, 30963678, 30165426, 29549949, 29084174, 28940889, 29766651, 31123678, 32626148]
3822C2626148J724812J993987J834005J777095J839590R05809L87013n15697p99447
3813D1773315p76420p7223Q67133J388594K027882K681388L364547L486535L028437
3804E7764188K693604J379545j08877j365505k319779k879702k584386k101865
3796E0477223j687683r65152m24374k13590m90611p99399j131922j105308q27053
3787D2832131n40877J05621N16543Q57358J095505J560357K467541L036523L066357
3778E4997059K880739K655349J676779M82494j224751j919793k627604k327231
3770E4593041j857396j779180j727723j791722k050061k210855j983924j676535
3762C9515645r69998p99806l71105k01401k143j91086k26378j6891o08424m88064
$$ y = [32626148, 34350960, 36344947, 38178952, 39956047, 41795637, 42701446, 43088459, 42572762, 41773315, 40996895, 40919672, 41786805, 43175399, 45203281, 47884669, 51249216, 54735751, 57764188, 60457792, 61837337, 61728460, 60362955, 58043176, 55163474, 52579088, 50477223, 48789540, 47824388, 47400014, 47186424, 46695813, 45896414, 44764492, 43659184, 42832131, 42291254, 42396875, 42913418, 43770776, 44866281, 46426638, 48894179, 51930702, 54997059, 57877798, 60533147, 62209926, 62692420, 61467669, 59547876, 56920272, 54593041, 52735645, 50956465, 49228742, 47437020, 45386959, 43176104, 41192180, 39515645, 38545647, 37745841, 37374736, 37173335, 37171192, 36980106, 36753728, 36736837, 36128413, 35640349]
3752C5640349m55561n05346n58728j25304J27476l47690m0679n08319j54765n1509
3742C3019924M81142K41564N29103K82859o61520j239087j912689k076377k390358
3733B6274561k055319j525345j426941j248864j296356o15946n57040o57939l63149
3724A6527662j69152j15747J13300j15103L2905O4893j78186N6464k42698n45080
3714A5429258k32896k04311l47424j91776k34448j50779k17335p91379m84832
3705A2574078n78495o30300p43956l59787j55100n24667k31560k86765k38499
3696H824949j90992l14292j05517J39449j70526j31639J17735j76286j19926j62972
3686G709983j12258M19136k56513K67244J71189J70160l14027j17472m33134m98364
$$ y = [35640349, 35184788, 34679442, 34120714, 33995410, 34122886, 33775196, 33734517, 33226198, 33071433, 33019924, 33501066, 33742630, 34271733, 34554592, 33893072, 32653985, 30741296, 28664919, 26274561, 24219242, 22693897, 21266956, 20018092, 18721736, 18105790, 17548750, 16890811, 16527662, 16358510, 16242763, 16356063, 16240960, 16273865, 16338758, 16160572, 16217036, 15974338, 15429258, 15196362, 14992051, 14644627, 14452851, 14218403, 14067624, 13850289, 13058910, 12574078, 11995583, 11365283, 10621327, 10261540, 10106440, 9581773, 9350213, 9063448, 8824949, 8633957, 8319665, 8214148, 8353597, 8183071, 8051432, 8169167, 7992881, 7872955, 7709983, 7597725, 8016861, 7760348, 8027592, 8198781, 8368941, 8054914, 7937442, 7504308, 7005944]
3676G005944l57457q225j64692j17807o5397k90479o7767j83893l15689j6086
3666E418452P933p2122P015O2385j03021L8441L3974K24820J45990J31825K10918
3655F106610N57448M69555K58847L69796m42494o76475m15905l00461k55614j39382
3645E531925l81014l74526r6514j0385q0710j82177k61780j47243k21662R7407
3635C873321J35247K02757R7824j67356J1899j49352k2625M58461M896L33837
3625D778909K66850K89089o4616l63428m06488J31278k57671l00010N3711j38657
3615C988967k17229p1385l33129J42561j16593p7344r288n5775k0499q6040J07734
3604C251980j15562Q5016J36036k18430k02062p9487k0834J75717j30405k8966
$$ y = [7005944, 6648487, 6640262, 6475570, 6357763, 6292366, 6001887, 5934120, 5750227, 5434538, 5418452, 5426385, 5354263, 5361278, 5423663, 5320642, 5359083, 5393057, 5617877, 5763867, 5895692, 6106610, 6664058, 7133613, 7392460, 7762256, 7319762, 6643287, 6227382, 5926921, 5671307, 5531925, 5150911, 4776385, 4679871, 4669486, 4588776, 4406599, 4144819, 3997576, 3775914, 3873321, 4008568, 4211325, 4309149, 4141793, 4153692, 4004340, 3981715, 4440176, 4445072, 4778909, 5045759, 5334848, 5270232, 4906804, 4500316, 4631594, 4373923, 4073913, 4127624, 3988967, 3771738, 3700353, 3367224, 3509785, 3393192, 3315848, 3306560, 3250785, 3230286, 3144246, 3251980, 3136418, 3221434, 3357470, 3139040, 2936978, 2857491, 2836657, 3012374, 2881969, 2853003]
3594B853003k14816K37836P3217o1766q6197K08972N1049o5794R8817P3256m02116
3583B765461q5836J59069m6970l74161K75630N712p9747n1571J07068J54257j69787
3572B659125q923k66992J13895J86882j18474j8836J34777J13499m1856P5327
3562B828424L26346l02795j94878O4738K6417r1027K1163j24130j53650P1869
3552B472477r022M9318m0552M4192j0739p614j22374k46323O238K2394q7896J91926
3540B262025j17818K35212J91079K3327j52739j63759R9307K13833l5532K50680
3530B805615o014N489L117j7822K47043J32955L16848k9370K26692k92431J38416
3519C530538j44903k76782l06431k44215p6630k14556L5808j97909r5984p6722
$$ y = [2853003, 2638187, 2876023, 2949240, 2887474, 2801277, 3010249, 3061298, 2995504, 3094321, 3167577, 2765461, 2679625, 2838694, 2791724, 2417563, 2693193, 2698905, 2619158, 2567587, 2674655, 2828912, 2659125, 2650202, 2383210, 2497105, 2683987, 2565513, 2546677, 2681454, 2794953, 2753097, 2828424, 3154770, 2851975, 2657097, 2721835, 2748252, 2657225, 2678388, 2554258, 2400608, 2472477, 2463455, 2512773, 2472221, 2516413, 2505674, 2498060, 2375686, 2129363, 2135601, 2157995, 2070099, 2262025, 2144207, 2379419, 2570498, 2593825, 2441086, 2277327, 2376634, 2590467, 2554935, 2805615, 2799601, 2805090, 2808207, 2790385, 3037428, 3170383, 3487231, 3457861, 3684553, 3392122, 3530538, 3385635, 3108853, 2802422, 2558207, 2481577, 2267021, 2302829, 2104920, 2008936, 1932214]
3509A932214k07010r5946K2980R7276k4900K73311j26997Q3963j30929k43782
3499A580180K2003R2481J17829K0702Q0353J5250L2321n6119n9031o1723k40901
3488A543345k2967J44585R4105q1855k84939k30689J89591l31691m9749K01405
3478A171141j03171k41191K27912J44972J28674k54640j97819K76325J54789r8348
3468A208644q3291o2593q8688K8495K75702K7907j00455J877n4726n082m4992
3457A102798m2918q8372j91784j24082K75807J36374j36658J97289K0228l39448
3447H09234J42009j24618M9215o7555J17558Q3331K05302P2718k23551j09951
3437I53692J60397L0005k12673l2232j0088j03953L65405k44578R1598K58919
$$ y = [1932214, 1725204, 1629258, 1652238, 1749514, 1724614, 1997925, 1870928, 1954891, 1823962, 1580180, 1602183, 1694664, 1812493, 1833195, 1913548, 1928798, 1961119, 1905000, 1845969, 1784246, 1543345, 1520378, 1664963, 1759068, 1677213, 1392274, 1161585, 1351176, 1019485, 969736, 1171141, 1067970, 826779, 1054691, 1199663, 1328337, 1073697, 875878, 1152203, 1306992, 1208644, 1125353, 1062760, 974072, 1002567, 1278269, 1306176, 1205721, 1207598, 1152872, 1147790, 1102798, 1059880, 971508, 779724, 655642, 931449, 1067823, 931165, 1128454, 1148682, 809234, 951243, 826625, 875840, 808285, 925843, 1009174, 1214476, 1287194, 1063643, 953692, 1114089, 1144094, 931421, 899189, 889101, 785148, 1150553, 905975, 997573, 1256492]
3427A256492k59887j26333K04982l0947M61365j78119k21769q5121J80237L74289
3417A575189J64671l08596j62788K04903K36619L149l2074J478j38240M3763j49229
3406A438845M3473J29366J36459m5854o9866j5166J29617J17062J1828j59431
3396A716333P2691j7427J69287n5251j81387J28094M313l03428Q9344L28591j99615
3385A751545J4802N0751j87248J68346j50972k76304K43221J75622m9103N3016
3375A793676K53450n7132j83035K796n9969J5908M5861K17871l22373O1494j9788
3364A748759j27353P3410j92207M9850o8496j03341J12881j06902k5319r9741
3354A261541K55682J28223Q4395j11669k10171J08384L404J11201j56614P2341
$$ y = [1256492, 996605, 870272, 1075254, 1044307, 1505672, 1327553, 1105784, 1020663, 1200900, 1575189, 1739860, 1431264, 1268476, 1473379, 1709998, 1713147, 1681073, 1682551, 1544311, 1588074, 1438845, 1482318, 1611684, 1748143, 1702289, 1632423, 1617257, 1746874, 1863936, 1875764, 1716333, 1789024, 1771597, 1940884, 1885633, 1704246, 1832340, 1836653, 1533225, 1622569, 1951160, 1751545, 1766347, 1817098, 1629850, 1798196, 1647224, 1370920, 1614141, 1789763, 1740660, 1793676, 2047126, 1989994, 1806959, 1809755, 1749786, 1765694, 1811555, 2029426, 1707053, 1768547, 1748759, 1621406, 1694816, 1502609, 1552459, 1483963, 1380622, 1493503, 1386601, 1361282, 1261541, 1517223, 1645446, 1729841, 1618172, 1408001, 1516385, 1519789, 1630990, 1474376, 1546717]
3344A546717j47253M5846q6107j82492O455k05216K42224N3580k33292Q0712m7962
3333A073212j00545K78930j30696j12444k73798j93376L72389J92847j38776j65411
3323H02332M1128k34875R8678m4241j31673K23731L3425M2506J4630j86811j70574
3312D88256J4322m144j43782n5962K35034J73560k00235j48354J46432L37058
3302H42185J09625o4417l5530k78875J3446j2868j97948J52859j53805k48247
3292A26425P8246j5635J27589M4188R742j14127q176j40066J45100P516j28385
3281A32417K75418k09756k13907K49051m5966j56740j93794j76523P2766J37601
3271a29433M17784Q9571k4320J6218k04856n9164j38642j21622r4962J56018P6499
$$ y = [1546717, 1399464, 1445310, 1359203, 1176711, 1183166, 977950, 1220174, 1273754, 1040462, 1121174, 1073212, 972667, 1251597, 1120901, 1008457, 734659, 541283, 913672, 1106519, 967743, 802332, 843460, 608585, 707263, 663022, 531349, 755080, 788505, 831011, 845641, 658830, 488256, 502578, 498434, 354652, 298690, 533724, 707284, 507049, 358695, 505127, 842185, 951810, 887393, 851863, 572988, 586434, 573566, 375618, 528477, 374672, 126425, 204671, 189036, 316625, 360813, 370555, 256428, 248252, 108186, 253286, 260802, 132417, 407835, 198079, -15828, 233223, 187257, 30517, -163277, -339800, -267034, -129433, 288351, 377922, 353602, 369820, 164964, 105800, -32842, -154464, -249426, -93408, -16909]
3260a6909p0735J85181r9470J1805J48938J5379j42719J51489J00002l3170n9541
3249A90250J57258j25901j32640p7757M0174J33192O1048K7914m7037j96778n5041
3238b5318L10665k14559l8022J67804M4743L986r8987L64193r5565J9572m1066
3227C97446l89168O8326O1998K01703r0048l13627J103J99340Q1845k07123j43195
3216a31400O0789J90632P41j16104j36018K77205J74826j52291M1911j58746J41620
3205A93165P6555J60553l886j71126O5807J67640k06524J2527j7601o466q9306
3194A81338j68946P3110R0536Q2272q1371k25156M5950K81498j24624o6296K33257
3183C21568r4549j60610k04136J43043k3233N337L9731L4792N8785j0827J6413
$$ y = [-16909, -87644, 97537, -1933, 9872, 158810, 174189, 31470, 182959, 282961, 249791, 190250, 347508, 221607, 88967, 11210, 51384, 184576, 245624, 273538, 226501, 29723, -25318, 285347, 70788, 32766, 200570, 245313, 249299, 150312, 514505, 418940, 438512, 397446, 8278, 76604, 138602, 340305, 250257, -63370, -62267, 137073, 218918, 11795, -131400, -70611, 120021, 120762, 4658, -131360, 145845, 320671, 168380, 210291, 51545, 193165, 269720, 430273, 426387, 255261, 321068, 488708, 282184, 294711, 277110, 270644, 181338, 12392, 85502, 176038, 258310, 176939, -48217, -2267, 279231, 154607, 88311, 321568, 227019, 66409, -137727, 5316, -17917, -12580, 27151, 61943, 120728, 109901, 126314]
3172A26314K9356j43574j87476M8802J73168l355O3982j29706j74965R7212R0852
3161i390j02480j09159K54221j16992J59652n229r2937N8568j37165Q3118k783
3150b0576o8944j33677J17798L15877j21178J2999k64865N2132j6175J21657j34891
3139a39843J66315K42898k42351k04948K19319j1402j76342J44602J96586j68607
3129B6227r7545k11423J87715l8424J08114K64151q6229k61359k31133Q0443K21374
3118c8089K47333n9276k19883J87642J12216l4120j40250k56740O9179J10271
3108b1717J65404k16304k26959J96915M4877j62683r3484L64103Q3223j82806
3098d9431p9629k6398L26697k29114j40410R715R6273J843K6973q2534J48419
$$ y = [126314, 155670, 12096, -175380, -126578, 46590, 43235, 107217, -22489, -197454, -100242, -9390, -111870, -221029, 33192, -83800, 75852, 70623, -22314, 36254, -100911, -17793, -20576, -89520, -223197, -105399, 210478, 89300, 102299, -162566, -110434, -126609, -4952, -139843, 26472, 269370, 27019, -177929, 41390, 29988, -146354, -1752, 194834, 26227, -71318, -282741, -95026, -133450, -25336, 238815, 152586, -108773, -339906, -259463, -38089, 209244, 149968, -69915, 117727, 229943, 195823, 55573, -201167, -131988, -21717, 143687, -72617, -299576, -102661, -57784, -220467, -313951, 50152, 133375, -49431, -129060, -155458, 171239, -57875, -198285, -188570, -92297, -90454, -63481, -146015, 2404]
3087B404j02465m344k90799J27966J71908L3012K91866j82670j05965N7705j53440
3076a54822K53287j63136J78634j83569o8838Q9840j3067J76340k2668q050j19636
3065c5685l41K6701k26293K24601K37041j89068J38084O7152r088N0434r9166
3054A84372l98829N7462L4328M4894p9691p952J65789l2917j65893K3296k15295
3043c90436L25186K8305j49331j50080p5017J93258J89159j10851K7286K0857
3033i1664M2351j97270k11576K06797J15969J70050j50654R2727M0870r6561R6049
3022A7088J09442r5545J18238N454j90501m3736j54419R0869K12640j01748o0849
3011i3067J31353L26014r7937l20780j28261r0084m409P25J38861R8187j37366
$$ y = [2404, -100061, -104405, -395204, -267238, -95330, -62318, 229548, 46878, -59087, -1382, -154822, 98465, -64671, 113963, -69606, -138444, -48604, -61671, 114669, 92001, 83951, -35685, -36026, -9325, -235618, -11017, 226024, 36956, 175040, 242192, 233104, 283538, 184372, -214457, -156995, -122667, -77773, -157464, -165416, 373, -32544, -198437, -175141, -390436, -65250, -36945, -186276, -336356, -411373, -218115, -28956, -139807, -112521, -91664, -49313, -246583, -458159, -251362, -135393, 34657, -115997, -23270, 17600, -78961, 17088, 126530, 30985, 149223, 154677, -35824, -79560, -233979, -143110, 69530, -32218, -93067, 38286, 364300, 266363, -54417, -182678, -272762, -277171, -276446, -137585, -39398, -176764]
3000a76764K62580j17022j51829K76269J73451k45142J8490J4337m3814J7051
2990B7607j6110j69262O2300J54772k8884k50645J72476J21776j51112M6573n5732
2979h6241J053P356R5512m2282j22937Q3379J79983j7613j33889K14772L3850
2968B12943m47125n5780K00862K43754O3188n0020k92501O5969J02882O7699j47627
2957c5756l0899p7751m9324K68206k19101q7864J89576k63474m3470J77886m9139
2946b21110J17999L9341q6330J28287K25728l4447l00797J18134J0812o9405J23490
2935E1702L4094j34571p3285J23098p4813p5185o3374K29812K87093l09796J31102
2924A25877l0934j17668Q6218j4768M3464K6899j79854q5531k2073o0510L90517
$$ y = [-176764, 85816, -31206, -183035, 93234, 266685, 21543, 40033, 54370, 10556, 27607, 11497, -157765, -95465, 59307, 30423, -220222, -47746, 74030, -77082, -30509, -86241, -85188, -77832, 17680, -24602, -147539, -64160, 115823, 98210, -35679, 179093, 212943, -234182, -289962, -89100, 154654, 217842, 167822, -124679, -58710, 44172, 111871, -35756, -66655, -144406, -193730, 74476, -144625, -232489, -42913, -306387, -349857, -171971, -221110, -103111, -63770, -150100, -21813, 203915, 169468, -131329, -13195, -2383, -71788, 51702, 85796, -48775, -122060, 1038, -73775, -148960, -212334, 17478, 304571, -5225, 125877, 94943, -22725, 63493, 48725, 92189, 119088, -60766, -146297, -168370, -228880, 161637]
2913A61637m1300k12121N0571K1569N3767j90190M2558J08931k49647M3884p3031
2902b83372j21736J53938K00362j18883k45434R7934L46542K46201l97654J76815
2892E4713m2426J20082M7171k60269j37710J25896J47379j78771j72891J70734
2882a26092K20076l2765J70604j58148K8031m6346m4711j7725j10731p4009J29431
2871f2385j58320r2320K29715K1744R0862k14888l6286Q9968k2352J82943j36765
2860a08084Q6465K38586j16172k47331J53393m1014R6613K575o0770J3141P9459
2849I6861O9894l011J09299j1307j7900k35503l4947l2236J15407O690M9514k9696
2837H3065J1018J81041j6590j28918Q2113j64990k088J4672k22276n0047Q5032
$$ y = [161637, 120337, -91784, -41213, -19644, 34123, -156067, -113509, -4578, -254225, -210341, -283372, -405108, -251170, -50808, -169691, -415125, -317191, 29351, 275552, -122102, 54713, 12287, 132369, 179540, -80729, -218439, -92543, 54836, -123935, -296826, -126092, 93984, 61219, 231823, 73675, 101706, 55360, 10649, -7076, -117807, -191816, -62385, -220705, -313025, -83310, -61566, 29296, -185592, -221878, -131910, -154262, 28681, -108084, -21619, 216967, 100795, -146536, 6857, -34157, 62456, 65031, 4261, 17402, 96861, 166755, 163744, 273043, 261736, 243836, 8333, -26614, -58850, 56557, 63247, 112761, 83065, 94083, 275124, 258534, 129616, 211729, 46739, 44651, 59323, -162953, -213000, -127968]
2826a27968J26537L8397j720o8310J23118k71336j43732K610K12717J2186L2526
2815f4975j20000K55893l8231k46313P4335J25535N3861k58286R8116M2807r2771
2804a70029J86013J39278n4909j898J04567k9006p5606o1582k34223O9307k455
2793a30543j17794J45881J99141J73650l91079j27076J23293K05915K50246j95142
2783A36492k21851n9493K29904J33661j93175J73943l31731J34142n9760j71041
2773b28909J64077J36116j39650K7871J57184j918j57333n0928L8254k32255O7039
2762b20452P7909J83230r355q4074K48062j36295j09394J66758j62064J47616
2752A01941P878n2519N3197Q9572Q576j24946J30815j10795o2697Q8629J32144
$$ y = [-127968, -1431, 36966, 35246, -33064, 90054, -181282, -325014, -322404, -109687, -97501, -64975, -184975, 70918, 32687, -213626, -139291, -13756, 40105, -218181, -120065, -77258, -170029, 15984, 155262, 100353, 98455, 203022, 174016, 98410, 36828, -197395, -128088, -130543, -248337, -102456, 96685, 270335, -120744, -247820, -124527, 81388, 331634, 136492, -85359, -144852, 85052, 218713, 25538, 199481, -132250, 1892, -57868, -228909, -64832, 71284, -68366, -40495, 116689, 114771, -42562, -93490, -55236, -287491, -220452, -142543, 40687, 31332, -52742, 195320, 59025, -50369, 116389, -45675, 101941, 109819, 57300, 110497, 200069, 208645, 83699, 214514, 103719, 41022, 129651, 261795]
2741B61795J29710k43348L02529m5959j37688J62374Q4844l7275j97405k82963
2731c386J52605r1784j02158O4608R0737j52463Q720K49258N608m41865K38046
2720A7926K19980k63421j54153K60599j35949k72797K69201M8847q0866J14327
2710B3694j8236j49963l2948M9916N2606J96550J14370J35607J2918k6348j56216
2699B01950o0042J42847m3854J7073j08380j71056K94341k16544k29049Q3439
2689h9275J56251j06208j5550P8726k15812L858J54283J14723q4833J57546j76231
2678b2522N6769m1134R7261J37090k35054J28543K4828k3830k57735L7163J54407
2667E5786j94697N2813j6883O5527M8635K55830j12191j44898J97509N1128K17936
$$ y = [261795, 391505, 148157, 450686, 404727, 267039, 429413, 514257, 476982, 279577, -3386, 149219, 57435, -44723, 19885, 110622, -41841, -33121, 216137, 221745, -220120, 17926, 237906, -25515, -179668, 80931, -55018, -327815, -58614, -9767, -90633, 23694, 5458, -144505, -177453, -127537, -74931, 121619, 235989, 371596, 384514, 358166, 201950, 141908, 284755, 240901, 257974, 149594, -21462, 272879, 56335, -172714, -89275, 66976, -39232, -54782, 23944, -191868, -188010, -33727, 80996, -3837, 153709, -22522, 34247, -6887, 90374, 227464, -7590, 120953, 145781, 121951, -135784, -98621, 55786, -138911, -86098, -102981, -37454, 11181, 267011, 154820, 9922, 207431, 258559, 476495]
2656D76495p1083l14204J35579j0137Q334P4868K5527j52244J43123J63359j67577
2645C12040n3505j3980j3259l943O1327L1888J69999p0499M7623P0353j74171
2634C63873j15189L2588P3684j70129J32706j88125J38493J30902k7577O03j23000
2623B48829O9086o4867m457m1193K60135M4209k38433M4794J89003k83458j2324
2612B11324K77219K20253k74551O058L62420j50013Q8282k54259j21711K24799
2602E89821N6266l5989l01918j4368J63345J91602r136k75961k9189n9220K82816
2591E58069j26061j82111O1412K52758P6149n5890j10682J62425Q4095k67050
2581D53114J29923J56676k69662K42574j49351O1385k0294k88732j00308J13635
$$ y = [476495, 405412, 91208, 226787, 216650, 224984, 299852, 325379, 173135, 316258, 479617, 312040, 258535, 244555, 231296, 227353, 288680, 320568, 490567, 420068, 467691, 538044, 363873, 248684, 281272, 354956, 184827, 317533, 129408, 267901, 398803, 371226, 371829, 248829, 317915, 253048, 248591, 207398, 467533, 511742, 273309, 318103, 507106, 223648, 211324, 488543, 708796, 434245, 440303, 802723, 652710, 740992, 486733, 365022, 589821, 646087, 610098, 308180, 293812, 457157, 648759, 639623, 363662, 334473, 275253, 558069, 432008, 249897, 311309, 564067, 640216, 584326, 473644, 636069, 720164, 453114, 583037, 739713, 470051, 712625, 563274, 624659, 604365, 315633, 215325, 328960]
2571C28960J73370L51376O6134L256k86317J51275L75624j04948k21795m747K25630
2560A057818O09088J09080n7940j83554j05041M9136o9247J73317M2656J72559
2550A797872K75799j64706J28928L39167k1052K56997j7902N5275L903j74153
2540B480128J51300L14809n8711M7574O41349r9406Q7399J49426J47544J38913
2530D000325k15813O6871J30528N17984M0387L51900P5484P3904J84341N27342
2520E753253K56337K00604K8558N92604N19046Q14419J042619R04555P75942J342047
2510A2229984J403711J347183O82050O73270P96230J548807K026906L895642M821319
2501B9425102O220579Q123787J1378509J3903503J8349950J7521035J2868917
$$ y = [328960, 502330, 853706, 919840, 923096, 636779, 788054, 1163678, 1058730, 836935, 832188, 1057818, 1666906, 1775986, 1718046, 1534492, 1429451, 1478587, 1409340, 1582657, 1625313, 1797872, 2073671, 1908965, 2037893, 2377060, 2356008, 2613005, 2595103, 2650378, 2654281, 2480128, 2631428, 2946237, 2887526, 2935100, 3576449, 3477043, 3564442, 3713868, 3861412, 4000325, 3784512, 3851383, 3981911, 4499895, 4540282, 4892182, 4967666, 5041570, 5225911, 5753253, 6009590, 6210194, 6238752, 6831356, 7350402, 8164821, 9207440, 10111995, 10887937, 12229984, 13633695, 14980878, 15662928, 16336198, 17132428, 18681235, 20708141, 24603783, 29425102, 35645681, 43769468, 55147977, 69051480, 87401430, 104922465, 117791382]
2494A17791382r307797k3283873j4164739j4310149j2226824q465873n717246
2487C0314881l905921k943762k650138j805882j737274j239060j154342j621397
2479A3257105j622332q01581p64832o12504p73899m18426l29592m25721m67779
2470G040439n49954m16111m86834j00071j35294l04090j01907l07514o1018o44647
2460C932999r5219L0559m00858o8871n9680p5875m70059k3325l35950j44909K03184
2449B491996P7193P3751l71037J01044k69832J5720J993L2738k69794j36051j83909
2438A563812k00342J83875K63625q0898l69981Q0534J35350l983l08963p7805
2428A185224L64957p7988k20414o1400j77084j44711K42873j81857j45646L75310
$$ y = [117791382, 108483585, 85199712, 71034973, 56724824, 44498000, 36032127, 30314881, 26408960, 23465198, 20815060, 19009178, 17271904, 16032844, 14878502, 13257105, 11634773, 10833192, 10068360, 9455856, 8681957, 8263531, 7933939, 7508218, 7040439, 6490485, 6074374, 5587540, 5487469, 5352175, 5048085, 4946178, 4638664, 4577646, 3932999, 3837780, 3868339, 3467481, 3398610, 3338930, 3263055, 2792996, 2769671, 2433721, 2288812, 2491996, 2569189, 2642940, 2271903, 2372947, 2103115, 2118835, 2120828, 2153566, 1883772, 1747721, 1563812, 1363470, 1547345, 1810970, 1730072, 1360091, 1440625, 1575975, 1571992, 1263029, 1185224, 1550181, 1472193, 1251779, 1190379, 1013295, 868584, 1111457, 929600, 783954, 1159264]
2418A159264j59834m3341l4778M1740n083j56263k1109N1648n9487n2942J76741
2407H96556r8007k97628k09697L07628j96591j09827k434p8675L28248K2145j73057
2396C88661k06850L37728J31057l45339k27366N8650J48853k46896j26383L36359
2386B48474M308k00433K09491j2126j84182L05372k4474p7598j27787K12342L2315
2375C85702k44522j50862J12528O5046l03170K84704J7056J74164j76699J76778
2365C40725j38076k49283K56447q5970R1267j97186o2010K88935r9970j71988
2355b7109p5187n0689Q8755q5560p0195L71914K30316k18867j69792J6731R0971
2344A01288j22549O3276j7949J19113J38891j01421m60973n6217L65005J2368
$$ y = [1159264, 999430, 956089, 921311, 963051, 957968, 801705, 780596, 832244, 772757, 719815, 896556, 798549, 500921, 291224, 598852, 402261, 292434, 290000, 211325, 539573, 561718, 388661, 181811, 519539, 650596, 305257, 77891, 136541, 285394, 38498, -87885, 248474, 252782, 52349, 261840, 249714, 65532, 370904, 346430, 268832, 141045, 353387, 385702, 141180, -9682, 102846, 167892, -135278, 149426, 166482, 340646, 163947, 340725, 202649, -46634, 209813, 123843, 215110, 17924, -44086, 244849, 144879, -27109, -102296, -152985, -64230, -149790, -219985, 151929, 382245, 163378, -6414, 10317, 101288, -21261, 42015, 24066, 143179, 282070, 180649, -280324, -336541, 28464, 40832]
2334D0832o4662k42394q8408M75519j25398k538P4739r5298m1835J38617R446
2323G8620o318m4358L210q6540M0778k2070O1132M1847j39017J38057j04245l4433
2311g3337K2002o4556J80507N2542j28184j26640J21747J12777n3967j13103J44376
2300G4164J9554q0813K04755k75343L2579k244R2954P1755k72026R9090J30192
2289I4617q3255Q4871j98855r4804K30112J7226j14387k56546L01683J83396j93411
2278b9353o7667J20032P0107J63552r9327m3053j05550Q5304j40802j9824Q2640
2267A6059M03207j37147k68660o1258J5500K01609R8712j01145k22564J35214
2257G9527J17507J85835j63566j3719J06468R2229j12570O7598r2019P9298j24721
$$ y = [40832, -23830, -266224, -354632, 120887, -4511, -7049, 67690, -27608, -69443, 69174, 78620, 72302, 27944, 31154, -55386, -14608, -36678, 24454, 66301, -72716, 65341, -38904, -73337, -51335, -115891, 64616, 117158, -11026, -137666, -15919, 96858, 42891, -70212, 74164, 93718, 12905, 217660, -57683, -25104, -27348, 65606, 137361, -134665, -35575, 94617, 11362, 96233, -102622, -197426, 32686, 49912, -64475, -321021, -19338, 164058, -29353, -97020, 23012, 93119, 256671, 157344, 114291, 8741, 94045, -46757, -66581, 16059, 419266, 282119, 13459, -47799, -32299, 169310, 268022, 166877, -55687, 79527, 197034, 382869, 219303, 205584, 312052, 404281, 291711, 359309, 267290, 346588, 221867]
2246B21867N5278j80783R044L3674o10l00576j98438M44436j06810q1952m775
2235a09645j0330o5151J53721R3401j37093j79240K70024K98221k53778j32386
2225g2256J95968r5114k39787K41609p6368Q5220o3952Q3186R6560k7620M7125
2214A74571j7188m25136M9151L36146j97419j72093K75821J80364k81390j6808
2204i3981J92104j85592j54137L8260M4413j25020N2674K02371j10902j6037L04293
2193A48446k83807r6576K36058J49463j22741l24078J08095P5310m6609K25303
2183F8864L0522l69172P3413K09819J0839N6943q1013j9437L5012j69553L3544
2172a20219J47422j09932J39812P7990l23412j67131M40038r2946j59309l0948
$$ y = [221867, 277145, 96362, 105406, 139080, 138470, -162106, -360544, 83892, -22918, -104870, -109645, -119975, -185126, -31405, 61996, -75097, -254337, 15687, 313908, 60130, -72256, 123712, 28598, -211189, 30420, -45948, 39272, -24680, 58506, 155066, 127446, 174571, 157383, -267753, -218602, 117544, -79875, -251968, 23853, 204217, -77173, -93981, 98123, -87469, -241606, -203346, -158933, -283953, -231279, -28908, -139810, -155847, 148446, -135361, -231937, 4121, 153584, 30843, -293235, -185140, -109830, -156439, 68864, 99386, -269786, -196373, 13446, 24285, 81228, 215, -19222, 15790, -153763, -120219, 27203, -82729, 57083, 135073, -188339, -355470, 84568, -8378, -167687, -198635]
2162a98635J49283O5231j44289J48486j07137J16266P3431j55299k51105J54624
2152a49144R1613j08298q0848N6231N4917L3218j44961R3353J18558J3534m9536
2141g1363J58868j46175o581J34491j31110j10611o0348K18849L5680k42080J47550
2130g2830K14150j07693M8992N5695j62972K36532k63519R1175j2126M4746J32135
2119B04285j17635j9898J12640o3742k40211K34991j32736K8103L7017j02409
2109e9595K72931J34090p4851m3283k86855k94970N1875P5543J26585k346j35022
2098b35898K18237J19445l16976J15639J39909o9800j29940j80414K32799k9246
2088a36245J20979j39896n1164q704j46769N42543K6079p8122r2149O4221j14233
$$ y = [-198635, -49352, 15879, -128410, 20076, -87061, 29205, 102636, -52663, -303768, -149144, -57531, -165829, -246677, -190446, -135529, -102311, -247272, -153919, -35361, -21827, -71363, 87505, -58670, -65251, 69240, -61870, -172481, -232829, -13980, 21700, -220380, -72830, 141320, 33627, 82619, 138314, -24658, 211874, -51645, 39530, 27404, 72150, 204285, 86650, 66752, 179392, 115650, -124561, 110430, -22306, 5797, 42814, -59595, 213336, 347426, 272575, 229292, -57563, -352533, -300658, -225115, -98530, -100876, -235898, -17661, 101784, -215192, -99553, 40356, -29444, -159384, -339798, -106999, -136245, -15266, -155162, -206326, -215030, -361799, 180744, 206823, 128701, 36552, 100773, -13460]
2077a3460j5199n9656J02280o2871n2614N4058K05512Q8495j91966J24662q4045
2066I5196K17104k4699o6286n8240L3949N0820r8909j50631P8013l1234q4981
2055c9898J3399j83009L679K16202k13067p1319o8050O8794K50484j62516m5299
2044b30600J02054r4856K51423J14742j52534j43294R3778J0854J30128Q7055
2034A68750k1285J8462k28685o54j9258j39645L11876k08083M7586L44503k15165
2023E8402k90431K11098J47053o3154Q7967O195k28781J12213P8079j19435q5055
2012h5849J65484j03205p6466K75803m1535m71846j07133K62912J19773j27145
2002a89207J13801J01522j77620j1745j56913K17175k21750J54586J69082J35744
$$ y = [-13460, -28659, -88315, 13965, -48906, -101520, -47462, 158050, 246545, 54579, 179241, 95196, 312300, 287601, 221315, 163075, 197024, 247844, 148935, -1696, 76317, 45083, -39898, -26499, -209508, -205829, 10373, -202694, -274013, -342063, -273269, -22785, -185301, -230600, -128546, -223402, 28021, 142763, -9771, -153065, -59287, -48433, 81695, 168750, 147465, 165927, -62758, -63412, -82670, -222315, 89561, -118522, -70936, 273567, 58402, -232029, -20931, 126122, 62968, 150935, 157130, -71651, 40562, 118641, -794, -85849, 79635, -23570, -100036, 175767, 134232, -337614, -444747, -181835, -62062, -189207, -75406, 26116, -151504, -163249, -320162, -102987, -324737, -170151, -1069, 134675]
1992A34675M8043o6422j64693q2874J25359j50035Q1337j65955J5453K30054o205
1981a263k88430p5169L89881o6459J20674N3590R133n1757l8795J3983p6073J32701
1969A22016J71195n0462l12857q27J17297k69572J79195j4050k34476M7710K11829
1958c3002P0688o0923N125j9584n0663l69408J55576r4920j03320J36884P0989
1947b92558J89514j7876R1941J10314j51101J8804M6821j75992j78516K466J58363
1936a97820J75170k09796o1564R5649j79802L29089M5655l19120L16909J79298
1926A73668k04078l218K72104o1439o0871J44795J7172l10151j36218Q7537r5488
1915a76187j46179J47590L13592M2411J9512j00721r8708l6193k69309P2193L9763
$$ y = [134675, 182718, 116296, -48397, -131271, -5912, -155947, -74610, -240565, -225112, 4942, -1263, -289693, -364862, 25019, -41440, 79234, 132824, 141957, 90200, 51405, 65388, -10685, 122016, 293211, 242749, -70108, -70935, 46362, -223210, -44015, -58065, -292541, -244831, -33002, 37686, -23237, -18112, -37696, -88359, -457767, -302191, -397111, -500431, -363547, -292558, -103044, -120920, -28979, 81335, -69766, -50962, -4141, -180133, -358649, -356183, -197820, -22650, -232446, -294010, -198361, -378163, -49074, -3419, -322539, -5630, 173668, -30410, -33628, 238476, 177037, 116166, 260961, 278133, -32018, -168236, -80699, -176187, -322366, -174776, 138816, 181227, 200739, 100018, 1310, -34883, -304192, -231999, -192236]
1904a92236J00260J33429k12921K06058m1056k00157o4603K52017K2180K16697
1894B19668j25326j62568k3348K19377l51972J40649K53705k42312K58733O8323
1884B54929K1631N073j39693m97383J03452K3694J35753K62490j3073k37131J15258
1873C5000K34047q0994j66619m4744j28140o2524L99188j42692j77003J69222
1863C4741L22549k43038J56362n1542j78516K6829O2316N5692j47498K012r1206
1852e1299M0000j40832L4631j28353j26996K32500R7595j72002J92497R7087k62414
1841a87586K0683p6731J6873J92742M371J31568k89350p5298O4139o4350J04472
1830a58467O1030O4082J95302P6549j54015P8370m9687j44775J44459j76280n4009
$$ y = [-192236, -91976, 41453, -171468, 34590, -6466, -206623, -271226, -19209, 2971, 219668, 94342, -68226, -91574, 127803, -224169, -83520, 170185, -72127, 186606, 254929, 276560, 281633, 141940, -355443, -251991, -228297, -92544, 169946, 156873, -80258, 35000, 269047, 188053, 21434, -23310, -151450, -213974, 185214, 42522, -134481, 34741, 357290, 114252, 270614, 219072, 40556, 67385, 129701, 185393, 37895, 39907, -51299, -11299, -152131, -117500, -245853, -372849, -140349, -42754, -214756, -22259, 74828, -187586, -166903, -243634, -226761, -34019, -29648, 101920, -187430, -262728, -198589, -262939, -158467, -97437, -33355, 161947, 238496, 84481, 162851, 113164, -31611, 112848, -63432, -117441]
1819a17441m1191J12229N2115p7184j05780N4213k7886J9071K51840q3660l32394
1808b96068J69795J59838j0335Q0594r2897J98679o4063k00431R5831K05346k40161
1797F128J82733J285j55845R2127l28511L3634J70482j18463k5266J35833j44830
1786a50693K99175k55442p1157k1479K24372K81679J2955k09562M9884j73237
1776a3505N1115j09973K15740k9844l669n0j56949j8985j69087n4087J26912J72302
1764I920k11476J57752J26051K19863k74915J22385J0727j98791N9301J77795
1754A98612k96634J14403j82758J78715M0493q622J01064P3059k92073p7889J92996
1743D1366R0878j01193m9789p0043J26510J42287p3155q0855k481J47340r5794
$$ y = [-117441, -158632, -46403, 5712, -71472, -177252, -123039, -150925, -131854, 119986, 36326, -296068, -126273, 33565, 23230, 103824, 10927, 209606, 145543, -54888, 40943, 246289, 6128, 188861, 190146, 34301, 126428, -202083, -168449, 2033, -116430, -141696, -5863, -150693, 148482, -106960, -178117, -199596, 24776, 306455, 319410, 109848, 159732, -13505, 37610, -72363, 143377, 113533, 109864, 109814, -47135, -66120, -235207, -289294, -162382, 9920, -201556, -43804, 82247, 302110, 27195, 149580, 160307, -38484, 20817, 198612, -98022, 16381, -166377, 12338, 52831, 44209, 145273, 218332, -73741, -151630, 41366, 132244, 31051, -18738, -88781, 37729, 180016, 106861, 26006, 23525, 170865, 75071]
1732G5071k20899K18578J78092P4191l21605r5633R3700K14608r8593k08971P5449
1721a6012k0560L08061q2677k68214J46991L2183n3099j10006P9019L2988q533
1710D0141j03917j03601J54537p256J34131K13099k5417m01010J33925m0321K2829
1699A7140K4051K9094o9864o7790j03508j22926J07965K55944m9480m2620j78868
1688b00862J50290J04479j25161L5773P0132Q334Q4690O5035j35349K01860P2919
1677C32140k13740m33998K01892K29490k19919l74832J04394M00355J6526J7911
1667F0219O6228j68785n6219M074K558Q5626M1421J65923m2497J35001j36790
1656A56759N1030p6624k62140n3149L2555j56793L19266k03040Q6484J7786J19943
$$ y = [75071, -145828, 72750, 250842, 325033, 3428, -92205, 1495, 216103, 117510, -91461, -16012, -36572, 271489, 188812, -79402, 67589, 99772, 46673, -63333, 15686, 48674, 40141, -63776, -167377, -12840, -20096, 114035, 327134, 301717, -99293, 34632, -5689, 17140, 41191, 70285, 421, -67369, -170877, -293803, -185838, 70106, 20626, -21994, -200862, -50572, 53907, -71254, -35481, 34651, 42985, 127675, 192710, 57361, 259221, 332140, 118400, -315598, -113706, 115784, -104135, -478967, -374573, 25782, 42308, 60219, 126447, -42338, -98557, -94483, -91925, -6299, 35122, 201045, 158548, 293549, 156759, 207789, 131165, -130975, -184124, -151569, -308362, 10904, -192136, -105652, -87866, 32077]
1645C2077p2353k37462J29087k0847j9168j33859P8166K6494Q9256K97989o7449
1634A01931j85775Q6049O0963j83283q8374N2435J70777o1524M053M5623q9740
1623h6865J97124j32362R9133J0513J33864l06899r736J99354j07458o8443K87814
1612B16039J08438j38521k29962j05417K08681j58207n3451J00550J864K38642
1602A88656p3225j16280R411j64374J62384J04118j60734M6460j74219j65846
1592c43649J99024O3205j86328K23819l7100k05196J01156J44750k0359K4556
1582c6122o2094Q8180K8367R9695j06185o0132k58433K2109K35632K8309k8537
1571d9211k00817J15571L16940J19804q9987J13558j3812k22840j07076q2822
$$ y = [32077, -40276, -277738, -148651, -169498, -188666, -322525, -244359, -217865, -128609, 169380, 101931, -83844, 2205, 63168, -120115, -208489, -156054, 14723, -46801, -42748, 2875, -86865, 110259, -22103, 77030, 87543, 221407, -85492, -95228, 104126, -3332, -71775, 216039, 324477, 185956, -44006, -149423, 59258, -98949, -152400, -51850, -49986, 188656, 115431, -849, 8562, -155812, 6572, 110690, -50044, -3584, -177803, -343649, -144625, -81420, -267748, -43929, -81029, -286225, -185069, -40319, -60678, -36122, -98216, -10036, 18331, 118026, 11841, -48291, -306724, -284615, -48983, -20674, -49211, -250028, -134457, 182483, 302287, 212300, 325858, 312046, 89206, -17870, -100692]
1561a00692J28052J56886k33551K4469j24221K63285O6083K4908j31612k59370
1551a85763L6941n158L4125l5751O1421J71069J07925K7739N8875k73362n9828
1540f1767L4786k64777J89774j15294J85251k07020J86084J30761l72993J35825
1530a59370J95893k09745j20258N32538k76752M8245N6972o7845J60669k01275
1520d0928R7160l8414K6021J7188M6694N5658J1744j32823p5251J0381j98074
1509b20644J75932l816o479N7036K07924j94867J63172j67938k16882L43002k23653
1498h7213L0810o8973O4538R4537j00875M5375j23850J15127j22269O4742j6155
1487a04206j39337r9153Q2216K97748m8939M6020q3857J5618K4679P3621l7359
$$ y = [-100692, 27360, 184246, -49305, -24836, -149057, 114228, 180311, 205219, 73607, -185763, -148822, -153980, -119855, -155606, -94185, 76884, 184809, 212548, 271423, -1939, -61767, -26981, -291758, -101984, -217278, -32027, -239047, -52963, 77798, -295195, -159370, 36523, -173222, -293480, 239058, -37694, 10551, 67523, -322, 160347, -40928, 56232, 17818, 43839, 61027, 107721, 163379, 175123, 42300, -32951, -22570, -220644, -44712, -48528, -55007, 2029, 209953, 15086, 178258, 10320, -206562, 136440, -87213, -56403, -125376, -60838, 33699, -67176, -21801, -145651, -30524, -152793, -88051, -104206, -243543, -342696, -260480, 37268, -11671, 34349, -49508, -33890, -9211, 64410, 27051]
1476B7051p8191j61383K52885K34341q1524J06038r3924l5631J46723J41221j16761
1465C40845k81571m6875j37464j2822K40075m4501k94551J36948K80540j33821
1455D6803J37758k41256j51843K63813N909j59191K10078j32101l14463j11078
1445d45571J99783K35410k49639k9464k3342N9153R8942M6855j84361J15394K14763
1434C7923O3869j01443j08137K15373O4282j5625j5559j2687O3859n6765J50742
1423B85832j00136R7965k78012k3951L05170N3671j47374j66607K57474j86960
1413I7072m9877j15772J06642L3515j11353j03121N9639J32691j18972K02722
1403A33186r5165m8245m0570j01937j29785l8560M08541j42198j41165N0014r2602
$$ y = [27051, -51140, -212523, 40362, 274703, 193179, 299217, 205293, 169662, 316385, 457606, 340845, 59274, 12399, -125065, -137887, 102188, 57687, -236864, -99916, 180624, 46803, 184561, -56695, -208538, 55275, 61184, -98007, 112071, -20030, -334493, -445571, -245788, -10378, -260017, -289481, -312823, -253670, -154728, -107873, -292234, -176840, 37923, 101792, 349, -107788, 107585, 171867, 156242, 140683, 127996, 191855, 135090, 285832, 185696, 283661, 5649, -18302, 286868, 340539, 193165, 26558, 284032, 97072, 47195, -68577, 38065, 71580, -39773, -142894, -83255, 49436, -69536, 133186, 38021, -10224, -50794, -152731, -282516, -321076, 87465, -54733, -195898, -145884, -238486]
1392b38486P4381K52931l5552k1476L4832j94226k6151r071p1047M6018K35559
1381D7712J2696j90639J38490J35088L10119k74871l66059L63117k11341q6726
1371a22414R8122L08766j24384O0477O8086O987j17950j54263R5507k09018L80971
1360B90887l2692j25540l2216k7345j201q0406k88319J91954K13929p8500K04241
1349B34792k86461r3477J42155j06815J5980l03257k0679J81092K1722r4024J25755
1338a83217k3002K49666l8669j63927L1585L1402M1129j04972J65239J24139M5799
$$ y = [-238486, -164105, 88826, 53274, 31798, 66630, -127596, -153747, -162818, -233865, -187847, 47712, 60408, -130231, 8259, 143347, 453466, 178595, -187464, 175653, -35688, -122414, -24292, 284474, 160090, 220567, 288653, 295640, 177690, 23427, 118934, -90084, 290887, 258195, 132655, 100439, 73094, 71893, -8513, -296832, -104878, 109051, 30551, 234792, -51669, -145146, -2991, -109806, -93826, -397083, -417762, -236670, -214948, -308972, -183217, -206219, 43447, 4778, -159149, -127564, -96162, -55033, -160005, 5234, 129373, 175172]
$$ [...]
##END NTUPLES=NMR SPECTRUM
##END=
