##TITLE=1H_EC-3260(III-11)
 CDCl3,8 sc, 
 20.9.2021
##JCAMPDX= 6.0         $$ Bruker NMR JCAMP-DX V2.0
##DATA TYPE= NMR SPECTRUM
##DATA CLASS= NTUPLES
##ORIGIN= UXNMR, Bruker Analytische Messtechnik GmbH
##OWNER= root
$$ XWIN-NMR		Version 3.5
$$ Mon Sep 20 11:01:12 2021 Russian Standard Time (UT+4h)  she@DPX200
##.OBSERVE FREQUENCY= 200.1314
##.OBSERVE NUCLEUS= ^1H
##.ACQUISITION MODE= SIMULTANEOUS
##.ACQUISITION SCHEME= undefined
##.AVERAGES= 8
##.DIGITISER RES= 18
##SPECTROMETER/DATA SYSTEM= spect
##.PULSE SEQUENCE= zg30
##.SOLVENT NAME= CDCl3
##.SHIFT REFERENCE= (INTERNAL, CDCl3, 0, 16.9766)
##AUDIT TRAIL= $$ (NUMBER, WHEN, WHO, WHERE, WHAT)
$$ ##TITLE= Audit trail, XWIN-NMR		Version 3.5
$$ ##JCAMPDX= 5.01
$$ ##ORIGIN= Bruker BioSpin GmbH
$$ ##OWNER= she
$$ F:/spectra/data/she/nmr/H-F/1/pdata/1/auditp.txt
$$ ##AUDIT TRAIL=  $$ (NUMBER, WHEN, WHO, WHERE, WHAT)
(   1,<2021-09-20 10:59:59.76 +0400>,<she>,<DPX200>,
      <created by zg, POWCHK disabled, PULCHK disabled
       configuration hash MD5:
       00 E9 B6 7A A2 85 ED C7 34 08 36 98 17 FE 4E 26
       data hash MD5: 16K
       59 47 93 14 65 27 06 81 38 10 33 CE 46 AC 24 CB>)
(   2,<2021-09-20 11:00:02.25 +0400>,<she>,<DPX200>,
      <Start of raw data processing
       efp BC_mod = 2 LB = 0.24 FT_mod = 6 PKNL = 1 PHC0 = -13712.1 PHC1 = 7.000901 SI = 16K 
       data hash MD5: 16K
       52 68 3B 27 DB 62 94 FF 5E A7 1C 93 80 07 F8 5B>)
(   3,<2021-09-20 11:00:20.29 +0400>,<she>,<DPX200>,
      <pk PHC0 = -2.520727 PHC1 = 4.800001 
       data hash MD5: 16K
       41 4D 89 9C A1 7A 7E AD CA 0F C4 B3 CD FC A2 96>)
(   4,<2021-09-20 11:00:23.39 +0400>,<she>,<DPX200>,
      <abs ABSG = 5 
       data hash MD5: 16K
       9B 51 01 57 CA 06 1F 00 08 71 FB 36 4A DF 90 7B>)
$$ ##END=
$$ 
$$ hash MD5
$$ 50 D9 CC 40 B2 E9 00 5D 3A 0A 66 D0 7B 82 45 9B
##$RELAX= 
##$RELAX= 
##$RELAX= 
##$RELAX= 
##$RELAX= 
##$RELAX= 
$$ Bruker specific parameters
$$ --------------------------
##$DU= <F:/spectra>
##$EXPNO= 1
##$NAME= <H-F>
##$PROCNO= 1
##$TYPE= <nmr>
##$USER= <she>
##$AMP= (0..31)
100 100 100 100 100 100 100 100 100 100 100 100 100 100 100 100 100 100 
100 100 100 100 100 100 100 100 100 100 100 100 100 100 
##$AQSEQ= 0
##$AQ_mod= 1
##$AUNM= <au_zg>
##$AUTOPOS= <>
##$BF1= 200.13
##$BF2= 200.13
##$BF3= 200.13
##$BF4= 200.13
##$BF5= 200.13
##$BF6= 200.13
##$BF7= 200.13
##$BF8= 200.13
##$BYTORDA= 1
##$CFDGTYP= 0
##$CFRGTYP= 5
##$CHEMSTR= <none>
##$CNST= (0..31)
1 1 145 1 1 1 1 1 1 1 1 1 1 1 1 1 1 1 1 1 1 1 1 1 1 1 1 1 1 1 1 1 
##$CPDPRG= <>
##$CPDPRG1= <>
##$CPDPRG2= <>
##$CPDPRG3= <>
##$CPDPRG4= <mlev>
##$CPDPRG5= <mlev>
##$CPDPRG6= <mlev>
##$CPDPRG7= <mlev>
##$CPDPRG8= <mlev>
##$CPDPRGB= <>
##$CPDPRGT= <>
##$D= (0..31)
0 1.2 0 0 0 0 0 0 0 0.06 0 0.03 0 0 0 0 0.0002 0 0 0 0 0 0 0 0 0 0 0 0 
0 0 0 
##$DATE= 1632121199
##$DBL= (0..7)
120 120 120 120 120 120 120 120 
##$DBP= (0..7)
150 150 150 150 150 150 150 150 
##$DBP07= 0
##$DBPNAM0= <>
##$DBPNAM1= <>
##$DBPNAM2= <>
##$DBPNAM3= <>
##$DBPNAM4= <>
$$ [...]
##$SUBNAM3= <"">
##$SUBNAM4= <"">
##$SUBNAM5= <"">
##$SUBNAM6= <"">
##$SUBNAM7= <"">
##$SUBNAM8= <"">
##$SUBNAM9= <"">
##$SW= 20.0188988654967
##$SWIBOX= (0..15)
0 0 2 0 0 0 0 0 0 0 0 0 0 0 0 0 
##$SW_h= 4006.41025641026
##$TD= 16384
##$TD0= 1
##$TE= 0
##$TE2= 300
##$TE3= 300
##$TEG= 300
##$TL= (0..7)
0 120 120 120 120 120 120 120 
##$TP= (0..7)
150 150 150 150 150 150 150 150 
##$TP07= 0
##$TPNAME0= <>
##$TPNAME1= <>
##$TPNAME2= <>
##$TPNAME3= <>
##$TPNAME4= <>
##$TPNAME5= <>
##$TPNAME6= <>
##$TPNAME7= <>
##$TPOAL= (0..7)
0.5 0.5 0.5 0.5 0.5 0.5 0.5 0.5 
##$TPOFFS= (0..7)
0 0 0 0 0 0 0 0 
##$TUNHIN= 0
##$TUNHOUT= 0
##$TUNXOUT= 0
##$USERA1= <user>
##$USERA2= <user>
##$USERA3= <user>
##$USERA4= <user>
##$USERA5= <user>
##$V9= 5
##$VALIST= <valist>
##$VCLIST= <CCCCCCCCCCCCCCC>
##$VD= 0
##$VDLIST= <DDDDDDDDDDDDDDD>
##$VPLIST= <PPPPPPPPPPPPPPP>
##$VTLIST= <TTTTTTTTTTTTTTT>
##$WBST= 1024
##$WBSW= 4
##$XGAIN= (0..3)
0 0 0 0 
##$XL= 0
##$YL= 0
##$YMAX_a= 163379
##$YMIN_a= -332990
##$ZGOPTNS= <>
##$ZL1= 120
##$ZL2= 120
##$ZL3= 120
##$ZL4= 120
##$ABSF1= 16.97049
##$ABSF2= -3.04855
##$ABSG= 5
##$ABSL= 3
##$ALPHA= 0
##$AQORDER= 0
##$ASSFAC= 0
##$ASSFACI= 0
##$ASSFACX= 0
##$ASSWID= 0
##$AUNMP= <proc_1d>
##$AZFE= 0.1
##$AZFW= 0.1
##$BCFW= 0
##$BC_mod= 2
##$BYTORDP= 0
##$COROFFS= 0
##$CY= -3
##$DATMOD= 1
##$DC= 0
##$DFILT= <>
##$DTYPP= 0
##$F1P= 0
##$F2P= 0
##$FCOR= 1
##$FTSIZE= 16384
##$FT_mod= 6
##$GAMMA= 0
##$GB= 0
##$INTBC= 1
##$INTSCL= 1.334414e-10
##$ISEN= 128
##$LB= 0.24
##$LEV0= 0
##$LPBIN= 0
##$MAXI= 10000
##$MC2= 0
##$MEAN= 0
##$ME_mod= 0
##$MI= 1.114404
##$NCOEF= 0
##$NC_proc= -7
##$NLEV= 6
##$NOISF1= 3.799351
##$NOISF2= 2.8
##$NSP= 0
##$NTH_PI= 0
##$NZP= 0
##$OFFSET= 16.97659
##$PC= 1
##$PHC0= -13714.62
##$PHC1= 11.8009
##$PH_mod= 1
##$PKNL= yes
##$PPARMOD= 0
##$PSCAL= 0
##$PSIGN= 0
##$REVERSE= no
##$SF= 200.130005680169
##$SI= 16384
##$SIGF1= 3
##$SIGF2= 2
##$SINO= 5.538805
##$SIOLD= 16384
##$SREGLST= <1H.CDCl3>
##$SSB= 0
##$STSI= 16384
##$STSR= 0
##$SW_p= 4006.41025641027
##$SYMM= 0
##$S_DEV= 0
##$TDeff= 16384
##$TDoff= 0
##$TI= <>
##$TILT= no
##$TM1= 0
##$TM2= 0
##$TOPLEV= 0
##$USERP1= <user>
##$USERP2= <user>
##$USERP3= <user>
##$USERP4= <user>
##$USERP5= <user>
##$WDW= 1
##$XDIM= 16384
##$YMAX_p= 492756186
##$YMIN_p= -707285
$$ End of Bruker specific parameters
$$ ---------------------------------
##NTUPLES= NMR SPECTRUM
##VAR_NAME=  FREQUENCY,     SPECTRUM/REAL,   SPECTRUM/IMAG
##SYMBOL=    X,             R,               I
##VAR_TYPE=  INDEPENDENT,   DEPENDENT,       DEPENDENT
##VAR_FORM=  AFFN,          ASDF,            ASDF
##VAR_DIM=   16384,         16384,           16384
##UNITS=     HZ,            ARBITRARY UNITS, ARBITRARY UNITS
##FACTOR=    0.244546801953871, 1,           1
##FIRST=     3397.52489360244, 0,            0
##LAST=      -608.885362807828, 0,           0
##MIN=       -608.885362807828, -707285,     0
##MAX=       3397.52489360244, 492756186,    0
$$ Real data points
##PAGE= N=1
##DATA TABLE= (X++(R..R)), XYDATA
$$ [...]
7255c7465j52931j91587r0319J59779K86844j12078r2832J05787r9339R7048M2406
7244h4687Q2653L2298j42454J37659J35667P741j32114j38316L2186K28123r6668
7233F2088k00001K44446k03194l16811K17186J12056J59430J13126M9953j05993
7223A32286m8710J9613j6546P7679j11887j51930m2129N8348J09809n1123K19553
7212A94963Q1274j67225J81401L0070k42997J74923k18903j30303J27341K3033
7202E3577n0713l12020K24088L9558J7311J55335j59977J58789J32820N4822j29438
7191A84152Q8534k66824n9274J77459j49324M5582J46975j95847Q4099L54751
7181D10283q2880j76556N1311J68553j26819k3166J70985j49146r2178K8353Q8915
$$ y = [-37465, -190396, -381983, -472302, -312523, -25679, -137757, -230589, -124802, -224141, -127093, -84687, -2034, 30264, -112190, 25469, 161136, 168877, 36763, -101553, -69367, 158756, 62088, -137913, 106533, -96661, -413472, -196286, -84230, 75200, 188326, 238279, 132286, 83576, 103189, 86643, 164322, 52435, -99495, -141624, -83276, 26533, -24590, 194963, 276237, 109012, 290413, 320483, 77486, 252409, 33506, -96797, 30544, 53577, 2864, -309156, -85068, -45510, -28199, 127136, -32841, 125948, 258768, 313590, 184152, 272686, 5862, -53412, 124047, -25277, 20305, 167280, -28567, 55532, 410283, 327403, 150847, 202158, 370711, 243892, 220726, 391711, 242565, 150387, 178740, 267655]
7170B67655Q5013P4351q124L8679K11502k46664l89752m1807q9909K47752l5884
7159A12812L2208Q128m7722q7315J82066K27844j97619j62707L1720O6012r2716
7148G2711r371J33038J92121J42244J23248k07776O1022J95035k05922k07794
7138B88556k1655k4161M1078N315M8824J95572K0916j39822l1526J96301j37212
7127D42186j76509K29830J15403K9504j0612q3840P0790P3515j89731k3325J5725
7116D92936J95386j26348J7554j34034J01947J31720K6623k46186K8569m9816
7106D38351R6475R6012M7542k91524K15120O4212M5032q0714p366P0215j11438
7095E81917o968n3471K08820N3364q2577n7595J47536j06711k1880N9856j70991
$$ y = [267655, 352668, 427019, 418895, 457574, 669076, 422412, 32660, -9147, -99056, 148696, 112812, 145020, 153148, 105426, 18111, 200177, 428021, 230402, 67695, 99415, 165427, 72711, 63340, 196378, 388499, 530743, 653991, 446215, 507237, 702272, 496350, 288556, 266901, 242740, 283818, 289133, 337957, 533529, 554445, 414623, 383097, 579398, 442186, 265677, 495507, 610910, 640414, 629802, 545962, 616752, 690267, 500536, 477211, 492936, 688322, 561974, 579528, 445494, 547441, 679161, 705784, 459598, 488167, 438351, 534826, 630838, 678380, 386856, 601976, 666188, 711220, 630506, 623140, 693355, 581917, 574949, 521478, 730298, 783662, 701085, 643490, 791026, 684315, 662435, 722291, 551300]
7084E51300J18457J65083Q7513j93671j08021J38682q2401K80329J83884n2562
7074A088593R4565J16788j81830j36189m9096K07539k6006r0940N5443J11354
7064A190221o6176J46926j36999p9261J04413J417L08430K6628J97106j6085L0330
7053A706950J72300J93J28498j21626M074N8510J88997Q2799K04307l8566L6066
7042B422502K44564J70398j50291j54404K04097Q3702J09417Q7553J72749J85474
7032C375761L12900n2536N0605l6980j5112J87888K55359K65933J52109J42475
7022D638402J19945K31621L05578K07704J6394K08547l7641J28425j45014L98194
7012F072155K60454J94802J84319N77972K57912L90193J90171M42392N24929N17509
$$ y = [551300, 669757, 834840, 922353, 728682, 620661, 759343, 676942, 957271, 1141155, 1088593, 1183158, 1299946, 1118116, 981927, 932831, 1140370, 1114364, 1023424, 1078867, 1190221, 1124045, 1270971, 1133972, 1054711, 1159124, 1160541, 1468971, 1495599, 1692705, 1676620, 1706950, 1879250, 1879443, 2007941, 1886315, 1890389, 1948899, 2137896, 2220695, 2425002, 2386436, 2422502, 2667066, 2837464, 2687173, 2532769, 2736866, 2820568, 2929985, 3017538, 3190287, 3375761, 3688661, 3636125, 3686730, 3649750, 3634638, 3822526, 4077885, 4343818, 4495927, 4638402, 4758347, 4989968, 5295546, 5503250, 5519644, 5728191, 5690550, 5818975, 5673961, 6072155, 6332609, 6527411, 6711730, 7289702, 7547614, 7937807, 8127978, 8570370, 9095299, 9612808]
7002I612808O59447K69297O36683L67758O81923Q21225Q70383Q58681Q49899J666247
6992A7294351J319527J866859K212893K978465L856173M072727M826243N532110
6984D3959348O455891P549443R507421J1813509J4728221J7310150J7213376J3209525
6976A41746884M808730n637395j4541411j8722274j8223187j5492757j1712452
6969F2226138r238431o584787n126337m134950l549237k964254k786271j971814
6961B5870057k071766j630604j693395j722405j242571j217331q89595r57174
6953A4445216o90319q65182q51395n10391l34736m20255l83910n67146m53054
6944I368828n53507k03646l84745l81377q7646j80303m54961n25764j04066q7274
$$ y = [9612808, 10272255, 10541552, 11178235, 11545993, 12227916, 13049141, 13919524, 14778205, 15628104, 17294351, 18613878, 20480737, 22693630, 25672095, 29528268, 33600995, 38427238, 43959348, 50415239, 57964682, 67472103, 79285612, 94013833, 111323983, 128537359, 141746884, 146555614, 140918219, 126376808, 107654534, 89431347, 73938590, 62226138, 52987707, 46402920, 41276583, 37141633, 33592396, 30628142, 27841871, 25870057, 23798291, 22167687, 20474292, 18751887, 17509316, 16291985, 15402390, 14445216, 13754897, 12889715, 12038320, 11527929, 11193193, 10772938, 10389028, 9821882, 9368828, 8815321, 8611675, 8226930, 7845553, 7757907, 7577604, 7122643, 6596879, 6492813, 6405539]
6934F405539l94730l17545k31625k81535k13602l69510L5607j24211j96886m53196
6924C858306O3102j61884k06027k15830J06904R216q6461L4265j24133M3990j66574
6913C154874k95611N2841N9748j54512q5871J08149Q5150k36738j03548j48614
6903B435868q7458L8317k16107j70392J70683j4420k52827J03204J46775j57459
6893A996184j66779p4347j13755l9899Q9005J2724j71907j88120N0616N0249J36997
6882A580968l56480r3336J39430l8174j16082J66202M1625o0741l11846q7385
6872H64181K12652Q3572J188J6627p3021Q975j06001r5015R151J35503j21049
6861I36763k67874J88625R0547n2078k12862l472J179j31698n6472j9805O599
$$ y = [6405539, 6010809, 5693264, 5461639, 5180104, 4966502, 4596992, 4632599, 4508388, 4311502, 3858306, 3921408, 3759524, 3553497, 3337667, 3444571, 3453787, 3367326, 3401591, 3277458, 3321448, 3154874, 2859263, 2912104, 2971852, 2817340, 2731469, 2839618, 2924768, 2688030, 2584482, 2435868, 2348410, 2386727, 2170620, 2000228, 2170911, 2156491, 1903664, 2006868, 2153643, 1996184, 1829405, 1755058, 1641303, 1601404, 1690409, 1703133, 1531226, 1343106, 1393722, 1443971, 1580968, 1224488, 1131152, 1270582, 1232408, 1116326, 1282528, 1324153, 1263412, 951566, 864181, 1076833, 1160405, 1161593, 1178220, 1105199, 1114174, 1008173, 913158, 922309, 1057812, 936763, 668889, 857514, 948061, 895983, 683121, 679649, 680828, 549130, 492658, 472853, 479452]
6850D79452J84109J03478k35331k1816M7565Q3973K8930Q3733J72630j24864p8922
6839G22937m9642j57989n4351J67366j01909j53210l5764J99808N9588k26492
6829C70342j86132k7547K78209P749K33002j18526j11039j78622J47352L1676
6819D46464P0726j82511J26753J06458j29223j35967J37778P2974p6459j84748
6809B52245k90305M46960k29232K30901O0777j93806k74042L24702J64379q2004
6799D10575l69802j6788K35911K0314O9414R282j24301J87653J22458j35468l1596
6788C77652j31016Q4527N1464k24408j47291K15403R8036m9611m57j71543n6638
6777D6118P9494P4779K68074p4597j13700k26183K02995r6305L9827K42897j84572
$$ y = [479452, 663561, 767039, 531708, 509892, 557457, 641430, 670360, 754093, 926723, 801859, 722937, 673295, 515306, 460955, 628321, 526412, 373202, 337438, 537246, 596834, 370342, 184210, 156663, 434872, 442621, 675623, 557097, 446058, 267436, 414788, 446464, 517190, 334679, 461432, 567890, 438667, 302700, 440478, 513452, 436993, 252245, -38060, 408900, 179668, 410569, 471346, 277540, 3498, 328200, 492579, 410575, 40773, 23985, 259896, 280210, 349624, 358906, 234605, 422258, 544716, 409248, 377652, 246636, 331163, 382627, 158219, 10928, 226331, 324367, 274756, 274299, 102756, 46118, 125612, 200391, 468465, 393868, 280168, 53985, 256980, 160675, 200502, 443399, 258827]
6766B58827j54226M9076Q9116j04880k0426o2337j09047P2755J9162j60542J20815
6755a707K05397L9381K3454j34212l2179J37915P9990j8719O2521N2278k9867
6744C84252j59501J4705j22475R1478o8586j7240J50343J26362J2998J0524j16533
6733C06327j11324J62129M1574j00586K7270N2132k87849J0499J46462L7520Q1755
6722C65909j91686p9966J79654j00222j01212J33888L8773N3743L30358k43281
6712C85958J31154O7609q6073j37965o6806j21931J00320k8372j12178j717J47514
6701B77513q2951q5363l4978K38357J11842k48234r390N4631j17986J10991K9015
6690B43447O9646K3633o7656k1295j65781k4019j28991l6585Q1946N2388j92312
$$ y = [258827, 104601, 153677, 242793, 137913, 117487, 55150, -53897, 18858, 38020, -122522, -1707, 203690, 243071, 266525, 132313, 100134, 238049, 318039, 299320, 361841, 414119, 384252, 224751, 239456, 116981, 208459, 139873, 122633, 272976, 399338, 412336, 422860, 306327, 195003, 357132, 398706, 298120, 325390, 377522, 89673, 100172, 246634, 284154, 365909, 174223, 94257, 273911, 173689, 72477, 206365, 245138, 298881, 629239, 385958, 517112, 584721, 498648, 360683, 293877, 171946, 272266, 243894, 131716, 129999, 277513, 194562, 109199, 74221, 312578, 424420, 176186, 166796, 221427, 103441, 214432, 243447, 313093, 336726, 269070, 247775, 81994, 57975, -71016, -107601, -25655, 26733, -165579]
6679a65579q6509K76041J2896J82688Q4670O156j3301p4320j29922j78573J77235
6668I1482Q3976k2367k39917K00596J14389l7072r2398m3146J14406j69351R3705
6657I4303j45829M9418K30875j64800N1672o1524j07531J62447K43438k77081
6647G5388j43919K18388L6662r067q8905q1061P6831j8420Q7363n196P7998j28794
6635I7268O9680k09445p3623J19483M820K01794j52128R2901J83400k29947K44536
6624C48739j59482J40331J29801R0604o8216J71888L43860k27622J4610Q23M492
6613G89828M4569O381j01870k2737q2074j21059j60733r4719p306p1306k22593
6602d3619K91315J36445k10680P0406M0686k1980m0868q1095j9571N1084j4171
$$ y = [-165579, -252088, 23953, 36849, 219537, 304207, 310363, 297062, 222742, 92820, -85753, 91482, 175458, 153091, -86826, 113770, 228159, 191087, 98689, 55543, 169949, 598, 94303, -51526, -2108, 228767, 63967, 115639, 54115, -53416, 109031, 352469, 75388, -68531, 149857, 186519, 177452, 88547, 7486, 84317, 65897, 153260, 148064, 226062, 97268, 166948, -42497, -116120, 3363, 8183, 209977, 57849, 150750, 334150, 104203, 348739, 189257, 329588, 459389, 549993, 481777, 653665, 997525, 769903, 784513, 785336, 789828, 834397, 840778, 738908, 716171, 634097, 513038, 352305, 257586, 250280, 178974, -43619, 247696, 384141, 173461, 243867, 284553, 262573, 221705, 140610, 121039, 172123, 157952]
6591A57952k42180L96482j80452k10646K02257m0230J7606p4578o005Q1082n694
6580I5594j31509J25368O6525k345p7645L8705j21474o2139K6991Q5047K2727
6569F5845N2939j07358n3502n5891L18797l96111q7465K93984J40728R136j66331
6558A4771k56081J04438L87712k11022j77813J90248o3175m8501m8386M418J4558
6547h8833l0492L31304M2401l6777k81442J8262L0941K44439l02527r9755L44710
6536A72231p6268l777P8892j63343J89349K4884j4944q8424o8437o1131p0504
6525h1472q0399j9761K60369j9864p4439m3578j3355R3812p9485J6314K24247
6514A82389o3665q4300J54972K9710k3234k59037J07964l70180J31963P6457j28362
$$ y = [157952, -84228, 312254, 131802, -78844, 123413, 83183, 100789, 26211, 20206, 101288, 95594, -35915, 89453, 155978, 153633, 75988, 114693, -6781, -68920, -41929, 43118, 65845, 118784, 11426, -42076, -97967, 220830, -175281, -262746, 31238, 171966, 181102, 14771, -241310, -136872, 250840, 39818, -137995, 52253, -10922, -59423, -107809, -103391, -88833, -119325, 211979, 254380, 217603, -63839, -45577, -14636, 229803, -72724, -172479, 172231, 95963, 92186, 171078, 7735, 197084, 221968, 207024, 118600, 50163, -10968, -81472, -161871, -181632, 78737, 58873, -15566, -59144, -72499, 21313, -58172, -41858, 182389, 118724, 34424, 189396, 219106, 195872, -63165, 44799, -325381, -193418, -116961, -245323]
6503b45323R2085K03461L4841P8423Q8693j44122q907q3992J59687J49338j97482
6492A26702j29436j54904q5501K51757j52876n3818K72520K4615M2971k497l02028
6481a62495q177K3651J08001K05611q2393k27604Q5861K55658j42520J0659o3665
6470B587k72907K23652K31135j30470K8042k3691k02611j07968m1022j4267K14919
6459i2601K94595J05104M8614j70287K44103R230O354j00510l64680L2763J30389
6448A43074j06553P3573j22409j39060J68583L3467J29490p5518M9842J21401
6438B75890l9172j42470k11917Q7316J84102K65047l35409M2595q0026j10145
6428f4189P0933J70551M1732j94559J57399k9661k02597N9214J33151Q6712Q8021
$$ y = [-245323, -153238, 50223, 85064, 163487, 252180, 108058, 99151, 15159, 174846, 324184, 126702, -2734, -157638, -243139, 8618, -144258, -198076, 74444, 99059, 142030, 139533, -162495, -170672, -147021, -39020, 166591, 84198, -143406, -57545, 198113, 55593, 66252, 2587, -270320, -46668, 184467, 53997, 82039, 58348, -144263, -252231, -293253, -307520, -92601, 201994, 307098, 355712, 185425, 429528, 438758, 445112, 344602, -20078, 12685, 143074, 36521, 110094, -12315, -151375, 17208, 50675, 180165, 104647, 154489, 275890, 236718, 94248, -117669, -30353, 153749, 418796, 83387, 125982, 45956, -64189, 6744, 177295, 219027, 24468, 181867, 152206, -50391, 8823, 141974, 228686, 316707]
6417C16707j11225Q0760l0192j34972J80427o1768l5574J76951k88085j10499
6407a7470j01113K8100J49367J09880J42824n08541L7792K49663J28631J28336
6397C47469l2938j69098k28708l3267K45387J06327p8338M8144O5231j17021j7746
6386A35442K08127r9578k40176Q754n7524J47523J41203j94361p098l0486O7769
6375G9595o9759J36645J02631J16696j70323l05475L6323J69602l8024n4878L19776
6364C22809j92251K556J95162L8114k09587R9529K7296k18124J76797J85402j44871
6353B82832R0937o9669j03507K7896j15223J01558L1758n9123J21298j32333J37192
6342C13616j62392J8918K8227L9563J14518P6967N7512j12203J6979Q8990J80714
$$ y = [316707, 205482, 286242, 256050, 121078, 301505, 239737, 204163, 381114, 93029, -17470, -118583, -90483, 58884, 168764, 311588, -196953, -159161, 90502, 219133, 347469, 314531, 145433, -83275, -116542, 128845, 235172, 156834, 204978, 270209, 153188, 135442, 343569, 243991, 3815, 12569, -44955, 102568, 243771, 49410, 42312, 11826, 79595, 9836, 146481, 249112, 365808, 195485, -109990, -73667, 95935, 57911, 3033, 322809, 130558, 133114, 328276, 366390, 156803, 256332, 283628, 65504, 242301, 427703, 282832, 373769, 304100, 200593, 228489, 113266, 214824, 246582, 187459, 308757, 176424, 313616, 151224, 170142, 198369, 237932, 352450, 429417, 486929, 374726, 391705, 480695, 661409]
6331F61409J00660m9277o2250j49M9060l7223j19896R5152M2972k68111K4991
6320D37338M43936j24619k72873k34631J10841o8649M4165J1921j29707J59455
6310C77177J68607j9939K59120j10542r8936j79433J31597O9445N0663N5962l1176
6299F72545k6830P3390J15327M7252k3919m4292k20389P0762j01478k09892J43193
6288D95669J53491o9748r0286r3191j0444M7438N0563j34073J9445l8140L41992
6277F72716m5680l85J8347J57936l0886Q6039J41860j31160m8187N1302j52830
6266G19072J8088j93356R1797J61200R6429n3178l06369k4670J70860J98938j79822
6255F98989m8999l8486k106J68266K43904j8608K36596J03090J59469k13456p1809
$$ y = [661409, 762069, 712792, 650542, 650393, 699453, 662230, 542334, 637486, 680458, 412347, 437338, 881274, 756655, 483782, 249151, 359992, 291343, 335508, 347429, 217722, 377177, 545784, 525845, 784965, 674423, 575487, 396054, 527651, 597096, 647759, 703721, 672545, 645715, 719105, 834432, 881684, 857765, 813473, 593084, 663846, 562368, 352476, 495669, 649160, 579412, 489126, 395935, 385491, 432929, 483492, 349419, 368864, 330724, 672716, 627036, 626651, 644998, 802934, 772048, 858087, 999947, 868787, 820600, 871902, 719072, 737160, 543804, 635601, 796801, 893230, 840052, 533683, 509013, 679873, 878811, 698989, 649990, 611504, 609398, 777664, 1021568, 1002960, 1239556, 1342646, 1502115, 1288659, 1216850]
6244A216850k27590j30110J47832P8298j40431n3681j53038J30091j72623m36
6234F95162m0900j29645O0025K962m0617K80410J1734R3975k9697p3209K69193
6223A099393L4352n8593P353m2735O7785j25744P3161r8427o8089K4149n7913
6212H54692m5853J67056k19413K836J33669K2370j55504O0094J06250k80130M3156
6201F89223R5669n1063P044L1819J97024N4873k66462J08290n4365M1539M6156
6190H99747k24189J81709K36245m35283J34313K70637j20983j6867j1346N2020
6180I66003K857o3177J75989L4381l6898p9960l5931O0630q8569K61508P9021
6169A275854K7861j21302O6858L0005l529k7485K6981N6885L6709p1495K01565
$$ y = [1216850, 989260, 859150, 1006982, 1085280, 944849, 891168, 738130, 868221, 695598, 695162, 654262, 524617, 584642, 587604, 546987, 827397, 839131, 933106, 903409, 830200, 1099393, 1133745, 1075152, 1082505, 1039770, 1107555, 981811, 1054972, 956545, 888456, 912605, 854692, 808839, 975895, 756482, 759318, 892987, 915357, 759853, 819947, 926197, 646067, 689223, 784892, 733829, 740873, 772692, 969716, 1024589, 758127, 866417, 812052, 853591, 899747, 675558, 857267, 1093512, 658229, 792542, 1063179, 942196, 925329, 913983, 966003, 968860, 905683, 1081672, 1116053, 1079155, 999195, 963264, 1023894, 935325, 1196833, 1275854, 1303715, 1182413, 1249271, 1279276, 1275747, 1248262, 1275243, 1332128, 1368837, 1297342, 1498907]
6158A498907J99352Q4105l00284R240J89046J35531m7482j5776J22224L4931Q5315
6147A995109l49503k7270J79749J15186j03666O8270J26903M7323R9424r8279
6137B053246K75616P4895j54082K46991j09533J23650q9383O083J96117J82386
6127B805986j34852K18886J88127L8201q7556k9081p6167L4357Q930j67733j5479
6116B783619Q8880P4817K06926o7155J35419l9782K11100j08226j6754j64197
6106C104647Q0256L93208J42301K5798k00373J49070J68017K21815P4496J27006
6096D286241J32878L47075L7988J04514l9097J6942K35310J1202r4258N462L1971
6085E076228J78169J54503K17647J32885K05966J25297j12013L72967K00553L13247
$$ y = [1498907, 1698259, 1782364, 1482080, 1491320, 1680366, 1815897, 1768415, 1752639, 1874863, 1909794, 1995109, 1645606, 1618336, 1798085, 1913271, 1809605, 1877875, 2004778, 2052101, 2151525, 2053246, 2328862, 2403757, 2249675, 2496666, 2387133, 2510783, 2421400, 2427483, 2623600, 2805986, 2671134, 2890020, 3078147, 3116348, 3028792, 2999711, 2923544, 2957901, 2966831, 2799098, 2783619, 2872499, 2947316, 3154242, 3087087, 3222506, 3182724, 3393824, 3285598, 3268844, 3104647, 3184903, 3578111, 3720412, 3746210, 3545837, 3694907, 3862924, 4084739, 4159235, 4286241, 4419119, 4766194, 4804182, 4908696, 4869599, 4886541, 5121851, 5133053, 5038795, 5044257, 5076228, 5254397, 5408900, 5626547, 5759432, 5965398, 6090695, 5978682, 6351649, 6552202, 6865449]
6075F865449J86134J92478M84561K89737J62227L85170L79365P71703M78022Q51707
6065A1046553M89452R09963J297388J096528J650947J869146K070020K818929
6057B3248926L377576M160310M069772K392638q44086l576977m002704l385199
6049B5440256k364253j477913p41586q82191m13396j46851k3084K21887N71168
6040B0184037O60573R20723J415525J900155J862900K652722K794997L264221
6032C5655853L886874M669704N866449Q009929R696262J2019043J2044535P385352
6024I9234001l030785j1802146j3063669j1994819q123736n607498l807972k885996
6016C8917380k260230j561651j037741q52074k73112p1448K55695P35260J190906
$$ y = [6865449, 7051583, 7244061, 7728622, 8018359, 8180586, 8565756, 8945121, 9716824, 10194846, 11046553, 11536005, 12445968, 13743356, 14839884, 16490831, 18359977, 20429997, 23248926, 26626502, 30786812, 34856584, 37249222, 36405136, 32828159, 28825455, 25440256, 23076003, 21598090, 20856504, 19974313, 19560917, 19414066, 19390982, 19612869, 20184037, 20844610, 21765333, 23180858, 25081013, 26943913, 29596635, 32391632, 35655853, 39542727, 44212431, 50078880, 58088809, 67785071, 79804114, 91848649, 99234001, 96203216, 84401070, 71337401, 59342582, 51218846, 45611348, 41803376, 38917380, 36657150, 35095499, 34057758, 33205684, 32932572, 32861124, 33116819, 33852079, 35042985]
6007C5042985J634958K042697K717046L139076L685030M769520O012171P772248
5999F6815731R589306J2106005J2227030P491857k266034j1440894j3227161j2266663
5991F9029177q406145n528438l712091k934438j815305j041261k83238q1206P95350
5982D6022405M69904J116075J636464J724003K697809L188970M119930N126422
5974F6101982O085741P606512Q527959R380303Q502542N126328J097690k817358
5966A09611699p187740r403919q772398p083927m574835k980314j759507p28673
5958F7120386L29869J198348J253725J175062J902826K651335M274965N074570
5950H4981086O628779Q903320J1224977J3565004J4784866J1817714M292225o221041
$$ y = [35042985, 36677943, 38720640, 41437686, 44576762, 48261792, 53031312, 59043483, 66815731, 76405037, 88511042, 100738072, 108229929, 105963895, 94523001, 81295840, 69029177, 60623032, 55094594, 51382503, 48448065, 46632760, 45591499, 45308261, 45227055, 46022405, 46492309, 47608384, 49244848, 50968851, 53666660, 56855630, 60975560, 66101982, 72187723, 79794235, 88322194, 97702497, 106205039, 111331367, 112429057, 109611699, 102423959, 93020040, 84247642, 77163715, 72588880, 69608566, 67849059, 67120386, 67450255, 68648603, 69902328, 71077390, 72980216, 75631551, 79906516, 84981086, 91609865, 100513185, 111738162, 125303166, 140088032, 151905746, 156197971, 149976930]
5942A49976930j4120168j6804506j5758559j2491665r372843o432976m944465
5935G0051748l806210k644016k190366j660238j085195p56467l22230q3081K45037
5926E7748982J054703J790550K880264M097622N361757O140730O512581M552471
5918I0139660K80265m958971q293884r110413p900467o348538m854504m190653
5910D4762495l138652k781216k502231k056859j669205j596483j285934j087744
5902B8644171r38858r11953p39189o80131n24244k98809k94879n03871l94016
5893B3358221m03917j55260J05580q1056L96000j29863L9756j11387r993n9714
5883B2948367j40673k12456l07068j56920P8241K88211Q9916O89397N63632M18235
$$ y = [149976930, 135856762, 119052256, 103293697, 90802032, 81429189, 74996213, 70051748, 66245538, 63601522, 61411156, 59750918, 58665723, 57909256, 57587026, 57503945, 57748982, 58803685, 60594235, 63474499, 67572121, 72933878, 79074608, 85587189, 90139660, 90419925, 85460954, 77167070, 68056657, 60156190, 53807652, 48953148, 44762495, 41623843, 38842627, 36340396, 34283537, 32614332, 31017849, 29731915, 28644171, 27705313, 26793360, 26054171, 25374040, 24849796, 24550987, 24256108, 23752237, 23358221, 22954304, 22799044, 22904624, 22823568, 23219568, 23089705, 23129461, 23018074, 23008081, 22948367, 22807694, 22595238, 22288170, 22131250, 22209491, 22497702, 22587618, 23277015, 23840647, 24258882]
5873B4258882P10407R05016Q16124J337559J491549J600472K060607K607593K840130
5864C8628339L082191M050016M366504N402073O185726O862687O921196N653499
5856H1152231K914689o35895m053217n542775n247354m500733l679430k859043
5848E7548473j835529q03550m52639N05953J024690J762791K366712L681177L930938
5839F7729016M576317O077127P177812R088053J1034662J3031647J4046234J2588543
5831A45349411P159335j715272r430824j3522663j4271219j2075673r947435q174983
5823H3370677o444743n072215m358948k876501k382461j444878j259794r24855
5815E8606282j36667K91556R16955J631483K743887L611696M581900N692074N419714
$$ y = [24258882, 24969289, 25874305, 26690429, 28027988, 29519537, 31120009, 33180616, 35788209, 38628339, 41710530, 45760546, 50127050, 55529123, 61714849, 68577536, 75498732, 81152231, 84066920, 83431025, 79377808, 73835033, 68587679, 64086946, 60407516, 57548473, 55712944, 54909394, 54456755, 54962708, 55987398, 57750189, 60116901, 63798078, 67729016, 72305333, 78382460, 85560272, 94648325, 105682987, 118714634, 132760868, 145349411, 152508746, 150793474, 141362650, 127839987, 113568768, 101493095, 91545660, 83370677, 76925934, 71853719, 67494771, 64618270, 62235809, 60790931, 59531137, 58606282, 58469615, 58761171, 59678126, 61309609, 64053496, 67665192, 72247092, 77939166, 83358880]
5806H3358880L309030n3471l681125o719554p628578p130436o294790n018130
5798E0141826m377497l553395k895830k674867k661528j985853j370584j765392
5790B8856880j893929j539945j405641j316812j545310q54884o66117q02771p40480
5781A8090991n48036p12510m42445l72910n30186l33843m15789n39566l58662
5772A3837044l95251l51820l36137m09676n61977m10992m09513n19366j82341
5763A0259971j54646l54858j40504o7404l12452n3106L0345L22685M2853J05656
5753I678540p0745j19816l2845j02207l31633m61946k23461m10951l48735m34710
5743G141491j07836k94812j06221q8752l52482q7858j52043l04344l14142J99086
$$ y = [83358880, 86667910, 86614439, 82933314, 76213760, 68585182, 61454746, 55159956, 50141826, 45764329, 42210934, 39315104, 36640237, 33978709, 31992856, 30622272, 28856880, 26962951, 25423006, 24017365, 22700553, 21155243, 20300359, 19634242, 18831471, 18090991, 17542955, 16830445, 16388000, 16015090, 15484904, 15151061, 14735272, 14195706, 13837044, 13441793, 13089973, 12753836, 12344160, 11782183, 11371191, 10961678, 10442312, 10259971, 10105325, 9750467, 9609963, 9542559, 9230107, 9177001, 9207346, 9530031, 9572884, 9678540, 9607795, 9487979, 9455134, 9352927, 9021294, 8559348, 8335887, 7924936, 7576201, 7141491, 7033655, 6738843, 6632622, 6543870, 6191388, 6103530, 5951487, 5647143, 5333001, 5532087]
5733E532087j11545j21525R9978l5178L9172Q7029J68377k85549J66755K81664
5723E821265m35176l68696j16574j79498j79951k01373k91258J89063j82669j47181
5713C907952J08170j91758n389j70606m8378k60951k83906j49595j42753J68883
5703B931669J67416j42023j16553k84876J15418N1841j5448K38565j45829Q7467
5693B887647J3114o4729J17261P25j70819K28657J97950j62989k06475j87123
5683B653219p9934j20497J22661j93659j38422j44383Q1204Q0258o1251N2788
5673B251984o6906J04049r4767K05309K06139j74764l7034J75402R8995P8622
5663B747029J90212N3574m03398J72649k3775Q1470r9047p9021P1953k76865K7104
$$ y = [5532087, 5420542, 5299017, 5398995, 5363817, 5402989, 5490018, 5658395, 5372846, 5539601, 5821265, 5386089, 5017393, 4900819, 4721321, 4541370, 4339997, 4048739, 4237802, 4055133, 3907952, 4016122, 3824364, 3818975, 3648369, 3599991, 3339040, 3055134, 2905539, 2762786, 2931669, 3099085, 2957062, 2840509, 2555633, 2671051, 2722892, 2707444, 2946009, 2800180, 2887647, 2900761, 2836032, 2953293, 2954018, 2783199, 3011856, 3209806, 3046817, 2840342, 2653219, 2573285, 2452788, 2575449, 2381790, 2243368, 2098985, 2180189, 2260447, 2199196, 2251984, 2185078, 2289127, 2194360, 2399669, 2605808, 2431044, 2394010, 2569412, 2668407, 2747029, 2937241, 2990815, 2587417, 2760066, 2736291, 2817761, 2718714, 2639693, 2711646, 2434781, 2461885]
5652B461885J6786n9983J33833q1366l5252n5628j5228O434L71683Q6042J51571
5641B980777o535j44532M52226j10262K88189p7205q8061J76781q49j67373j17424
5630C185732k8837M9795j85058k49272P6178R9227k59814k24766N4141j97732
5620B319594q1664J48486P1096k19868r377K47140K9495m7235J46285R2781o2637
5609B634096k07331J51610M0820q7141j37874N0419P4331p3369O5126K95908j5855
5598B790740k15500k12798o2988j01222k95347k04145r9808r6225J32061j83185
5588A451583j81561K30453J32155J15659l47334p4006J12093j34063m9724J0603
5578A265858j29205n3008N6701J11893J94203j98014p9372q229K8524J5355j02297
$$ y = [2461885, 2478671, 2418688, 2552521, 2471155, 2435903, 2380275, 2365047, 2371481, 2743164, 2829206, 2980777, 2974242, 2829710, 3281936, 3171674, 3459863, 3382658, 3294597, 3471378, 3470529, 3303156, 3185732, 3156895, 3206690, 3021632, 2772360, 2848538, 2947765, 2687951, 2463185, 2517326, 2319594, 2237930, 2386416, 2457512, 2237644, 2228267, 2475407, 2504902, 2457667, 2603952, 2696733, 2634096, 2426765, 2578375, 2619195, 2532054, 2394180, 2444599, 2518930, 2445561, 2510687, 2806595, 2790740, 2575240, 2362442, 2299454, 2198232, 1902885, 1698740, 1598932, 1502707, 1634768, 1451583, 1270022, 1500475, 1632630, 1748289, 1400955, 1326949, 1439042, 1304979, 1255255, 1265858, 1136653, 1083645, 1140346, 1252239, 1446442, 1248428, 1169056, 1160827, 1189351, 1204706, 1102409]
5567A102409k4311J701K1377J51624J09733m6796O4038j46498M1747M2902j46977
5556A170949k9514J90203O377l59015K0335o2512J9987N4385R8515R5402k62803
5545I42309K31221O4142j25683r4609K80219J17592k26038k40223M1507K34189
5535A224626Q3343K08046Q4928n8700j4222L826k47867M9597l0748q8784j54614
5524A059431j50396Q7584j53206L2086J9275j81276Q7392K166K47978R2983k52084
5513H91933M0872m2245J19648l1077m3634J0003K1164j1042J7869J37954R0945
5502A202390j95649j61439k46367J14724R5154l4091l05087J48936J48685q1187
5492F86069m6128k03020R3002K57125k49672L03140N7411j23179j51780j0127
$$ y = [1102409, 1078098, 1079799, 1101176, 1252800, 1362533, 1315737, 1379775, 1233277, 1275024, 1317926, 1170949, 1141435, 1331638, 1338015, 979000, 999335, 936823, 956810, 1011195, 1109710, 1205112, 942309, 1173530, 1237672, 1111989, 1017380, 1297599, 1415191, 1189153, 948930, 990437, 1224626, 1307969, 1516015, 1600943, 1542243, 1528021, 1531847, 1283980, 1333577, 1302829, 1214045, 1059431, 909035, 996619, 843413, 875499, 894774, 713498, 800890, 803056, 1051034, 1144017, 891933, 932805, 890560, 1010208, 979131, 935497, 945500, 966664, 955622, 973491, 1111445, 1202390, 1006741, 845302, 598935, 713659, 808813, 774722, 469635, 618571, 767256, 686069, 639941, 436921, 529923, 787048, 537376, 840516, 897927, 774748, 622968, 612841]
5482F12841r8313L3909J95131k9936k40191j33399K20386m7036N6327Q9777J1552
5471F71048P4311q4749J14912j08674K7496K62763M324l2804K6499j37006p6234
5460G41886o9039O5831J4970j16912P8724Q9578k9031J3891j2205j27989K02972
5449H52676j22263J33772m6952K3318k16985K20038J9181L189M2234j41771J32487
5438H98924M8029P1464J34969q7725O4061J96226k0703k22192k608L9077K91529
5427A411051J25834J99296N4067m1225N4614L09267J38521K26901L67635M16914
5417C262875l52033j27292k17035K8397j70778j17559n8551j0709K62957l49966
5407B150306K05265l5311o5476n0752j03014L2711J77299M36216K38194J67465
$$ y = [612841, 514528, 548437, 743568, 713632, 473441, 340042, 560428, 513392, 569719, 659496, 671048, 745359, 660610, 775522, 666848, 694344, 957107, 961431, 928627, 955126, 818120, 741886, 672847, 738678, 753648, 636736, 715460, 805038, 776007, 789898, 777693, 649704, 852676, 730413, 864185, 817233, 840551, 623566, 843604, 862785, 865974, 908208, 766437, 898924, 946953, 1018417, 1153386, 1065661, 1129722, 1325948, 1305245, 1083053, 1080445, 1119522, 1411051, 1536885, 1736181, 1790248, 1749023, 1803637, 2112904, 2251425, 2478326, 2845961, 3262875, 2910842, 2783550, 2566515, 2594912, 2424134, 2306575, 2248024, 2237315, 2500272, 2150306, 2355571, 2320260, 2254784, 2204032, 2101018, 2133729, 2311028, 2747244, 2985438, 3152903]
5397C152903J58763L07515K08445M17882L70193O5531M42757J76189l18144n02656
5387D479378m87198j36572n23150n34011r4349r7523k62515q5183K15454j42392
5377B331939O2120L4200N3843Q7197k5556Q3404q926j55751J69551J88629L13542
5366C134192M51458J27820p1975j02062k02019m04321j42723j49443k60442j40296
5356B240189Q946j15257k94223J66554K24651o3802k22137P6226r8753j11689
5346A810705K5800J04206n55j95626O2726j60217J74150j14532k71324J67507
5336A602840J59212L40168N2954k22109k11603P1736M1184L60139Q8834K0459
5326B303814N1650L11277P6464K80901K86997o6815Q9272N40372M08200N68682
$$ y = [3152903, 3311666, 3619181, 3827626, 4245508, 4615701, 4681232, 5123989, 5300178, 4982034, 4479378, 3992180, 3855608, 3332458, 2798447, 2704098, 2606575, 2344060, 2258877, 2474331, 2331939, 2394059, 2428259, 2482102, 2569299, 2543743, 2627147, 2618221, 2462470, 2632021, 2820650, 3134192, 3585650, 3713470, 3641495, 3539433, 3337414, 2933093, 2790370, 2640927, 2380485, 2240189, 2249135, 2133878, 1839655, 2006209, 2230860, 2167058, 1944921, 2021147, 1922394, 1810705, 1836505, 1940711, 1940156, 1744530, 1807256, 1647039, 1821189, 1706657, 1435333, 1602840, 1762052, 2102220, 2155174, 1933065, 1721462, 1793198, 1834382, 2194521, 2283355, 2303814, 2355464, 2666741, 2743205, 3024106, 3311103, 3244288, 3333560, 3873932, 4282132, 4850814]
5316D850814O34363L59487K58040k2670n67215m15017n16133j53839N524o1770
5306D371584J5929l1048r8638J44657Q8871J00552K48565K76265n6993M8122J13797
5295E221663M39259P31132K75590P07499P56662Q34593Q77904Q45358J55280l82115
5285A0462825q74507p51163q53820n74221l50926j92698k74234p3724l5027p9317
5275F403188m72634k78006N1206k35537l23252J94969j96692m8583K03579M4751
5265E342989L15860M08142N99095K22374L16164J34992j87302o19425n03546k80780
5255E748563l84402m28879n00664r455q4156j54843J9437j90146l9530j59663
5245C816262j80213n2599j95837k09275J62930m6102m1019R2033K07448P3755
$$ y = [4850814, 5485177, 5844664, 6102704, 6080034, 5512819, 5097802, 4581669, 4427830, 4433354, 4371584, 4387513, 4356465, 4257827, 4402484, 4491355, 4591907, 4840472, 5116737, 5059744, 5107866, 5221663, 5660922, 6392054, 6667644, 7375143, 8131805, 8966398, 9844302, 10689660, 10844940, 10462825, 9588318, 8837155, 7983335, 7409114, 7058188, 6865490, 6591256, 6517532, 6482505, 6403188, 5930554, 5652548, 5703754, 5468217, 5144965, 5339934, 5143242, 5094659, 5298238, 5342989, 5658849, 6066991, 6666086, 6888460, 7204624, 7339616, 7152314, 6532889, 6029343, 5748563, 5364161, 4935282, 4434618, 4425163, 4341007, 4186164, 4205601, 4015455, 3975925, 3816262, 3636049, 3583450, 3387613, 3178338, 3341268, 3295166, 3254147, 3346180, 3553628, 3627383]
5235C627383j34457L6654J68347L93713M35583L28483k9683K3226k44671k69312
5225D335266l38349l40339l652q8386m2498j92492J47318M4696M85093J28005
5215D134662K97963m2527J2057K23486q7200K19074l5788k82120J10707L3340
5205D583654L1916P7125J51405O07229m1590k79863j70945j95202n10182j66324
5195D087223L0323n343Q2168K02399K69089J29373O98509M76357L64416R28900
5185G263414P25149L14315M8597n47513p58706o90362p50548m32526m08406l83183
5175D380231l7797k91117j24202o0646j17355j1544j24245k390L5692K47980n7547
5164C837060J39659K43528L44584M36570K80933J85026Q99120Q50052Q69442K84595
$$ y = [3627383, 3492926, 3529580, 3697927, 4091640, 4527223, 4855706, 4826023, 4849249, 4604578, 4335266, 3996917, 3656578, 3652926, 3564540, 3522042, 3329550, 3476868, 3521564, 4006657, 4134662, 4432625, 4390098, 4402155, 4625641, 4538441, 4757515, 4721727, 4439607, 4550314, 4583654, 4615570, 4692695, 4844100, 5451329, 5409739, 5129876, 4958931, 4763729, 4253547, 4087223, 4117546, 4112203, 4194371, 4396770, 4665859, 4795232, 5493741, 5970098, 6334514, 7263414, 7988563, 8302878, 8351475, 7803962, 7045256, 6354894, 5604346, 5171820, 4763414, 4380231, 4342434, 4051317, 3927115, 3866469, 3749114, 3737570, 3613325, 3610935, 3646627, 3894607, 3837060, 3976719, 4220247, 4564831, 5001401, 5282334, 5467360, 6366480, 7216532, 8085974, 8370569]
5154H370569j41405o53328m00143o95260o54641o51276m19074j06905p7778l39394
5144D231365k05149j46069N6323j38794k8953j30288M808k484P2441K23292q4409
5133C852083j17974R3613L1413M0647R4175K08005O99441K2297k48193k06067
5123D469440n2715j39232j92136j28328j76202k4590J43049J76046k43348k10492
5113C621492P673j541n8643O5089N639m28393r0645j7444J3690M2983K27566L3912
5101C421378j77744q4411J84086J34905j68137J34762P8988J6369j75175R3183
5091C458204J68400J42878J51784j3936p437j04756L50640J59424p5272p9759
5081D150170R2584k30494R2755J41995j68041m54065j01671k310J23479L13673
$$ y = [8370569, 8229164, 7575836, 7175693, 6480433, 5825792, 5174516, 4755442, 4648537, 4570759, 4231365, 4026216, 3880147, 3936470, 3797676, 3768723, 3638435, 3643243, 3640759, 3713200, 3936492, 3852083, 3734109, 3827722, 3859135, 3899782, 3993957, 4201962, 4901403, 4923700, 4675507, 4469440, 4416725, 4277493, 4085357, 3957029, 3780827, 3756237, 3899286, 4075332, 3831984, 3621492, 3629165, 3627624, 3568981, 3634070, 3639709, 3211316, 3120671, 3103227, 3116917, 3159900, 3387466, 3421378, 3243634, 3159223, 3343309, 3478214, 3310077, 3444839, 3523827, 3540196, 3365021, 3458204, 3626604, 3769482, 3921266, 3907330, 3899893, 3795137, 4145777, 4305201, 4229929, 4150170, 4242754, 4012260, 4105015, 4247010, 4078969, 3624904, 3523233, 3520923, 3644402, 3958075]
5071C958075O0748P7393J15170j46959r410j14664J35816J91963J1237K860k7406
5060D254823o1917J27021P5216K68866N8138J28347J20445l0709n895J80068N8545
5049E172948J85118j70024J21575P7213k44375l0759J60809R4935Q1687j15327
5039E333800K8588m7973K14210j34694J74120q7557K23680N6041J61403P3529
5029E995147L36661K16296K95986J43271K34442L766L10710L46084J73891L8053
5019H094307K23487L59611K23394K82302L62390K35408K10290L52134O0155J59177
5009A0562655L31404L57467M15198K21056J35992L66109M45980N73154L56299
5000A3765314R1470M50140M80676M92945P20612M04422M37805N92870Q12393P59814
$$ y = [3958075, 4018823, 4096216, 4211386, 4064427, 4055017, 3940353, 4076169, 4268132, 4279369, 4282229, 4254823, 4192906, 4319927, 4395143, 4664009, 4722147, 4850494, 4970939, 4940230, 4934335, 5114403, 5172948, 5358066, 5188042, 5309617, 5386830, 5142455, 5111696, 5272505, 5367440, 5449127, 5333800, 5362388, 5314415, 5528625, 5393931, 5568051, 5480494, 5704174, 5760215, 5921618, 5995147, 6331808, 6548104, 6844090, 6987361, 7221803, 7225569, 7536279, 7882363, 8056254, 8094307, 8317794, 8677405, 8900799, 9183101, 9545491, 9780899, 9991189, 10343323, 10403478, 10562655, 10894059, 11251526, 11666724, 11887780, 12023772, 12389881, 12835861, 13409015, 13765314, 13856784, 14306924, 14787600, 15280545, 16001157, 16405579, 16843384, 17436254, 18248647, 19008461]
4990A9008461O36062L71476N83851Q82129L97989N92069Q82891O81446Q96412
4981B4932786R30096Q97711J004207J177852J228289J229542J463183J543438
4973C4407104J188704J226915J326122J881021J576690K285032K225680K629415
4965D8746683K885497L508354L498923M287215M996166O810592P815729J0538999
4957I3088158J2014816J4789583J6604634J9326211J9066228K0471924K3322683
4950B18684237L3247294M1752779N5762403N1007903K6557400k5823613n6787293
4943C44401110n9583977n1631571l2750684k3656623j5725657j1595604p506991
4936A41950003n213726k686234n06138K716369M519784O666133Q264931J0010875
$$ y = [19008461, 19644523, 20015999, 20599850, 21481979, 21879968, 22472037, 23354928, 24036374, 24932786, 25862882, 26760593, 27764800, 28942652, 30170941, 31400483, 32863666, 34407104, 35595808, 36822723, 38148845, 40029866, 41606556, 43891588, 46117268, 48746683, 51632180, 55140534, 58639457, 62926672, 67922838, 74733430, 82549159, 93088158, 105102974, 119892557, 136497191, 155823402, 174889630, 195361554, 218684237, 251931531, 293684310, 349446713, 400454616, 427012016, 401188403, 344401110, 284817133, 233185562, 200434878, 176778255, 161052598, 149456994, 141950003, 136736277, 134050043, 133543905, 136260274, 140780058, 147446191, 155711122, 165721997]
4928A65721997J2382190J4881411J8557214K4640539L3781882M5055890N6986786
4921C72007909O5200773M9489549O057955n2649942p1410954p1543997n4978019
4914B42173274l7298597k7101993k0597487j6076869j2551070j0303085r165572
4907A09078601p646866n775019m645228l796820m104821n082536n700295n121992
4899F7205024m568510m025943l433314k962337k619613k221981k166436k174349
4891D3032541j984168j725650j562478j182981j435141r46604q38006j302953
4883C2054560j221907j334074j177496j011464j046706n89311j174153r60841
4875B3538608m09156o84965o24049l07209m18354n96025m09060n16117p01153
$$ y = [165721997, 178104187, 192985598, 211542812, 236183351, 269965233, 315021123, 372007909, 437208682, 486698231, 492756186, 440106244, 368695290, 297151293, 242173274, 204874677, 177772684, 157175197, 141098328, 128547258, 118244173, 109078601, 101431735, 95656716, 91011488, 87214668, 83109847, 78027311, 72327016, 67205024, 62636514, 58610571, 55177257, 52214920, 49595307, 47373326, 45206890, 43032541, 41048373, 39322723, 37760245, 36577264, 35142123, 34195519, 33357513, 32054560, 30832653, 29498579, 28321083, 27309619, 26262913, 25673602, 24499449, 23538608, 23129452, 22444487, 21820438, 21513229, 21094875, 20498850, 20089790, 19573673, 18872520]
4866A8872520l31699j024577n39592o99336o38287n33362j34208k66309l71218
4857A4333932k81472k53421m71166k28957l58581n27400l35188l67139k85487
4848A1225121k55289k12630R5413l81074k49140l05364k29174j90304k45470k43334
4838I008755P447o1420j42363j84286r0384m44515m6583j67802K7368n812p0855
4827G829550k87350o92j52269O8206j23444J09424k50097o853K31124P2624k77094
4816G213129K29915L3785M59719J44124J29352L60289J04508O42984L89912M81201
4806A0188918Q77730J139229J066654K131860K152059J733773M41824j018804
4798A8713243j675196k104492k015958j661369j355254r43148n54346m27456l26368
$$ y = [18872520, 18540821, 17516244, 16976652, 16277316, 15639029, 15105667, 14971459, 14705150, 14333932, 14052460, 13799039, 13327873, 13098916, 12740335, 12212935, 11877747, 11510608, 11225121, 10969832, 10757202, 10852615, 10471541, 10222401, 9917037, 9687863, 9497559, 9252089, 9008755, 9016202, 8954782, 8812419, 8628133, 8537749, 8093234, 8046651, 7878849, 7906217, 7900405, 7829550, 7542200, 7541508, 7389239, 7457445, 7334001, 7443425, 7193328, 7186475, 7417599, 7490223, 7213129, 7443044, 7476829, 7936548, 8080672, 8210024, 8570313, 8674821, 9317805, 9707717, 10188918, 11066648, 12205877, 13272531, 15404391, 17556450, 19290223, 19732047, 18713243, 17038047, 14933555, 12917597, 11256228, 9900974, 8957826, 8403480, 7976024, 7649656]
4789G649656n81814n14468l68717m05089k84204N8135j01113m20763l78541J98675
4779D851757j71736k55321k88195j57041m8515m24885j76222M0742K29775j45029
4769C455330r4857K187l58804M744J28158j86530K31537J21391l04557M9116k30411
4758B817304J84748j42169l23956l399M8435k80523j62697J21381j33675K62917
4748B388366j7963p5802l15827L8913N6182j9114j1781J72478O5879k45640k5658
4737B010033R0223N0171l63801L2443J14780R4352J1602j55171Q2036k38190j0615
4726A717863J29433R3981p6j16388j86054J87685j14340n0358q5974K75350j09754
4715A741368J82j60519K16875M1979R822j27854k69220J82003J9930J22458j53370
$$ y = [7649656, 7067842, 6553374, 6184657, 5779568, 5495364, 5553499, 5452386, 5031623, 4653082, 4851757, 4680021, 4424700, 4136505, 3979464, 3930949, 3506064, 3329842, 3370584, 3600359, 3455330, 3360473, 3362660, 3003856, 3008600, 3136758, 2950228, 3181765, 3303156, 2998599, 3047715, 2817304, 3002052, 2859883, 2535927, 2532528, 2580963, 2300440, 2137743, 2259124, 2125449, 2388366, 2370403, 2294601, 1978774, 2017687, 2073869, 2054755, 2042974, 2215452, 2281331, 2035691, 2010033, 2100256, 2150427, 1786626, 1819069, 1933849, 2028201, 2039803, 1884632, 1966668, 1728478, 1717863, 1847296, 1941277, 1941201, 1824813, 1638759, 1826444, 1712104, 1661746, 1575772, 1851122, 1741368, 1741550, 1581031, 1797906, 1839885, 1849707, 1721853, 1452633, 1634636, 1654566, 1777024, 1623654]
4704A623654O1480J40300q6100k0831j8002j3786j91598j37644L98750r538p9625
4693A667060O7639j39188o5927K2596r0236Q2369P3241j13261P0132J25688P5966
4682A776079j22622r6081N8396k66748J94169j25306p280J81024K57551M5254
4672A894436r9517M18667j0638J70431l2167K22937K05451K42128J79354L51051
4662C542133J95777k9522k75731m08939k99104m06544j80446J54680r1219j72092
4652B028993K7492J01481k37192j51891O4054K1745L46661k82511k5087J73147
4642B066892R7006L26946P6976L28134N4913P0248J92197L12351K33232m18452
4632C340443r7272k42569k90500l00837n9241Q9648k02589o0399j81224N7338
$$ y = [1623654, 1685134, 1825434, 1739334, 1718503, 1700501, 1686715, 1495117, 1357473, 1756223, 1746685, 1667060, 1734699, 1595511, 1529584, 1552180, 1461944, 1544313, 1617554, 1504293, 1574425, 1700113, 1776079, 1653457, 1557376, 1615772, 1349024, 1543193, 1417887, 1410607, 1591631, 1849182, 1894436, 1794919, 2213586, 2202948, 2373379, 2341212, 2564149, 2769600, 3011728, 3191082, 3542133, 3737910, 3708388, 3432657, 3023718, 2724614, 2318070, 2137624, 2292304, 2201085, 2028993, 2056485, 2157966, 1920774, 1768883, 1832937, 1854682, 2201343, 1918832, 1893745, 2066892, 2163898, 2490844, 2567820, 2895954, 2950867, 3021115, 3213312, 3525663, 3758895, 3340443, 3243171, 3000602, 2710102, 2409265, 2350024, 2439672, 2237083, 2176684, 1995460, 2052798]
4622B052798L4479J6770K8653l9924L419J33420J72799P0676R2167n6603J12583
4611B621237L97114M94930N00813K5941J30824k04635l39806m88508m6187p4346
4601C017377m91651j07537j49888r9935j84970J06290j16375n4572K8108L4383
4591A981230K4445j13858J47461r4954l87762r7237K29555K76617k44343J10593
4581A831747k61359j6084j86914M7420K71103j77144O4438J2233l6452N2609k56013
4570A345584l5305J18110n0525n3766K13596k38607J53791J97195K39394l79664
4560A509803j34915K06598K54206J22653j44175o6095j44568n7436M9220M13120
4550B008411j15722l62662m0383M20877L15685l9397N437l0918o9539J16500j15390
$$ y = [2052798, 2087277, 2104047, 2132700, 2092776, 2096195, 2229615, 2402414, 2473090, 2565257, 2508654, 2621237, 3018351, 3513281, 4014094, 4040035, 4170859, 3966224, 3626418, 3137910, 3091723, 3017377, 2525726, 2418189, 2268301, 2168366, 1983396, 2089686, 1973311, 1918739, 1946847, 1981230, 2005675, 1891817, 2039278, 1944324, 1556562, 1459325, 1688880, 1965497, 1721154, 1831747, 1570388, 1554304, 1367390, 1414810, 1685913, 1508769, 1573207, 1585440, 1548988, 1601597, 1345584, 1310279, 1428389, 1377864, 1324098, 1537694, 1299087, 1452878, 1650073, 1889467, 1509803, 1374888, 1581486, 1835692, 1958345, 1814170, 1748075, 1603507, 1546071, 1595291, 2008411, 1892689, 1530027, 1489644, 1910521, 2226206, 2186809, 2192246, 2161328, 2091789, 2208289, 2092899]
4539B092899j33327j36161J44531l9136k07865j63514J10313J90193j4107K02272
4529B046098M9887O5792J28403k71458j37244M780J7702l3356k4118P0976J81158
4518B098620q5329p6311k29102l0788q6228K08074J78632J30440n965K8240L2247
4507B162530r3303N9657O5435q4153P3141r5444J82844K52299q2999J46235l02064
4496B284178J83378j31159J3359J61215J80350n353j87364k06634J69464L03644
4486B765078P1412N1627m5683J12191j06575O9707K11149J43505R7193M2930N6965
4475C469499j41913R5495K91106J07598N7337k35926K67677M1339J04577k20812
4465C835977r0967L53916J16700P9391K00396J5782j407M9578J69348J2940J63563
$$ y = [2092899, 1959572, 1823411, 1967942, 1928806, 1720941, 1557427, 1667740, 1857933, 1843826, 2046098, 2095985, 2161777, 2290180, 2018722, 1881478, 1886258, 1903960, 1870604, 1846486, 1917462, 2098620, 2013291, 1936980, 1707878, 1677090, 1590862, 1798936, 1977568, 2108008, 2102043, 2130283, 2162530, 2069227, 2128884, 2194319, 2110166, 2183307, 2087863, 2270707, 2523006, 2440007, 2586242, 2284178, 2467556, 2336397, 2349756, 2510971, 2691321, 2685968, 2498604, 2291970, 2461434, 2765078, 2836490, 2888117, 2842434, 2954625, 2848050, 2917757, 3128906, 3272411, 3369604, 3412534, 3469499, 3327586, 3423081, 3714187, 3821785, 3879122, 3643196, 3910873, 3952212, 4056789, 3835977, 3745010, 4098926, 4215626, 4295017, 4495413, 4511195, 4509788, 4559366, 4728714, 4741654, 4905217]
4454D905217J72774K84418J35863j60782L44848J5880j16425J41322J991N2979
4444E778085L15086K31534k36258J05328K96980Q3351P996j2382J18598o1875
4434F626443N7057q353J95001J09806J20441K64469L74713N59711K26463n0070
4424H475681J04844L91106L66728K92579J68091J8570K45763M25997R3097K13865
4414A0796321L40750J13551L12021L18215M01484L73578L36925K97730J50064
4405A3440639J91701J88903L61155O55827N36617P29124R07329N69932Q84599
4396A8465826M98952K21099K11300M7771j9665J56980K53464L5364M64162L05696
4386B0640949N15278N04755P57151P47586J078588P71723J155626J062531J293411
$$ y = [4905217, 5077991, 5362409, 5498272, 5337490, 5682338, 5698218, 5581793, 5723115, 5725106, 5778085, 6093171, 6324705, 6088447, 6193775, 6490755, 6574106, 6582102, 6569720, 6688318, 6626443, 6683500, 6675147, 6870148, 6979954, 7100395, 7364864, 7739577, 8299288, 8525751, 8475681, 8580525, 8971631, 9338359, 9630938, 9799029, 9817599, 10063362, 10489359, 10582456, 10796321, 11137071, 11250622, 11562643, 11880858, 12282342, 12655920, 12992845, 13290575, 13440639, 13632340, 13821243, 14182398, 14838225, 15374842, 16103966, 17011295, 17581227, 18465826, 18964778, 19185877, 19397177, 19444948, 19425283, 19582263, 19835727, 19871091, 20335253, 20640949, 21156227, 21660982, 22418133, 23165719, 24244307, 25016030, 26171656, 27234187, 28527598]
4377B8527598J164220J154250J018273J623667J605788J549244J973343J789021
4369D0405404K425021K700132L200860L584406M027846M946087O002790P609602
4361G4902148Q908854J0912635J3225298J5108326J7628202J9885474K3533476
4354A84104413K9110623L6712508M6626026N6400037N8024163M3258695P344647
4347D61581112l2107044n9706471o4212033n5055713m1865459l0323997k3082773
4340A55227622j8126722j4587156j1602096r953024q296232p244348n863751n705748
4332G3848545n389798m907054m271001l711309l159041k619755k378103k162269
4324D5250215k134282k096890j513702j702256j236806q45013p78508o15683l68740
$$ y = [28527598, 29691818, 30846068, 31864341, 33488008, 35093796, 36643040, 38616383, 40405404, 42830425, 45530557, 48731417, 52315823, 56343669, 61289756, 67292546, 74902148, 83811002, 94723637, 107948935, 123057261, 140685463, 160570937, 184104413, 213215036, 249927544, 296553570, 352953607, 410977770, 454236465, 461581112, 429474068, 369767597, 305555564, 250499851, 208634392, 178310395, 155227622, 137100900, 122513744, 110911648, 100958624, 92662392, 85418044, 79554293, 73848545, 68458747, 63551693, 59280692, 55569383, 52410342, 49790587, 47412484, 45250215, 43115933, 41019043, 39505341, 37803085, 36566279, 35721266, 34942758, 34327075, 33958335]
4315C3958335m20901j01236k13730o97446j491285j764669j740203j792499j683914
4306B4052452j237647j104872j166181p32940o96860j045623o85245n77520n50826
4297A6254738k18642p44456n16102o02581j59418n49606m43676j69881k01916
4288A2648460k83451l94940J21755n09663k36667r8689j09472l64753j65745l58492
4278A0248343k72771K90741j33037l19082K92074l9755l95877k39932k94072k46512
4268H890120k65403k32046q678k10283L6366J3571l36462j91888l3452j84313
4258G477532j74042l01180j26530j20205K081J948j50955k08499j03565j51809
4248F144776k22891j06392l2427J2749j49478j71709R1769k13415k23123k6084
$$ y = [33958335, 33537434, 33436198, 33222468, 32525022, 31033737, 29269068, 27528865, 25736366, 24052452, 22814805, 21709933, 20543752, 19810812, 19113952, 18068329, 17383084, 16805564, 16254738, 16036096, 15291640, 14775538, 14172957, 14013539, 13463933, 13020257, 12850376, 12648460, 12365009, 11970069, 12091824, 11582161, 11345494, 11246805, 11137333, 10772580, 10606835, 10248343, 9975572, 10266313, 10133276, 9814194, 10106268, 10066513, 9670636, 9430704, 9136632, 8890120, 8624717, 8392671, 8383993, 8173710, 8210076, 8223647, 7887185, 7695297, 7661845, 7477532, 7303490, 7002310, 6875780, 6755575, 6757656, 6759604, 6608649, 6400150, 6296585, 6144776, 5921885, 5815493, 5783066, 5795815, 5646337, 5474628, 5566397, 5352982, 5129859, 5103775]
4238E103775K59938J75654j46331m6345K09972r2737j84905J79575k3868J01172
4228E535900N4285j88931J72088L2691p1816J1421k1422J74732j57617J72580
4218E713911k80070O0083J99895j12524l48013o2398L1965O802r9188J47983j1847
4207E246599J11917R4487K6837L0347L28891j09881J83354M12472Q5053M60748
4197F870824N49778M68448N13431Q48346O50398J041886R73779J200064R81002
4188A4097956K99314m22538j028163j285746j121858r94366l31316M8839k09694
4179I052428k06628L0468j84584r0831O4586K83138M81577P01267N25240M76893
4169A1133554N24018J06734J41422l03291r146J50604K79609O81927O81113R29026
$$ y = [5103775, 5363713, 5539367, 5393036, 5346691, 5556663, 5463926, 5279021, 5458596, 5434728, 5535900, 5590185, 5401254, 5573342, 5606033, 5534217, 5545638, 5524216, 5698948, 5541331, 5713911, 5433841, 5493924, 5693819, 5581295, 5233282, 5170884, 5202849, 5209651, 5110463, 5258446, 5246599, 5358516, 5453003, 5479840, 5510187, 5839078, 5729197, 5912551, 6325023, 6410076, 6870824, 7420602, 7889050, 8402481, 9250827, 9901225, 10943111, 11916890, 13116954, 14097956, 14397270, 13974732, 12946569, 11660823, 10538965, 9544599, 9213283, 9262122, 9052428, 8845800, 8876268, 8691684, 8600853, 8665439, 8948577, 9430154, 10131421, 10656661, 11133554, 11657572, 11764306, 11905728, 11602437, 11593291, 11743895, 12023504, 12705431, 13386544, 14315570]
4159A4315570J385641J252430J663790J244877J465013J285276J5663j216447
4151B1411813k267252k575227k220976j384431r93793o89011m23577o70771l33056
4142I853719k46039L3127m4298J65446L07834o8249K32215P5118R0781O78358
4132A1078012P49323O23003R60031J348188J326111P36644k82469j339406j926800
4123A3272637j378348q73874q06077n67952l22179k22857k74885j37761k49780
4114H438924p4735l150p5720J72197j68755k66072J11089k2810K58001L50152
4104H719121j67538r7625J4862j00801K25614K36044n7769R1915J52918J10719
4094I127460M57610M39421J79178L15759O43075M11832O46075L09622K04568O1692
$$ y = [14315570, 15701211, 16953641, 18617431, 19862308, 21327321, 22612597, 22628260, 21411813, 19144561, 16569334, 14348358, 12963927, 11970134, 11281123, 10857546, 10186775, 9853719, 9607680, 9640807, 9596509, 9761955, 10069789, 10001540, 10233755, 10308873, 10399654, 11078012, 11827335, 12450338, 13410369, 14758557, 16084668, 16821312, 16538843, 15199437, 13272637, 11894289, 11020415, 10214338, 9646386, 9324207, 9101350, 8826465, 8688704, 8438924, 8364189, 8361039, 8285319, 8457516, 8288761, 8022689, 8133778, 8110968, 8368969, 8719121, 8551583, 8453958, 8468820, 8368019, 8593633, 8829677, 8771908, 8863823, 9016741, 9127460, 9585070, 10024491, 10203669, 10519428, 11162503, 11574335, 12220410, 12530032, 12734600, 12796292]
4084A2796292J71190j76129J84095L74289M05346L73894K06856K67895K47169
4075A4850897J65171K42860L37208O91343M43862P16332R89042Q37372J092654
4066B0366741J126070J349870J593885J198385R27930L90356L37063J83718r3061
4057B7380957p2000k95189r3791Q4729L90955L94542O41579Q48312J094668J235596
4047C1610358J449578J540086J520320J977144K424398K674727K973046L116273
4039D9285930L166390K479164K192000K431952J855512J663363J471273Q92198
4031F5437782L18547j93404m00696k98038L5219L50713Q26526P23800J128362
4022F7928811J020773J051538P38783N81278R83455J173306J755880K193120K539251
$$ y = [12796292, 12967482, 12791353, 12975448, 13349737, 13755083, 14128977, 14335833, 14603728, 14850897, 15016068, 15258928, 15596136, 16287479, 16731341, 17447673, 18436715, 19274087, 20366741, 21492811, 22842681, 24436566, 25634951, 26562881, 26953237, 27290300, 27474018, 27380957, 27308957, 27013768, 26919977, 27004706, 27395661, 27790203, 28431782, 29280094, 30374762, 31610358, 33059936, 34600022, 36120342, 38097486, 40521884, 43196611, 46169657, 49285930, 52452320, 54931484, 57123484, 59555436, 61410948, 63074311, 64545584, 65437782, 65756329, 65562925, 65162229, 64864191, 64899410, 65250123, 66076649, 66800449, 67928811, 68949584, 70001122, 70739905, 71321183, 72304638, 73477944, 75233824, 77426944, 79966195]
4013G9966195K561504K959749K960750L102447L484211L530861L348966K791628
4005A04706311K582575L009576K754214K712929K723274K503094J601176Q15906
3997A23409055Q47303K13703J50059o53522j445963j368938j298130p03402L87415
3988A19537580J400892K804159M661019O375813P190207O724351K271553k642232
3980A48323342l630409l062987j659747K15430J429402J669959Q70041r04502
3972A43250529k180160k833886l199051k969946l215430k932574k666011k986737
3964A20266734k501969k472071k733490k456851l081314k989863k963072k742758
3956I8325346k621191k445673j665364j072826n19398J40752L68492J10013n04296
$$ y = [79966195, 82527699, 85487448, 88448198, 91550645, 95034856, 98565717, 101914683, 104706311, 107288886, 110298462, 113052676, 115765605, 118488879, 120991973, 122593149, 123409055, 124256358, 124470061, 124620120, 123966598, 122520635, 121151697, 119853567, 119150165, 119537580, 120938472, 123742631, 128403650, 134779463, 141969670, 148694021, 150965574, 148323342, 144692933, 141629946, 139970199, 140185629, 141615031, 143284990, 144155031, 143250529, 141070369, 138236483, 135037432, 132067486, 128852056, 125919482, 123253471, 120266734, 117764765, 115292694, 112559204, 110102353, 107021039, 104031176, 101068104, 98325346, 95704155, 93258482, 91593118, 90520292, 90000894, 90141646, 90510138, 90620151, 90115855]
3947I0115855p82361j340704j567599j209176r79217M882P03474J211800J636156
3938H7793110J715135J349195o0031j793050l608041n061523n377962n179860
3930F9776973m806602m232279l612277l102602j981307j879480j823043j306386
3922D7032997j434828j093760r10916n93715l79265N5655L99699N99231J002357
3913D4677455J159153P70824J15271n41441j149792j908695k326850k288278j841329
3904C6666318j753931j459347j234827j021605j032162r98932q60458o78896p65609
3895B6860551r72625m09056m36755o34461m28007k75893l19028j7427k98382l62505
3885B2706412k53680j33486j19100L0156r2445j79883k76070K70290k9150k51459
$$ y = [90115855, 89333494, 87992790, 86425191, 85216015, 84236798, 84241680, 84945154, 86156954, 87793110, 89508245, 90857440, 90797409, 89004359, 85396318, 80334795, 74956833, 69776973, 64970371, 60738092, 57125815, 54023213, 52041906, 50162426, 48339383, 47032997, 45598169, 44504409, 43593493, 42999778, 42620513, 42676168, 43075867, 43675098, 44677455, 45836608, 46607432, 46722703, 46181262, 45031470, 43122775, 40795925, 38507647, 36666318, 34912387, 33453040, 32218213, 31196608, 30164446, 29165514, 28305056, 27626160, 26860551, 25887926, 25478870, 25042115, 24407654, 23979647, 23703754, 23384726, 23367299, 23068917, 22706412, 22452732, 22319246, 22200146, 22230302, 22137857, 21957974, 21681904, 21952194, 21923044, 21671585]
3875B1671585Q93M14082l5804j5068K0700O3971K30913Q4779j5899K11328N9406
3864B2690886K76327J2318K48206K66002Q2902J5171R4132J11543M1346L60820
3854B4199653L76742J60108L16471N32608P12222P34013P20217R99467J118932
3845B9870433J652607J558153J515331J444631J702717J661657J774613J365741
3837D2545883J327892J029801Q98044O06861N12852L66747N5225l02403j000139
3828D6040763j100617j079984p02542l00176J51886O12547J126674J420366J696967
3819D7865884K219232K153155K196506J623467J470687Q34156R7369l91616m72243
3810E7596597J41404O86055J533128K466326K995252L568128L626181L129246
$$ y = [21671585, 21672478, 22086560, 22050756, 22035688, 22056388, 22120359, 22351272, 22436051, 22420152, 22631480, 22690886, 22967213, 22979531, 23227737, 23493739, 23576641, 23591812, 23685944, 23797487, 23838833, 24199653, 24576395, 24736503, 25052974, 25585582, 26297804, 27031817, 27752034, 28751501, 29870433, 31523040, 33081193, 34596524, 36041155, 37743872, 39405529, 41180142, 42545883, 43873775, 44903576, 45801620, 46408481, 46921333, 47288080, 47343305, 47040902, 46040763, 44940146, 43860162, 43157620, 42857444, 43009330, 43621877, 44748551, 46168917, 47865884, 50085116, 52238271, 54434777, 56058244, 57528931, 58363087, 58460456, 58068840, 57596597, 57738001, 58424056, 59957184, 62423510, 65418762, 68986890, 72613071, 75742317]
3802G5742317K402093J914603M39583j117722k241121k866751k917354k595105
3794F8760543j914077j431600j001014o99753n96406n33975n56590q31228p48870
3785F0447030k38037K80786O04448R69407J044029J689259K144653K865622L153969
3776G2961166L226606K656464J829616O44776o84207j973863k578045k710674
3768G3371839k277633k018047j665779j785561k363565k464868k284713j864208
3760E6647465j179971p22472n07299m91976j74612l24551j26140l89571n04875
3751E2225998n25504o81616n75768m87565k28628J22827q7051m62774q5866j99184
3741D9014869k12386l07112M51004L59698J8883n55011j244242k105236k252136
$$ y = [75742317, 78144410, 80059013, 80498596, 79380874, 77139753, 74273002, 71355648, 68760543, 66846466, 65414866, 64413852, 63714099, 63117693, 62583718, 62027128, 61195900, 60447030, 60208993, 60489779, 61094227, 62063634, 63107663, 64796922, 66941575, 69807197, 72961166, 76187772, 78844236, 80673852, 81318628, 80634421, 78660558, 76082513, 73371839, 71094206, 69076159, 67410380, 65624819, 63261254, 60796386, 58511673, 56647465, 55467494, 54745022, 54237723, 53745747, 53571135, 53246584, 53120444, 52730873, 52225998, 51700494, 51018878, 50443110, 49955545, 49726917, 49849744, 49762693, 49299919, 49214053, 49014869, 48802483, 48495371, 48946375, 49306073, 49324956, 48769945, 47525703, 45420467, 43168331]
3732D3168331k516213k229890k162562j540980r04230j007144p42472m35517l81353
3723C1247970n32390k23009k22854m00382m4991L86319j6307k93390O5206j30116
3713B9836056l41390m70561j02210J91727j2755J63491J25883l05525k68869m00320
3703B8415527n20408o54423r4252R4739k2523L96052M7878M04316N77437M14009
3693B9058352R77645J281090J281057K060804K194910K438153K933562L726947
3685D5952520L988897N146761O291922Q386666J0661365J3577973J2936412P270185
3677A14212701m167719j2586081j4071554j2668067q159564n795971l811999k919301
3669E0032445j782716j187252n97777o14744J17902M70798J104665J736281K935181
$$ y = [43168331, 40652118, 38422228, 36259666, 34718686, 33814456, 32807312, 32064840, 31629323, 31247970, 30715580, 30492571, 30269717, 29869335, 29824344, 30210663, 30194356, 29900966, 29966172, 29836056, 29494666, 29024105, 28921895, 29113622, 29100867, 29264358, 29390241, 29084716, 28815847, 28415527, 27895119, 27240696, 27146444, 27241183, 27218660, 27614712, 27662590, 28066906, 28644343, 29058352, 30035997, 31317087, 32598144, 34658948, 36853858, 39292011, 42225573, 45952520, 49941417, 55088178, 61380100, 69766766, 80428131, 94006104, 106942516, 114212701, 110044982, 97458901, 83387347, 70719280, 62559716, 56763745, 52951746, 50032445, 48249729, 47062477, 46464700, 45849956, 45967858, 46438656, 47543321, 49279602, 52214783]
3660E2214783L559231M949400N322912O428349O999980Q563943J1420020J5907282
3652A15365900J9711614K5769432K4901415J4942896q476503k5733667k8021561
3645A38459526k6098594j7111742j2159909q691673o912824m636523m237026l523929
3637E5087306l182456k034654j687343q80843o04384j33702J55895J147680J792296
3628D9659795K303100K363502L738850M714120P163982Q345016J1513900J1761500
3620A01563765O851489l762274j2606156j3933378j3111264r184675o282220m916826
3612D4618461l750397k971599k676924k043818k095794j875736j324969j188247
3604B6690977r12792j186612j169224p48633j001845n78910o68369m39791m40622
$$ y = [52214783, 55774014, 60723414, 66046326, 72474675, 79474655, 88038598, 99458618, 115365900, 135077514, 160846946, 185748361, 200691257, 192214754, 166481087, 138459526, 112360932, 95249190, 83089281, 74397608, 67484784, 62848261, 58611235, 55087306, 51904850, 49870196, 48182853, 47302010, 46697626, 46563924, 46719819, 47867499, 49659795, 51962895, 54326397, 58065247, 62779367, 69943349, 78288365, 89802265, 101563765, 108415254, 104652980, 92046824, 78113446, 65002182, 55817507, 49535287, 44618461, 40868064, 37896465, 35219541, 33175723, 31079929, 29204193, 27879224, 26690977, 25778185, 24591573, 23422349, 22673716, 21671871, 21092961, 20424592, 19984801, 19544179]
3595A9544179o03054q30763m28131l53537k41132k22500l40587k90949q5342k62733
3585A5885451j05790j79408l18498r6763k56577p2899j52037k19619n9691j43363
3575A4280806k09083j19251j05949l62893j08189j68007l7105j37979m0212l00458
3565A2691680Q8522l3662J71705Q0491j97253R0176j7507J9922k15479o6314Q4271
3554A2696552J47140J24659Q9005j62822l2193K72782K00316p6565O4808J52778
3544A3476460L1790K06092q279O8030K20206L43933j12632N0819K59493K85621
3534A4821533P8017L96755L63026M07719Q75299N36893Q56178O27136Q10343R71778
3524B0744677R61468J110894J285316J008384J498253R70143P49433O28185R4325
$$ y = [19544179, 18941125, 18110362, 17682231, 17328694, 17087562, 16865062, 16524475, 16233526, 16148184, 15885451, 15779661, 15600253, 15281755, 15184992, 14928415, 14855516, 14703479, 14483860, 14424169, 14280806, 14071723, 13952472, 13846523, 13483630, 13375441, 13207434, 13170329, 13032350, 12992138, 12691680, 12780202, 12746540, 12918245, 12998736, 12801483, 12891659, 12874152, 12894074, 12678595, 12612281, 12696552, 12843692, 12968351, 13057356, 12894534, 12862341, 13135123, 13335439, 13258874, 13323682, 13476460, 13508250, 13714342, 13706063, 13774093, 13994299, 14338232, 14225600, 14276419, 14535912, 14821533, 14899550, 15296305, 15659331, 16067050, 16942349, 17479242, 18335420, 18962556, 19772899, 20744677, 21706145, 22817039, 24102355, 25110739, 26608992, 27579135, 28328568, 28956753, 29051078]
3515B9051078j69885r28851o28964q53644q70294n26634r92093q59665j215593
3506B2005455j231877j130770j253099j053810j243311j027970o88761m35423
3498A3940434n29183l28560m80294k64191k23814k16084J42045j40111R2726K09116
3488A2202084K36606L26288J84819P73346O68441J104326J262113J522363J307771
3479A9588157N01826n83384r89993j366490j743910j470419j118709j097991j022112
3470A0696975k57391l70998m49242m58404k92990r7973j20211k22728l1162m1436
3460H354440j66085j31397J93694M08505N7172L84355L75306N10671O82311Q97976
3450A1566948O7610j2941n30319p73732p31923p30233k23798n42550m41488n1622
$$ y = [29051078, 28881193, 27952342, 27323378, 26469734, 25599440, 25072806, 24080713, 23221048, 22005455, 20773578, 19642808, 18389709, 17335899, 16092588, 15064618, 14375857, 13940434, 13411251, 13082691, 12602397, 12338206, 12114392, 11898308, 12040353, 11900242, 11992968, 12202084, 12438690, 12764978, 12949797, 13723143, 14391584, 15495910, 16758023, 18280386, 19588157, 20089983, 19506599, 18516606, 17150116, 15406206, 13935787, 12817078, 11719087, 10696975, 10439584, 10068586, 9619344, 9160940, 8867950, 8769977, 8649766, 8427038, 8395876, 8354440, 8188355, 8056958, 8250652, 8659157, 8716329, 9100684, 9475990, 9986661, 10668972, 11566948, 11634558, 11621617, 11091298, 10317566, 9585643, 8855410, 8631612, 8089062, 7647574, 7595952]
3440G595952l73793k62564j89860l75828j9706n6320r3411k19719k83192j48699
3430E572860P6121j74491m6708j32417m162j69150L4148L7051J81609o1425K3216
3419E336652O1871m3523P1246K45255p7366O3097l21152J25554j43307n2369Q447
3408E274405k20645p9443n1753J54764j34197j14094O8941P4343n565J06182j68274
3397D904664k2873r3725J30984L61817L7577l6012m6128L17743J13581k55324
3387E412304p3113J88092R2356l03974p2884k43562n2449n1270l92817n7900Q301
3376D453084l2368P4770q633k67679J50318K63913O2448J1365k54711Q8973J15880
3365D657360k5420j2702j91833M8342L5819p6174q5776J06370j03418q4154r4673
$$ y = [7595952, 7222159, 6959595, 6769735, 6393907, 6374201, 6317881, 6224470, 6004751, 5721559, 5572860, 5648981, 5474490, 5427782, 5295365, 5291203, 5122053, 5156201, 5193252, 5374861, 5313436, 5336652, 5398523, 5355000, 5426246, 5671501, 5594135, 5657232, 5336080, 5461634, 5318327, 5265958, 5274405, 5053760, 4974317, 4922564, 5077328, 4943131, 4829037, 4897978, 4972321, 4966756, 5072938, 4904664, 4881791, 4788066, 4919050, 5280867, 5318444, 5282432, 5236304, 5554047, 5667628, 5412304, 5339191, 5527283, 5619639, 5315665, 5242781, 4999219, 4946770, 4895500, 4502683, 4444783, 4453084, 4420716, 4495486, 4486853, 4219174, 4369492, 4633405, 4695853, 4707218, 4452507, 4541480, 4657360, 4631940, 4619238, 4427405, 4475747, 4511566, 4435392, 4349616, 4455986, 4352568, 4268414, 4173741]
3354D173741r2716J00804q4730k51683q9784n2215l0386J1267j83451n9766J28340
3343C569421j92698J56334K2345j37947o4873L1074o0327k18635K74914l42376
3333C037232j48977m5697M5093j8555O4467k3200L6023l4169J52462L8620j74068
3322B929231j99780K06043L64m0166j56922j5509j27922L0369K75646M6713j1501
3311B936566K4996J55537o9053j24077J98732J82105j36889j22854K59687P2642
3301C377392P4091P2324N6560p952p9667J55508r7493J59455j25820N2842j36471
3290C500769K70892K79534N2913j09660j96629J63157o0123k07508L65010J04414
3280D162769Q6372p1960K23917L4593p967J28642l1083O9624q2221J37847O6138
$$ y = [4173741, 4081025, 4181829, 4097099, 3845416, 3755632, 3703417, 3673031, 3684298, 3500847, 3441081, 3569421, 3376723, 3533057, 3555402, 3417455, 3352582, 3383656, 3323329, 3104694, 3379608, 3037232, 2888255, 2842558, 2887651, 2869096, 2933563, 2910363, 2946386, 2912217, 3064679, 3103299, 2929231, 2729451, 2935494, 2935858, 2895692, 2738770, 2723261, 2595339, 2625708, 2901354, 2948067, 2936566, 2961562, 3117099, 3048046, 2923969, 3122701, 3304806, 3167917, 3045063, 3304750, 3377392, 3451483, 3523807, 3580367, 3572415, 3492748, 3648256, 3550763, 3710218, 3584398, 3637240, 3500769, 3771661, 4051195, 4104108, 3994448, 3797819, 3960976, 3900853, 3693345, 4058355, 4162769, 4249141, 4177181, 4401098, 4435691, 4427724, 4556366, 4525283, 4594907, 4512686, 4650533, 4716671]
3269D716671K00247R9240j36722j66975K08136L3674k22464j16941M49716j4550
3259E050032M2312J50649m3797m24869j0095J32665n5567k43376r2765K89850
3249D795039K34690r3541Q227M0307k97457j11290J41848r2065m2848j4569M9206
3238D617547q9621J29766J56572J77610Q7167j88592M9250j49277L96974n2889
3228E134507k16344j97307N1819J74057N0611l26979l7840q9661n6128K21623
3218D708358M3842J0370j0266l3305Q4724J87608J82486r3666k17402K43758j03236
3207E003271m73884j86707k60696j13429n4206k00485J1905m1536j17422L2021
3197C598832k21560J1470R1998Q0496O4511l9157K0608R5606l9971L5416J50909
$$ y = [4716671, 4916918, 5016158, 4879436, 4712461, 4920597, 4954271, 4731807, 4614866, 5064582, 5050032, 5092344, 5242993, 5199196, 4774327, 4764232, 4896897, 4841330, 4597954, 4505189, 4795039, 5029729, 4936188, 4944415, 4984722, 4687265, 4575975, 4717823, 4625758, 4582910, 4568341, 4617547, 4527926, 4657692, 4814264, 4991874, 5079041, 4890449, 4939699, 4790422, 5187396, 5134507, 4918163, 4720856, 4772675, 4946732, 4997343, 4670364, 4632524, 4542863, 4486735, 4708358, 4752200, 4762570, 4752304, 4718999, 4803723, 4991331, 5173817, 5080151, 4862749, 5106507, 5003271, 4529387, 4342680, 4081984, 3968555, 3914349, 3713864, 3725769, 3684233, 3566811, 3598832, 3377272, 3388742, 3480740, 3561236, 3625747, 3586590, 3607198, 3702804, 3662833, 3698249, 3849158]
3186C849158l21010Q171J6171J88686j41429n01285K7722K04436j33970j65221
3176C031429j89711j34751k89249M429J25528P8465j92697k24228K50005l2836
3166B426384j11967k50814R097j1269o3902o0066J48995k40483k33025J25302
3156A738252K40007j60415j05801m8049n9185o6173J16258k2931j32712l5969
3146A463282j46881J62031k51159j46885O4020J27322m5401r228q7601k2932M9017
3135A155585n5254j8504n0273J71725j38033k17788j60926J71493J34252J1452
3125A003729j6951k42190j03090p8077k8667K27030j04360N717J84332m26774
3115D20699K11985M3837M161L3481o9553K62955m4900q7019k6462J16750j22009
$$ y = [3849158, 3528148, 3536319, 3552490, 3741176, 3599747, 3098462, 3126184, 3330620, 3196650, 3031429, 2841718, 2706967, 2417718, 2422147, 2547675, 2626140, 2433443, 2209215, 2459220, 2426384, 2314417, 2063603, 2072700, 2061431, 1997529, 1937463, 2086458, 1845975, 1612950, 1738252, 1978259, 1817844, 1712043, 1663994, 1604809, 1538636, 1654894, 1631963, 1499251, 1463282, 1316401, 1478432, 1227273, 1080388, 1144408, 1271730, 1226329, 1217101, 1129500, 1106568, 1155585, 1100331, 1081827, 1031554, 1203279, 1065246, 847458, 686532, 858025, 992277, 1003729, 986778, 744588, 641498, 563421, 534754, 761784, 657424, 663141, 847473, 420699, 632684, 676521, 680682, 714163, 644610, 907565, 862665, 775646, 749184, 865934, 743925]
3104G43925J3377r279k47685j93504J4853k8863j5675q276J52738j51369J73469
3093D43711P9334n7799J04396J7542k79863O4064K58528l78645j6176o961K38422
3082D66553N1851q6755N0046K35574l7592l07333J0723R2346q6499J02658q605
3071D82967K17537l42467q7780P0899J99464M776j5546j96683j67932j59999J03629
3060A08865L00823J2752Q9853p5473k270j7452j54444p8410k7948K91470n8675
3049C89091q0974Q315N6538K68352j38057o2752j4137r2012j35468L57737l53836
3038B02797j16215J29850K1506r1677k26970N26K87864R5330j573K31948j22104
3027D11282J20550k32810n9184J29873k95960O1061k8669K13454J36411j6109
$$ y = [743925, 757302, 748023, 500338, 306834, 321687, 292824, 277149, 268873, 421611, 270242, 443711, 523045, 465246, 569642, 587184, 307321, 371385, 629913, 251268, 235092, 228131, 466553, 518404, 431649, 481695, 717269, 679677, 372344, 383067, 475413, 388914, 491572, 482967, 700504, 358037, 270257, 341156, 540620, 545396, 529850, 333167, 165235, 5236, 108865, 409688, 422440, 512293, 436820, 434550, 417098, 262654, 184244, 156296, 447766, 389091, 308117, 316432, 372970, 641322, 503265, 440513, 426376, 334364, 198896, 556633, 202797, 86582, 216432, 237938, 146261, -80709, -80183, 207681, 303011, 301438, 533386, 411282, 531832, 299022, 239838, 369711, 73751, 134812, 106143, 319597, 456008, 439899]
3017D39899j87780m1730J19951N2077k105P5183L1274r7105k4878j74335p6800
3006A13651m4756J68576P1553r1415q0147j6281N9591J11046J79253q5935J01352
2995D86488q3506L62104k38216j78693R5625j09379M0866j71495K12777n6578
2985C59993J59096J02535q6137j80890R9562Q9370Q9211m4467k99721J02975R4782
2974D86309P6739n2123q5522N7652r6244L2675l3964L13654l15711J0688J12433
2963E06586q0106N4956j49254N6736K47899P6280l09193J11057M6845J96169K4605
2952G82580j23269j86324j07881P9126P2773J79327J55956k07788j2701R6891
2942G28690k91174K4571J12209Q4154R1983j37689L6781Q5481J12122m2538j88257
$$ y = [439899, 252119, 210389, 330340, 382417, 380312, 455495, 486769, 389664, 364786, 190451, 113651, 68895, 237471, 309024, 217609, 137462, 121181, 180772, 291818, 471071, 385136, 486488, 402982, 765086, 526870, 348177, 443802, 334423, 375289, 203794, 416571, 359993, 519089, 621624, 535487, 354597, 454159, 543529, 632740, 588273, 288552, 391527, 486309, 563048, 510925, 425403, 483055, 386811, 419486, 385522, 699176, 383465, 394153, 506586, 426480, 481436, 332182, 388918, 636817, 713097, 403904, 514961, 561806, 757975, 782580, 659311, 472987, 365106, 444232, 517005, 696332, 852288, 644500, 631799, 728690, 437516, 462087, 574296, 658450, 750433, 612744, 649525, 735006, 847128, 804590, 616333]
2931F16333J28051l126K05541q3003j74063R081J39175J48376l13322M1352J08131
2920H22526j12113J07089K89186k04499j86030j61133q0580l5752J37369L2596
2910F08659Q5374o4431l0545R4372k0420j04720j18987L53231k11825l7076M7350
2899F00982k59999L37124J04787j0286R4255N6130l73691P5278J03q6942L9180
2888E76921k32972j1929M2340j91792q8541K68556L1369j58499J15694J13758
2878D64905K3306m4245j94060j72572J53854K77795r1366K17819J1007j07927
2868E38516k80709k00907R7823N3072O8647o3186j40900J5096M741k6229J5171
2857H1135j35517r2879K44021K24852k41045j02009J09462M2324J31695r0351
$$ y = [616333, 744384, 741258, 946799, 863796, 689733, 698814, 837989, 986365, 673043, 714395, 822526, 710413, 817502, 1106688, 902189, 716159, 555026, 474446, 438694, 576063, 608659, 694033, 629602, 599057, 693429, 673009, 568289, 449302, 802533, 590708, 553632, 600982, 340983, 678107, 782894, 772608, 866863, 922993, 549302, 624580, 624683, 537741, 576921, 343949, 332020, 374360, 182568, 94027, 362583, 393952, 235453, 351147, 464905, 488211, 443966, 249906, 77334, 231188, 508983, 417617, 635436, 646443, 538516, 257807, 56900, 154723, 207795, 276442, 213256, 72356, 87452, 92193, 65964, 81135, -54382, -147261, 96760, 321612, 80567, -21442, 88020, 130344, 262039, 171688]
2847A71688O3655m3205r3024J94320K0296k35306k9452K01709k8907j76443J0318
2836E5649J450N5032K4179o3706J56078k21424q4823M88j3558R4195J57570J01538
2824B62668K016r9834j97701N5999K0788J85574j78973j5670n6511M2847P0066
2813I1269k4828p4515J47744R8328J199q7391O15j2940j43473J77675Q6268r2390
2801A67561P9974l3720j00822J1957L6273l286k13120j1682J46109P8893q8876
2790F9261M9155R3018l00519K3224K31522L8202k6771j57209R3539q3294P870
2779C7998J55237l5551j5566j93965P61J55596N683O2415n3925j25014m2031K06453
2767A58091K6076j32366J82402j8783j69852o1107p2334K33658l4510J9411m7824
$$ y = [171688, 235343, 192138, 99114, 293434, 313730, 78424, 48972, 250681, 221774, 45331, 55649, 57099, 112131, 136310, 72604, 228682, 7258, -77565, -77077, -90635, 3560, 161130, 262668, 264684, 164850, -32851, 23148, 43936, 229510, 50537, 34867, -21644, 21203, 91269, 66441, -8074, 139670, 237998, 239197, 151806, 152421, 139481, -3992, 173683, 259951, 167561, 247535, 213815, 112993, 124950, 161223, 157937, -55183, -66865, 79244, 158137, 69261, 118416, 211434, -89085, -65861, 165661, 203863, 177092, 19883, 113422, 30128, 37998, 193235, 157684, 142118, -51847, -51086, 104510, 110193, 172608, 118683, -6331, -48362, 158091, 184167, 51801, 234203, 215420, 45568, -15539, -87873, 145785, 111275, 130686, 82862]
2756H2862j75626l7509r9608K82981J85644M6091J0197o0948k50488J10904J25794
2745B20294R4441o7322r2671J21681P893k6829n539L54765J7418l12955Q8164
2734C99340K95666r4551J98623K8266O5066j76394l41353j95466N4061l8099j8071
2723A77088K22242m5809r8322j35228L0577n8919L9880J77997m984j50138l8221
2712A16163j82086j65241M04775J28783J05718R0144j16648n9558j59684R537
2702A71903m2613m6180P6637M943n2733m9545M3731L191j9141J33352J5595j79350
2690E9790M4702p4636M1341Q5978R9107R1395k11188L1378k70769R0609K59685
2679B47392l8397M8629l8305m5541P0383j5046j31763J65302J67210m2318j48866
$$ y = [82862, -92764, -130273, -229881, 53100, 238744, 284835, 295032, 234084, -16404, 94500, 220294, 314735, 247413, 154742, 276423, 284316, 257487, 251948, 606713, 624131, 311176, 399340, 695006, 600455, 799078, 827344, 892410, 716016, 374663, 179197, 233258, 195159, 177088, 399330, 353521, 255199, 119971, 150548, 91629, 131509, 309506, 304522, 154384, 116163, -65923, -231164, 173611, 302394, 408112, 498256, 381608, 322050, 162366, 171903, 129290, 83110, 159747, 164690, 111957, 62412, 106143, 109334, 90193, 223545, 239140, 59790, 104492, 29856, 71197, 157175, 256282, 347677, 136489, 167867, -102902, -12293, 247392, 208995, 257624, 219319, 173778, 244161, 229115, 97352, 262654, 429864, 387546, 238680]
2668B38680n5029j1896M0684j18183j02182K42096K21217r0262j78609N1263J16487
2657C54266q8715j0778j05125j13964J14323m4801q8018p382M7117K76077j57289
2646A75711p5154L7336R96K10448n0026j8813M1255r2874K57147K32389k62818
2635D55597j68179j38771J72339J81063j49064l8476o9829Q6680j57314K25574
2625C99620Q0238j99523r7881j04489J87127j28010O6694R7133J81594N1000j43051
2614C90452P0423l2013Q4907P8069k02927j12570K30963L13720j04057k70901
2604D46066N6445q779K0166J19341k2565J6627j51978O7132Q4361m2933M5875
2593F29758K08663l753O6923j03275Q772j20670J02753q0439k01415K43468l2623
$$ y = [238680, 183651, 171755, 212439, 94256, -7926, 234170, 455387, 365125, 186516, 237779, 354266, 265551, 254773, 149648, 35684, 150007, 105206, 17188, 9806, 56923, 333000, 175711, 100557, 137893, 138889, 349337, 299311, 280498, 321753, 228879, 486026, 718415, 455597, 287418, 148647, 320986, 502049, 352985, 314509, 244680, 331360, 174046, 399620, 479858, 280335, 182454, 77965, 265092, 137082, 203776, 300909, 482503, 533503, 390452, 460875, 428862, 513769, 591838, 388911, 276341, 507304, 821024, 716967, 446066, 502511, 493732, 513898, 633239, 610674, 627301, 475323, 542455, 626816, 583883, 629758, 838421, 834668, 901591, 798316, 807088, 686418, 789171, 708732, 507317, 750785, 718162]
2582G18162R9839j90044J04933L82053L24357j9483j10123k6843j45666J68343
2572A305528r1315q5347K38019j00894l5148R1407R3947j63562J00859K87683
2562A641177L9329L14044K18543J08525k40923K24108J23548J15033j11646M0150
2552B471888J14211K48063j17133k3808L06809o4952Q7193O2869R4898j4493L00448
2541C465993L63172k8194L16345j19904K21222K9768j57880K09014L04197R2377
2531D696110R3767J50867M6869K90336j13129J32104M42059J69145L71998K46409
2521F526535K84112O12437K42443J92951N64897M34509M70400L31613M31005O39837
2511A0730739P66062P10997J152819J252219J201389J560141K090422K334788
$$ y = [718162, 818001, 627957, 732890, 1114943, 1439300, 1419817, 1309694, 1282851, 1137185, 1305528, 1214213, 1128866, 1366885, 1265991, 1230843, 1322250, 1416197, 1252635, 1353494, 1641177, 1680506, 1994550, 2213093, 2321618, 2080695, 2304803, 2428351, 2543384, 2431738, 2471888, 2586099, 2834162, 2717029, 2693221, 3000030, 2935078, 3022271, 3085140, 3180038, 3165545, 3465993, 3829165, 3800971, 4117316, 3997412, 4218634, 4248402, 4090522, 4299536, 4603733, 4696110, 4789877, 4940744, 4987613, 5277949, 5164820, 5296924, 5738983, 5908128, 6280126, 6526535, 6810647, 7423084, 7665527, 7858478, 8423375, 8857884, 9328284, 9659897, 10090902, 10730739, 11496801, 12207798, 13360617, 14612836, 15814225, 17374366, 19464788, 21799576]
2503B1799576K120180K511427L187694L285442M467797N691350O168368P654041
2495E6885875J0045495J3778749J6634366K1364277J8685990P117483j3982035
2488A30530200k1671506k2081525j8268206j1074593q612569o037368n115845
2481C7668588l294211l045229k288781j903450j600012j725962j711541j966062
2473B0133340j784079j699199j031147r97121p12658p56445o58123o83920q79118
2464A0931530o17126n14313m47160k98380m04666m86955n79596j287J02739k09349
2454G475437l52575n06134l83262r3851k24064k06864m06542m03503j77535j59171
2444D561936j99540J39624J06141j47967l91786k31610j73390m6927j96233j44834
$$ y = [21799576, 23919756, 26431183, 29618877, 32904319, 37372116, 43063466, 49231834, 56885875, 66931370, 80710119, 97344485, 118708762, 137394752, 144512235, 130530200, 108858694, 86777169, 68508963, 57434370, 48821801, 42784433, 37668588, 34374377, 31329148, 29040367, 27136917, 25536905, 23810943, 22099402, 20133340, 18349261, 16650062, 15618915, 14621794, 13909136, 13152691, 12494568, 11810648, 10931530, 10314404, 9800091, 9352931, 9054551, 8649885, 8162930, 7583334, 7582047, 7684786, 7475437, 7122862, 6616728, 6233466, 6139615, 5915551, 5708687, 5302145, 4898642, 4721107, 4561936, 4362396, 4502020, 4608161, 4460194, 4068408, 3836798, 3663408, 3616481, 3420248, 3275414]
2434C275414Q1384j91070j65294J1387j36191k4277m9845N7981M6548k55597j62863
2423B487577p8055k63925M8612n837j12571l476l4720P9770j64907j55176J80253
2412A977545j63997r7572J56199l47046L4349j50889j979J97833P4746k40848
2402A438341l31412k4055J57313J19266M0738J0850j31792j15247j27249J43334
2392A180087k08413J3105M7561o4119N4432K69032k07398j38062j27814p2470
2382G45941R8689J0842J391R7013O1228J01608r907j68621j85046j86699J37920
2371G04359r9709K1597J8703j40493k02652J03839J19563K21333j19599P0199
2361F97140N7628k6794j44574j97164K95634N8756j52096l5150K5243M9685j35559
$$ y = [3275414, 3356798, 3165728, 3000434, 3011821, 2875630, 2851353, 2801508, 2859489, 2906037, 2650440, 2487577, 2409522, 2145597, 2194209, 2188372, 2075801, 2072325, 2037605, 2117375, 1952468, 1797292, 1977545, 1813548, 1715976, 1872175, 1525129, 1559478, 1408589, 1406610, 1604443, 1679189, 1438341, 1106929, 1082874, 1240187, 1359453, 1400191, 1411041, 1279249, 1164002, 1036753, 1180087, 971674, 984779, 1032340, 968221, 1022653, 1291685, 1084287, 946225, 818411, 745941, 844630, 855472, 856863, 953876, 1015104, 1116712, 1106805, 938184, 753138, 566439, 704359, 604650, 626247, 644950, 504457, 301805, 405644, 525207, 746540, 626941, 697140, 754768, 727974, 583400, 386236, 681870, 740626, 588530, 553380, 578623, 628308, 492749]
2350D92749N1797M9802n2119M559j68228j52113j04656L58112J48129K4387k28400
2339D24019n8710M991M6761P3430m8202J45111O3490j36544k79780L8831k6065
2328B47332K5670J42857o0228m4762O4854N7085J11932j99627N1558J4721j03412
2317C07980K4421m1606K77614n2018k72913r994m8224n1056K63378j40380P4293
2306C31495R9812j92015J05459q9131K17674j56617j44274J92395j31830j1683
2296B21285j02813J54056O6514j92822Q0622j97982J17587K07702J76213l0965
2286D99397Q1618p3074k52462J75947p3694j04103J00998l5167r4159J50871K0217
2275C96389l28337r5213K71232k7665o0269j4994j09041J57461K80374j68028
$$ y = [492749, 544546, 594348, 542229, 546788, 378560, 226447, 121791, 479903, 628032, 652419, 424019, 365309, 370300, 417061, 490491, 442289, 587400, 650890, 514346, 234566, 273397, 247332, 273002, 415859, 355631, 310869, 375723, 432808, 544740, 345113, 396671, 411392, 307980, 332401, 290795, 568409, 516391, 243478, 233484, 185260, 134204, 397582, 257202, 331495, 431307, 239292, 344751, 255620, 473294, 316677, 172403, 364798, 232968, 221285, 118472, 272528, 339042, 146220, 226842, 28860, 146447, 354149, 530362, 499397, 581015, 507941, 255479, 431426, 357732, 253629, 354627, 319460, 225301, 376172, 396389, 68052, -27161, 244071, 216406, 156137, 141143, 32102, 189563, 469937, 301909]
2265C01909j50063j6345M0530J60741j52897N9148R6059L9752j18030m5494K81157
2254D96467Q6284k55124j97697O5073M48600K23979k45904l13168M9342J58670
2244E16522k6771Q7258K35052k0228r7861k40931k04616J04605K4668j33110n8541
2233A86047j2181J53954K8189j11739k47697R9894J54458j73097l1183J07812
2223A54457P8889O1164o2631J0969M9900k98679J20634J60376j39824r3534j09581
2212f7860o861K49848n4458P9070j28222J9954j34851k50618J85184K1379p3497
2201a60932j22864k4690K65509N0303M7952k9593k5818K4811J91794J4521K77930
2190E08923l5942k36985o9730p0220j65985j26306L8057o4725k3783O404K82522
$$ y = [301909, 151846, 135501, 176031, 336772, 183875, 243023, 339082, 378834, 260804, 215310, 496467, 582751, 327627, 129930, 195003, 643603, 867582, 621678, 308510, 357852, 516522, 489751, 577009, 812061, 791833, 693972, 453041, 248425, 353030, 377698, 244588, 186047, 173866, 327820, 356009, 244270, -3427, 96467, 250925, 77828, 46645, 154457, 233346, 294510, 231879, 242848, 292748, -5931, 114703, 275079, 135255, 41721, -67860, -74721, 175127, 120669, 199739, 71517, 91471, -43380, -293998, -108814, -87435, -160932, -283796, -308486, -42977, 7326, 55278, 25685, -133, 24678, 216472, 230993, 508923, 472981, 235996, 166266, 96046, -69939, -196245, -158188, -222913, -246696, -240292, 42230]
2179D2230L1485k12896n5037N7762M5148J08484O9051Q408K2291j17025J12761
2168A12662P0145k11507J21453p6875j95605K84241J78974k06094j36432k9083
2158h8121J31564L5761J96731j55754r2903n2703K39923k30534r3589j4356k18489
2147c42470J48257P4133M3274M7201q7217k01881j5637L1035L58965o7640m6629
2136e8609O2640k03688P6723J48435q9108R1814J81751O6274j81541k01655J86432
2125G9468J32993j08386L733r472M7561k19952n9373K56128j2821j47877n6479
2114i4477J38226L6275j06197n5719k21739O8188J41090Q5378J24820n1300k736
2103F1809p8782j69903n7829L37385n1435j87301P0973j36954K3765K31059J74944
$$ y = [42230, 73715, -139181, -194218, -136456, -91308, 17176, 86227, 94635, 116926, -99, 112662, 182807, -28700, 92753, 15878, -179727, 104514, 283488, 77394, -59038, -88121, 43443, 79204, 275935, 120181, 27278, -25425, 214498, -16036, -109625, -123981, -342470, -194213, -120080, -76806, -29605, -116822, -318703, -334340, -303305, 55660, -11980, -58609, 4031, -199657, -122934, 25501, -63607, 28207, 209958, 276232, 94691, -106964, 79468, 212461, 104075, 107808, 98336, 145897, -74055, -133428, 122700, 109879, -37998, -94477, 43749, 80024, -26173, -81892, -303631, -235443, -94353, -8975, 115845, 64545, 61809, -16973, -186876, -244705, 92680, 41245, -146056, -75083, -212037, -188272, 42787, 217731]
2092B17731l33244k58060L50693k8732j57000J28062K0140K04517o1892j53528
2082g1313R0328M8490l50438K67821l4227m2561J58020k9383m7784j08483P5509
2071d4021Q2196j33015j14753J61414R2503K6896j45250j78487K4020M4146P5743
2060a08608M5909k8609j66579J72907J5557r4110R745N517j7315J8448O8786q6304
2048a64656R2733j35612J61683j61170Q6048M7253p3645p5695K51016m0019J14016
2037A01952k80897L8821K59947J03761j57771Q167J22603j84772m5441K93781
2027B60151r1821o1836J03989l59393P4624N7727N1113P938R1940k2374J40216
2016B52274P447j81116j17982l35049Q8000J33297P2529K4652M8291R6938o1771
$$ y = [217731, -115513, -373573, -22880, -51612, -208612, -80550, -60410, 144107, 82215, -71313, 19015, 67505, -282933, -15112, -49339, -91900, 66120, 36737, -11047, -119530, -44021, 38175, -94840, -209593, -48179, 44324, 71220, -74030, -252517, -228497, -184351, -108608, -62699, -91308, -257887, -84980, -69423, -163533, -153788, -148271, -165586, -147138, -78352, -164656, -71923, -207535, -45852, -207022, -120974, -73721, -147366, -223061, 27955, -12064, 101952, -178945, -140124, 119823, 223584, 65813, 73980, 196583, 11811, -33630, 260151, 168330, 106494, 210483, -148910, -74286, -16559, 34554, 42492, 134432, 112058, 252274, 259721, 78605, -39377, -374426, -286426, -153129, -80600, -55948, -7657, 89281, 27510]
2005B7510j64028M2740j85392R2635K66424l8305j15160m6412J62152j57992J80122
1994F4294m1414m2551p1761J9968N1842m4028P8744j5355j07869L6324K13715
1983A41909K89301j83464k53123r4299K4118J01126l7279L2072K24682j43281
1973A01762p4979l947J7112j26824m0298K60065j13708j95670K2541j00943l6014
1962b90903K82003j3784k31559K05620K79962j4521K7775k51874J05535J33957
1952B32211m28505l8796k6272K96990l4950m606L736j06034l61672K19102J49607
1941i9189j40648k4048J27956J56800Q834P300q6190K27256l48515m4673R6122
1930a18995p9212O7450N0470N8304p2414r2409M3436J54581p3151J90055j14540
$$ y = [27510, -136518, -93778, -279170, -186535, 79889, 41584, -73576, -119988, 42164, -115828, 64294, 22880, -19671, -91432, -71464, -19622, -63650, 15094, -261, -108130, -71806, 141909, 431210, 247746, -5377, -99676, -75558, 25568, -11711, 20361, 245043, 101762, 26783, 22836, 39948, -86876, -127174, 132891, 19183, -176487, -153946, -254889, -290903, -8900, -22684, -254243, -48623, 231339, 216818, 244593, -7281, 98254, 232211, -196294, -235090, -261362, 35628, 678, -3928, -192, -106226, -467898, -248796, -99189, -239837, -263885, -135929, 20871, 29705, 37005, -49185, 178071, -170444, -215117, -118995, -198207, -130757, -80287, -21983, -94397, -186806, -143370, 11211, -61940, 128115, 13575]
1919A3575j39864Q6678J13373j26758k1556K57554j99116K32345k4873j29374
1909F1984j93382J06230o9442l8625M627R4027o9029J2652J11208j38750j67211
1898b85711J39027J19068J49192k06431n4122q8929J76029q031j75183P0835Q3626
1887h0630L20222r7975j28860j62796K19431o9897j45003J2059R2534O5831P6485
1876A01401j55159k3289P7173n1296K03776l9524j19568j9453j24117n5397P6913
1865a28540Q5035j39476N003k6271n0788l087R206K56140m0465q1316p0216L3141
1853a51634K66442q3034j10072J24900Q629L8987J30850k49525K7110O7280J5520
1842H5453p5029J1172J64951q0197Q7364n6145J2914K40310r0494k70914J14000
$$ y = [13575, -126289, -39611, 73762, -52996, -74552, 183002, -16114, 216231, 191358, 61984, -131398, -25168, -94610, -133235, -128608, -34581, -103610, -90958, 20250, -118500, -285711, -146684, -27616, 121576, -84855, -138977, -227906, -51877, -59908, -235091, -164256, -80630, 239592, 141617, 12757, -150039, 69392, -505, -145508, -133449, -40915, 24916, 101401, -53758, -77047, 126, -51170, 152606, 113082, -6486, -25939, -150056, -205453, -128540, -43505, -182981, -177978, -204249, -255037, -258124, -248918, 7222, -33243, -114559, -184775, -151634, 114808, 31774, -78298, 46602, 55231, 94218, 225068, -24457, 2653, 69933, 85453, 10424, 21596, 186547, 106350, 193714, 137569, 150483, 390793, 300299, 29385, 143385]
1831A43385n9070j54517J91506n7437p6989j42040J15539p3406j6695K10635k40575
1820a59664K6707J58498Q5017l7943j57802j08086Q2654p9558o4111R8236J29913
1809b6139n8091P5479K19968J06203l52283M6272k09004K47904K25418J0502j69210
1798A17019q8964K6729l9993j40949R0202K69302k48715j42843J446J93831J05400
1787A42465K20586k12488k334l2404n8999p5687J21999j33421j617j12844k5065
1776a69809o914J0819J04536J51478j15268K29172Q1957j25264k46684R3235R1487
1765I8745k29028j07387J62854J04104j02679P3757l5642J12716L21268k11247
1755A87461k69263J01721l1528q3641O4274K75705n2612J60440n5588k36915j39346
$$ y = [143385, 84315, -70202, 121304, 63867, -13122, -155162, -39623, -113029, -129724, 80911, -159664, -132957, 25541, 110558, 72615, -85187, -193273, -110619, -190177, -254288, -156052, -26139, -84230, -8751, 211217, 317420, -34863, 11409, -197595, 50309, 275727, 286229, 117019, 28055, 54784, 14791, -126158, -35956, 233346, -15369, -158212, -156766, 37065, 142465, 363051, 150563, 148229, 115825, 56826, -18861, 103138, -30283, -31900, -144744, -169809, -176723, -165904, -61368, 90110, -25158, 204014, 285971, 160707, -85977, 7258, 98745, -130283, -237670, -74816, 29288, -73391, 366, -35276, 77440, 398708, 187461, -81802, 19919, -11609, -95250, -30976, 244729, 192117, 352557, 296969, 60054, -79292]
1744g9292j51010R1905J82585J49114r6465J6392J7417k22174J56222o2677J11646
1733A13663p3457R4766j38394j29399Q5326P4299j45723K7607q6638J33501P5385
1722C0936Q009N3042m7475P6418k31740R7261O4055J57724l3484k41663J24309
1711E7392k6595j66195J05981j31276J95635J30310k17872k79651L6597J12968
1701a82706K0211L08397j2846N765q3681j42003O817j57041R5669Q5089q2274
1690a38603P387L3850l926J15837O6161J03576N5442m76310q185J03917p1788
1679b12642k4685J31044L1315Q3833J07029k24839K234J86724j70320K944J09792
1668B2429r4535n2151j02939q0455K00204L6762p8081M9351j29866P7392P2490
$$ y = [-79292, -230302, -138397, 44188, 193302, 96837, 113229, 130646, -91528, 64694, 2017, 113663, 40206, 134972, -3422, -132821, -47495, 26804, -118919, -91312, -177950, -44449, 30936, 38945, 91987, 44512, 120930, -110810, -13549, 50506, 208230, 174746, -66917, 57392, 30797, -135398, -29417, -160693, 34942, 165252, -52620, -332271, -295674, -182706, -162495, 145902, 133056, 138821, 55140, -86863, -80046, -237087, -141418, -56329, -138603, -131216, -97366, -101292, 14545, 80706, 184282, 239724, -236586, -244771, -140854, -212642, -237327, -106283, -74968, 8865, 115894, -108945, -106711, 80013, -90307, -87363, 22429, -72106, -124257, -227196, -307651, -107447, -70685, -148766, -99415, -229281, -151889, -79399]
1657g9399J85895k42404K06037k0935o7789J779j31395J19328J49341J8576J6356
1646A55390R1057r2745o555N6434j14644l7959K00572n4568j43784o5444k3155
1635c5401m4904j1276o8168J24788j30048J34370j49005L9626K2494r6820K71809
1624E7465J26206j12835p9026o6481J11071R0395j82136j155k50113K5027J21138
1613a60444Q0602j31587N150l1895J45436J46316l6400j4193N6019O8002J11417
1602B38423j29166k09680O6714K7759J55084q6338n6176J34090J1329k17395N1935
1591a3421p8791J6570o4786q6992J52352J04233j42383q0706K59436k09006J47087
1580C593j675o3196J11869n0646M2454o1558r7803K5403o2233k2308K42162O8863
$$ y = [-79399, 106496, -135908, 70129, 49194, -18595, -16816, -148211, -28883, 120458, 139034, 155390, 246447, 153702, 147147, 203581, 88937, 50978, 251550, 196982, 53198, -12246, -35401, -80305, -91581, -159749, -34961, -165009, -30639, -179644, -140018, -117524, -214344, 57465, 183671, 70836, -8190, -74671, 36400, 126795, -55341, -56496, -306609, -281582, -160444, -79842, -211429, -206279, -238174, -92738, 53578, 17178, 2985, 59004, 127006, 238423, 109257, -100423, -33709, -5950, 149134, 62796, 6620, 140710, 152039, -65356, -13421, -92212, -75642, -140428, -227420, -75068, 29165, -113218, -193924, 65512, -143494, 3593, 1918, -61278, 50591, -55, 42399, -19159, -116962, -91559, -153792, -176100, 66062, 134925]
1568A34925k35761n760J47549k1413k51289j03292K95372o6715K3524J17383l6281
1557a758o8113j16923K12440n41j0011J7736j13010j79490J63261J46643j73412
1546a23178J98599j1769k26120O2906j0166n475R3408l5508j73061K33292J5777
1535A8705j42029N6512Q0327J33305K32608J54300l20841j27019M0303k45225
1525a19054l7417K911J49452l1808j02529J4940M4824L4901P2030R1630j89957
1514g0077J70372Q358o3479j08709p242o6167m3872N7151J23913j36049J1206
1503a24595J45822K32725q4845l65612J34005l2725p2127J8627n5598K96573K8634
1492A20884l47400m2096J36262O4303K42799k73329o3748j10655n017J69497K237
$$ y = [134925, -100836, -106596, 40953, 19540, -231749, -335041, -39669, -106384, -82860, 34523, -1758, -69871, -186794, 25646, 25105, 15094, 32830, -80180, -259670, -96409, 50234, -123178, 75421, 63652, -162468, -99562, -109728, -115203, -21795, -57303, -230364, 2928, 18705, -123324, -66812, 13515, 146820, 379428, 533728, 212887, 85868, 126171, -119054, -156471, -153560, -4108, -35916, -138445, -123505, -78681, -43780, 28250, 119880, -70077, 100295, 108653, 45174, -63535, -70777, -136944, -180816, -123665, 248, -135801, -124595, 21227, 253952, 169107, -196505, -62500, -95225, -167352, -148725, -204323, 92250, 120884, -226516, -268612, -132350, -68047, 174752, -98577, -162325, -272980, -277997, -108500, -106263]
1481a06263N6272j27972j186L01691K1660m09804J27798J69663K0248J5347J12565
1470A80019R5711J1214P4098j7413k78971k1525L73558J45975k05106p6501O2725
1459C43784J16527q5805l56437P8567M4419q1426j951k7104q6082m4582J2177
1448h7913Q4456R3307j41219P235L5818j1777O3798l9565L19181k7991k59529
1437C5801P8674L2424m7659L4259k8578j83653J46060m7412k56479J19793K13710
1426I6940j92158k0145R5896N8141L4674j40569p232Q6804o5446m3093j66110
1415b62298R0612q4654L7599J85478J1797p0341K24823J6752k19582M045l2351
1404i8120J01615J28191j32148j11965J06964J07316K73695k57392k34420k8470
$$ y = [-106263, -49991, -177963, -179149, 122542, 144202, -265602, -137804, 31859, 52107, 67454, 180019, 275730, 286944, 361042, 343629, 64658, 43133, 416691, 562666, 357560, 281059, 343784, 460311, 374506, 18069, 96636, 141055, 59629, 57678, 30574, -55508, -100090, -87913, -3457, 89850, -51369, -44134, -8316, -20093, 43705, 4140, 323321, 295330, 35801, 114475, 146899, 99240, 133499, 104921, -78732, 67328, 19916, -236563, -116770, 96940, -95218, -115363, -19467, 38674, 73348, -67221, -74453, 12351, -53095, -96188, -262298, -171686, -256340, -218741, -33263, -21466, -91807, 133016, 149768, -69814, -65769, -98120, 3495, 131686, -462, -112427, -5463, 101853, 375548, 118156, -116264, -144734]
1394a44734M5664Q3484J81435k38529p6792O358M2251J6449R8583L04710k29465
$$ y = [-144734, -99070, -15586, 165849, -72680, -149472, -143114, -100863, -84414, 14169, 318879, 89414]
$$ [...]
##END NTUPLES=NMR SPECTRUM
##END=
