##TITLE=1H_EC-3260(9)
 CDCl3, 8 sc, 
 24.08.2021
##JCAMPDX= 6.0         $$ Bruker NMR JCAMP-DX V2.0
##DATA TYPE= NMR SPECTRUM
##DATA CLASS= NTUPLES
##ORIGIN= UXNMR, Bruker Analytische Messtechnik GmbH
##OWNER= root
$$ XWIN-NMR		Version 3.5
$$ Tue Aug 24 09:16:21 2021 Russian Standard Time (UT+4h)  she@DPX200
##.OBSERVE FREQUENCY= 200.131506
##.OBSERVE NUCLEUS= ^1H
##.ACQUISITION MODE= SIMULTANEOUS
##.ACQUISITION SCHEME= undefined
##.AVERAGES= 8
##.DIGITISER RES= 18
##SPECTROMETER/DATA SYSTEM= spect
##.PULSE SEQUENCE= zg30
##.SOLVENT NAME= D2O
##.SHIFT REFERENCE= (INTERNAL, D2O, 0, 17.4971)
##AUDIT TRAIL= $$ (NUMBER, WHEN, WHO, WHERE, WHAT)
$$ ##TITLE= Audit trail, XWIN-NMR		Version 3.5
$$ ##JCAMPDX= 5.01
$$ ##ORIGIN= Bruker BioSpin GmbH
$$ ##OWNER= she
$$ F:/spectra/data/she/nmr/H-F/1/pdata/1/auditp.txt
$$ ##AUDIT TRAIL=  $$ (NUMBER, WHEN, WHO, WHERE, WHAT)
(   1,<2021-08-24 09:14:29.64 +0400>,<she>,<DPX200>,
      <created by zg, POWCHK disabled, PULCHK disabled
       configuration hash MD5:
       00 E9 B6 7A A2 85 ED C7 34 08 36 98 17 FE 4E 26
       data hash MD5: 16K
       F6 12 D9 66 1B 30 56 44 77 58 24 3E E4 74 FC F4>)
(   2,<2021-08-24 09:14:32.12 +0400>,<she>,<DPX200>,
      <Start of raw data processing
       efp BC_mod = 2 LB = 0.24 FT_mod = 6 PKNL = 1 PHC0 = -13355.84 PHC1 = 11.401 SI = 16K 
       data hash MD5: 16K
       BF 37 F4 10 48 CE 3C F0 C2 67 DC 5B 67 19 DE D0>)
(   3,<2021-08-24 09:14:53.20 +0400>,<she>,<DPX200>,
      <pk PHC0 = -0.9069113 PHC1 = -1.192093e-07 
       data hash MD5: 16K
       3E 81 CD 2A 86 3C BF D0 82 8D 38 E4 6A 6D C1 63>)
(   4,<2021-08-24 09:14:56.07 +0400>,<she>,<DPX200>,
      <abs ABSG = 5 
       data hash MD5: 16K
       0C CB F7 FB 78 23 C8 9D 2B 7F A5 0C 2A 0E 08 B2>)
$$ ##END=
$$ 
$$ hash MD5
$$ C9 32 E6 4E 4A EE 75 82 B6 A6 48 C8 5A FE E5 95
##$RELAX= 
##$RELAX= 
##$RELAX= 
##$RELAX= 
##$RELAX= 
##$RELAX= 
$$ Bruker specific parameters
$$ --------------------------
##$DU= <F:/spectra>
##$EXPNO= 1
##$NAME= <H-F>
##$PROCNO= 1
##$TYPE= <nmr>
##$USER= <she>
##$AMP= (0..31)
100 100 100 100 100 100 100 100 100 100 100 100 100 100 100 100 100 100 
100 100 100 100 100 100 100 100 100 100 100 100 100 100 
##$AQSEQ= 0
##$AQ_mod= 1
##$AUNM= <au_zg>
##$AUTOPOS= <>
##$BF1= 200.13
##$BF2= 200.13
##$BF3= 200.13
##$BF4= 200.13
##$BF5= 200.13
##$BF6= 200.13
##$BF7= 200.13
##$BF8= 200.13
##$BYTORDA= 1
##$CFDGTYP= 0
##$CFRGTYP= 5
##$CHEMSTR= <none>
##$CNST= (0..31)
1 1 145 1 1 1 1 1 1 1 1 1 1 1 1 1 1 1 1 1 1 1 1 1 1 1 1 1 1 1 1 1 
##$CPDPRG= <>
##$CPDPRG1= <>
##$CPDPRG2= <>
##$CPDPRG3= <>
##$CPDPRG4= <mlev>
##$CPDPRG5= <mlev>
##$CPDPRG6= <mlev>
##$CPDPRG7= <mlev>
##$CPDPRG8= <mlev>
##$CPDPRGB= <>
##$CPDPRGT= <>
##$D= (0..31)
0 1.2 0 0 0 0 0 0 0 0.06 0 0.03 0 0 0 0 0.0002 0 0 0 0 0 0 0 0 0 0 0 0 
0 0 0 
##$DATE= 1629782069
##$DBL= (0..7)
120 120 120 120 120 120 120 120 
##$DBP= (0..7)
150 150 150 150 150 150 150 150 
##$DBP07= 0
##$DBPNAM0= <>
##$DBPNAM1= <>
##$DBPNAM2= <>
##$DBPNAM3= <>
##$DBPNAM4= <>
$$ [...]
##$SUBNAM3= <"">
##$SUBNAM4= <"">
##$SUBNAM5= <"">
##$SUBNAM6= <"">
##$SUBNAM7= <"">
##$SUBNAM8= <"">
##$SUBNAM9= <"">
##$SW= 20.0188882624521
##$SWIBOX= (0..15)
0 0 2 0 0 0 0 0 0 0 0 0 0 0 0 0 
##$SW_h= 4006.41025641026
##$TD= 16384
##$TD0= 1
##$TE= 0
##$TE2= 300
##$TE3= 300
##$TEG= 300
##$TL= (0..7)
0 120 120 120 120 120 120 120 
##$TP= (0..7)
150 150 150 150 150 150 150 150 
##$TP07= 0
##$TPNAME0= <>
##$TPNAME1= <>
##$TPNAME2= <>
##$TPNAME3= <>
##$TPNAME4= <>
##$TPNAME5= <>
##$TPNAME6= <>
##$TPNAME7= <>
##$TPOAL= (0..7)
0.5 0.5 0.5 0.5 0.5 0.5 0.5 0.5 
##$TPOFFS= (0..7)
0 0 0 0 0 0 0 0 
##$TUNHIN= 0
##$TUNHOUT= 0
##$TUNXOUT= 0
##$USERA1= <user>
##$USERA2= <user>
##$USERA3= <user>
##$USERA4= <user>
##$USERA5= <user>
##$V9= 5
##$VALIST= <valist>
##$VCLIST= <CCCCCCCCCCCCCCC>
##$VD= 0
##$VDLIST= <DDDDDDDDDDDDDDD>
##$VPLIST= <PPPPPPPPPPPPPPP>
##$VTLIST= <TTTTTTTTTTTTTTT>
##$WBST= 1024
##$WBSW= 4
##$XGAIN= (0..3)
0 0 0 0 
##$XL= 0
##$YL= 0
##$YMAX_a= 182446
##$YMIN_a= -295363
##$ZGOPTNS= <>
##$ZL1= 120
##$ZL2= 120
##$ZL3= 120
##$ZL4= 120
##$ABSF1= 17.52154
##$ABSF2= -2.497499
##$ABSG= 5
##$ABSL= 3
##$ALPHA= 0
##$AQORDER= 0
##$ASSFAC= 0
##$ASSFACI= 0
##$ASSFACX= 0
##$ASSWID= 0
##$AUNMP= <proc_1d>
##$AZFE= 0.1
##$AZFW= 0.1
##$BCFW= 0
##$BC_mod= 2
##$BYTORDP= 0
##$COROFFS= 0
##$CY= -3
##$DATMOD= 1
##$DC= 0
##$DFILT= <>
##$DTYPP= 0
##$F1P= 0
##$F2P= 0
##$FCOR= 1
##$FTSIZE= 16384
##$FT_mod= 6
##$GAMMA= 0
##$GB= 0
##$INTBC= 1
##$INTSCL= 1.334414e-10
##$ISEN= 128
##$LB= 0.24
##$LEV0= 0
##$LPBIN= 0
##$MAXI= 10000
##$MC2= 0
##$MEAN= 0
##$ME_mod= 0
##$MI= 1.114404
##$NCOEF= 0
##$NC_proc= -7
##$NLEV= 6
##$NOISF1= 3.799351
##$NOISF2= 2.8
##$NSP= 0
##$NTH_PI= 0
##$NZP= 0
##$OFFSET= 17.49711
##$PC= 1
##$PHC0= -13356.75
##$PHC1= 11.401
##$PH_mod= 1
##$PKNL= yes
##$PPARMOD= 0
##$PSCAL= 0
##$PSIGN= 0
##$REVERSE= no
##$SF= 200.130007507903
##$SI= 16384
##$SIGF1= 3
##$SIGF2= 2
##$SINO= 5.538805
##$SIOLD= 16384
##$SREGLST= <1H.CDCl3>
##$SSB= 0
##$STSI= 16384
##$STSR= 0
##$SW_p= 4006.41025641026
##$SYMM= 0
##$S_DEV= 0
##$TDeff= 16384
##$TDoff= 0
##$TI= <>
##$TILT= no
##$TM1= 0
##$TM2= 0
##$TOPLEV= 0
##$USERP1= <user>
##$USERP2= <user>
##$USERP3= <user>
##$USERP4= <user>
##$USERP5= <user>
##$WDW= 1
##$XDIM= 16384
##$YMAX_p= 398652593
##$YMIN_p= -587296
$$ End of Bruker specific parameters
$$ ---------------------------------
##NTUPLES= NMR SPECTRUM
##VAR_NAME=  FREQUENCY,     SPECTRUM/REAL,   SPECTRUM/IMAG
##SYMBOL=    X,             R,               I
##VAR_TYPE=  INDEPENDENT,   DEPENDENT,       DEPENDENT
##VAR_FORM=  AFFN,          ASDF,            ASDF
##VAR_DIM=   16384,         16384,           16384
##UNITS=     HZ,            ARBITRARY UNITS, ARBITRARY UNITS
##FACTOR=    0.24454680195387, 1,            1
##FIRST=     3501.69682907855, 0,            0
##LAST=      -504.713427331708, 0,           0
##MIN=       -504.713427331708, -587296,     0
##MAX=       3501.69682907855, 398652593,    0
$$ Real data points
##PAGE= N=1
##DATA TABLE= (X++(R..R)), XYDATA
$$ [...]
6850d376p3894R2652K84834p8520k21509n1283Q5675n6584R6195O1858n8854l8350
$$ -4376 -78270 14382 299216 220696 -813 -52096 33579 -23005 73190 135048 76194 37844
6838C7844q8977r6586J91852K20921J40365j52586l52412P3755L935J55732K2097
$$ 37844 -51133 -147719 44133 265054 405419 252833 -99579 -25824 -21889 133843 155940
6827A55940k18495J06937N0155k13326J38478P1481r3147K2549o2122P8318M5111
$$ 155940 -62555 44382 94537 -118789 19689 91170 -1977 20572 -41550 36768 81879
6816H1879J15740N8038k87526L5036j68873J8292K57626Q6099Q1608k97482R9021
$$ 81879 197619 255657 -31869 3167 -165706 -147414 110212 196311 277919 -19563 79458
6805G9458j90349o1703P1842J31078O3611j62517j41438n5632L66195l1647j48093
$$ 79458 -110891 -172594 -100752 30326 93937 -68580 -210018 -265650 100545 68898 -79195
6794g9195J0063J20214j71108q3709J24384R626j71243K12550J8488J68520k6046
$$ -79195 -69132 51082 -120026 -203735 -79351 -69725 -240968 -28418 -9930 158590 132544
6783A32544j15575l2994K19754J113j10190j30234m0454L28667K3710n7099q0278
$$ 132544 16969 -16025 203729 204842 94652 -35582 -76036 252631 276341 219242 138964
6772A38964K407j75152j78582Q2609m2467o596J38754J85964j03990P7615q4299
$$ 138964 141371 -33781 -212363 -129754 -172221 -178817 -40063 145901 41911 119526 35227
6761C5227r5536j1565K18611K58329k22341p8936R2289q9839j2783J62951J64472
$$ 35227 -60309 -71874 146737 405066 182725 103789 196078 106239 93456 256407 420879
6750D20879j77417o5628j6032k4521l9107R5294J14970r9143O5207j19568J12755
$$ 420879 243462 177834 161802 137281 98174 193468 308438 209295 274502 154934 267689
6739B67689P9213j56238k07584J71880J09404j02967k32912J17590K9179L05126
$$ 267689 346902 190664 -16920 154960 264364 161397 -71515 46075 75254 380380
6729C80380q6544J19502M6608j82836l15301K7693J87727K8221N4180j09535K17971
$$ 380380 293836 413338 459946 277110 -38191 -10498 177229 205450 259630 150095 368066
6718C68066P1114o1976r1487M040j04933N8414P8423Q1876P0173p9234m7066q6881
$$ 368066 439180 377204 285717 289757 184824 243238 321661 403537 473710 394476 347410 260529
6706B60529K4456K29123q8337r145J08887p3132O7288O336j092N0414m5762o9321
$$ 260529 284985 514108 425771 416626 525513 452381 519669 526005 524913 575327 529565 460244
6694D60244M6827j50623R0307j00824p7698R3415j51001J45184L9550P0284M32028
$$ 460244 507071 356448 446755 345931 268233 361648 210647 355831 395381 465665 897693
6683H97693j85453k7573j90473J4931J93137R4741j82405J82858N6205l02238
$$ 897693 712240 684667 494194 509125 702262 797003 614598 797456 853661 551423
6673E51423J3220M8049o156j26868J82513r1273L5217K31739K21641j80911O3191
$$ 551423 564643 612692 606536 479668 662181 570908 606125 837864 1059505 878594 941785
6662I41785n7942k66015J85140K5323L5828k9214k45495O344L36747j68650j04662
$$ 941785 883843 617828 802968 828291 864119 834905 589410 595754 932501 763851 659189
6651F59189J35115K05847J8803j3847J46852m0992M6156l43436K0644m4048K99467
$$ 659189 794304 1000151 1018954 1005107 1151959 1110967 1157123 813687 834331 790283 1089750
6640A089750l5804k7519J7025Q9170o1352L83767p8379R3413j41802M8616R8000
$$ 1089750 1053946 1026427 1043452 1132622 1071270 1455037 1376658 1470071 1328269 1376885 1474885
6629A474885Q7888J21243l8931J22472j70883q9717J70161K99709J10149p7706
$$ 1474885 1562773 1684016 1645085 1767557 1596674 1506957 1677118 1976827 2086976 2009270
6619B009270J55349J3883J38400O2101M0481K8161K7780L28031J59197p0148q0415
$$ 2009270 2164619 2178502 2316902 2379003 2419484 2447645 2475425 2803456 2962653 2892505 2812090
6608B812090Q9414j28463L8028K60631K53188p3917K40310j58112L59809n4191
$$ 2812090 2901504 2773041 2811069 3071700 3324888 3250971 3491281 3333169 3692978 3638787
6598C638787j16946K15240L22445q7810N5980J12211l2696K69189K87806J21768
$$ 3638787 3521841 3737081 4059526 3971716 4027696 4139907 4107211 4376400 4664206 4785974
6588D785974P2517J45280L325K04516J93365L94469M43115L44445M07950K70536
$$ 4785974 4858491 5003771 5007096 5211612 5404977 5799446 6242561 6587006 6994956 7265492
6578G265492L4305K61898L37206L96789K04609M10744O11388P90138N73667N03911
$$ 7265492 7299797 7561695 7898901 8295690 8500299 8911043 9522431 10312569 10886236 11390147
6568A1390147M84341O58650Q69348P30313P71967P31242J551378J535025J717958
$$ 11390147 11874488 12533138 13402486 14132799 14904766 15636008 17187386 18722411 20440369
6559B0440369K221445K435519K810288L587244L596530L812719M114798N096288
$$ 20440369 22661814 25097333 27907621 31494865 35091395 38904114 43018912 48115200
6551D8115200O169637P575417R345019J0204813Q780842M240540k127710p853736
$$ 48115200 54284837 61860254 71205273 81410086 90190928 94431468 92303758 84450022
6543H4450022j0447228r373840o861729m633107k197245m76919J216699K156528
$$ 84450022 74002794 64628954 57767225 53134118 50936873 50459954 51676653 53833181
6535E3833181J824584M75406j721551l953416n579321n151823m613641l645050
$$ 53833181 55657765 56133171 54411620 50458204 44878883 39727060 35113419 31468369
6527C1468369k877449j970334j629665j220966p87446q50356r56653q53369q15961
$$ 31468369 28590920 26620586 24990921 23769955 22982509 22132153 21175500 20322131 19506170
6518A9506170l06998q0868J13971N46934O71934Q28572R39814J722838K044164
$$ 19506170 19199172 19118304 19232275 19779209 20451143 21279715 22219529 23942367 25986531
6509B5986531K575962K447241K351549J214102q56131k721251l307594l491804
$$ 25986531 28562493 31009734 33361283 34575385 33719254 30998003 27690409 24198605
6501B4198605l262905k298387j813602j713128j401287j064722r42292p94368
$$ 24198605 20935700 18637313 16823711 15110583 13709296 12644574 11702282 10907914
6493A0907914q78138n89408o23774n86893o58366m35965k41093j95219l24274
$$ 10907914 10029776 9440368 8816594 8229701 7571335 7135370 6894277 6699058 6374784
6484F374784m80654l75174j81829k10362l4124j66166k41754j19604j81009J54878
$$ 6374784 5894130 5518956 5337127 5126765 5092641 4926475 4684721 4565117 4384108 4538986
6474D538986l40803m0272r3711j01468l59576l06658r0321J6989m1071J18325
$$ 4538986 4198183 4157911 4064200 3962732 3603156 3296498 3206177 3223166 3182095 3300420
6464C300420m01802p4633m9872J14362l8182m7781j67301k07991n0754R2671K8864
$$ 3300420 2898618 2823985 2774113 2888475 2850293 2802512 2635211 2427220 2376466 2469137 2498001
6453B498001j07230k6108m4856j64777R181q0334Q2001m4904k00766j26938l57000
$$ 2498001 2390771 2364663 2319807 2155030 2164211 2083877 2165878 2120974 1920208 1793270 1436270
6442A436270K39478j98470k9869N5869O2120k3023O9053r4103k45269K49487J11456
$$ 1436270 1675748 1477278 1447409 1503278 1565398 1542375 1611428 1517325 1272056 1521543 1632999
6431A632999j52634K2304j87893j09629j7573j93537j7655q0719n006o182L5021
$$ 1632999 1480365 1502669 1314776 1205147 1187574 994037 976382 895663 890657 884475 919496
6420I19496J8350j23344R0053k87255J576P0282O2061M0104J72009K68368O8074
$$ 919496 937846 814502 904555 617300 618876 689158 751219 791323 963332 1231700 1299774
6409A299774j13711j23970j06062j86616j89437J85561j22560R3147j03620j65993
$$ 1299774 1186063 1062093 956031 769415 579978 765539 642979 736126 632506 466513
6399D66513o7140r8160J85085J14926K04092j46172P966q5589L4379q5181J02901
$$ 466513 399373 301213 486298 601224 805316 659144 667110 581521 615900 530719 633620
6388F33620j24757j02811l0581k6881P5090M489k90443n4160P2719J03422K21976
$$ 633620 508863 406052 375471 348590 423680 428169 137726 83566 156285 259707 481683
6377D81683l1022j9742j98770l9352R7889r6915j24240k0192J16928M1294J06659
$$ 481683 450661 430919 232149 192797 290686 193771 69531 49339 166267 207561 314220
6366C14220L2157L4507J85721k61157j52964J4993l897J10808J4287j18769q7865
$$ 314220 346377 380884 566605 305448 152484 167477 163580 274388 288675 169906 82041
6355H2041j12724L18708J60066l6841j17970L6924k31041J22653P1083r0018K5999
$$ 82041 -30683 288025 448091 411250 293280 330204 99163 221816 292899 202881 228880
6344B28880m0783j0214J1111L9746K7714P3332J04989m00483J08251J5572j43881
$$ 228880 188097 177883 188994 228740 256454 329786 434775 34292 142543 158115 14234
6333A4234J18640N8166l7496l3431J16126J29330k19887l5736K9488k17861L26731
$$ 14234 132874 191040 153544 120113 236239 365569 145682 109946 139434 -78427 248304
6322B48304K5548j15143j33624j08829P2241m1991J82501O0912k32443q082j77434
$$ 248304 273852 158709 25085 -83744 -11503 -53494 129007 189919 -42524 -50606 -228040
6311b28040R4212J7439M7149K2106P3852Q6874j15476J41436M1168o3655n5767
$$ -228040 -133828 -116389 -69240 -47134 26718 113592 -1884 139552 180720 117065 61298
6300F1298K28981r0056n7309n6704l55197J03692p1010N2202J43945O4557P5280
$$ 61298 290279 200223 142914 86210 -268987 -165295 -236305 -184103 -40158 24399 99679
6289I9679p0638r5705K02506j55095n2547j6626N3513Q3703J05276J23028J17759
$$ 99679 29041 -66664 135842 -19253 -71800 -88426 -34913 48790 154066 277094 394853
6278C94853o7290n5022j28482j27408m4811q5522O6765K27608j9294j8003K1634
$$ 394853 327563 272541 144059 16651 -28160 -113682 -46917 180691 161397 143394 165028
6267A65028k38360j56461J9394J98719j00070k1844J60767P4579p804m0505j57315
$$ 165028 -73332 -229793 -210399 -11680 -111750 -133594 27173 101752 93948 53443 -103872
6256a03872J12440o1903M7157K21173j08938N7802j50913O9896J32075k119k05338
$$ -103872 8568 -53335 -6178 214995 106057 163859 12946 82842 214917 212798 7460
6245G460K6984p6646o6960J88225R3309j29127M0117j58906K3647K02630j91132
$$ 7460 34444 -42202 -109162 79063 172372 43245 83362 -75544 -51897 150733 -40399
6234d0399J54841L45628k27802j21441j42772N977K56436j19807l7634k04219
$$ -40399 114442 460070 232268 110827 -31945 -25968 230468 110661 73027 -131192
6224a31192L9650o7893J27088R6423j60122j03018n8304J44842J65977o0416M3318
$$ -131192 -91542 -159435 -32347 64076 -96046 -199064 -257368 -112526 53451 -6965 36353
6213C6353N4628P390R0012M5420k32787l1217N3234M853j12816J36974j01851
$$ 36353 90981 98371 188383 233803 1016 -30201 23033 27886 -84930 52044 -49807
6202d9807J05084M9164r1962Q5434k2020J81218L1774j58110j09800Q0125P4986
$$ -49807 55277 104441 12479 97913 75893 257111 288885 130775 20975 101100 176086
6191A76086K1175j14774Q3920J0244K65574R2545j45275J85041m5907K2073R0213
$$ 176086 197261 82487 166407 176651 442225 534770 389495 574536 528629 550702 640915
6180F40915q376k07494j44804l689J61450o0494j68781l0608J09K9611n5342l3225
$$ 640915 632539 425045 280241 276552 438002 377508 208727 178119 178228 207839 152497 119272
6168A19272l9331k36463R6170J89534R148Q6966j125k18125k4854J15898k7329
$$ 119272 79941 -156522 -60352 129182 138330 225296 224171 6046 -18808 97090 69761
6157F9761M6999j4309q3438N3513K16846j49596M6711J63024L5067j33234l7442
$$ 69761 116760 102451 19013 72526 289372 139776 186487 349511 384578 251344 213902
6146B13902r153O5978n2493P2801j47744r3109J69703p5120o3809k867J45298
$$ 213902 204749 270727 218234 291035 143291 50182 219885 144765 80956 78089 223387
6135B23387M3077j39583j17858j13342J75030n7984k01987J03784l3012J19369
$$ 223387 266464 126881 9023 -104319 70711 12727 -189260 -85476 -118488 881
6125H81J13306M4904j31841J17060J44378j10568k86954p2034K2712J3966P235
$$ 881 114187 159091 27250 144310 288688 178120 -108834 -180868 -158156 -144190 -136955
6114a36955K530K69788j19192J6870O6298k8043j37108k06810L5957K78614Q7908
$$ -136955 -134425 135363 16171 33041 99339 71296 -65812 -272622 -236665 41949 129857
6103A29857K2973O0544l14851J86008k1363J11612k34577L30374k24081j6748
$$ 129857 152830 213374 -101477 84531 63168 174780 -59797 270577 46496 29748
6093B9748L388P6552L7699l9305J47809j50954K79982q5158j11623J36178M7383
$$ 29748 33136 109688 147387 108082 255891 104937 384919 299761 188138 324316 371699
6082C71699k16928P239j8508P7742j15316J00990j27149j09301j56919L10521
$$ 371699 154771 162010 143502 221244 105928 206918 79769 -29532 -186451 124070
6072A24070j28258j06813Q557O612L0277k7509r5837k1951m8513M69148K4571
$$ 124070 -4188 -111001 -102444 -95832 -65555 -93064 -188901 -210852 -259365 209783 234354
6061B34354J250j7078k7055r8353j84088J11271r9628q6063J66893J66267j6915
$$ 234354 235604 218526 191471 93118 -90970 20301 -79327 -165390 1503 167770 150855
6050A50855k54849N449K91648j0531j79092j3097J36229j01167O6679j61198J31151
$$ 150855 -103994 -98545 193103 182572 3480 -9617 126612 25445 92124 -69074 62077
6039F2077k68734J29175J12797j5821o6605J55387j70207J24815J33540r3369
$$ 62077 -206657 -77482 35315 19494 -47111 108276 -61931 62884 196424 103055
6029A03055J38254K8253k50436o2700p5992m7837L6368L3190M8534j71831j4682
$$ 103055 241309 269562 19126 -43574 -119566 -167403 -131035 -97845 -49311 -221142 -235824
6018b35824l4433J00974L5230n8790L0346N2911j56862m7871K73483J47435k2203
$$ -235824 -270257 -169283 -134053 -192843 -162497 -109586 -266448 -314319 -40836 106599 84396
6007H4396o4543O4051J63237j56830k41579K29093N7823l14179J17235o7675j0322
$$ 84396 19853 83904 247141 90311 -151268 77825 135648 -178531 -61296 -128971 -139293
5996a39293J30839m8772j95506P0421K66867P5877p2395N6363j99530l5524R2711
$$ -139293 -8454 -57226 -252732 -182311 84556 160433 88038 144401 -55129 -90653 2058
5985B058Q766j20402M8118o9464J92570k06833J90573J22954j27330K10714K5297
$$ 2058 10824 -109578 -61460 -130924 61646 -145187 45386 168340 41010 251724 277021
5974B77021J02751k32638M3969Q1254j55696L6089j28403N8434L58476j21075
$$ 277021 379772 147134 191103 272357 116661 152750 24347 82781 441257 320182
5964C20182k29789k52667L5447K16754n8575k938r7632k75146P6778K01177J3681
$$ 320182 90393 -162274 -126827 89927 31352 28414 -69218 -344364 -267586 -66409 -52728
5953e2728p0818J43353j04969M0931K8571O2704L9965j25058R2648j73349K0023
$$ -52728 -123546 19807 -85162 -44231 -15660 47044 87009 -38049 54599 -118750 -98727
5942i8727Q7834L7405k65122L91629Q1054k10916K24247j53385N2368r2401O9097
$$ -98727 -10893 26512 -238610 153019 234073 23157 247404 94019 146387 53986 123083
5931A23083j02940M3604N0556p8346L4898j05964L6501K32736n8528l01208N0448
$$ 123083 20143 63747 114303 35957 70855 -35109 1392 234128 175600 -125608 -75160
5920g5160J96381n6874J13492P4800n6652k19339o0908J1282J15195k71820J69918
$$ -75160 121221 64347 177839 252639 195987 -23352 -84260 -72978 42217 -229603 -59685
5909e9685M74847j21706l35182R5433K6215o5418K0033J39064m7742M5090O9858
$$ -59685 415162 293456 -41726 53707 79922 14504 34537 173601 125859 170949 240807
5898B40807J14821R369J79061j69795k68208m2167q2136J17377l6845N7776J75210
$$ 240807 355628 364997 544058 374263 106055 63888 -18248 99129 62284 120060 295270
5887B95270j61711k33716L5246P7221L04301R5561P6828j81709j17130k1150J00246
$$ 295270 133559 -100157 -64911 12310 316611 412172 489000 307291 190161 169011 269257
5876B69257J77547j18674P762J98676l08163j38498K23503n2114r5395J02146
$$ 269257 446804 328130 335892 534568 226405 87907 311410 259296 163901 266047
5866B66047k2666l9580n0349n991q8113O2413m0541N2367o4536J16406l320j21029
$$ 266047 243381 203801 153452 147461 59348 121761 81220 133587 69051 185457 182137 61108
5854F1108n4938L22843R410l4087q9114j05691K14090K55066j09980m0144m9949
$$ 61108 6170 329013 338423 304336 215222 109531 323621 578687 468707 428563 378614
5843C78614o489l00786J23572Q2862j30548K03832M7402J15K4726Q6431k13744
$$ 378614 372125 71339 194911 277773 147225 351057 398459 398574 423300 509731 295987
5832B95987j7849j03360R8578K63046j43484j34678J32712l1224P601o4057R8135
$$ 295987 278138 174778 273356 536402 392918 258240 390952 359728 367329 303272 401407
5821D01407q9139J74483M4750O264P6043k19273N4140J42213k76637j72220J96178
$$ 401407 312268 486751 531501 537765 613808 394535 448675 590888 314251 142031 338209
5810C38209j14954j54890K86828K16057j22474j84384N7163Q2556M2532k7846
$$ 338209 223255 68365 355193 571250 448776 264392 321555 404111 446643 418797
5800D18797O1345P0754j27707r4529j742j39364K90639J21072K28337k09452j32710
$$ 418797 480142 550896 423189 328660 326918 187554 478193 599265 827602 618150 485440
5789D85440J9087q5882P4033j96159L4297p1966K50391K1197k57322M1917J32143
$$ 485440 504527 418645 492678 296519 330816 258850 509241 530438 273116 315033 447176
5778D47176j94279j55339J20639K07571j07594j69133J36360k4053Q0051m720
$$ 447176 252897 97558 218197 425768 318174 149041 285401 261348 341399 336679
5768C36679q3247J29335k3353J25418J60232o4036p1925j36605j49391J84209
$$ 336679 253432 382767 359414 484832 645064 581028 509103 372498 223107 407316
5758D07316J04704j25412M0110J39385j12108l1700O582K9015k03569r6688Q7841
$$ 407316 512020 386608 426718 566103 453995 422295 428877 457892 254323 157635 245476
5747B45476r1121J84481P8192K61307k8234j20637k14283K9654O8129J97375j51679
$$ 245476 154355 338836 417028 678335 650101 529464 315181 344835 412964 610339 458660
5736D58660K52669J61532r7860L959n2539k8712k78838J20135j071K21314l7449
$$ 458660 711329 872861 775001 778960 726421 697709 418871 539006 537935 759249 721800
5725G21800J14804k03657p1503J31104q6922R6110K9263j62365R3837K2267r0295
$$ 721800 836604 632947 561444 692548 605626 701736 730999 568634 662471 684738 594443
5714E94443O2390K63720K698j87483J00676k1194j2801J6422K3920Q6509O6319
$$ 594443 656833 920553 923251 735768 836444 815250 802449 818871 842791 929300 995619
5703I95619j32171J69695q7844j33889J09583K07093R2606j05639N7871j52912
$$ 995619 863448 1033143 945299 811410 920993 1128086 1220692 1115053 1172924 1020012
5693A020012J73367j8170k80094o7668K7748r9379j8413J14380Q5439J95574L00697
$$ 1020012 1193379 1175209 895115 827447 855195 755816 737403 851783 937222 1132796 1433493
5682A433493j66293j64550K6545l7656o601K06947r2464j65293l1205K1995J77679
$$ 1433493 1267200 1102650 1129195 1091539 1084938 1291885 1199421 1034128 1002923 1024918 1202597
5671A202597J42451j06348l3591K47669p3303n0949n3830Q3443K1212q6577J53244
$$ 1202597 1345048 1238700 1205109 1452778 1379475 1328526 1274696 1358139 1379351 1292774 1446018
5660A446018j32095k68880K17511K52824j73113l5292L01706j39953r7955O945
$$ 1446018 1313923 1045043 1262554 1515378 1342265 1306973 1608679 1468726 1370771 1377716
5650A377716J09979O9899l44985K08031J19191j26805K34725J46390j59964O4740
$$ 1377716 1487695 1557594 1212609 1420640 1539831 1413026 1647751 1794141 1634177 1698917
5640A698917p2226j03418J46171P1215J54653k36964O8975M007K5310K8017K57197
$$ 1698917 1626691 1523273 1669444 1740659 1895312 1658348 1727323 1731330 1756640 1784657 2041854
5629B041854l0503J03761K58846k32322j04880K28583n7089l0347L33341l2435
$$ 2041854 2011351 2115112 2373958 2141636 2036756 2265339 2208250 2177903 2511244 2478809
5619B478809j03756j06815n8426P6456j3056J83352J00731Q10L66258q5454J9599
$$ 2478809 2375053 2268238 2209812 2286268 2273212 2456564 2557295 2558105 2924363 2838909 2858508
5608B858508j9944J85504N8931J37479N4813r5992K03448J2157J04264J39581
$$ 2858508 2838564 3024068 3082999 3220478 3275291 3179299 3382747 3394904 3499168 3638749
5598C638749J16168M6919L94584J37243j0863j4606K6084R4298J9867J76098K6068
$$ 3638749 3754917 3801836 4196420 4333663 4322800 4308194 4334278 4428576 4448443 4624541 4650609
5587D650609N237K28634K87342K94385j36541K24792K6280j04889O2095o6065
$$ 4650609 4655846 4884480 5171822 5466207 5329666 5554458 5580738 5475849 5537944 5471879
5577E471879L74225L89197L52472R3734J60457K40041L02067L48820K01723M15376
$$ 5471879 5846104 6235301 6587773 6681507 6841964 7082005 7384072 7732892 7934615 8349991
5567H349991L44276J24201O51904L83212J69143J34496N39987N70735M71865N50792
$$ 8349991 8694267 8818468 9470372 9853584 10022727 10157223 10697210 11267945 11739810 12290602
5557A2290602N45570O70968O76194O67714J096571J455016J252735J512334J722868
$$ 12290602 12836172 13507140 14183334 14851048 15947619 17402635 18655370 20167704 21890572
5548B1890572J924728K172792K818401L100064L636037M247904M327474L655517
$$ 21890572 23815300 25988092 28806493 31906557 35542594 39790498 44117972 47773489
5540D7773489J496681j210893l284173m064764l529148k464882j248467q50532
$$ 47773489 49270170 48059277 44775104 40710340 37181192 34716310 33467843 32617311
5532C2617311o03197l87971K26916P43201Q06305J224858J366132K190770K616086
$$ 32617311 32014114 31626143 31853059 32596260 33402565 34627423 35993555 38184325 40800411
5523D0800411L047850L700659M375113M898499O130427P608482Q724649P917836
$$ 40800411 43848261 47548920 51924033 56822532 62952959 70561441 79286090 87203926
5515H7203926L931234k712805q296469j0455911r465877p079215n113908l312413
$$ 87203926 91135160 88422355 80125886 69669975 60204098 53124883 48010975 44698562
5507D4698562k753005k141631j816326j425664r26979o00125k55551n1648L54143
$$ 44698562 41945557 39803926 37987600 36561936 35634957 35034832 34779281 34727633 35081776
5498C5081776Q17120P11355J534955K091997K620778L254307M033079M365398
$$ 35081776 35898896 36610251 38145206 40237203 42857981 46112288 50145367 54510765
5490E4510765L859681J456778k005983m013576m851177m172380l155110k592144
$$ 54510765 58370446 59827224 57821241 53807665 48956488 44784108 41628998 39036854
5482C9036854k290539j843641j798637j876820j651012j341448j109575o43014
$$ 39036854 36746315 34902674 33104037 31227217 29576205 28234757 27125182 26482168
5474B6482168n65731n18932l05358q1652k65950K69320K93769K64244N51782R62927
$$ 26482168 25916437 25397505 25092147 25010495 24744545 25013865 25307634 25571878 26123660 27086587
5464B7086587J011625R79665J096985J383579J576843J837546R40066q7075j140165
$$ 27086587 28098212 29077877 30174862 31558441 33135284 34972830 35912896 35825821 34685656
5455C4685656j838502j843264j433585j049307r47287k52256j05678J25639J07457
$$ 34685656 32847154 31003890 29570305 28520998 27573711 27321455 27215777 27341416 27448873
5446B7448873J55580L23689O89889O60704R24766R41995J291751J388085J738722
$$ 27448873 27604453 27928142 28618031 29278735 30203501 31145496 32437247 33825332 35564054
5437C5564054K091156K281148K314239K716510K881520K640637K422376K727016
$$ 35564054 37655210 39936358 42250597 44967107 47848627 50489264 52911640 55638656
5429E5638656L276800L453766K326530M77380j576345k941288l645578k464498
$$ 55638656 58915456 62369222 64695752 65173132 63596787 60655499 57009921 54545423
5421E4545423j490232r43923q2653O04678Q34830J397150K279915K218939K383943
$$ 54545423 53055191 52111268 52028615 52633293 53468123 54865273 57145188 59364127 61748070
5412F1748070K257510J951020K220164K756013L141078M030940M731713O338378
$$ 61748070 64005580 65956600 68176764 70932777 74073855 78104795 82836508 89174886
5404H9174886P694400Q601529P505801L842289j515314n365554o006474m242469
$$ 89174886 96869286 105470815 112976616 116818905 115303591 109938037 103931563 99689094
5396I9689094k523077l360362m488624m874269m218294k722538j083406k5135
$$ 99689094 97166017 93805655 89317031 84442762 80224468 77501930 76418524 76393389
5388G6393389K52889j16007j829294k228062k266207j779291q92581R6405Q65108
$$ 76393389 76646278 76530271 74700977 72472915 70206708 68427417 67534836 67631241 68496349
5379F8496349J562378K419624K057053J000176j514566m235413n497811n242125
$$ 68496349 70058727 72478351 74535404 75535580 74021014 69785601 64287790 59045665
5371E9045665m258841l302178k156207j685323j039553m29607m17178J68103k4725
$$ 59045665 54786824 51484646 49328439 47643116 46603563 46173956 45756778 45924881 45900156
5362D5900156l16361q40088j240007j215961j600669j345710r25590o11963p41826
$$ 45900156 45583795 44743707 43503700 42287739 40687070 39341360 38415770 37803807 37061981
5353C7061981o78586j036551j521875j571576j292898j201382j109813o28420
$$ 37061981 36383395 35346844 33824969 32253393 30960495 29759113 28649300 28020880
5345B8020880p08571o91045k05793m42556n02351N4803j21399N40991N03889K11317
$$ 28020880 27312309 26621264 26415471 25972915 25470564 25525367 25403968 25944959 26448848 26660165
5335B6660165P28871Q64551R97595J288354J273159J642605J148895N40299k98069
$$ 26660165 27389036 28253587 29251182 30539536 31812695 33455300 34604195 35144494 34846425
5326C4846425j525698k195640k087223j843380j889635j399947j304030q68117
$$ 34846425 33320727 31125087 29037864 27194484 25304849 23904902 22600872 21732755
5318B1732755o32844r50284l95363n17919m39384k82083o34528j18576j42990
$$ 21732755 21099911 20149627 19754264 19236345 18796961 18514878 17880350 17761774 17618784
5309A7618784L03953K48679M45463M05730M66032M02481R1583j57573n63314q96194
$$ 17618784 17922737 18171416 18616879 19022609 19488641 19891122 19982705 19825132 19261818 18365624
5299A8365624r51126j178827j049810q53004r59967q38200p07349m82547n96818
$$ 18365624 17414498 16235671 15185861 14332857 13372890 12534690 11827341 11344794 10747976
5290A0747976k12203m68058m16365l10397l05745l70308m46326k64220j69452
$$ 10747976 10535773 10067715 9651350 9340953 9035208 8664900 8218574 7954354 7784902
5281G784902n62701k12115k0593k89671k50900j30764k75931k06596k07805k27297
$$ 7784902 7222201 7010086 6989493 6699822 6448922 6318158 6042227 5835631 5627826 5400529
5271E400529j00130J51678j01825k28055k41280j15208j1881m9441q2052Q0836
$$ 5400529 5300399 5452077 5350252 5122197 4880917 4765709 4753828 4704387 4622335 4703171
5261D703171O1563j30864j55383N7624K43138l85769Q3952m7202K04401Q9826
$$ 4703171 4764734 4633870 4478487 4536111 4779249 4393480 4477432 4430230 4634631 4724457
5251D724457k29872j09244N6403O6491J68908q925k76116J63888M6667k15948
$$ 4724457 4494585 4385341 4441744 4508235 4677143 4668218 4392102 4555990 4602657 4386709
5241D386709j65279M5844J46498P6435J08559N3076J10893K5202J10328J4483
$$ 4386709 4221430 4267274 4413772 4490207 4598766 4651842 4762735 4787937 4898265 4912748
5231D912748k4240K2167L7982R3197K72384j63644j82249Q4872R3992O3522n2277
$$ 4912748 4888508 4910675 4948657 5041854 5314238 5150594 4968345 5053217 5147209 5210731 5158454
5220E158454L3129J88587J79987M992K75263j0557O9971K69953K40996K76420
$$ 5158454 5191583 5380170 5560157 5565149 5840412 5829855 5899826 6169779 6410775 6687195
5210F687195P6909r999K10250K38900K75924P4758j05879k1601J68814J8395R2767
$$ 6687195 6764104 6754105 6964355 7203255 7479179 7553937 7448058 7426457 7595271 7613666 7706433
5199G706433q9196M62409N78065J00426k158J33169J18855K36931J58455K64275
$$ 7706433 7617237 8079646 8657711 8758137 8755979 8889148 9008003 9244934 9403389 9667664
5189I667664J34526M5174N18893O77215P78952P38053O59033P89507Q39144P46715
$$ 9667664 9802190 9847364 10366257 11043472 11822424 12560477 13219510 14009017 14848161 15594876
5179A5594876J107084J457221J605353K037869K311202L340363M169960N108281
$$ 15594876 16701960 18159181 19764534 21802403 24113605 27453968 31623928 36732209
5171C6732209N206490J854326l277209o428764o558234n125585l107050k326946
$$ 36732209 41938699 43793025 40515816 34087052 27528818 22403233 19296183 16969237
5163A6969237j577482j059616r40832o71370r25582m15309m21122o16010l91323
$$ 16969237 15391755 14332139 13391307 12719937 11794355 11379046 10957924 10341914 9950591
5154I950591l49178j4110m35435l3140K14323K32595L14408M32121M12172J04663
$$ 9950591 9601413 9587303 9151868 9118728 9333051 9565646 9880054 10312175 10724347 10829010
5144A0829010m68471q74184q93559p85403m56672m91220l20750k79014l04953
$$ 10829010 10360539 9486355 8592796 7807393 7350721 6859501 6538751 6259737 5954784
5135E954784k31590k06711j66164k66535p6823k28218o9883q8026r4899j219J07079
$$ 5954784 5723194 5516483 5350319 5083784 5006961 4778743 4708860 4620834 4525935 4524716 4631795
5124D631795k622l49939j42165n9552k76998j52929K08147j40259k75834J51618
$$ 4631795 4629173 4279234 4137069 4077517 3800519 3647590 3855737 3715478 3439644 3591262
5114C591262J50944k47816o4017N5577J9053J02401p9221q1104p7239M5247l5276
$$ 3591262 3742206 3494390 3430373 3485950 3505003 3607404 3528183 3447079 3369840 3415087 3379811
5103C379811P5716m29151P0562J20332P4088q4384j14949J3585j87828k39105
$$ 3379811 3455527 3026376 3096938 3217270 3291358 3206974 3092025 3105610 2917782 2678677
5093B678677J53416o3563l0262R4210O2769j05525j95436m8595O4161o0070j3573
$$ 2678677 2832093 2768530 2738268 2832478 2895247 2789722 2594286 2545691 2609852 2549782 2536209
5082B536209J14846k16131J14639K9550N0147j0088j92850R30j20192K1894n7809
$$ 2536209 2651055 2434924 2549563 2579113 2629260 2619172 2426322 2427252 2307060 2328954 2271145
5071B271145l9570k14117Q2260K20546k15950j87880J48474L6685r8580l409K8672
$$ 2271145 2231575 2017458 2099718 2320264 2104314 1916434 2064908 2101593 2003013 1999604 2028276
5060B028276O9527K39922p2154l13227R9606j26377m2343l50057K56541O1047
$$ 2028276 2097803 2337725 2265571 1952344 2051950 1925573 1883230 1533173 1789714 1850761
5050A850761r1693j1594L01595q6261j38575l1589m1929j82004K57038j14867
$$ 1850761 1759068 1747474 2049069 1962808 1824233 1792644 1750715 1568711 1825749 1710882
5040A710882R4464k87917r5013n947J2791J21865P8064k9706J41642n8592j3971
$$ 1710882 1805346 1517429 1422416 1416469 1429260 1551125 1629189 1599483 1741125 1682533 1668562
5029A668562j12059J00183j96491k9736p9054j77794J44086n9156P7075J77968
$$ 1668562 1556503 1656686 1460195 1430459 1351405 1173611 1317697 1258541 1335616 1513584
5019A513584r7296j13844J46426q256k09150Q2503m4814k61905J62463J95444
$$ 1513584 1416288 1302444 1448870 1440614 1231464 1313967 1269153 1007248 1169711 1365155
5009A365155r9969n6007J26361q1307J05187j1425J57152L560R2474K2671q5273
$$ 1365155 1265186 1209179 1335540 1254233 1359420 1347995 1505147 1508707 1601181 1623852 1538579
4998A538579j77785m0987n2758O7793j29224J23006K8867m4593j86240l2115O6178
$$ 1538579 1360794 1319807 1267049 1334842 1205618 1328624 1357491 1312898 1126658 1094543 1160721
4987A160721J74178j69301K7508j46064J56291k54915J733L5609m177N3870q9025
$$ 1160721 1334899 1165598 1193106 1047042 1203333 948418 950151 985760 981583 1035453 946428
4976I46428J64308j36824L3182L2058r5000K04399J15052J05044k35233p3093
$$ 946428 1110736 973912 1007094 1039152 944152 1148551 1263603 1368647 1133414 1060321
4966A060321J07836j1140k00291m63Q5098J89613J81358j49287m6589J06124J33196
$$ 1060321 1168157 1157017 956726 956263 1041361 1230974 1412332 1263045 1216456 1322580 1455776
4955A455776k01124O415P4676q7785L3153k30464m7933K062L14175P2245j5356
$$ 1455776 1254652 1261067 1335743 1247958 1281111 1050647 1002714 1004776 1318951 1391196 1375840
4944A375840j18575j37018J68435O1455j5910j86297J8804P6127m5661R6259K8894
$$ 1375840 1257265 1120247 1288682 1350137 1334227 1147930 1166734 1242861 1197200 1293459 1322353
4933A322353k29184Q4000o6555k86703J92693L82660j80808q1220L4856K64372
$$ 1322353 1093169 1177169 1110614 823911 1016604 1399264 1218456 1137236 1172092 1436464
4923A436464M9477j10546J03498J10324Q002R0296j90284J86221M0322l34174
$$ 1436464 1485941 1375395 1478893 1589217 1597219 1687515 1497231 1683452 1723774 1389600
4913A389600p833K05443J98387q8319K1504m4210K22986J91643l9011n4502J74935
$$ 1389600 1381767 1587210 1785597 1697278 1718782 1674572 1897558 2089201 2050190 1995688 2170623
4902B170623N9846r9695J31036R6073L28584L3767l8436J73147K03818K91976
$$ 2170623 2230469 2130774 2261810 2357883 2686467 2720234 2681798 2854945 3058763 3350739
4892C350739J62517L56977M67273M23007P31545R97342N99285K13957n53526r67034
$$ 3350739 3513256 3870233 4337506 4760513 5492058 6489400 7088685 7302642 6749116 5782082
4882E782082o18369m22147l84400k2689K89161m32752n2770L23259L56324j23377
$$ 5782082 5163713 4741566 4357166 4334477 4623638 4190886 4138116 4461375 4817699 4694322
4872D694322K65642o8408k19854J09011j99628J47872L0193j06220N678j07967
$$ 4694322 4959964 4891556 4671702 4780713 4581085 4728957 4759150 4652930 4658608 4550641
4862D550641j46967k25347J53327O8583K1774Q0726K36807j44104J17314K48147
$$ 4550641 4403674 4178327 4331654 4400237 4422011 4502737 4739544 4595440 4712754 4960901
4852D960901M22053J49955K88113M06455N67949L70502j7618k47483p5330j0934
$$ 4960901 5382954 5532909 5821022 6227477 6795426 7165928 7148310 6900827 6825497 6814563
4842F814563l35327n23189l60037k18478m91687j78505j26171K35200m4355n7450
$$ 6814563 6479236 5956047 5596010 5377532 4885845 4707340 4581169 4816369 4772014 4714564
4832D714564j53772J07041j04211k5896O4231K3649J31541pJ92442R6277K04010
$$ 4714564 4560792 4667833 4563622 4537726 4601957 4625606 4757147 4757140 4949582 5045859 5249869
4821E249869K54309p4130M4581k28051j18044n5773l67045n7405j44548k81589
$$ 5249869 5504178 5430048 5474629 5246578 5128534 5072761 4705716 4648311 4503763 4222174
4811D222174j49648k1310P6044J14820l2376k69908q6034k98495J4923J66571
$$ 4222174 4072526 4051216 4127260 4242080 4209704 3939796 3853762 3555267 3570190 3736761
4801C736761p1082L4419K0606k93882j89576l6853j64993q5145O651K04291L6649
$$ 3736761 3665679 3700098 3720704 3426822 3237246 3200393 3035400 2950255 2956906 3161197 3197846
4790C197846k14964k9549R9206L44842P5857j51948j28592j46985J35140K09144
$$ 3197846 2982882 2953333 3052539 3397381 3473238 3321290 3192698 3045713 3180853 3389997
4780C389997J06703m0606L5653K07093K01476j48263J08135J43832J32144J97957
$$ 3389997 3496700 3456094 3491747 3698840 3900316 3752053 3860188 4004020 4136164 4334121
4770D334121k85690m39061k05441k43864k60282K6272k72617R8394p2459n1606
$$ 4334121 4048431 3609370 3403929 3160065 2899783 2926055 2653438 2751832 2679373 2627767
4760B627767j01657m4862K37788J70907j76412J22818J5785o091n898j86984j48158
$$ 2627767 2526110 2481248 2719036 2889943 2713531 2836349 2852134 2846043 2840145 2653161 2505003
4749B505003j41183j82372J24247j68261J3155J002R2682P1239q9092l9039k07308
$$ 2505003 2363820 2181448 2305695 2137434 2150589 2151591 2244273 2315512 2226420 2187381 1980073
4738A980073p1913l6411P0067k18201J78029j38633k10547L08530M7175j61576
$$ 1980073 1908160 1871749 1941816 1723615 1901644 1763011 1552464 1860994 1908169 1746593
4728A746593P3151J4775k6537J11989l06545R5408L9133K17287M2451j02527J64176
$$ 1746593 1819744 1834519 1807982 1919971 1613426 1708834 1747967 1965254 2007705 1905178 2069354
4717B069354L4404k3927k1466K07809j78294l9139M98892K38144o4173J67475
$$ 2069354 2103758 2079831 2058365 2266174 2087880 2048741 2547633 2785777 2721604 2889079
4707B889079J23448M14630k3925l0136M55838L07564K21572L98540K55236j72396
$$ 2889079 3012527 3427157 3403232 3373096 3828934 4136498 4358070 4756610 5011846 4839450
4697D839450l34449j03727k42216r9690k12932j73139J24619Q5534j11956L95403
$$ 4839450 4505001 4401274 4159058 4059368 3846436 3673297 3797916 3883450 3771494 4166897
4687D166897R4118q2013J8483m03065k01550j75316l15762l7746j19539r7260
$$ 4166897 4261015 4179002 4197485 3794420 3592870 3417554 3101792 3064046 2944507 2847247
4677B847247j73675k37498k30925p2046J20386o6049l32877j61875j37019M2142
$$ 2847247 2673572 2436074 2205149 2133103 2253489 2187440 1854563 1692688 1555669 1597811
4667A597811K58194J67631j47247n47P9345q7242l4253k7935j13131n5776n9372
$$ 1597811 1856005 2023636 1876389 1875842 1955187 1867945 1833692 1805757 1692626 1636850 1577478
4656A577478J41860Q4411M0402J30065k43422j11242l6327J5998J92896L0391
$$ 1577478 1719338 1803749 1844151 1974216 1730794 1619552 1583225 1599223 1792119 1822510
4646A822510M4586j2830J4850k60060K15487p330k14765j24533m1713K0296K93277
$$ 1822510 1867096 1854266 1869116 1609056 1824543 1817213 1602448 1477915 1436202 1456498 1749775
4635A749775J7604p5581J16490K84015J15651j77004J7975j05190j28040J48341
$$ 1749775 1767379 1691798 1808288 2092303 2207954 2030950 2048925 1943735 1815695 1964036
4625A964036Q8557m071K23741j48288K38573M2230N6076J12148R4117j272R3036
$$ 1964036 2052593 2048522 2272263 2123975 2362548 2404778 2460854 2573002 2667119 2665847 2758883
4614B758883j29901r2570k9813j74151j67102P705r9267J14272J10132j58694
$$ 2758883 2628982 2536412 2506599 2332448 2165346 2173051 2073784 2188056 2298188 2139494
4604B139494K5122N4159l5537K40916j75346k67226K16327M03809Q0232j03482
$$ 2139494 2164616 2218775 2183238 2424154 2248808 1981582 2197909 2601718 2681950 2578468
4594B578468n5218J05239l588m30n809Q9488J05822K0425K872j04186L49648j45418
$$ 2578468 2523250 2628489 2624901 2624471 2618662 2708150 2813972 2834397 2837269 2733083 3082731 2937313
4582B937313q1090L23601J35260K13234K17106K82133P2757j28042j39496J36899
$$ 2937313 2856223 3179824 3315084 3528318 3745424 4027557 4100314 3972272 3832776 3969675
4572C969675M44320P0816J38582j19054J62112L91241J72648K65315j4586O9688
$$ 3969675 4413995 4484811 4623393 4504339 4666451 5057692 5230340 5495655 5481069 5550757
4562E550757J16135O9647K69993J92531p1437K43904L17481K02472L00432Q5924
$$ 5550757 5666892 5736539 6006532 6199063 6127626 6371530 6689011 6891483 7191915 7277839
4552G277839M92596K34566K0294j03895j50829K07104K92127J05426J99098L69262
$$ 7277839 7770435 8005001 8025295 7921400 7770571 7977675 8269802 8375228 8574326 8943588
4542H943588L18102J51660K70227L45544K46316J95578M65844K71541K1268L95850
$$ 8943588 9261690 9413350 9683577 10029121 10275437 10471015 10936859 11208400 11229668 11625518
4532A1625518K09519O01085N92457O19261M46679N74934L20697R47591Q85936
$$ 11625518 11835037 12436122 13028579 13647840 14094519 14669453 14990150 15937741 16823677
4523A6823677Q37964R92556J179870R35230J164414J255250J249564J775649J623794
$$ 16823677 17661641 18654197 19834067 20769297 21933711 23188961 24438525 26214174 27837968
4514B7837968J377518J492264R01792J294416J655620J573067J743378K423939
$$ 27837968 29215486 30707750 31609542 32903958 34559578 36132645 37876023 40299962
4506D0299962K453492L476868L926070M740061N488338O843437P492703Q185753
$$ 40299962 42753454 46230322 50156392 54896453 60384791 67228228 74720931 82906684
4498H2906684R045435J0035679J0470265J2995743J5706948J9949180K4740284
$$ 82906684 91952119 101987798 112458063 125453806 141160754 161109934 185850218
4491A85850218L4136415M0421145L2010037L17052l6634964m8067728m3801150
$$ 185850218 219986633 260407778 292417815 292734867 256099903 208032175 164231025
4484A64231025k8591843j8442264j1657984p759023m656693k923974j094610M9418
$$ 164231025 135639182 117196918 105538934 97779911 93123218 90199244 89104634 89154052
4476H9154052J598913K112471M208645N435512L300854m353864j1454111j3047265
$$ 89154052 90752965 92865436 97074081 102509593 105810447 101456583 90002472 76955207
4468G6955207j1330153p672234n728779m693315m158412l893200l436962k734877
$$ 76955207 65625054 57952820 52224041 47530726 43372314 39479114 36042152 33307275
4460C3307275k212317j962259j806680j436261j364130j342873r37837j268189
$$ 33307275 31094958 29132699 27326019 25889758 24525628 23182755 22244918 20976729
4452B0976729r17376p21530j063634q41353p17137p83709o25087l47658m95250
$$ 20976729 20059353 19337823 18274189 17432836 16715699 15931990 15306903 14959245 14463995
4443A4463995j70743o90560k71080l76432m86036m74380k21931m80766m99812
$$ 14463995 14293252 13602692 13331612 12955180 12469144 11994764 11772833 11292067 10792255
4434A0792255j08340j35310k86238m00005k48576k16380k26578l3426k28569j30670
$$ 10792255 10683915 10548605 10262367 9862362 9613786 9397406 9170828 9137402 8908833 8778163
4424H778163l45013l71270m87833J39187j35710j17645k01870J07205r6158j56079
$$ 8778163 8433150 8061880 7574047 7713234 7577524 7459879 7258009 7365214 7269056 7112977
4414G112977k34474m43052r4759k31037m06855j29233j65200k34039J69132J19915
$$ 7112977 6878503 6435451 6340692 6109655 5702800 5573567 5408367 5174328 5343460 5463375
4404E463375m05376j78504P8092l16102M0543j14949j43047o0419j0833k05746
$$ 5463375 5057999 4879495 4957587 4641485 4682028 4567079 4424032 4363613 4352780 4147034
4394D147034j29955j4066j06152k1581K0703j83417J2550K39607j11644l4101
$$ 4147034 4017079 4003013 3896861 3875280 3895983 3712566 3725116 3964723 3853079 3818978
4384C818978j41634l30850j14159k142j03266O6805j78793k33843J23603k4674
$$ 3818978 3677344 3346494 3232335 3230193 3126927 3193732 3014939 2781096 2904699 2880025
4374B880025J6487J74801k34599j27449J70484o8737l05453J9908p9912k08423
$$ 2880025 2896512 3071313 2836714 2709265 2879749 2811012 2505559 2525467 2445555 2237132
4364B237132P889J42828k21754K19203l0799l12329L8026M8015j45229j48683
$$ 2237132 2245021 2387849 2166095 2385298 2354499 2042170 2080196 2128211 1982982 1834299
4354A834299L047L27708j16400R8968j9281k37925j62991Q4251k01801r9609J63266
$$ 1834299 1837346 2165054 2048654 2147622 2128341 1890416 1727425 1811676 1609875 1510266 1673532
4343A673532J54019m2993j82122l4744M5474J69324l8992l2001l24558J73469
$$ 1673532 1827551 1784558 1602436 1567692 1613166 1782490 1743498 1711497 1386939 1560408
4333A560408k37599L6848O2919O6382L9142p4310J75514l3332j57258j05876j74233
$$ 1560408 1322809 1359657 1422576 1488958 1528100 1453790 1629304 1595972 1438714 1332838 1158605
4322A158605K51649O6902j66801p1271l8121j8168Q9858j11465J61645Q5798j36502
$$ 1158605 1410254 1477156 1310355 1239084 1200963 1182795 1272653 1161188 1322833 1408631 1272129
4311A272129k23698o1330K23672P8511M001j06003M730m4781K90956r149j66121
$$ 1272129 1048431 987101 1210773 1289284 1293285 1187282 1192012 1147231 1438187 1429038 1262917
4300A262917l0988k04120L5151O1161J8786J37074n0915N8740j2362O671L2014
$$ 1262917 1231929 1027809 1062960 1124121 1142907 1279981 1229066 1287806 1275444 1282115 1314129
4289A314129k30988J04254K46730k6598R498j62350j81796k1371j34930J55660
$$ 1314129 1083141 1187395 1434125 1407527 1417025 1254675 1072879 1051508 916578 1072238
4279A072238J22408j98086K55301n7356r4424M4627p1781Q0567o2409j73980j20126
$$ 1072238 1194646 996560 1251861 1194505 1100081 1144708 1072927 1153494 1091085 917105 796979
4268G96979K34059j39692K65048Q7134l6442m5872J09610r1197q7511O111q4707
$$ 796979 1031038 891346 1156394 1243528 1207086 1161214 1270824 1179627 1092116 1098227 1013520
4257A013520j23163J53897J52745k02824K35496l7491k52160K44178K9156k42603
$$ 1013520 890357 1044254 1196999 994175 1229671 1192180 940020 1184198 1213354 970751
4247I70751Q1354Q3158L3003K36335r9249k98931j9236K21473O8600k39412o6138
$$ 970751 1052105 1135263 1168266 1404601 1305352 1006421 987185 1208658 1277258 1037846 971708
4236I71708K10708n7240k69306r2046K22474J31039K22055J679j25054J32153
$$ 971708 1182416 1125176 855870 763824 986298 1117337 1339392 1341071 1216017 1348170
4226A348170k9972J040K40512q0122q8234j02145K01260M3763Q6255J4903q5663
$$ 1348170 1318198 1319238 1559750 1479628 1391394 1289249 1490509 1534272 1620527 1635430 1549767
4215A549767j23J22464L59473R0031K34411j19958J29841m9231J68046K76938
$$ 1549767 1549644 1672108 2031581 2121612 2356023 2236065 2365906 2316675 2484721 2761659
4205B761659J00512K27705j14052k47215m3976J8612k84263j28524K69486R1112
$$ 2761659 2862171 3089876 2975824 2728609 2684633 2703245 2418982 2290458 2559944 2651056
4195B651056J48066K316k0636K94683r6327j47826K45977K42341P2455J43067
$$ 2651056 2799122 2801438 2780802 3075485 2979158 2831332 3077309 3319650 3392105 3535172
4185C535172K45241L3422R6284K67216N4153j86754M1648r7017j89239m78691
$$ 3535172 3780413 3813835 3910119 4177335 4231488 4044734 4086382 3989365 3800126 3321435
4175C321435J1076j25221J02000n2172j5303m2662M7424J24567k72683j6874J21502
$$ 3321435 3332511 3207290 3309290 3257118 3241815 3199153 3246577 3371144 3098461 3081587 3203089
4164C203089o5642j7798J5799Q8752Q3848K3217K24294K49884J33919J66665J21814
$$ 3203089 3137447 3119649 3135448 3224200 3308048 3331265 3555559 3805443 3939362 4106027 4227841
4153D227841O58438L14301N18455Q20035L72955N20844P28772K81480n87463o77287
$$ 4227841 4886279 5200580 5719035 6539070 6912025 7432869 8161641 8443121 7855658 7178371
4143G178371r23684o77218l74860n41330m14815j91873j61499l8149L9714m3332
$$ 7178371 6254687 5577469 5202609 4661279 4246464 4054591 3893092 3854943 3894657 3851325
4133C851325k05563k19293Q6632q0955L8753j2114l06772O5904K91061M7587j46179
$$ 3851325 3645762 3426469 3513101 3432146 3470899 3458785 3152013 3217917 3508978 3556565 3410386
4122C410386j62364j88636p5979O6514J44016l10522n6172J21351P6053p6335
$$ 3410386 3248022 3059386 2983407 3049921 3193937 2883415 2827243 2948594 3024647 2948312
4112B948312J48188l39200o6323K60112K75500j09502l9348o742j2066M12319
$$ 2948312 3096500 2757300 2690977 2951089 3226589 3117087 3077739 3070997 3058931 3471250
4102C471250j14450j17733L25959K55180k32828Q8026J46833j80313K8962J75930
$$ 3471250 3356800 3239067 3565026 3820206 3587378 3675404 3822237 3641924 3670886 3846816
4092C846816m1669n8455j70640j6350K95973M1784J86045k05378m7813R3493j78566
$$ 3846816 3805147 3746692 3576052 3559702 3855675 3897459 4083504 3878126 3830313 3923806 3745240
4081C745240l0906K15245J41540q359J74712J60610R6791J87669j28573j04238
$$ 3745240 3714334 3929579 4071119 4062760 4237472 4398082 4494873 4682542 4553969 4449731
4071D449731J59674l8637n0798q1545l9411m9513J5431L00791l2121J75972j43313
$$ 4449731 4609405 4570768 4519970 4438425 4399014 4349501 4364932 4665723 4633602 4809574 4666261
4060D666261o3039K4836L991M9002K81721K60398R8035M4987j43962K46934J85304
$$ 4666261 4603222 4628058 4632049 4681051 4962772 5223170 5321205 5366192 5222230 5469164 5654468
4049E654468M17098P2659n5662l0585m0295K44362J02855L24495J67939o9104
$$ 5654468 6071566 6144225 6088563 6057978 6017683 6262045 6364900 6689395 6857334 6788230
4039F788230P2409p9436L74286M1305J84821k341R5530L3596K71140J06626J95563
$$ 6788230 6860639 6781203 7155489 7196794 7381615 7379274 7474804 7508400 7779540 7886166 8081729
4028H081729N9774J20716K09383J16349K53064P019J60757N2135J81203J12109
$$ 8081729 8141503 8262219 8471602 8587951 8841015 8848034 9008791 9060926 9242129 9354238
4018I354238J81087K59656j10150K92986L85609j23481L08960J34469M4289q3024
$$ 9354238 9535325 9794981 9684831 9977817 10363426 10239945 10548905 10683374 10727663 10644639
4008A0644639M1816L38829J51454J8445J30382M79047O5895L52512J26187K81278
$$ 10644639 10686455 11025284 11176738 11195183 11325565 11804612 11870507 12223019 12349206 12630484
3998A2630484K73821M6117L29013J26854J91482K34499M32032J13818L62691P3999
$$ 12630484 12904305 12950422 13279435 13406289 13597771 13832270 14264302 14378120 14740811 14814810
3988A4814810L02249K76728M35129J12545J04301J84291J56846K56763L67719
$$ 14814810 15117059 15393787 15828916 15941461 16045762 16230053 16386899 16643662 17011381
3979A7011381J26974K37678M39195Q7925J45044M25193K55433R4830J40116K37044
$$ 17011381 17138355 17376033 17815228 17903153 18048197 18473390 18728823 18823653 18963769 19200813
3969A9200813K46035M53866K34898L87282N23167M55151M80133M84791O03787
$$ 19200813 19446848 19900714 20135612 20522894 21046061 21501212 21981345 22466136 23069923
3960B3069923P78168Q20885J085048J059910R52078J209549J027425J323621J554827
$$ 23069923 23848091 24668976 25754024 26813934 27766012 28975561 30002986 31326607 32881434
3951C2881434J278531J311338J611436J609154J967492J755910K256599K324671
$$ 32881434 34159965 35471303 37082739 38691893 40659385 42415295 44671894 46996565
3943D6996565K415097K661773K704364L115894L525823M218042N440269O565474
$$ 46996565 49411662 52073435 54777799 57893693 61419516 65637558 71077827 77643301
3935G7643301P439884Q678025R859560J1543671J3867845J5578663J8549668K1346851
$$ 77643301 85083185 93761210 103620770 115164441 129032286 144610949 163160617 184507468
3927A84507468K4999420L0137834L7584467M4522459M5269807L0066239J564899
$$ 184507468 209506888 239644722 277229189 321751648 367021455 397087694 398652593
3920C98652593k8944770m6178479m7323230l9042356k8323009k0076145j3297509
$$ 398652593 369707823 323529344 276206114 237163758 208840749 188764604 175467095
3913A75467095r023017n624560l034836J05613J862386O77609m080508j0501171
$$ 175467095 166444078 160819518 157784682 157890295 159752681 160430290 156349782 145848611
3905A45848611j5023093j5151945j3008209j1077412q632471o785487n950584
$$ 145848611 130825518 115673573 102665364 91587952 82955481 76169994 70219410
3898G0219410m663422l965542l490287k867733k095237j759225j565294j264747
$$ 70219410 65555988 61590446 58100159 55232426 53137189 51377964 49812670 48547923
3890D8547923j220423p66359l63458l84241O6027J70151l54427m32787j93509
$$ 48547923 47327500 46561141 46197683 45813442 45879469 46049620 45695193 45262406 45068897
3881D5068897k76609m65386l91318j235985k014794k128361k082434k044208j432287
$$ 45068897 44792288 44326902 43935584 42699599 40684805 38556444 36474010 34429802 32997515
3872C2997515j197743j487020j111963j090411q86595n94445o29636p80123n88921
$$ 32997515 31799772 30312752 29200789 28110378 27223783 26629338 25999702 25219579 24630658
3863B4630658o34653o27955j054904o72007n85700p84208l58253m27303l06525
$$ 24630658 23996005 23368050 22313146 21641139 21055439 20271231 19912978 19485675 19179150
3854A9179150k33351p07952K05784j00642k76594m92383m86797l24092m90072
$$ 19179150 18945799 18237847 18443631 18342989 18066395 17574012 17087215 16763123 16273051
3845A6273051o05024m56065n07803m02161k7862k01288j25255k47767k17552m14589
$$ 16273051 15668027 15211962 14704159 14301998 14274136 14072848 13947593 13699826 13482274 13067685
3835A3067685N5427k80588l95302l33354j67442j64703l71965O8485q0611j90707
$$ 13067685 13123112 12842524 12447222 12113868 11946426 11781723 11409758 11478243 11397632 11206925
3825A1206925q7338j90252l0129j44280k06815J52970k27544m6681O5348j40319
$$ 11206925 11119587 10929335 10899206 10754926 10548111 10701081 10473537 10426856 10492204 10351885
3815A0351885o9369j65988K2898J7067J71751J11686o3998p0318J46792l2083
$$ 10351885 10282516 10116528 10139426 10156493 10328244 10439930 10375932 10305614 10452406 10420323
3805A0420323L65159j23343j60689J41401J03729J72195K20461K80899K07418
$$ 10420323 10785482 10662139 10501450 10642851 10746580 10918775 11139236 11420135 11627553
3796A1627553L88185K6279J7383p517K68075L67670N12211M25174M47271M32240
$$ 11627553 12015738 12042017 12059400 12051883 12319958 12687628 13199839 13625013 14072284 14504524
3786A4504524M99578O72871N51337K34755m44606p59866r05699m78556l81469
$$ 14504524 15004102 15676973 16228310 16463065 16018459 15258593 14352894 13874338 13492869
3777A3492869k76684j78908O0614k5215n9367K25983J78296J87498O02833N12917
$$ 13492869 13216185 13037277 13097891 13072676 13013309 13239292 13417588 13605086 14207919 14720836
3767A4720836N40301P23757O02744P80487N18447P87243Q94051R00762L38907
$$ 14720836 15261137 15984894 16587638 17368125 17886572 18673815 19567866 20468628 20807535
3758B0807535K17872M66186P30695O44047R73665J166404J345825J590297J853530
$$ 20807535 21025407 21491593 22222288 22866335 23840000 25006404 26352229 27942526 29796056
3749B9796056K485575K757014L184270L201324M416132M912387N773637O176152
$$ 29796056 32281631 35038645 38222915 41424239 45840371 50752758 56526395 62702547
3741F2702547N225042J600234l282419o049801p219707o404083m743343l657540
$$ 62702547 67927589 69527823 66245404 60195603 52975896 46571813 41828470 38170930
3733C8170930k642644j903450j372273j251765j058286q69494o87782o54026o21660
$$ 38170930 35528286 33624836 32252563 31000798 29942512 29073018 28385236 27731210 27109550
3724B7109550j29858m2807K51553N05258O15116L78595P499r34902j639930j312870
$$ 27109550 26979692 26936885 27188438 27693696 28308812 28687407 28694906 27760004 26120074 24807204
3714B4807204j251055q75300p29537o54749l01865k06693n9704o86876m13746
$$ 24807204 23556149 22680849 21951312 21296563 20994698 20788005 20728301 20041425 19627679
3705A9627679m19749k77560p1704Q5785L62751K14960m9110m57292p97963q30011
$$ 19627679 19207930 18930370 18858666 18944451 19307202 19522162 19473052 19015760 18217797 17387786
3695A7387786q42705q79026m95838j15319j91091k70646l90824n17p312n78296
$$ 17387786 16545081 15666055 15170217 15054898 14863807 14593161 14202337 14201820 14194508 13616212
3685A3616212n6795n7460R2643P1970n8641K78177M18075J53741L5104l90358
$$ 13616212 13559417 13501957 13594600 13666570 13607929 13886106 14304181 14457922 14493026 14102668
3675A4102668l85285n21700J07029j33764j32655k1165M2213J19914P3409L39897
$$ 14102668 13717383 13195683 13302712 13168948 13036293 13015128 13057341 13177255 13250664 13590561
3665A3590561o5599R9941j6729M27556K04504J33610j1561J96354J55975J30414
$$ 13590561 13524962 13624903 13608174 14035730 14240234 14373844 14362283 14558637 14714612 14845026
3655A4845026j8154j46243J27285J50830L56104N63502L22991M52122N61389P44084
$$ 14845026 14826872 14680629 14807914 14958744 15314848 15878350 16201341 16653463 17214852 17958936
3645A7958936P16416M08395P75074P18781N42816N98167O59036Q95386M99011
$$ 17958936 18675352 19083747 19858821 20577602 21120418 21718585 22377621 23273007 23772018
3636B3772018O49792Q51660M69337L33598J78494N28384N886k12632l00620J41156
$$ 23772018 24421810 25273470 25742807 26076405 26254899 26783283 26789169 26576537 26275917 26417073
3626B6417073J43573J98166O65310O35673O22227R61896J219809J527235J728097
$$ 26417073 26560646 26758812 27424122 28059795 28682022 29643918 30863727 32390962 34119059
3617C4119059J770721K020157K242454K321858K140400K258474K331609K329647
$$ 34119059 35889780 37909937 40152391 42474249 44614649 46873123 49204732 51534379
3609E1534379K012226J479805J251049Q36218P72706Q37676K71844L18237l44132
$$ 51534379 53546605 55026410 56277459 57113677 57886383 58724059 58995903 59314140 58970008
3600E8970008n55697j36390J92025R8578M12634P80202J148474J212068J282808
$$ 58970008 58414311 58277921 58469946 58568524 58981158 59761360 60909834 62121902 63404710
3591F3404710J379875J281164J427622J578582K136265K028532K333233K379320
$$ 63404710 64784585 66065749 67493371 69071953 71208218 73236750 75569983 77949303
3583G7949303K217594J921308K069222K318217K290984K123262J967026J282036
$$ 77949303 80166897 82088205 84157427 86475644 88766628 90889890 92856916 94138952
3575I4138952J341635J606425J467504J644943J310311J178161O87086O09707
$$ 94138952 95480587 97087012 98554516 100199459 101509770 102687931 103375017 103984724
3567A03984724N98912O54921L87763L77017J59797N23390P46451J120407J315732
$$ 103984724 104583636 105238557 105626320 106003337 106163134 106686524 107432975 108553382 109869114
3558A09869114M99084o67710j369580j306048j761364j429239r19215o2277K17628
$$ 109869114 110368198 109700488 108330908 107024860 105263496 103834257 102915042 102852765 103070393
3549A03070393O15069Q90059J295024J261996N53541j66602j591329j763955k268760
$$ 103070393 103685462 104575521 105870545 107132541 107686082 107519480 105928151 104164196 101895436
3540A01895436k158214k151181k239475k049570k089248k196007j717373j508600
$$ 101895436 99737222 97586041 95346566 93296996 91207748 89011741 87294368 85785768
3532H5785768j876135j651714j275836j465622j433597j065012j267738j283086
$$ 85785768 83909633 82257919 80982083 79516461 78082864 77017852 75750114 74467028
3524G4467028m70741p7917J57892K36579J95688J5969q22183q99046r76343j131378
$$ 74467028 73996287 73918370 74076262 74312841 74508529 74524498 73702315 72803269 71826926 70695548
3514G0695548n39698o79999j8573N13496N63966J010150R55347L82773p26715
$$ 70695548 70155850 69475851 69457278 69970774 70534740 71544890 72500237 72883010 72156295
3505G2156295j855566k880432l298844l424422l011628k475309k000558k351593
$$ 72156295 70300729 67420297 64121453 60697031 57685403 55210094 53209536 50857943
3497E0857943j767367j526395q03791l18080p84667o12528j16098o233K23908
$$ 50857943 49090576 47564181 46760390 46442310 45657643 45045115 44929017 44922784 45146692
3488D5146692L40915N09642M55000O09912O71694J267881N94358m5837m88203
$$ 45146692 45487607 45997249 46452249 47062161 47733855 49001736 49596094 49550257 49062054
3479D9062054q63661r24353j040440j041821p25193q43485p19348o48677q38510
$$ 49062054 48198393 47274040 46233600 45191779 44466586 43623101 42903753 42255076 41416566
3470D1416566o24820l59183J26551n7376l87429n9943J136k92767K1449p7709
$$ 41416566 40791746 40432563 40559114 40501738 40114309 40054366 40055502 39762735 39784184 39706475
3460C9706475j07398n45633l11309j60450l87068j75685p3916k15188j14200J10795
$$ 39706475 39599077 39053444 38742135 38581685 38194617 38018932 37945016 37729828 37615628 37726423
3450C7726423J7877o579J95473M50102J63964N20892P46471N25291J02130J26856
$$ 37726423 37744300 37737721 37933194 38383296 38547260 39068152 39814623 40339914 40442044 40568900
3440D0568900L50472L03275J81042J2452M38139K34597K30777K57330J39509r279
$$ 40568900 40919372 41222647 41403689 41416141 41854280 42088877 42319654 42576984 42716493 42707214
3430D2707214K53020O8989L0226K14652M38899M56318j017K00185K86475K49006
$$ 42707214 42960234 43029223 43059449 43274101 43713000 44169318 44168301 44368486 44654961 44903967
3420D4903967K93002J64566K82438M65925N36843O20276Q79643P44764R97048
$$ 44903967 45196969 45361535 45643973 46109898 46646741 47267017 48146660 48891424 49888472
3411D9888472Q22055J097514J092464J182042Q49125O28797P22202P78150P48952
$$ 49888472 50710527 51808041 52900505 54082547 54931672 55560469 56282671 57060821 57809773
3402E7809773L16879j95056m58346q76337q06211l73974k17415k01389J14417
$$ 57809773 58126652 57931596 57473250 56596913 55790702 55416728 55199313 54997924 55112341
3393E5112341O13939O61329J238269J230837P58065P70379N82398O50612L28403
$$ 55112341 55726280 56387609 57625878 58856715 59614780 60385159 60967557 61618169 61946572
3384F1946572j41952n89275l40270p6288L52650J059063J559355J363145J716803
$$ 61946572 61804620 61215345 60875075 60798787 61151437 62210500 63769855 65133000 66849803
3375F6849803K103174J692998J494693J035831K15360o90426j472478j475921
$$ 66849803 68952977 70645975 72140668 73176499 73391859 72701433 71228955 69753034
3367F9753034j579112j321804q70001n99839n92486m03810l16788n67430o01132
$$ 69753034 68173922 66852118 65982117 65382278 64789792 64385982 64069194 63501764 62900632
3358F2900632r21304p88445m78276K0655m5213K04351K36536N45186J009895J531391
$$ 62900632 61979328 61190883 60712607 60733262 60688049 60892400 61128936 61674122 62684017 64215408
3348F4215408J655793J798445J265537R46599L38389r14298j333685j985694j946291
$$ 64215408 65871201 67669646 68935183 69881782 70220171 69305873 67972188 65986494 64040203
3339F4040203j238028j321757j496571j317530j336793j646863j148789j287626
$$ 64040203 62802175 61480418 59983847 58666317 57329524 55682661 54533872 53246246
3331E3246246q89625o59037n69618k41401l67269k07607j94214n81597m09272
$$ 53246246 52356621 51697584 51127966 50886565 50519296 50311689 50117475 49535878 49126606
3322D9126606n27402r69235n21868m32343k91359r8123m84695m1679j49661j88586
$$ 49126606 48599204 47629969 47108101 46675758 46384399 46286276 45801581 45759902 45610241 45421655
3312D5421655k75545k7135Q3105J36621l7079m39360r74861j323109j739799j357184
$$ 45421655 45146110 45118975 45202080 45338701 45301622 44862262 43887401 42564292 40824493 39467309
3302C9467309j134870j651202r68132q55177q00384n49943n22870n06210r30982
$$ 39467309 38332439 36681237 35713105 34857928 34057544 33507601 32984731 32478521 31547539
3293C1547539n31366j25738o7704K4644k69273K6146l42819m92892l03333o05088
$$ 31547539 31016173 30890435 30822731 30847375 30578102 30604248 30261429 29768537 29465204 28860116
3283B8860116k78720j46432M2797m59857l88804k26701m59852l24241l79535n10696
$$ 28860116 28581396 28434964 28477761 28017904 27629100 27402399 26942547 26618306 26238771 25728075
3273B5728075o80098j60325l67413l59924l58452k82381l73075J0148j17351p2778
$$ 25728075 25047977 24887652 24520239 24160315 23801863 23519482 23146407 23156555 23039204 22966426
3263B2966426K0121Q1945p9861j38579J75652L80727k74105k37792M5497k46019
$$ 22966426 22986547 23068492 22988631 22850052 23025704 23406431 23132326 22894534 22940031 22694012
3253B2694012P084j38377k49337L00804K26956n8824O5998j51446M8889K83172
$$ 22694012 22701096 22562719 22313382 22614186 22841142 22782318 22848316 22696870 22745759 23028931
3243B3028931m2692J69131O7952j42861j23003J95263o1862J15888L83203L4048
$$ 23028931 22986239 23155370 23223322 23080461 22957458 23152721 23090859 23206747 23589950 23623998
3233B3623998L64573J09021L48368J20913K82484K13128J53223J66021o958K29083
$$ 23623998 23988571 24097592 24445960 24566873 24849357 25062485 25215708 25381729 25374771 25603854
3223B5603854K15171K70297P498J38926P3406O2742k3971k12228L6324O0854K72176
$$ 25603854 25819025 26089322 26096820 26235746 26309152 26371894 26347923 26135695 26172019 26232873 26505049
3212B6505049J41274o240l114j8999J3805L4579L6449K25863J22557K26439Q9241
$$ 26505049 26646323 26640083 26636969 26617970 26631775 26666354 26702803 26928666 27051223 27277662 27366903
3201B7366903k3908N0109N5890K03977m2048J45387Q4054K24593q734j8670J40670
$$ 27366903 27342995 27393104 27448994 27652971 27610923 27756310 27840364 28064957 28056223 28037553 28178223
3190B8178223q7614k95773j64583k63844j78471N227j17369j99034L6303L5211
$$ 28178223 28090609 27794836 27630253 27366409 27187938 27193165 27075796 26876762 26913065 26948276
3180B6948276k598j42059n1220k5054k36661k25321j44021k57693j7117l43021
$$ 26948276 26945678 26803619 26752399 26727345 26490684 26265363 26121342 25863649 25846532 25503511
3170B5503511j90871l47958n8294J1665k29849Q785k59707j06312Q7429J61083
$$ 25503511 25312640 24964682 24906388 24918053 24688204 24696989 24437282 24330970 24418399 24579482
3160B4579482j81598n06884l73316l58791k84067n57935n48742j1818m79216l07587
$$ 24579482 24397884 23891000 23517684 23158893 22874826 22316891 21768149 21756331 21277115 20969528
3150B0969528p9857o5095j71361l46972l85707r5940j59242j47231k46310m48318
$$ 20969528 20889671 20824576 20653215 20306243 19920536 19824596 19665354 19518123 19271813 18823495
3140A8823495l46585k3659l65873k77398j14474j55624Rl17751j83852p6817k75840
$$ 18823495 18476910 18453251 18087378 17809980 17695506 17539882 17539891 17222140 17038288 16961471 16685631
3129A6685631k76731m34967m75768l76618Q9160j62878r4578j51732R287j33040
$$ 16685631 16408900 15973933 15498165 15121547 15210707 15047829 14953251 14801519 14810806 14677766
3119A4677766N1744m0375o8185j10665l40557k92894k00685k05119q034j95309
$$ 14677766 14729510 14689135 14620950 14510285 14169728 13876834 13676149 13471030 13462996 13267687
3109A3267687J05059O5979j3850k97869M9001K79945L64414r0962K618K53628
$$ 13267687 13372746 13438725 13424875 13127006 13176007 13455952 13820366 13729404 13732022 13985650
3099A3985650J1348J71466K15687J24605K37641L27687q3336J81027k0835J4057
$$ 13985650 13996998 14168464 14384151 14508756 14746397 15074084 14990748 15171775 15150940 15164997
3089A5164997l61482k44533m73476k63428l46099j84564n28076l36052l50438
$$ 15164997 14803515 14558982 14085506 13822078 13475979 13291415 12763339 12427287 12076849
3080A2076849k85961k95343j69545l73231k7028Q0680o2568P5329j69998p7370
$$ 12076849 11790888 11495545 11326000 10952769 10925741 11006421 10943853 11019182 10849184 10771814
3070A0771814J759j65305J33019O4802L89069M1147N4347K21485J56185j43457
$$ 10771814 10773573 10608268 10741287 10806089 11195158 11236305 11290652 11512137 11668322 11524865
3060A1524865k89490m70868k25600J90510k91264r1178j1092M3979n925o4215
$$ 11524865 11235375 10764507 10538907 10729417 10438153 10346975 10335883 10379862 10373937 10309722
3050A0309722m30142J11915k73228j45739J13537R5201k11467K17844J07087o3095
$$ 10309722 9879580 9991495 9718267 9572528 9686065 9781266 9569799 9787643 9894730 9831635
3040I831635J07682J3829K37221l1117o85L79805K43313J26994m363j1455J55978
$$ 9831635 9939317 9953146 10190367 10159250 10158565 10538370 10781683 10908677 10904314 10892859 11048837
3029A1048837j86329J26467K40995Q8852Q1221j00773M4218m7170o9013J17839
$$ 11048837 10862508 10988975 11229970 11318822 11400043 11299270 11343488 11296318 11227305 11345144
3019A1345144K4720J61453q6637R1084L09974L97212Q0868K37367M41576K66133
$$ 11345144 11369864 11531317 11444680 11535764 11845738 12242950 12323818 12561185 13002761 13268894
3009A3268894K99375K67682L65582J54838K55178P2532K1641K14402j14584m2244
$$ 13268894 13568269 13835951 14201533 14356371 14611549 14684081 14705722 14920124 14805540 14763296
2999A4763296J33222O8299J34643j38229J37568J30870J88646J38508K04696M51651
$$ 14763296 14896518 14964817 15099460 14961231 15098799 15229669 15418315 15556823 15761519 16213170
2989A6213170J69578J4511M31967N16452K61078L23164L45407J96257L08286K10319
$$ 16213170 16382748 16397259 16829226 17345678 17606756 17929920 18275327 18471584 18779870 18990189
2979A8990189K69613L38693K08760K07374l2276m921n2815j39191j43040K01839
$$ 18990189 19259802 19598495 19807255 20014629 19982353 19977432 19924617 19785426 19642386 19844225
2969A9844225l482j46359k71966l3207K40763J42392j2203K07696L00951m1294
$$ 19844225 19840743 19694384 19422418 19389211 19629974 19772366 19760163 19967859 20268810 20227516
2959B0227516L03384K08079J39084P3031q0836p7594j74470N3246j63204J41710
$$ 20227516 20530900 20738979 20878063 20951094 20870258 20792664 20618194 20671440 20508236 20649946
2949B0649946J19158p3630m6543q894J38095r3497j91779K2367k29390j62987
$$ 20649946 20769104 20695474 20648931 20640037 20778132 20684635 20492856 20515223 20285833 20122846
2939B0122846m216l9838j46697j98536k43904j83819j77833j00211J03831n7783
$$ 20122846 20118630 20078792 19932095 19733559 19489655 19305836 19128003 19027792 19131623 19073840
2929A9073840k42854O4415j38507l62871j44727k64209k55537q8756k74431l58453
$$ 19073840 18830986 18895401 18756894 18394023 18249296 17985087 17729550 17640794 17366363 17007910
2919A7007910k02963j89358l86663j47080N6106k39199j90600j55293J0214k46134
$$ 17007910 16804947 16615589 16228926 16081846 16137952 15898753 15708153 15552860 15563074 15316940
2909A5316940j94016j96888J34114k20853k35685k93988k54926r3709o3170k9296
$$ 15316940 15122924 14926036 15060150 14839297 14603612 14309624 14054698 13960989 13897819 13868523
2899A3868523k35539j00861l76317n11472l19625k74177k82989q8141j85671m18929
$$ 13868523 13632984 13532123 13155806 12644334 12324709 12050532 11767543 11679402 11493731 11074802
2889A1074802k77702l101m5522j63938j81761j3019K8794l97387j68945J49834
$$ 11074802 10797100 10793999 10748477 10584539 10402778 10389759 10418553 10021166 9852221 10002055
2879A0002055q1510j22267j88531O5670M5144k45636l43602k52094J10743j10263
$$ 10002055 9920545 9798278 9609747 9675417 9720561 9474925 9131323 8879229 8989972 8879709
2869H879709j88421l77009o1531m02384r6591J64576j36305l55065k31264O1096
$$ 8879709 8691288 8314279 8252748 7850364 7753773 7918349 7782044 7426979 7195715 7256811
2859G256811j71798l1044M1312j81484o3704k60482j85888k0485R4563K6828k62244
$$ 7256811 7085013 7053969 7095281 6913797 6850093 6589611 6403723 6383238 6477801 6504629 6242385
2848F242385j6789N7433R8278l67774p1256R1428k8469l7804l19621r8353J46563
$$ 6242385 6225596 6283029 6381307 6013533 5942277 6033705 6005236 5967432 5647811 5549458 5696021
2837E696021Q736j57146r3787j0853j10849j37656k68510Q1073J9444q5634j93912
$$ 5696021 5704757 5547611 5453824 5442971 5332122 5194466 4925956 5007029 5026473 4940839 4746927
2826D746927J9590J4746j36011k30123k33396J73889J70446r3406J02051o46J01695
$$ 4746927 4766517 4781263 4645252 4415129 4181733 4355622 4526068 4432662 4534713 4534067 4635762
2815D635762j54195n3028N4344J68881n2767j49811j25907J56317l200L4752m07681
$$ 4635762 4481567 4428539 4482883 4651764 4598997 4449186 4323279 4479596 4476396 4511148 4103467
2804D103467k22712K50979l88600M6140q1268J5481j302J77354j15614j68437
$$ 4103467 3880755 4131734 3743134 3789274 3708006 3723487 3722185 3899539 3783925 3615488
2794C615488p247m0230M5578j67259o7227N0415L0670N2061P4897J04086J85915
$$ 3615488 3608241 3568011 3613589 3446330 3379103 3429518 3460188 3512249 3587146 3691232 3877147
2783C877147j85080k60315j3737j76272k0420m9367J53729k41656p1346k58589
$$ 3877147 3692067 3431752 3418015 3241743 3221323 3171956 3325685 3084029 3012683 2754094
2773B754094J47007K38223j05912j04071o3109P4317j84869m828j59987l4198
$$ 2754094 2901101 3139324 3033412 2929341 2866232 2940549 2755680 2750852 2590865 2556667
2763B556667O7491J29349q4356p3022N2766J5403M2462j32396k60513K12813o1948
$$ 2556667 2624158 2753507 2669151 2596129 2648895 2664298 2706760 2574364 2313851 2526664 2464716
2752B464716l35491J81848j4522n1399J48763p3739j24837J9661J9234j09084
$$ 2464716 2129225 2311073 2296551 2245152 2393915 2320176 2195339 2215000 2234234 2125150
2742B125150m8670r4268p0951q1641J12507O1332j54492N5227P3226j60871k1522
$$ 2125150 2076480 1982212 1911261 1829620 1942127 2003459 1848967 1904194 1977420 1816549 1795027
2731A795027j31468k1643l82736p0930K90915r7459J30958J70836k51014j02700
$$ 1795027 1663559 1641916 1259180 1188250 1479165 1381706 1512664 1683500 1432486 1329786
2721A329786O9283j63072o4875j93386L46667j85486j42737K04901m8433O6419
$$ 1329786 1399069 1235997 1171122 977736 1324403 1138917 996180 1201081 1152648 1219067
2711A219067p7298O8027n2217j69805R2659K00153j06925m11366J4208K44388
$$ 1219067 1141769 1209796 1157579 987774 1080433 1280586 1173661 762295 776503 1020891
2701A020891q8037J38546M2095J0072k69640j23302n4423K1314Q8150J22497n4730
$$ 1020891 932854 1071400 1113495 1123567 853927 730625 676202 697516 785666 908163 853433
2690H53433j85606j21119j08853M4195j18860K00734N3919J33712Q708j10133
$$ 853433 667827 546708 437855 482050 363190 563924 617843 751555 760263 650130
2680F50130J51291k5941k80515k1579J55937O1030j23839K32512r2760M5388J15834
$$ 650130 801421 775480 494965 473386 629323 690353 566514 799026 706266 751654 867488
2669H67488k96451J63537P9879O52j0978j72910n7386j14186J11698K4943k23778
$$ 867488 571037 734574 814453 815105 804127 631217 573831 459645 571343 596286 372508
2658C72508j02747J38733j46630n1420J63016j31900O1138K35593o9387J28135
$$ 372508 269761 408494 261864 210444 373460 241560 302698 538291 468904 597039
2648E97039k74210J5246L5819J58572l1368j79711J26182L8387m7165J90856j1525
$$ 597039 322829 338075 373894 532466 501098 321387 447569 485956 438791 629647 618122
2637F18122k95396J11739j03571M4564l9837m6509J46422p1119j81570O9466R4795
$$ 618122 322726 434465 330894 375458 335621 289112 435534 364415 182845 252311 347106
2626C47106k70203j61317L44557K12541n8912l42415k9398J9980P4749o520J33595
$$ 347106 76903 -84414 260143 472684 413772 71357 41959 61939 136688 130168 263763
2615B63763j53364J44807k3356j08952q9361R9827L45674j21161o8302j47624
$$ 263763 110399 255206 231850 122898 33537 133364 479038 357877 289575 141951
2605A41951k21482K63870k6851j9936J51587m9394P4819r6337l2397m0396J08232
$$ 141951 -79531 184339 157488 137552 289139 239745 314564 218227 185830 145434 253666
2594B53666K39182m3727k64910j74241K26859J4893j30848q7833L9132J40223
$$ 253666 492848 449121 184211 9970 236829 251722 120874 33041 72173 212396
2584B12396j19144P7671J21505j13507N850m7504j13141J50678r7756j5529m7617
$$ 212396 93252 170923 292428 178921 184771 137267 24126 174804 77048 61519 13902
2573A3902j1312J29006K6648M2656j84008m1096p0188j7137J05974r5724L14185
$$ 13902 2590 131596 158244 200900 16892 -24204 -94392 -111529 -5555 -101279 212906
2562B12906j66799Q323J09951J04893R9802k50161Q8531O5032p7595K4796k1547
$$ 212906 46107 54430 164381 269274 369076 118915 207446 272478 194883 219679 198132
2551A98132k51485J65029J41416k8875k5568Q477j17550J75880P6144l3141j21982
$$ 198132 -53353 111676 253092 224217 198649 207126 89576 265456 341600 308459 186477
2540A86477j13439M0162K70782p1152J79452M4239j93545l6614K10920k18972
$$ 186477 73038 113200 383982 312830 492282 536521 342976 306362 517282 298310
2530B98310J38834J53684n7063n0373j37694J54288j0041j52801j20783M6964
$$ 298310 437144 590828 533765 483392 345698 499986 489945 337144 216361 263325
2520B63325k52818L26796j41003N0400O2148j06738R1930k1123j7393L878j96292
$$ 263325 10507 337303 196300 246700 308848 202110 294040 272917 255524 259402 63110
2509F3110J31185L6513K03562n2249l1795j45383O1455Q4084k22662K4138K0000
$$ 63110 194295 230808 434370 382121 350326 204943 266398 350482 127820 151958 171958
2498A71958J34295L1526j39446R6017j17464R5256L8508m7597j08952Q3578k5909
$$ 171958 306253 337779 198333 294350 176886 272142 310650 263053 154101 237679 211770
2487B11770l5102j84200J03364K01296o9684p1216o4632K03317k28883J30535
$$ 211770 176668 -7532 95832 297128 227444 156228 91596 294913 66030 196565
2477A96565Q8596n4023N6277L6970m9510j1410l9023O8009R5763o8504k94444
$$ 196565 285161 231138 287415 324385 274875 263465 224442 292451 388214 319710 25266
2466B5266J46184J30635j95433J81156j22440Q0320P7010l94841J15195J56722
$$ 25266 171450 302085 106652 287808 165368 245688 322698 -72143 43052 199774
2456A99774j65367j22247K19726J07771j99589K39576J53153j61711J48730k26769
$$ 199774 34407 -87840 131886 239657 40068 279644 432797 271086 419816 193047
2446A93047o2615J3201N4324r9935J14622N5280m5399r1151m2496J30725q4874
$$ 193047 130432 143633 197957 98022 212644 267924 222525 131374 88878 219603 134729
2435A34729J01709r3560J4176j06640N7782j32725j31440J35391J04113l6392
$$ 134729 236438 142878 157054 50414 108196 -24529 -155969 -20578 83535 47143
2425D7143j34116Q3272J4143j31105P9594R7315k0475M7488p7216J06588j02444
$$ 47143 -86973 -3701 10442 -120663 -41069 56246 35771 83259 6043 112631 10187
2414A0187o9868J01414P0178m6178o2436o5987l1135k7523M9294p3721J76032
$$ 10187 -59681 41733 111911 65733 3297 -62690 -93825 -121348 -72054 -145775 30257
2403C0257k86708p8545J01408J79539K3170O1117m5044o1827N6677n7710O0473
$$ 30257 -256451 -334996 -233588 -54049 -30879 30238 -14806 -76633 -19956 -77666 -17193
2392a7193J70849O603j15207l3466P8445r3614k47009O7285O9025J17461J91767
$$ -17193 153656 160259 45052 11586 90031 -3583 -250592 -183307 -114282 3179 194946
2381A94946j42425O1508j23739M7259K55121j01674R3590l87991J50130J53554
$$ 194946 52521 114029 -9710 37549 292670 190996 284586 -103405 46725 200279
2371B00279l5798j18306j86990N6492M099L1944K09760r1273O3221j8492Q7j05634
$$ 200279 164481 46175 -140815 -84323 -80224 -48280 161480 70207 133428 114936 115023 9389
2359I389K3331J58907j51622q6730K25296p3057L5466M1621j88082j7564L66500
$$ 9389 32720 191627 40005 -46725 178571 105514 140980 182601 -5481 -23045 343455
2348C43455j62828r0607M6660m0224j55646J43773J77810k0901j4641l15296R1771
$$ 343455 180627 90020 136680 96456 -59190 84583 262393 241492 226851 -88445 3326
2337C326J59880l7070J8595O0762j89443j11538Q6243K44388k1377O0279n6961
$$ 3326 163206 126136 144731 205493 16050 -95488 -9245 235143 213766 274045 217084
2326B17084q9182j43228P3600J61247N8019M17429j37513k71268j28960n8313
$$ 217084 127902 -15326 58274 219521 277540 694969 557456 286188 157228 98915
2316I8915J45466n3211P6530K4701O244L7219J22945R1240p8416K41352J15930
$$ 98915 244381 191170 267700 292401 298645 335864 458809 550049 471633 712985 828915
2305H28915J14951N7047j14104j08826j38514j49537J7891l58594j6850j12626
$$ 828915 943866 1000913 886809 777983 639469 489932 507823 149229 132379 19753
2295A9753J41507q0510J96796q6234k13595m9800R7043J60777k441J07784m3715
$$ 19753 161260 80750 277546 191312 -22283 -72083 24960 185737 183296 291080 247365
2284B47365J8692j36944J28763o9654J22845j08817k4756J59094R3687r8866J74812
$$ 247365 266057 129113 257876 188222 311067 202250 177494 336588 430275 331409 506221
2273E06221j15649j36821j64857J37810k4974N0001L2321O9414j04558J89814
$$ 506221 390572 253751 88894 226704 201730 251731 284052 353466 248908 438722
2263D38722j07643j01920N980J26055r0073L6931j36149r7828R5516k53018M2140
$$ 438722 331079 229159 235139 361194 271121 308052 171903 74075 169591 -83427 -41287
2252d1287K41431o3373M8575K01590j36826k08370R7842K57904p0324j67827J22183
$$ -41287 200144 136771 185346 386936 250110 41740 139582 397486 327162 159335 281518
2241B81518J41918J11176j62302R1771n0399l4620m7389j71702K44221L4351n7448
$$ 281518 423436 534612 372310 464081 413682 379062 331673 159971 404192 438543 381095
2230C81095R5588J19242O3311q6975j40504N5108o8238O7168j34668J50416m0273
$$ 381095 476683 595925 659236 572261 431757 486865 418627 485795 351127 501543 461270
2219D61270j36455J32477K17916J7561o2330k8415P349j84373k20725N9647J05315
$$ 461270 324815 457292 675208 692769 630439 602024 609373 425000 204275 263922 369237
2208C69237j78410J05758k488K60330p3421k14192j02214K0134J82493P6347O3384
$$ 369237 190827 296585 294097 554427 481006 266814 164600 184734 367227 443574 506958
2197E06958L4019j06788q4556q1922K56154o0339J31918j81422J71215M8996j30248
$$ 506958 540977 434189 349633 267711 523865 463526 595444 414022 585237 634233 503985
2186E03985K6918J14184p315j04499J10253k31964K35376O4906k68227n4452K40320
$$ 503985 530903 645087 637772 533273 643526 411562 646938 711844 443617 389165 629485
2175F29485K05423N9837o7335n7467M3146K12660R1901j40831r2577R2223k1370
$$ 629485 834908 894745 827410 769943 813089 1025749 1117650 976819 884242 976465 955095
2164I55095q1390N0512J56759K20270k43085k86972P7274J16239M2878J11552
$$ 955095 873705 924217 1080976 1301246 1058161 771189 848463 964702 1007580 1119132
2154A119132k2648j81427K7801K89287O1181J13962J71445K17353n8756Q9556
$$ 1119132 1096484 915057 942858 1232145 1293326 1407288 1578733 1796086 1737330 1826886
2144A826886p79k31542J09610J86000J48166J26794L0503j9253k8803k06543K68900
$$ 1826886 1826107 1594565 1704175 1890175 2038341 2165135 2195638 2176385 2147582 1941039 2209939
2133B209939R7054J37305O8321R467J14487J6468J26711K8238n0559J34460Q9900
$$ 2209939 2306993 2444298 2512619 2522086 2636573 2653041 2779752 2807990 2757431 2891891 2981791
2122B981791L6446P4855M22472j27852j16303L57683K24489j43589r7395K5441
$$ 2981791 3018237 3093092 3515564 3387712 3271409 3629092 3853581 3709992 3612597 3638038
2112C638038M93083P524J12860J52637J12896K4040J10125L58877K27955n501
$$ 3638038 4131121 4138645 4251505 4404142 4517038 4541078 4651203 5010080 5238035 5232534
2102E232534K31287K11122L99397M01148M78542O9095K41921L92522N86204L24982
$$ 5232534 5463821 5674943 6074340 6475488 6954030 7023125 7265046 7657568 8243772 8568754
2092H568754O55069N72514K91595P85325Q62917N92262Q11889Q92259P40554Q52653
$$ 8568754 9223823 9796337 10087932 10873257 11736174 12328436 13140325 14032584 14773138 15625791
2082A5625791J010764J202626J354692K127243K428999K419084K703767K580742
$$ 15625791 16636555 17839181 19193873 21321116 23750115 26169199 28872966 31453708
2074C1453708L065779L615255N133768N671578O821813Q089544R874869J1475626
$$ 31453708 34519487 38134742 43268510 48940088 55761901 63851445 73726314 85201940
2066H5201940J5822181K2624081K1368330O366966j7517752k6309996k5520453
$$ 85201940 101024121 123648202 145016532 151383498 133865746 107555750 82035297
2059H2035297j7626743j1027718q033609n474533m358325l421750k820384k281986
$$ 82035297 64408554 53380836 45347227 39872694 35514369 32092619 29272235 26990249
2051B6990249j865400j411674j514294j917907k111367j612952j115101j388110
$$ 26990249 25124849 23713175 22198881 20280974 18169607 16556655 15441554 14053444
2043A4053444r27915q73966q36589o42359n40396k39571q17033n02391r0074j05723
$$ 14053444 13125529 12251563 11414974 10772615 10232219 9992648 9175615 8673224 8583150 8477427
2033H477427m51572j58560m33367k95957l88709l08732k9711l55375l58587J26665
$$ 8477427 8025855 7867295 7433928 7137971 6749262 6440530 6410819 6055444 5696857 5823522
2023E823522n5759k33969l04020j99088k21861k51238j62904j05838j56222k78554
$$ 5823522 5767763 5533794 5229774 5030686 4808825 4557587 4394683 4288845 4132623 3854069
2013C854069J85403N7409k52943M5918m0700O1727j03253l2926j29579j58192
$$ 3854069 4039472 4096881 3843938 3889856 3849156 3910883 3807630 3774704 3645125 3486933
2003C486933k67482j77221l4390j00322m26L9774l8881j78412j78998j85584J4304
$$ 3486933 3219451 3042230 3007840 2907518 2907092 2946866 2907985 2729573 2550575 2364991 2379295
1992B379295K13539N8767k15614j1104n9093k40223j45612P2834l0866n6286K2509
$$ 2379295 2592834 2651601 2435987 2424883 2365790 2125567 1979955 2052789 2021923 1965637 1988146
1981A988146K1646j7012N5162k3631M4769l01426j74623j05483J27406o4099r9330
$$ 1988146 2009792 1992780 2047942 2024311 2069080 1767654 1593031 1487548 1614954 1550855 1451525
1970A451525q1756p8069P5830p3022J13918q4278p2041j11460J67168k23769K387
$$ 1451525 1369769 1291700 1367530 1294508 1408426 1324148 1252107 1140647 1307815 1084046 1086433
1959A086433J7889l9659m7783N6450j72940N985j26735R3164j788p5682N4376
$$ 1086433 1104322 1064663 1016880 1073330 900390 906375 779640 872804 871016 795334 849710
1948H49710o6471J95916Q7812j56395O4024j57945r2915k3266L4696J88796m5620
$$ 849710 783239 979155 1066967 910572 974596 816651 723736 700470 735166 923962 878342
1937H78342k14715m8597O221J40557R8158k15036m8401j88555l3103J9644L9208
$$ 878342 663627 615030 621251 761808 859966 644930 596529 407974 374871 394515 433723
1926D33723L404J42161P9066q0002j57743j50891J00327p5051K45866Q4068j79021
$$ 433723 437127 579288 658354 578352 420609 269718 370045 294994 540860 624928 445907
1915D45907J18355j5758j83041k0655M9665R5741r5025j20214J56698N5588o4015
$$ 445907 564262 548504 365463 344808 394473 490214 395189 274975 431673 487261 423246
1904D23246n1480j69809r2472J4002P7525j4084K24909J56633k3865J52898j13400
$$ 423246 371766 201957 109485 123487 201012 186928 411837 568470 544605 697503 584103
1893E84103k45511j03827m1244k21948J01471J76140l8758j58992Q5106R5764
$$ 584103 338592 234765 193521 -28427 73044 249184 210426 51434 136540 232304
1883B32304j21398K13372K65887k72425k51305K0664J10896j81852N0021j72785
$$ 232304 110906 324278 590165 317740 66435 87099 197995 16143 66164 -106621
1873a06621J42883J990q4540K21321j12731K12235r5654l4587J30732n0595J23990
$$ -106621 36262 38252 -46288 175033 62302 274537 178883 144296 275028 224433 348423
1862C48423P728M8618r1377j4126J35183L7249j88450k59583J03139L6833l03523
$$ 348423 356151 404769 313392 299266 434449 471698 283248 23665 126804 163637 -139886
1851a39886J88010m0862M9590L2470K6400j70840n1403J62164M4625l6964k6591
$$ -139886 48124 7262 56852 89322 115722 -55118 -106521 55643 100268 63304 36713
1840C6713R5245R4132o9905m0011K32417o1702m4297N2458N2235j4720k07905
$$ 36713 131958 226090 156185 116174 348591 286889 242592 295050 347285 332565 124660
1829A24660K65089K8502L3545Q1561k6401J36669J7457k0681K15820J8417j841
$$ 124660 389749 418251 451796 533357 506956 643625 661082 640401 856221 874638 872797
1818H72797m26945j18901J75193r4641j26415Q9952j52269r709n8826M8699K88299
$$ 872797 445852 326951 502144 407503 281088 371040 218771 209062 150236 198935 487234
1807D87234j15670k13381m5743n5266j57924R6224K04327l0387j31208J76875
$$ 487234 371564 158183 112440 57174 -100750 -4526 199801 169414 38206 215081
1797B15081j8014J12564k5999J92679l54482o2211j2691Q240j86906K22936N5362
$$ 215081 197067 309631 283632 476311 121829 59618 46927 55167 -131739 91197 146559
1786A46559l3718k00829j10795Q017J67023O8899l7921p5958J23243R2022j59762
$$ 146559 112841 -87988 -198783 -190766 -23743 45156 7235 -68723 54520 146542 -13220
1775a3220J01007O1965l0185q0294p4879J28468K3449J5428K5868L9857j49586
$$ -13220 87787 149752 119567 39273 -35606 92862 116311 131739 157607 197464 47878
1764D7878K27919O5504j92005K3344j18526K07045K1781j03750m755k13605J64319
$$ 47878 275797 341301 149296 172640 54114 261159 282940 179190 174435 -39170 125149
1753A25149K3092j70785p8606m3281k12169K81017J11776o6408P7347R4736l5463
$$ 125149 148241 -22544 -101150 -144431 -356600 -75583 36193 -30215 47132 141868 106405
1742A06405Q4393K71664k19177l64222k7433K26755O4644l7199o4245j27780p6118
$$ 106405 190798 462462 243285 -120937 -148370 78385 143029 105830 41585 -86195 -162313
1731a62313K54817k0267o1946j99018j6941L25962l8019P2641k5783N960p4919
$$ -162313 92504 72237 10291 -188727 -205668 120294 82275 154916 129133 135093 60174
1720F0174n1980o8018k15101J25448K90345K23760m06240l3957Q3444j33400k2179
$$ 60174 8194 -59824 -274925 -149477 140868 364628 -41612 -75569 7875 -125525 -147704
1709a47704J41912l8854J22673j48910J66789j98092R2021m3037k1425n4753P7766
$$ -147704 -5792 -44646 78027 -70883 95906 -102186 -10165 -53202 -74627 -129380 -51614
1698e1614r3491q5254J89243M6000M777j43945J77714j79537k11368L60806P1895
$$ -51614 -145105 -230359 -41116 4884 9661 -134284 43430 -136107 -347475 13331 85226
1687H5226J7000j4881r0272p0962J38650r0546n6772O3584j73463k9903N9885
$$ 85226 102226 87345 -2927 -73889 64761 -25785 -82557 -18973 -192436 -222339 -162454
1676a62454J12198J59088p2463J40951L4495k14941j70843K5263M3551J11678
$$ -162454 -50256 108832 36369 177320 211815 -3126 -173969 -148706 -105155 6523
1666F523K03977m1757M7285k10022l31429O6240J97501O1456k8663L3161J1544
$$ 6523 210500 168743 216028 6006 -325423 -259183 -61682 -226 -28889 4272 15816
1655A5816j79863J72595K1071r2159P6805Q8420n2471j36851k2037j90779l0320
$$ 15816 -164047 8548 29619 -62540 14265 102685 50214 -86637 -108674 -299453 -329773
1644c29773L88884l06665r9258N35O6143K19012J24880J96218l79145L2712J66192
$$ -329773 59111 -247554 -346812 -346277 -280134 -61122 63758 259976 -119169 -86457 79735
1633G9735l53060K95643Q642l12921J2480J49997K01577j35886R1978r5343R7218
$$ 79735 -273325 22318 30960 -281961 -269481 -119484 82093 -53793 38185 -57158 40060
1622D0060n3361M146j153J24461k11121m1882J54544j75325o05J56019K62781
$$ 40060 -13301 -9155 -10308 114153 -96968 -138850 15694 -159631 -160236 -4217 258564
1611B58564p2368j87385J32586j33739q5375n6136m2813J96328k86321J73633
$$ 258564 186196 -1189 131397 -2342 -87717 -143853 -186666 9662 -276659 -103026
1601a03026L2758K05696L6906j6677k44434n950p8218o4447J1151J41675J77029
$$ -103026 -70268 135428 172334 155657 -88777 -94727 -172945 -237392 -226241 -84566 92463
1590I2463n1071P0681j00958q088j52244l02104L24225P4761L16995k8610k29213
$$ 92463 41392 112073 11115 3027 -149217 -451321 -127096 -52335 264660 236050 6837
1579F837O40Q0934k43866M0625J53364M6637o8445j01920J25265J19403j26148
$$ 6837 7477 88411 -155455 -114830 38534 85171 16726 -85194 40071 159474 33326
1568C3326j50978P7726q3067P849j04525J00213n9429P3838p1176l106K59350
$$ 33326 -117652 -39926 -122993 -115144 -219669 -119456 -178885 -105047 -176223 -179329 80021
1557H0021m613K7742j62511o4788J07474K53127j33050R3757k19203k42538K28323
$$ 80021 75408 103150 -59361 -124149 -16675 236452 103402 197159 -22044 -264582 -36259
1546c6259J19841O8796r4719k19519k1314q9590k9751m0728r0077K13756J29542
$$ -36259 83582 152378 57659 -161860 -183174 -272764 -302515 -343243 -433320 -219564 -90022
1535i0022P36R3773r0004l1952k8307k03830o6983N9180K63246j37523J61199
$$ -90022 -89286 4487 -85517 -117469 -145776 -349606 -416589 -357409 -94163 -231686 -70487
1524g0487J3892O3390o1713k87592K26062K46665o3693q4774k5630K4003P8050
$$ -70487 -56595 6795 -54918 -342510 -116448 130217 66524 -18250 -43880 -19877 58173
1513E8173R348j64779L4388J48905o744j30099J7869J05306K09947k84994J7306
$$ 58173 67521 -97258 -62870 86035 79291 -50808 -32939 72367 282314 -2680 14626
1502A4626L9900R5408j27203q786j75370P5086l5755o0280o8837K6995L05979
$$ 14626 54526 149934 22731 13945 -161425 -86339 -122094 -182374 -251211 -224216 81763
1491H1763j83275J5508j0815j11836K28329k64351k5074L5630J82911K11423j38861
$$ 81763 -101512 -86004 -96819 -208655 19674 -244677 -269751 -234121 -51210 160213 21352
1480B1352m4537p825J36575j06080j38746M6070M5926j25922R357R8520L2036
$$ 21352 -23185 -31010 105565 -515 -139261 -93191 -47265 -173187 -163830 -65310 -33274
1469c3274j16794J0779J30992J85450p813n3391M3719o2331k7359J88938l45363
$$ -33274 -150068 -139289 -8297 177153 169340 115949 159668 97337 69978 258916 -86447
1458h6447O798L7421j13661K51257p1235P6938k4796L6901Q868J17976j49216
$$ -86447 -79649 -42228 -155889 95368 24133 101071 76275 113176 122044 240020 90804
1447I0804O211j93716O9844k03021j44028J88533N2230j70K06406O127m8503k99752
$$ 90804 97015 -96701 -26857 -229878 -373906 -185373 -133143 -133313 73093 79220 30717 -269035
1435b69035O5311k8681k09245L30226K6198j6859j44509J58188Q4284k3939j26483
$$ -269035 -203724 -232405 -441650 -111424 -85226 -102085 -246594 -88406 -4122 -28061 -154544
1424a54544K48571J89638k35295J2772J57360j21007J20071j57968j0392P133
$$ -154544 94027 283665 48370 61142 218502 97495 217566 59598 49206 56339
1414E6339o9510P275L0322k06186O47Q0835j32576n567M3669p1770O1150Q3235
$$ 56339 -13171 -5896 24426 -181760 -181113 -100278 -232854 -238421 -194752 -266522 -205372 -122137
1402a22137J00017p6141J34234q1219l475J6154Q0433j57089J24888j29338p4942
$$ -122137 -22120 -98261 35973 -45246 -48721 -32567 47866 -109223 15665 -113673 -188615
1391a88615K6878r8982J04704N8627K07836J39395l25043j93638l6877K00298
$$ -188615 -161737 -260719 -156015 -97388 110448 249843 -75200 -268838 -305715 -105417
1381a05417k9958O9038l5376M041Q3985j87842J7202j4883P7070J61666j24601
$$ -105417 -135375 -66337 -101713 -97672 -13687 -201529 -184327 -199210 -122140 39526 -85075
1370h5075k79577O5864m8943L19816J92898r7643n3321k44326K86634m4063n3265
$$ -85075 -364652 -298788 -347731 -27915 164983 67340 14019 -230307 56327 12264 -41001
1359d1001Q1930m639j25846k4693P1613Q0998J22273l08626l5091J15753K70101
$$ -41001 40929 36290 -89556 -114249 -42636 38362 160635 -147991 -183082 -67329 202772
1348B02772J4552l45247J63117j44392N2314q1096j9450K9923O5896K65177j72759
$$ 202772 217324 -127923 35194 -109198 -56884 -137980 -157430 -127507 -61611 203566 30807
1337C0807j5474N3454l8336O1258j4661J40383J0886l11107m4056r6792L3558
$$ 30807 15333 68787 30451 91709 77048 217431 228317 -82790 -126846 -223638 -190080
1326a90080J31027K48671k25834n5178j64684J01487N3069j28438J48504J73937
$$ -190080 -59053 189618 -36216 -91394 -256078 -154591 -101522 -229960 -81456 92481
1316I2481L8958l0471q6508p391L8979j21056j22786J71936k6502N9432O1306
$$ 92481 131439 100968 14460 7069 46048 -75008 -197794 -25858 -52360 7072 68378
1305F8378m0526j02860K54703j77086j0685p7754R2410k44099K01829O3726l25605
$$ 68378 27852 -75008 179695 2609 -8076 -85830 6580 -237519 -35690 28036 -297569
1294b97569L40021R0928K6231L8642q4137L8372n1187j79229J15408n2566k74997
$$ -297569 42452 133380 159611 198253 114116 152488 101301 -77928 37480 -15086 -290083
1283b90083R0300J26804q996P5287J62245J4781j48148K5165p8919L0370N6639
$$ -290083 -199783 -72979 -81975 -6688 155557 170338 22190 47355 -31564 -1194 55445
1272E5445p1915J28829j40312J10010k40609O5884N2536J22780o2524k49219j75563
$$ 55445 -16470 112359 -27953 82057 -158552 -92668 -40132 82648 20124 -229095 -404658
1261d04658j82638K30886Q4169J4340R6331J10690l5549k14588o5527J61650M8584
$$ -404658 -587296 -356410 -272241 -257901 -161570 -50880 -86429 -301017 -366544 -204894 -156310
1250a56310J05152p1418J49051p3823k9646n7841j36947J35631K30700K28651
$$ -156310 -51158 -122576 26475 -47348 -76994 -134835 -271782 -136151 94549 323200
1240C23200j7885l82011J8121Q1204j08551j39314j9381L4929Q654o3413J84167
$$ 323200 305315 -76696 -58575 22629 -85922 -225236 -244617 -209688 -201034 -264447 -80280
1229h0280p1526J5806J5737m6444l0887K52291Q3369l01521n4699K13299J61779
$$ -80280 -151806 -136000 -120263 -166707 -197594 54697 138066 -163455 -218154 -4855 156924
1218A56924K12059l08147j98677j10315K25517k03293K3462M65215m1568k54900
$$ 156924 368983 60836 -137841 -248156 -22639 -225932 -202470 262745 221177 -33723
1208c3723M5763n7545j4918j85404K20879J52775K1782k04736j18913J17045J05030
$$ -33723 12040 -45505 -60423 -245827 -24948 127827 149609 -55127 -174040 -56995 48035
1197D8035J42720k29551K3118k45056k6278M5380j484J41222J43055J56079q6602
$$ 48035 190755 -38796 -15678 -260734 -287012 -241632 -243116 -101894 41161 197240 110638
1186A10638j78625J74734j25481j25274J3637K13579o3632j48681l2102l457j46480
$$ 110638 -67987 106747 -18734 -144008 -130371 83208 19576 -129105 -161207 -164664 -311144
1175c11144O9743L20203K38964p2870j19522p2656J49726j42023J0150k8676j8149
$$ -311144 -241401 78802 317766 244896 125374 52718 202444 60421 70571 41895 23746
1164B3746J56886j84750j33607p4089M3694M7743K13306j06466j26351P4783J48673
$$ 23746 180632 -4118 -137725 -211814 -168120 -120377 92929 -13537 -139888 -65105 83568
1153H3568p3591N4321k92783r0916L53988O3103q9681j63625K71023r8618q1386
$$ 83568 9977 64298 -228485 -319401 34587 97690 8009 -155616 115407 16789 -64597
1142f4597J16248J7304k38115O0499J08079J17503r7410j24881J18559j12874
$$ -64597 51651 68955 -169160 -108661 -582 116921 19511 -105370 13189 -99685
1132i9685o4180J07528J41348j11929J00420K23038l50156r7058J56631R806j85570
$$ -99685 -163865 -56337 85011 -26918 73502 296540 -53616 -150674 5957 15763 -169807
1121a69807r1129N3953J80487K3414j86152J77812j76130N0859r0547Q8942R9472
$$ -169807 -260936 -206983 -26496 -3082 -189234 -11422 -187552 -136693 -227240 -138298 -38826
1110c8826k8899O1194m2095m1571j21431R5981K533k8877K58968j46835R772K03029
$$ -38826 -67725 -6531 -48626 -90197 -211628 -115647 -113114 -141991 116977 -29858 -20086 182943
1098A82943J41698j62438m8412j41193q7857K24937k9782J43758R6322j86543
$$ 182943 324641 162203 113791 -27402 -115259 109678 79896 223654 319976 133433
1088A33433k25504J24753r9428k05478j4748J15722J44757j84815J2373K35619
$$ 133433 -92071 32682 -66746 -272224 -286972 -171250 -26493 -211308 -198935 36684
1078C6684J5728n9463n2412N0104M3499R3401k33025Q943J94362j54580J6531
$$ 36684 52412 -7051 -59463 -9359 34140 127541 -105484 -96541 97821 -56759 -40228
1067d0228j31596J24684K10623L0662k69688q8202k8688O9412J87821j26973K978
$$ -40228 -171824 -47140 163483 194145 -75543 -163745 -192433 -123021 64800 -62173 -59195
1056e9195j49705K22785M1468j05836j66077K74805J98126j377L7075l21904o4158
$$ -59195 -208900 13885 55353 -50483 -216560 58245 256371 254994 292069 -29835 -93993
1045i3993J16096J627L5674j33581j69955Q5465J23905J12809j70245Q0169o9297
$$ -93993 22103 23730 59404 -74177 -244132 -158667 -34762 78047 -92198 -12029 -81326
1034h1326p8087J57150M3353L56879j97110N2547j48852k18304J21409q1078r5887
$$ -81326 -159413 -2263 41090 397969 200859 253406 104554 -113750 7659 -73419 -169306
1023a69306j3252J43626M9840l7691K82180j42321p6119K0895o3355M135k4648
$$ -169306 -182558 -38932 10908 -26783 255397 113076 36957 57852 -5503 -1368 -26016
1012b6016m3335p5408P1329o9609M6253K38075l6176J02320j33871L4345K8988
$$ -26016 -69351 -144759 -73430 -143039 -96786 141289 105113 207433 73562 107907 136895
1001A36895k30523P3191J2276k75573l1154O3893P6365J39592P9248O6960n9857
$$ 136895 -93628 -20437 -8161 -283734 -314888 -250995 -174630 -35038 44210 111170 51313
990E1313j00410M0811q5496K74872k0862l1738J15413l38246O3993Q4972J00847
$$ 51313 -49097 -8286 -93782 181090 160228 128490 243903 -94343 -30350 54622 155469
979A55469q7504j24457J8029o8183q0778n038M8164K7357p9860K23818O5069m0629
$$ 155469 67965 -56492 -38463 -106646 -187424 -192462 -144298 -116941 -196801 27017 92086 51457
967E1457N8612m0031J11873p6466j02440L2661n4268O8495j51029J59865L7017
$$ 51457 110069 70038 181911 105445 3005 35666 -18602 49893 -101136 58729 95746
956I5746M068j17941j16229m7483K73928j17966J4157K17161J37501l86275r5610
$$ 95746 99814 -18127 -134356 -181839 92089 -25877 -11720 205441 342942 -43333 -138943
$$ [...]
##END NTUPLES=NMR SPECTRUM
##END=
