##TITLE=1H_EC-3260(8)
 CDCl3, 8 sc, 
 24.08.2021
##JCAMPDX= 6.0         $$ Bruker NMR JCAMP-DX V2.0
##DATA TYPE= NMR SPECTRUM
##DATA CLASS= NTUPLES
##ORIGIN= UXNMR, Bruker Analytische Messtechnik GmbH
##OWNER= root
$$ XWIN-NMR		Version 3.5
$$ Tue Aug 24 09:25:43 2021 Russian Standard Time (UT+4h)  she@DPX200
##.OBSERVE FREQUENCY= 200.131506
##.OBSERVE NUCLEUS= ^1H
##.ACQUISITION MODE= SIMULTANEOUS
##.ACQUISITION SCHEME= undefined
##.AVERAGES= 8
##.DIGITISER RES= 18
##SPECTROMETER/DATA SYSTEM= spect
##.PULSE SEQUENCE= zg30
##.SOLVENT NAME= D2O
##.SHIFT REFERENCE= (INTERNAL, D2O, 0, 17.4995)
##AUDIT TRAIL= $$ (NUMBER, WHEN, WHO, WHERE, WHAT)
$$ ##TITLE= Audit trail, XWIN-NMR		Version 3.5
$$ ##JCAMPDX= 5.01
$$ ##ORIGIN= Bruker BioSpin GmbH
$$ ##OWNER= she
$$ F:/spectra/data/she/nmr/H-F/1/pdata/1/auditp.txt
$$ ##AUDIT TRAIL=  $$ (NUMBER, WHEN, WHO, WHERE, WHAT)
(   1,<2021-08-24 09:24:13.31 +0400>,<she>,<DPX200>,
      <created by zg, POWCHK disabled, PULCHK disabled
       configuration hash MD5:
       00 E9 B6 7A A2 85 ED C7 34 08 36 98 17 FE 4E 26
       data hash MD5: 16K
       F5 86 AE 40 AE 8D 43 0F 8E 3D BC AD 93 A5 DA E4>)
(   2,<2021-08-24 09:24:15.70 +0400>,<she>,<DPX200>,
      <Start of raw data processing
       efp BC_mod = 2 LB = 0.24 FT_mod = 6 PKNL = 1 PHC0 = -13356.75 PHC1 = 11.401 SI = 16K 
       data hash MD5: 16K
       25 3F 05 B8 36 ED 42 ED B6 1F 23 16 CB BF 27 4C>)
(   3,<2021-08-24 09:24:55.95 +0400>,<she>,<DPX200>,
      <pk PHC0 = -4.640961 PHC1 = 8.599999 
       data hash MD5: 16K
       EF F0 EC 0E 8E 06 49 C8 11 0B C7 79 BD F8 C7 A9>)
(   4,<2021-08-24 09:24:58.98 +0400>,<she>,<DPX200>,
      <abs ABSG = 5 
       data hash MD5: 16K
       13 BD 54 50 64 C6 32 50 A6 7D 03 3F 35 0E 15 A3>)
$$ ##END=
$$ 
$$ hash MD5
$$ AA A6 FB DB 35 F5 00 36 2C 31 8D 31 B2 74 B1 92
##$RELAX= 
##$RELAX= 
##$RELAX= 
##$RELAX= 
##$RELAX= 
##$RELAX= 
$$ Bruker specific parameters
$$ --------------------------
##$DU= <F:/spectra>
##$EXPNO= 1
##$NAME= <H-F>
##$PROCNO= 1
##$TYPE= <nmr>
##$USER= <she>
##$AMP= (0..31)
100 100 100 100 100 100 100 100 100 100 100 100 100 100 100 100 100 100 
100 100 100 100 100 100 100 100 100 100 100 100 100 100 
##$AQSEQ= 0
##$AQ_mod= 1
##$AUNM= <au_zg>
##$AUTOPOS= <>
##$BF1= 200.13
##$BF2= 200.13
##$BF3= 200.13
##$BF4= 200.13
##$BF5= 200.13
##$BF6= 200.13
##$BF7= 200.13
##$BF8= 200.13
##$BYTORDA= 1
##$CFDGTYP= 0
##$CFRGTYP= 5
##$CHEMSTR= <none>
##$CNST= (0..31)
1 1 145 1 1 1 1 1 1 1 1 1 1 1 1 1 1 1 1 1 1 1 1 1 1 1 1 1 1 1 1 1 
##$CPDPRG= <>
##$CPDPRG1= <>
##$CPDPRG2= <>
##$CPDPRG3= <>
##$CPDPRG4= <mlev>
##$CPDPRG5= <mlev>
##$CPDPRG6= <mlev>
##$CPDPRG7= <mlev>
##$CPDPRG8= <mlev>
##$CPDPRGB= <>
##$CPDPRGT= <>
##$D= (0..31)
0 1.2 0 0 0 0 0 0 0 0.06 0 0.03 0 0 0 0 0.0002 0 0 0 0 0 0 0 0 0 0 0 0 
0 0 0 
##$DATE= 1629782652
##$DBL= (0..7)
120 120 120 120 120 120 120 120 
##$DBP= (0..7)
150 150 150 150 150 150 150 150 
##$DBP07= 0
##$DBPNAM0= <>
##$DBPNAM1= <>
##$DBPNAM2= <>
##$DBPNAM3= <>
##$DBPNAM4= <>
$$ [...]
##$SUBNAM3= <"">
##$SUBNAM4= <"">
##$SUBNAM5= <"">
##$SUBNAM6= <"">
##$SUBNAM7= <"">
##$SUBNAM8= <"">
##$SUBNAM9= <"">
##$SW= 20.0188882624521
##$SWIBOX= (0..15)
0 0 2 0 0 0 0 0 0 0 0 0 0 0 0 0 
##$SW_h= 4006.41025641026
##$TD= 16384
##$TD0= 1
##$TE= 0
##$TE2= 300
##$TE3= 300
##$TEG= 300
##$TL= (0..7)
0 120 120 120 120 120 120 120 
##$TP= (0..7)
150 150 150 150 150 150 150 150 
##$TP07= 0
##$TPNAME0= <>
##$TPNAME1= <>
##$TPNAME2= <>
##$TPNAME3= <>
##$TPNAME4= <>
##$TPNAME5= <>
##$TPNAME6= <>
##$TPNAME7= <>
##$TPOAL= (0..7)
0.5 0.5 0.5 0.5 0.5 0.5 0.5 0.5 
##$TPOFFS= (0..7)
0 0 0 0 0 0 0 0 
##$TUNHIN= 0
##$TUNHOUT= 0
##$TUNXOUT= 0
##$USERA1= <user>
##$USERA2= <user>
##$USERA3= <user>
##$USERA4= <user>
##$USERA5= <user>
##$V9= 5
##$VALIST= <valist>
##$VCLIST= <CCCCCCCCCCCCCCC>
##$VD= 0
##$VDLIST= <DDDDDDDDDDDDDDD>
##$VPLIST= <PPPPPPPPPPPPPPP>
##$VTLIST= <TTTTTTTTTTTTTTT>
##$WBST= 1024
##$WBSW= 4
##$XGAIN= (0..3)
0 0 0 0 
##$XL= 0
##$YL= 0
##$YMAX_a= 128508
##$YMIN_a= -222284
##$ZGOPTNS= <>
##$ZL1= 120
##$ZL2= 120
##$ZL3= 120
##$ZL4= 120
##$ABSF1= 17.49711
##$ABSF2= -2.521927
##$ABSG= 5
##$ABSL= 3
##$ALPHA= 0
##$AQORDER= 0
##$ASSFAC= 0
##$ASSFACI= 0
##$ASSFACX= 0
##$ASSWID= 0
##$AUNMP= <proc_1d>
##$AZFE= 0.1
##$AZFW= 0.1
##$BCFW= 0
##$BC_mod= 2
##$BYTORDP= 0
##$COROFFS= 0
##$CY= -3
##$DATMOD= 1
##$DC= 0
##$DFILT= <>
##$DTYPP= 0
##$F1P= 0
##$F2P= 0
##$FCOR= 1
##$FTSIZE= 16384
##$FT_mod= 6
##$GAMMA= 0
##$GB= 0
##$INTBC= 1
##$INTSCL= 1.334414e-10
##$ISEN= 128
##$LB= 0.24
##$LEV0= 0
##$LPBIN= 0
##$MAXI= 10000
##$MC2= 0
##$MEAN= 0
##$ME_mod= 0
##$MI= 1.114404
##$NCOEF= 0
##$NC_proc= -7
##$NLEV= 6
##$NOISF1= 3.799351
##$NOISF2= 2.8
##$NSP= 0
##$NTH_PI= 0
##$NZP= 0
##$OFFSET= 17.49955
##$PC= 1
##$PHC0= -13361.39
##$PHC1= 20.001
##$PH_mod= 1
##$PKNL= yes
##$PPARMOD= 0
##$PSCAL= 0
##$PSIGN= 0
##$REVERSE= no
##$SF= 200.130007019204
##$SI= 16384
##$SIGF1= 3
##$SIGF2= 2
##$SINO= 5.538805
##$SIOLD= 16384
##$SREGLST= <1H.CDCl3>
##$SSB= 0
##$STSI= 16384
##$STSR= 0
##$SW_p= 4006.41025641026
##$SYMM= 0
##$S_DEV= 0
##$TDeff= 16384
##$TDoff= 0
##$TI= <>
##$TILT= no
##$TM1= 0
##$TM2= 0
##$TOPLEV= 0
##$USERP1= <user>
##$USERP2= <user>
##$USERP3= <user>
##$USERP4= <user>
##$USERP5= <user>
##$WDW= 1
##$XDIM= 16384
##$YMAX_p= 336445603
##$YMIN_p= -609197
$$ End of Bruker specific parameters
$$ ---------------------------------
##NTUPLES= NMR SPECTRUM
##VAR_NAME=  FREQUENCY,     SPECTRUM/REAL,   SPECTRUM/IMAG
##SYMBOL=    X,             R,               I
##VAR_TYPE=  INDEPENDENT,   DEPENDENT,       DEPENDENT
##VAR_FORM=  AFFN,          ASDF,            ASDF
##VAR_DIM=   16384,         16384,           16384
##UNITS=     HZ,            ARBITRARY UNITS, ARBITRARY UNITS
##FACTOR=    0.24454680195387, 1,            1
##FIRST=     3502.18503745999, 0,            0
##LAST=      -504.225218950275, 0,           0
##MIN=       -504.225218950275, -609197,     0
##MAX=       3502.18503745999, 336445603,    0
$$ Real data points
##PAGE= N=1
##DATA TABLE= (X++(R..R)), XYDATA
$$ [...]
6866a27857J08655J37239j58461j14952K79171j8272Q4495N4650j42042j40519
6856c7893O4730o3014p4873o8788J01989J40424J16728n2820k2805Q9984P0998
6845B64660j06771j4473j57638P4837Q4538j52731K408n2326o1969n6145J74632
6834i78R7081j04123m8213J17698J3073m0526P9321m1876K9560k10822j00256
6823b10061N8495j38444K14415R991P6989k8626j23270K25840K4620M6023j48163
6812G809J47774M7504r1676J60821k98912o192j95769L07062J17700j25473j3462
6801E7186o8636K6409k19475L00948k3500k72121J18304K43334m181r6486O3966
6790A25748N7795j91152q2987Q8376R649N1848R2658P5159J919l15923N3991o4001
$$ plain form
6866 -127857 -19202 118037 -40424 -155376 123795 105523 190018 244668 102626 -37893
6856 -37893 26837 -36177 -111050 -179838 -77849 62575 179303 126483 103678 193662 264660
6845 264660 157889 143416 -14222 60615 145153 -7578 -5170 -57496 -119465 -175610 -978
6834 -978 96103 -8020 -56233 61465 74538 34012 113333 71457 101017 -109805 -210061
6823 -210061 -151566 -290010 -75595 -65604 11385 -17241 -140511 85329 109949 155972 7809
6812 7809 155583 203087 111411 272232 -26680 -32872 -228641 78421 196121 70648 57186
6801 57186 -11450 14959 -204516 96432 72932 -199189 -80885 162449 158268 61782 125748
6790 125748 183543 -7609 -90596 -2220 7429 59277 151935 227094 229013 -86910 -32919 -96920
6778i6920R5136J25637K07845n88j03027J01425o6185n8009j64554m8542J26054
6767A18272K29883j77733j59467J20416j29085J17858p4542K07169k4503n3033
6757A75235k1652j68594J41934j21130m14327M16708K32804j04608K7152K48463
6747D11985P3363l17310K1501q8066J61434J50316l24004j39533J21679k2390
6737D8975J09153j30401M3957j5941J52855k8300r4746j79841J34613J36397N6448
6726B33169j45920Q1271j32033J10019O9236j94335j25462J52309K43545L3185
6716C24984J9019k11380K6692K4156M9953j87708J16807R1537J14540J43341K755
6705E14696j83604J28969N8366j58450N4657M2874N181J50166J57396L298m93668
$$ plain form
6778 -96920 -1784 123853 331698 331110 228083 329508 263323 205314 40760 -7782 118272
6767 118272 348155 170422 10955 131371 2286 120144 45602 252771 228268 175235
6757 175235 153583 -15011 126923 5793 -408534 8174 240978 136370 163522 411985
6747 411985 485348 168038 189539 101473 262907 413223 89219 -50314 71365 48975
6737 48975 158128 27727 71684 55743 208598 180298 85552 -94289 40324 176721 233169
6726 233169 87249 168520 36487 146506 215742 21407 -104055 48254 291799 324984
6716 324984 344003 132623 159315 183471 233424 45716 162523 254060 368600 511941 514696
6705 514696 331092 460061 518427 359977 414634 457508 462689 612855 770251 773549 279881
6694B79881k15426O6784J20548J72549J73710R5846l4447j39892j42021o0125
6684C17407l834J51926j9178Q913n7833J48681R4981J75582l31270P7833K36660
6673G99868O2489j00485m6416R4385Q5641j32511j16600j46377j70796P7022J93085
6662E99305l6774L0169K0040J1068K8332K37674j84805k36034Q7855N7715K00470
6651H15015j61303q956R1612J05383j52799j67812J05558J44785J56144j02395
6641H25232n6347k7031p7920p458l4695m4756L5158L79239j12230J33124k87923
6630G24393J93173K77075r8550m3553K07268o4963p6201l8961J05282J29460j10781
6619A203642L28874Q1934L232J88729J66709K4488o7254k07711J3779K31244J61710
$$ plain form
6694 279881 64455 131239 251787 424336 598046 693892 659445 519553 377532 317407
6684 317407 313573 465499 446321 455234 397401 546082 641063 816645 485375 563208 799868
6673 799868 862357 761872 715456 809841 895482 762971 646371 499994 329198 406220 599305
6662 599305 562531 592700 612740 623808 652140 889814 705009 468975 556830 614545 815015
6651 815015 653712 644756 736368 841751 688952 521140 626698 771483 927627 825232
6641 825232 768885 741854 663934 656476 621781 577025 612183 991422 879192 1012316 724393
6630 724393 917566 1194641 1096091 1052538 1259806 1194843 1118642 1079681 1184963 1314423 1203642
6619 1203642 1532516 1614450 1617682 1806411 1973120 1997608 1930354 1722643 1736422 1967666 2129376
6608B129376L23880k11101q7491j918M6073L21966J90888k34724L3117L71600
6598B881666j57302J73690K63588K74183l4418K70204K24446k49095j47764J35496
6588C634694K42188K42957P5891K05531J05608J74332K13762L16006L55583Q0258
6578E646810J06299n9690J50927L37158M79689K25236L50764K73607O43784L70133
6568H524717K78931N58699O24551P52126P73855Q93670R75397J258875J396001
6559A6036822J884925J774069K020914K630691L130576L644989M292676N487547
6551D0903209O274530P128509Q121607O940611L801050j070731n208283o845319
6543F0045183o308948m750133k737532o37353N47766J780310K751787K938789
$$ plain form
6608 2129376 2453256 2242155 2154664 2152746 2198819 2520785 2711673 2476949 2510066 2881666
6598 2881666 2724364 2898054 3161642 3435825 3401407 3671611 3896057 3646962 3499198 3634694
6588 3634694 3876882 4119839 4195730 4401261 4506869 4681201 4894963 5210969 5566552 5646810
6578 5646810 5753109 5693419 5844346 6181504 6661193 6886429 7237193 7510800 8154584 8524717
6568 8524717 8803648 9362347 9986898 10739024 11512879 12406549 13381946 14640821 16036822
6559 16036822 17921747 19695816 21716730 24347421 27477997 31122986 35415662 40903209
6551 40903209 47177739 54306248 62427855 69368466 73169516 72098785 66890502 60045183
6543 60045183 53736235 48986102 46248570 45611217 46158983 47939293 50691080 53629869
6535E3629869J569793j139008m012117n907926o019900n248087m023994k981784
6527B5866846j823265j350892r73555l78500l97810p79645j230174j575982j486206
6518A5870817j622892j539544q16223n69912q38989n39485l71623l36970j53879
6509I081300k9232k14920l58177m65803l13893m36680l40579m63320m43689m76959
6499E538048l10155k35726j85604p4738j61945l42696l35677q8737j11129n1089
6489C640552m6676j59113k32178l2637l75989M0330m7592k8084P5321J1626j68207
6478B677353m1116r5048o8243k14250n8364K9025Q9833j57073M486j35666M1846
6467B072783k64149n7604r5829K5619N8828l21370J32178J37678k056L4934J51000
$$ plain form
6535 53629869 55199662 54060654 50048537 44140611 38120711 32872624 28848630 25866846
6527 25866846 24043581 22692689 21719134 21340634 20942824 20163179 18933005 17357023 15870817
6518 15870817 14247925 12708381 11892158 11322246 10483257 9943772 9572149 9235179 9081300
6509 9081300 9052068 8837148 8478971 8013168 7699275 7262595 6922016 6458696 6015007 5538048
6499 5538048 5227893 4992167 4806563 4731825 4569880 4227184 3891507 3802770 3691641 3640552
6489 3640552 3593876 3434763 3202585 3169948 2793959 2834289 2786697 2758613 2833934 2845560 2677353
6478 2677353 2636237 2541189 2472946 2258696 2200332 2229357 2319190 2162117 2166603 2030937 2072783
6467 2072783 1808634 1751030 1655201 1680820 1739648 1418278 1550456 1688134 1686078 1721012 1872012
6456A872012k05886k27861l03845K48261R359j11467j77644j77260J21527o5078
6446I82118J34656p3795j84197J32258j54781j9294K01173k7906r02k07491j78701
6435F03138K15808m7432L9900J429j61661m9662P8933K11248j35412j66539k424
6424E87326j42033Q6163J23894O1831L8625p7423o8912J21355J37752k49762j27601
6413D91215K51504j26974m2234n0116r5231P6626j13242Q5134P3141P6458r2664
6402E33617l5820L8510k43486j69561K38124j79050r2828J46967J0354j07873
6392A38954o5582q749m2643K28437j18979k7098j23221J72958J18910M2827O7071
6381C82885J0944n0981n8325M322K33478p7580j14081O1084k37577P2402o1922
$$ plain form
6456 1872012 1666126 1438265 1134420 1382681 1392040 1280573 1102929 925669 1047196 982118
6446 982118 1116774 1042979 858782 991040 836259 816965 1018138 990232 989330 781839 603138
6435 603138 818946 771514 811414 812843 651182 601520 680453 891701 756289 589750 587326
6424 587326 445293 531456 655350 717181 755806 678383 609471 730826 868578 618816 491215
6413 491215 742719 615745 573511 523395 428164 504790 391548 476682 549823 626281 533617
6402 533617 497797 536307 292821 123260 361384 182334 89506 236473 246827 138954
6392 138954 73372 64623 21980 250417 131438 104340 -18881 154077 272987 315814 382885
6381 382885 393829 342848 284523 288845 522323 444743 330662 391746 154169 226571 164649
6370A64649O6901Q712j69250p4537j5769n0935L69405o8657k19855J88552j25003
6359G4213o2223j08012J58563J81959R089K7706j33454j48878K99376l2867L6524
6348C01996j56873J11008K7621j74726L7491J60419l054j91892J36836k23039
6338B5787j11733K2824P5187J38187K14903o7478m2298j82700p6368K73752o994
6327B63069j64358k45283k8774L07366J11845l124q9283p2001L9751o6199m773
6316D8236j77978K04006P8668j37282o1607j13521J38641L35153q803k50797o4478
6305i762R7790N1589q3706R8520k13102J03152j44009j07800K95407n4289P3927
6294A07717M4380K507o2513p8798j26917j36115r618K56885J65400j36652J72994
$$ plain form
6370 164649 231550 240262 71012 -3525 -19294 -70229 299176 230519 10664 199216 74213
6359 74213 11990 -96022 62541 244500 253589 281295 147841 -1037 298339 265472 301996
6348 301996 145123 256131 283752 109026 146517 306936 303882 111990 248826 25787
6338 25787 -85946 -63122 12065 150252 365155 297677 255379 72679 -3689 270063 263069
6327 263069 98711 -146572 -175346 132020 243865 240741 151458 79457 119208 53009 48236
6316 48236 -129742 74264 152932 15650 -45957 -159478 -20837 314316 305513 54716 -9762
6305 -9762 88028 139617 55911 154431 -58671 44481 -99528 -207328 88079 33790 107717
6294 107717 152097 154604 92091 13293 -113624 -249739 -259357 -2472 162928 26276 199270
6283A99270j2123j41502o2457r724k61007J53757J79365k25293k24925J51905
6273b52734q3516k3680K11479O1528R005Q5R056J45501Q2633j33931l31039Q159
6261b97454K95293P9037j5007j59368j9512J49680j41492o1361K18187j9376N8893
6250H7520K20888m9941M1792k19546p2241K89841k0913j89625j60605l0378L400
6239i9808J15721K9253o2075j7138P4315M9209r3550k528L27126j88529k30154
6228i8158K39621J24975J8583J21480j20915o097p91m6763n9410p5532j30458
6217c3465R2717M5973j47640Q6350K1610j98446J67258P2062P3208R2954q5506
6206A87075N7335j52885J42555j57684K8457j16598k12463K36098K76682n7575
$$ plain form
6283 199270 187147 45645 -16812 -26536 -287543 -133786 45579 -179714 -404639 -252734
6273 -252734 -336250 -359930 -148451 -86923 -77918 -77833 -68777 76724 159357 25426 -305613 -297454
6261 -297454 -2161 76876 61869 -97499 -117011 32669 -108823 -170184 48003 28627 87520
6250 87520 308408 258467 300259 80713 8472 298313 277400 87775 -72830 -103208 -99808
6239 -99808 15913 45166 -16909 -34047 40268 89477 -4073 -6601 320525 131996 -98158
6228 -98158 141463 266438 285021 406501 285586 279489 278698 231935 172525 96993 -33465
6217 -33465 59252 105225 -42415 43935 65545 -132901 34357 106419 179627 272581 187075
6206 187075 244410 91525 234080 76396 104853 -11745 -224208 11890 288572 230997
6196B30997j03248k30444r8897K34112m0965J94942L5372P5587l2565K18373j5222
6185D68042k63902J06727R5823J24933N5668O0730J3697k40532j39068R2135K02339
6174E76592L9845J01979K06673k8899l63202k10875N2633N7129j58655M8258J99795
6163E21273k4175r0238K68258k37365M7353R6863j57598P866K22184O5159k92153
6152D27427j99760K5407J49246O1471J28683j23663o5942K62999k27238M7658
6142D86288J80213l0524N2890k62664M8823j57685n6686K14343p3602L9243n327
6131D35312j22586J68811k14596m3996K18162k7479N7722J10122j94013k05777
6121A81682o9484K3850J20858J27613J35425k70426j04752k3424j9928k8285J88215
$$ plain form
6196 230997 127749 -102695 -201592 32520 -8445 186497 221869 297456 264891 483264 468042
6185 468042 204140 310867 406690 531623 587291 648021 661718 421186 282118 374253 576592
6174 576592 616437 718416 925089 896190 532988 322113 374746 431875 273220 321478 521273
6163 521273 497098 406860 675118 437753 485106 581969 424371 432237 654421 719580 427427
6152 427427 227667 253074 402320 463791 592474 468811 402869 665868 438630 486288
6142 486288 666501 635977 688867 426203 475026 317341 260655 474998 401396 440639 435312
6131 435312 312726 481537 266941 222945 441107 413628 471350 581472 387459 181682
6121 181682 112198 136048 256906 384519 519944 249518 144766 121342 101414 73129 261344
6110B61344J63457j83101J40723L5341n7936k68393K20043p8325J0256k9630O1294
6099B75073j28248kN6453K14521P9613Q6219l5880j15045L5234o7034J77723m3227
6087E35400k3446l5874J07k22112q2565K89047k8603j15512j46994o5210j38154
6076c3916K55851J36134k26306J68739J40j58867L8459j04586K16345q1310k47063
6065c6380L5930M2510O9190J4824J50157p7468j21275M127j42830j9111K50303
6054A69977k5836r4902J17114m4491j65404j40300K6484K31445n2824J13770q6767
6043D8266K46048l0490J02680n7421k38203k11649j12064K08824j47567k9281
6033b20857K15216j88241K93580J17008k31707o4754j83532Q0111K18324K7147
$$ plain form
6110 261344 424801 241700 382423 417764 359828 91435 311478 233153 243409 213779 275073
6099 275073 146825 146823 203276 417797 497410 583629 547749 432704 467938 400904 578627 535400
6087 535400 511954 476080 476187 254075 171510 460557 431954 316442 169448 104238 -33916
6076 -33916 221935 358069 131763 300502 300642 141775 180234 75648 291993 210683 -36380
6065 -36380 -450 42060 111250 126074 276231 198763 77488 81615 -61215 -80326 169977
6054 169977 144141 49239 166353 121862 -43542 -183842 -157358 74087 21263 135033 48266
6043 48266 294314 263824 366504 309083 70880 -140769 -252833 -44009 -191576 -220857
6033 -220857 -5641 -193882 99698 216706 -15001 -79755 -263287 -183176 35148 62295
6023F2295j616j27646J13619q3997K4122r9669l3161n179j5503M698j43174J13796
6011a91415j6832M9883O1857k1634r8513J13286n3380J55178J33655q9866p2504
6000c0285j58503J51615J04938J96377q4102j64701J30186p225p1469q5710J43093
5989A24214L4628q6033J73988n2678j63692l8787m9709J86946j4464j26119r7947
5978a09653j26794Q8891K54938N1669j35211R4052L9867j41951l8856r5037O9437
5967d8648O7046j2917j43999n2624m3323J76600J26328N5025k98620q4778L2689
5956b27221J30685J41588L928j51362l3157Q3760j49326L16714k38784k56344
5946c79519L18833L5001p2244J78847J37584l28566q0539K0918J2328O0484L3576
$$ plain form
6023 62295 60679 -66967 46652 -37345 -13223 -112892 -146053 -151232 -166735 -162037 -305211 -191415
6011 -191415 -208247 -158364 -96507 -118141 -216654 -103368 -156748 -1570 132085 42219 -30285
6000 -30285 -188788 -37173 67765 264142 180040 15339 145525 138300 66831 -18879 124214
5989 124214 158842 72809 246797 194119 30427 -8360 -58069 128877 114413 -11706 -109653
5978 -109653 -236447 -147556 107382 159051 23840 117892 157759 15808 -23048 -118085 -48648
5967 -48648 18398 5481 -138518 -191142 -234465 -57865 68463 123488 -175132 -259910 -227221
5956 -227221 -96536 45052 48980 -102382 -135539 -51779 -201105 115609 -123175 -379519
5946 -379519 -60686 -25685 -97929 80918 218502 -110064 -190603 -169685 -157357 -96873 -63297
5935f3297N7770j5914L6136K85693o4553Q4130j98541j14639P1070p9982m3836
5924d5963k736N3164j45160R01L4555Q3968N1550j04458J19529o1343n5268N4534
5912a6727o2523J73666j9840K14907l2583j51311j82650K28620O0011p3688m8402
5901H9480M3536J1754J4792K02161p6071r1548K87560j5658L140K24728k21894
5890D71980k85406q9141k20013K04264j26029O2059J83024o24p0747k36592K06046
5879I8821J15988k56318j67872k6518J13183L1129J39337J63226j9916l0775J76
5868A60461J64107j91655r2677O4137K36598q0811j92354j34955M9630k11881
5858b29400N9559K93787k89229m9581K59366P7829k1590K9473j26708M4256J57825
$$ plain form
5935 -63297 -5527 -21441 14695 300388 235835 319965 121424 6785 77855 -2127 -45963
5924 -45963 -48699 4465 -140695 -139794 -105239 -21271 30279 -74179 45350 -15993 -71261 -16727
5912 -16727 -79250 94416 74576 289483 256900 105589 -77061 151559 211570 137882 89480
5901 89480 133016 144770 159562 361723 285652 194104 481664 466006 469146 693874 471980
5890 471980 186574 97433 -122580 81684 -44345 17714 200738 200114 129367 -107225 98821
5879 98821 214809 -41509 -209381 -235899 -122716 -91587 47750 210976 191060 160285 160461
5868 160461 324568 132913 40236 104373 340971 260160 67806 -67149 -17519 -229400
5858 -229400 -169841 123946 -165283 -214864 44502 122331 100741 130214 3506 47762 205587
5847B05587J20950j87557j20465J72826M8589k4137k11077j14178m750O9842k3562
5836f7932j01422J31929Q0580j24390K85738J2195j04309J40604N585L7444J5590
5825C11612J41679j05319J32114j86841o2215Q8922j18561K2814Q1202R6960J6385
5814D18752j63997J3643K4685k57462J1133K66013J49724j99864m4663j44514
5804G3450J66624J5612O0370l4441j48589J57302M461l7261J40399j78510k73345
5793e3928J07537L09372O1577r1730j11459j06656m9530K53774j1059r6143J86417
5782C98172p1851k09870J77508J29545r7106j38547K68698j29263l3487J55619
5772D49418M0512o2325k39808j37122j10247j01j13644K29201P8818R7460K2956
$$ plain form
5847 205587 326537 138980 18515 191341 239930 215793 4716 -109462 -114212 -44370 -67932
5836 -67932 -169354 -37425 43155 -81235 204503 216698 112389 252993 258578 296022 311612
5825 311612 453291 347972 480086 293245 231030 319952 201391 224205 305407 402367 418752
5814 418752 254755 268398 293083 35621 46754 312767 462491 262627 217964 73450
5804 73450 240074 255686 316056 281615 133026 290328 294789 257528 397927 219417 -53928
5793 -53928 53609 362981 424558 332828 221369 114713 65183 318957 307898 211755 398172
5782 398172 326321 116451 293959 423504 326398 187851 456549 327286 293799 449418
5772 449418 489930 427605 187797 50675 -59572 -59673 -173317 55884 134702 232162 255118
5761B55118q7172J89899J36819k19932L1067k642n878K02983l52912K32385n7722
5750C22013p5709M9704M3700l15580k0818K54075l16692K00675j42114J58275
5740A57529R2629m1604J22338N1606M49q7392r9275J24298M4470J46587k03177
5729C08458J47065o2935J15260P6228P5924j37855l0614j7633o7984J41357R0742
5718F38013n2035R7058k12816J4250m479J26669L1670p2079J38646q2489k26307
5707C96101j5180M24469K87960j25092j44388K20858o7080j52796L9696K88843
5697A153391J16263p4991r1661P9855Q515j98823j99857q0005P7978P3706j05544
5686G58827K24331o6465K0988M1952P9601r370J41705j38287l9097k260o4294
$$ plain form
5761 255118 167946 357845 494664 274732 305799 303157 297279 500262 147350 379735 322013
5750 322013 246304 296008 339708 24128 3310 257385 -59307 141368 -746 157529
5740 157529 250158 208554 330892 382498 382947 295555 196280 320578 365048 511635 308458
5729 308458 455523 392588 507848 584076 660000 522145 491531 473898 405914 547271 638013
5718 638013 585978 683036 470220 484470 479991 606660 638330 566251 704897 622408 396101
5707 396101 380921 805390 1093350 968258 823870 1044728 977648 824852 864548 1153391
5697 1153391 1269654 1194663 1103002 1182857 1191372 992549 792692 712687 790665 864371 758827
5686 758827 983158 916693 937681 979633 1059234 1049864 1191569 1053282 1014185 1011925 947631
5675I47631j17340J53093L68908j2082j15665k6282K00626K03222j00307j01025
5665A400779Q5789l5366J37224J26120l57871J00453K31382R9533P6028J24589
5655A988660j08400l8554J44735j1847N3784j2778M4975M562N5679q0930R814
5644B049700K25366R8371K83162K51007j2348L16675J69412K81677O64719M00827
5634D728568K86137M42645O78796Q19910P11441O89820P06093l89828q49369r20097
5624F904116p80365l87837m00222m59440R076J9432l9822K54560M0702J84811
5614E345011K05090Q4581N47935Q22404M82116N38595P89495O67118R26111J425327
5604A1833783J263415J678495K210132K795964K554012J340466j332495l035174
$$ plain form
5675 947631 830291 983384 1352292 1340210 1224545 1198263 1398889 1602111 1501804 1400779
5665 1400779 1486568 1451202 1588426 1714546 1356675 1457128 1688510 1788043 1864071 1988660
5655 1988660 1880260 1841706 1986441 1974594 2028378 2015600 2060575 2065137 2120816 2039886 2049700
5644 2049700 2275066 2373437 2656599 2907606 2895258 3211933 3381345 3663022 4327741 4728568
5634 4728568 5014705 5457350 6136146 6956056 7667497 8357317 9063410 8673582 7824213 6904116
5624 6904116 6123751 5735914 5335692 4876252 4885328 4904760 4864938 5119498 5160200 5345011
5614 5345011 5550101 5634682 6182617 7005021 7487137 8025732 8815227 9482345 10408456 11833783
5604 11833783 13097198 14775693 16985825 19781789 22335801 23676267 22343772 19308598
5596A9308598l198362k575406j526691j087553q90665l57283k46311n38499j89752
5587H698076K52665j741j56595J4049L37521K30342N91805N96433O75300P53331
5577A1991186J066964J370810J405543J662196K524773K777263K699386J671188
5569B7169309j121409l051044l516642k410692j840933q95393p41092l71185r1196
5560A3129723p4577K0100M1035K0833P84516Q82225P96229J213472J425389J155678
5550A9394623J467986K042934K247972K746610L164569L584316L647272K572180
5542D0868462Q36261j602937l555061l820291l636852k518311j562079j035818
5534B3973374p16062l10167J86365M22649L74334Q94566J494816J801071J930384
$$ plain form
5596 19308598 16110236 13534830 12008139 10920586 10029921 9672638 9426327 8887828 8698076
5587 8698076 8950741 8949000 8792405 8806454 9143975 9374317 9966122 10562555 11237855 11991186
5577 11991186 13058150 14428960 15834503 17496699 20021472 22798735 25498121 27169309
5569 27169309 26047900 22996856 19480214 17069522 15228589 14333196 13592104 13220919 13129723
5560 13129723 13055146 13075246 13116281 13137114 13921630 14803855 15600084 16813556 18238945 19394623
5550 19394623 20862609 22905543 25153515 27900125 31064694 34649010 38296282 40868462
5542 40868462 41704723 40101786 36546725 32726434 29089582 26571271 25009192 23973374
5534 23973374 23257312 22947145 23133510 23556159 23930493 24825059 26319875 28120946 30051330
5525C0051330K326336K854286L470110M224333N112156N952898O236693M142348
5517F4370490M62677m402251p510793p567539o218986m668339l219388k644536
5509B8601335k297178j136147q23948r40308o82916k5318j19525K84551N02675
5500B3363221M72596O39488J294800J850284K096410K448159K736192K381100
5492C7282250J555188o61356l032685l695025l875795l250311k403257j855308
5484B0063701j441664j338133p28378r16622o30475p60146k97320l29050n10907
5475A3111006k02969l19863n1882l98014j52876l44117K6675p0783j94641O3278
5465A1465814p0015l45214K17293K44546J35996J76095M0730K0047m5406L7229
$$ plain form
5525 30051330 32377666 35231952 38702062 42926395 48038551 53991449 60228142 64370490
5517 64370490 64833167 60430916 52920123 45352584 39133598 34465259 31245871 28601335
5509 28601335 26304157 25168010 24344062 23403754 22720838 22695520 22575995 22860546 23363221
5500 23363221 23835817 24475305 25770105 27620389 29716799 32164958 34901150 37282250
5492 37282250 38837438 38176082 35143397 31448372 27572577 24322266 21919009 20063701
5484 20063701 18622037 17283904 16555526 15638904 15008429 14248283 13950963 13621913 13111006
5475 13111006 12908037 12588174 12536292 12138278 11985402 11641285 11667960 11597177 11402536 11465814
5465 11465814 11395799 11050585 11267878 11512424 11648420 11824515 11865245 11885292 11839886 11877115
5455A1877115J33377J56181K81990K59980K0543L0128K6149L67598L20938L82985
5445A3856984M57578M93589M64387O96651J229181R85688J018285J073525J378272
5436B1654140J738502K166261K128992K516254K814808L071451L245179K690189
5428D2025776J197430n79947j691072j530083j279936r15696k14886M05742P01817
5419C8119145O88023J763892K199147K296492J705741J409297J453310J079824
5411E0714871J013202J534210K339395L375902M408155N001740N604587N070200
5403G9062262K464705j422593m374683n304455m624232l413920j974835j082989
5395E9329260l19556P42924J264517J806433K239003K302350Q78198r48698k484944
$$ plain form
5455 11877115 12010492 12166673 12448663 12708643 12729186 12759314 12785463 13153061 13473999 13856984
5445 13856984 14314562 14808151 15272538 15969189 17198370 18184058 19202343 20275868 21654140
5436 21654140 23392642 25558903 27687895 30204149 33018957 36090408 39335587 42025776
5428 42025776 43223206 42643259 40952187 39422104 38142168 37226472 37011586 37417328 38119145
5419 38119145 38807168 40571060 42770207 45066699 46772440 48181737 49635047 50714871
5411 50714871 51728073 53262283 55601678 58977580 63385735 68387475 73992062 79062262
5403 79062262 81526967 80104374 75729691 70425236 65801004 62387084 60412249 59329260
5395 59329260 59009704 59752628 61017145 62823578 65062581 67364931 68243129 67294431 64809487
5386F4809487l467906l130372k312596j604922o69810L37381J012267P63369L88738
5377E6125636j404714k897560l601228l340648k669164j836665j230367r03646
5369C8241644k53310L43841M64080L93845N36785O79327p3099j237770j923335
5360C7172008k818573k808278k783452k419250k055628j679631j759381j332753
5352A9515062j194828r91384p22342j110407m06731n00226m96485l87575k29316
5343A3475768l61823k95896k40555j06953R9539O582n0294j26046k79969n26901
5333A1593452j24043m07227m47452k66784m29630l93616n97254l73571l46179
5324H207696k43389l40205m56396p4436l76799l10072k22954j2545l95939m51045
$$ plain form
5386 64809487 61341581 58211209 55898613 54293691 53623881 53961262 54973529 55736898 56125636
5377 56125636 54720922 51823362 48222134 44881486 42212322 40375657 39145290 38241644
5369 38241644 37988334 38332175 38796255 39190100 39726885 40406212 40333113 39095343 37172008
5360 37172008 34353435 31545157 28761705 26342455 24286827 22607196 20847815 19515062
5352 19515062 18320234 17328850 16606508 15496101 15089370 14589144 14092659 13705084 13475768
5343 13475768 13113945 12818049 12577494 12470541 12570080 12576662 12526368 12400322 12120353 11593452
5333 11593452 11469409 11062182 10614730 10347946 9918316 9524700 8927446 8553875 8207696
5324 8207696 7964307 7624102 7167706 7093270 6716471 6406399 6183445 6170900 5774961 5323916
5314E323916J42195j03481j73182q1657j76833q2105m2063j20855J82522r9072
5304D769385m05333J07464m9072N6648j69281k63562O8273q5028m24674j76220
5294C428600r9777j26933k7491L5400j28544r3987K8514J75913k76414j38793
5284B776488o7986j59319o1746j42138r4502J13310k2210M018k9470l7871O3577
5273B342151J13637m3288j26524j24104k19288j8815J46700p9161k36964L24565
5263B078909k7306O9605j27930J1513N2014j75267p9350J92452J26814k08054
5253A913400o4473J7943k70705q0741M13680o059J6061K2275k56410l587N2980
5242A754364M6734M6015r0995j85097L69701J01014j29924K8940n9855J26322
$$ plain form
5314 5323916 5466111 5362630 5189448 5107791 4930958 4848853 4806790 4685935 4868457 4769385
5304 4769385 4364052 4471516 4422444 4479092 4309811 4046249 4114522 4029494 3604820 3428600
5294 3428600 3328823 3201890 3174399 3209799 3081255 2987268 3015782 3191695 2915281 2776488
5284 2776488 2708502 2549183 2487437 2345299 2250797 2364107 2341897 2345915 2316445 2278574 2342151
5273 2342151 2455788 2412500 2285976 2161872 1942584 1923769 2070469 1991308 1754344 2078909
5263 2078909 2051603 2121208 1993278 2004791 2056805 1881538 1802188 1994640 2121454 1913400
5253 1913400 1848927 1866870 1596165 1515424 1929104 1923045 1939106 1961381 1704971 1701384 1754364
5242 1754364 1801098 1847113 1756118 1571021 1940722 2041736 1911812 1940752 1880897 2007219
5232B007219Q472j63136R1059j19730j29306K75200k4244n5839j16794n6250K96469
5221B013120k61266N3747J71409J52388l5095K01533j09417J91523J01685N6099
5211B535726l3738p8118J8582M329j27630j65224K93482j64130j79491p2606K40469
5200B271651j82943k8424L4059L4165n1829N3073j0719M1583M3500K50510j91378
5189B263248k01840J51498L36125j53484K0506O1286K33909r639K39404j90189
5179B750824J8189K47624J29449K18399J99837M73604j47263k21611l65286k75867
5169C027899l07316j20110k04274k41059M0842o5705k49103n282j17260J67755
5159A926387P1801J1552k78100L37446j23271l01533k4282q1900R1347P6811j6332
$$ plain form
5232 2007219 2015691 1852555 1943614 1823884 1694578 1969778 1945534 1889695 1772901 1716651 2013120
5221 2013120 1751854 1805601 1977010 2129398 2094303 2295836 2186419 2377942 2479627 2535726
5211 2535726 2501988 2423870 2442452 2446781 2319151 2153927 2447409 2283279 2103788 2031182 2271651
5200 2271651 2088708 2060284 2094343 2128508 2076679 2129752 2119033 2160616 2204116 2454626 2263248
5189 2263248 2061408 2212906 2549031 2395547 2416053 2477339 2711248 2701609 2941013 2750824
5179 2750824 2769013 3016637 3146086 3364485 3564322 4037926 3890663 3669052 3303766 3027899
5169 3027899 2720583 2600473 2396199 2155140 2195982 2130277 1881174 1875892 1758632 1926387
5159 1926387 1998188 2009740 1731640 2069086 1945815 1644282 1620000 1538100 1629447 1706258 1689926
5148A689926j34425M219Q0384l8948L7909q0544k08478P2667R4628K46556q9928
5137A673966k44585k1142J1468L4971K9919J06338J30420K87796k7474j25606
5127A856071j2257j38961j8604j5113n2379k64091j9410K33869J6012l32519k0317
5116A232301J92692R1077j41097j20695Q7433q4918K44240J11749k14962k92499
5106A105321L08059P8459K086l7161j78540r4508P5048K49251j26684n9112j79641
5095A142578j91577J14452N8700j5207J14440j42847j45006j4082J03915k6667
5085I98699O8763j08667k61055K18275L73356l49237N0669j34745K66954k03968
5075I19044j42270K02988j19443n2899l600j2106j0153K26004n3459P4388k33118
$$ plain form
5148 1689926 1555501 1559720 1640104 1601156 1639065 1558521 1350043 1422710 1517338 1763894 1673966
5137 1673966 1429381 1408239 1419707 1454678 1484597 1590935 1721355 2009151 1981677 1856071
5127 1856071 1843814 1704853 1686249 1671136 1618757 1354666 1335256 1569125 1585137 1252618 1232301
5116 1232301 1424993 1516070 1374973 1254278 1341711 1256793 1501033 1612782 1397820 1105321
5106 1105321 1413380 1491839 1493925 1456764 1278224 1183716 1258764 1508015 1381331 1322219 1142578
5095 1142578 951001 1065453 1124153 1108946 1223386 1080539 935533 921451 1025366 998699
5085 998699 1067462 958795 697740 916015 1289371 940134 990803 856058 1123012 919044
5075 919044 776774 979762 860319 807420 803820 791714 781561 1007565 954106 1028494 795376
5064G95376k18394J65362R0978k1951J71206l13237O852J13891p9589k33034Q0700
5053E58160o1922P7906m1720l4200J80594J18478j78142L06548M8421k78862J46206
5042H41467R67P6065k6318K0779j10724K06722P0816j25826k1396j14364j36188
5031F82000K5164p2391q161Q9665J56711k98529k03021K2756q4021q9831R5457
5020C15799K62414k154k15552M9843J57987n391N7001r3573J63110K07272l67597
5009E29159N6440J52045j28169K21328o5873k6786J8036n8342P8838m7993m6250
4998F82433N9945M4133j09445M9899L1027J43049R3575J18184J9704j4211K65548
4987A383841l866r7094k261j48519O1829L44j37803J65720J14901o9646j27106
$$ plain form
5064 795376 576982 742344 833322 811371 982577 669340 676192 790083 710494 477460 558160
5053 558160 496238 574144 532424 498224 678818 797296 619154 925702 974123 695261 841467
5042 841467 842434 918499 892181 912960 802236 1008958 1079774 953948 932552 818188 682000
5031 682000 707164 634773 626612 716277 872988 574459 371438 394194 310173 220342 315799
5020 315799 578213 576059 360507 410350 568337 562946 619947 526374 689484 896756 529159
5009 529159 585599 737644 609475 830803 764930 738144 756180 697838 776676 728683 682433
4998 682433 742378 786511 677066 726965 757992 901041 994616 1112800 1132504 1118293 1383841
4987 1383841 1379975 1282881 1280620 1132101 1193930 1194274 1056471 1222191 1337092 1267446 1140340
4976A140340J22847j44572j4005Q8650j07504m3670J74314J64986j19654K87324
4966A549056Q5928p3231Q6831J50653k34209l0158J31883p8071p2472l15764N047
4955A205493Q9637o2731p9484j24998J25676J64834L3387P0433R7435k15732K10593
4944A514543j1510k50133K15978j72384R8579J21869j6144k1306J33792J04767
4934A718051j21615M0567j15328l3753K59160N1754j43249L4941L7246J04864
4924A832638k62515q0980J52546k1019J64139P1125M9716j64179N7529j24434
4914A674566j00710P4030L9477o6222L3897k9073q4043K48826r612j40657J17517
4903A757996K41844M45837n5315Q3738K1448q2499M7890J55794k8700j81109m01030
$$ plain form
4976 1140340 1263187 1118615 1104610 1193260 1085756 1042086 1216400 1381386 1261732 1549056
4966 1549056 1634984 1561753 1648584 1799237 1565028 1534870 1666753 1588682 1516210 1200446 1205493
4955 1205493 1295130 1232399 1152915 1027917 1153593 1318427 1351814 1422247 1519682 1303950 1514543
4944 1514543 1503033 1252900 1468878 1296494 1395073 1516942 1500798 1479492 1613284 1718051
4934 1718051 1596436 1637003 1521675 1487922 1747082 1798836 1655587 1690528 1727774 1832638
4924 1832638 1570123 1489143 1641689 1620670 1784809 1855934 1905650 1741471 1799000 1674566
4914 1674566 1573856 1647886 1687363 1621141 1655038 1625965 1541922 1790748 1781136 1640479 1757996
4903 1757996 1999840 2445677 2390362 2474100 2495548 2413049 2460939 2616733 2588033 2406924 2005894
4892B005894q5262Q0682j86692K08152J65810J20201j43514k9012J92680m757
4882B324182J5385M8976l5325j12883J2081j0236j7497L47707K27020J1425k5397
4871B785438j5051k10602P4505j75188k2144m17006R5852L29367J68474J57496
4861B771141k2587k12652j78350J43783J43360jk93586K32653M9921P4600K6166
4850B734448k7849R3928Q4934j15245N5386p5259P9776m2278j07550K75035O2891
4839C018217j59761n9731J01844K19554P5721j64299l8508J96816j5550J35812
4829C310115j05178j20659R4269n0317J74834n7582j726j16376J7392j74421Q6666
4818C057017O2409L70141j34700R2971p1669k13756m6851q9764M24170L3335N7858
$$ plain form
4892 2005894 1920632 2001314 1814622 2022774 2188584 2308785 2165271 2136259 2328939 2324182
4882 2324182 2339567 2388543 2353218 2240335 2252416 2242180 2224683 2572390 2799410 2810835 2785438
4871 2785438 2770387 2559785 2634290 2459102 2436958 2019952 2115804 2445171 2613645 2771141
4861 2771141 2748554 2535902 2357552 2501335 2644695 2644694 2351108 2583761 2633682 2708282 2734448
4850 2734448 2706599 2800527 2885461 2770216 2825602 2750343 2830119 2787841 2680291 2955326 3018217
4839 3018217 2858456 2798725 2900569 3120123 3195844 3031545 2993037 3189853 3174303 3310115
4829 3310115 3204937 3084278 3178547 3128230 3303064 3245482 3243756 3127380 3144772 2970351 3057017
4818 3057017 3119426 3489567 3354867 3447838 3376169 3162413 3115562 3025798 3449968 3483303 3541161
4807C541161Q9615K36485M81729L35337p2111K94665j84965q1939q4700k26374
4797D328903p8957L17183K59295L46895M59465M78026L18033J59449N11671L24497
4787G424460R9809M6688n02691l39283k40304k68809j86840K52200N6363K02125
4777F543718K47404J86545K65133P7606L20237r5475j05580r8382L27097K61317
4767G929620J72184O90121N38457Q36816J132691R24328J255571J682062J609177
4758A6771027N72251l76423j662011j786858j515692j001371j059888m08607m84614
4749I047814k84846k44252k71347l2698k7326L8282k72101O764J40182L34561
4739H435033J52815L14344N74627P94392P43101R14538J220537J589226J709934
$$ plain form
4807 3541161 3630776 3867261 4348990 4684327 4612216 4906881 4721916 4639977 4555277 4328903
4797 4328903 4249946 4567129 4826424 5173319 5632784 6110810 6428843 6588292 7099963 7424460
4787 7424460 7524269 7570957 7068266 6728983 6488679 6219870 6033030 6285230 6341593 6543718
4777 6543718 6791122 6977667 7242800 7320406 7640643 7545168 7439588 7341206 7668303 7929620
4767 7929620 8101804 8791925 9330382 10167198 11299889 12224217 13479788 15161850 16771027
4758 16771027 17343278 16966855 15304844 13517986 12002294 11000923 9941035 9532428 9047814
4749 9047814 8762968 8518716 8247369 8214671 8187345 8225627 7953526 7960290 8100472 8435033
4739 8435033 8587848 8902192 9476819 10271211 11014312 11928850 13149387 14738613 16448547
4730A6448547J487430P81086m08898j321943j748405j614072j160044j042727
4722A1420974p78966k35596m11014k02883k34749J03199N3020K86140N74591L32582
4712A0907298P47152Q13184P61480J066909R33687J225150J502233J841896K234157
4703B2033146K759799L149970K988980J248757j790780l754014m045012l493308
4695A9097538k723751j894625j485856j029039q06403q25446o22478l75988p22300
4686H611652o21366l76960k72554n47188j65130j5179j31457k93715k60809k80795
4676E646499L0580j66338N4102K00888r006L2600L11N8552j23973M2844J72747
4665E939806p6298n425J61548J53343J22606o2471r9822K8037M7892K06065k7332
$$ plain form
4730 16448547 17935977 18717063 18308165 16986222 15237817 13623745 12463701 11420974
4722 11420974 10642008 10406412 9995398 9792515 9557766 9660965 9713985 10000125 10574716 10907298
4712 10907298 11654450 12467634 13229114 14296023 15229710 16454860 17957093 19798989 22033146
4703 22033146 24792945 27942915 30931895 32180652 30389872 26635858 22590846 19097538
4695 19097538 16373787 14479162 12993306 11964267 11157864 10332418 9709940 9333952 8611652
4686 8611652 7990286 7613326 7340772 6793584 6628454 6613275 6481818 6188103 5927294 5646499
4676 5646499 5677079 5510741 5564843 5765731 5756725 5789325 5789636 5848188 5724215 5767059 5939806
4665 5939806 5863508 5858083 6019631 6172974 6295580 6233109 6133287 6161324 6209216 6415281 6387949
4654F387949P5925J32409j56589j22776L44856K96032q7472k51397K17113J78333
4644G014383J54724K86773K94880K74477L40917K56034M77649O59607P53344R36430
4634A1449218R19542J419460J803049J812307K113928K276350K873286L685102
4626B8352242M945437N600804P477593P845777P531722J512259q148072j1430032
4618D3687730j0077199o336201m324074l255797k239411j742032j542964j143843
4610A3026209j093327r13279o58984m10306n48604l91879l43959l07371n67254
4601G791246k30412k75544J75142l7603M5125j65317k60956k71924p0124j4609
4591F685024j41538k58243p0611n0061q1363J7773k01942j14798n5337j01245
$$ plain form
4654 6387949 6463874 6596283 6439694 6316918 6661774 6957806 6870334 6618937 6836050 7014383
4644 7014383 7169107 7455880 7750760 8025237 8366154 8622188 9099837 9759444 10512788 11449218
4634 11449218 12368760 13788220 15591269 17403576 19517504 21793854 24667140 28352242
4626 28352242 33297679 38898483 46376076 54221853 61753575 63265834 55117762 43687730
4618 43687730 33610531 27274330 22950256 19694459 17455048 15713016 14170052 13026209
4610 13026209 11932882 11019603 10360619 9950313 9401709 9009830 8665871 8358500 7791246
4601 7791246 7560834 7285290 7460432 7422829 7467954 7302637 7041681 6769757 6699633 6685024
4591 6685024 6543486 6285243 6214632 6164571 6083208 6100981 5899039 5784241 5728904 5627659
4581E627659q7482J7632k53013L39513Q6205k1984l7683J0328N3162N1089L19144
4570F104570K06060J56845K18736q9610R6173L83552R0755Q0140N2362J88133
4560G487716J52419J72801J05681P0760K04125L40746K62890J12564J7167K14341
4550I141210K24330K95441M07156L68519J24355O36332M11705N03380N67543M66848
4540A3146819O88063N88320P76053P32267J071841Q95617J022856J566541K017718
4531B2506095J837106K492556L014382L360075L953260M437021N135859O841234
4523E3577588Q516964J0524334J2539825J2332244P306279o217861j4106751j4663362
4515F9809260r784281o308093m630936l497545k360952j525596n08499M38571
$$ plain form
4581 5627659 5540177 5557809 5304796 5644309 5730514 5708530 5670847 5681175 5734337 5785426 6104570
4570 6104570 6310630 6467475 6686211 6596601 6692774 7076326 7167081 7247221 7299583 7487716
4560 7487716 7640135 7812936 7918617 7989377 8193502 8534248 8797138 8909702 8926869 9141210
4550 9141210 9365540 9660981 10068137 10436656 10561011 11197343 11609048 12112428 12679971 13146819
4540 13146819 13834882 14423202 15199255 15931522 17003363 17898980 18921836 20488377 22506095
4531 22506095 24343201 26835757 29850139 33210214 37163474 41600495 46736354 53577588
4523 53577588 62094552 72618886 85158711 97490955 104797234 98579373 84472622 69809260
4515 69809260 60024979 53716886 49085950 45588405 43227453 41701857 41193358 41631929
4507D1631929O77518J422641K586414L372887M163559N175811O191125O769791
4499G1991675P988222J0094358J2581427J6754884K0596331K5346497K5015063
4492A90368457J7173940r907479l0946774l5169886k7268862j7638141j2791250
4485G3820005r558589p531713n696347m622131l500801l198441k350539j888640
4477C5472804j545893j409377j269418j781920j963333j921958j776806j382888
4469B2421211j374861j302826q15027j111853n71076n11358q38698p90919o22733
4460A4481860n12691n21147o47025m64295k91898n01844l06591m06336k66393
4451A0563640n39050l48319j77322m13115l69572j39131k45227m34318m2197j32037
$$ plain form
4507 41631929 42309447 43732088 46318502 49691389 53854948 59030759 65221884 71991675
4499 71991675 79979897 90074255 102655682 119410566 140006897 165353394 190368457
4492 190368457 207542397 197634918 166688144 131518258 104249396 86611255 73820005
4485 73820005 64261416 56729703 51033356 46411225 42910424 39711983 37361444 35472804
4477 35472804 33926911 32517534 31248116 29466196 27502863 25580905 23804099 22421211
4469 22421211 21046350 19743524 18928497 17816644 17245568 16734210 15895512 15104593 14481860
4460 14481860 13969169 13448022 12800997 12336702 12044804 11542960 11236369 10830033 10563640
4451 10563640 10024590 9676271 9498949 9085834 8716262 8577131 8331904 7897586 7855389 7723352
4441G723352j02991l05312j07381k3130R0618j34940m34896j81733j11677j32757
4431F279153M308j25123k84693P1767P2110j34614r0824N3468J02563j72727n6229
4420E719159K8119R9496j57499m6467L3117k39176j84026J50697j28113j39951
4410E135356n8261J03718l05273j7654J38786j46049Q4083J33328j53910J11439
4400E025563J790K59294k7045o8665L72359k0192M62559J73825L2654P2009L82632
4389F666783O85269P35020O74531J044380O30635J003954J025785Q69791R97103
4380A4333251J410139K094486K547610L274440M022108M350093L218745q30697
4372C4420175m646454n500182m688297l294435k738438j472926j526538j084068
$$ plain form
4441 7723352 7620361 7315049 7207668 7184538 7275156 7140216 6705320 6523587 6411910 6279153
4431 6279153 6283461 6158338 5873645 5945412 6017522 5882908 5792084 5845552 5948115 5775388 5719159
4420 5719159 5747278 5846774 5689275 5642808 5675925 5436749 5252723 5403420 5275307 5135356
4410 5135356 5077095 5180813 4875540 4857886 4996672 4850623 4934706 5068034 4914124 5025563
4400 5025563 5027353 5286647 5259602 5190937 5563296 5543104 6005663 6179488 6212142 6284151 6666783
4389 6666783 7352052 8087072 8761603 9805983 10436618 11440572 12466357 13336148 14333251
4380 14333251 15743390 17837876 20385486 23659926 27682034 32032127 35250872 34420175
4372 34420175 29773721 24273539 19585242 16290807 13552369 12079443 10552905 9468837
4364I468837r50094p87015p53132l25074l67622l39271n64836k31792k25599l11567
4354D612835j02665k54281k41872j20864j02163j75954k32032j39978R0599P6573
4344C410198k50683r8764K14233j59802j85682l169L0715q4930L4199l16800q6615
4333B502900k10986j90582J09547L6905k49274j54678L8774r2884L9385J59047
4323A988154j61822N7406m3340k57405J26853L37622n1304l35258O3290P6178
4313A800374k65214P6008p4532J23061r289l12692j50251R4854p8298J43363K98231
4302A645615M8493k45570j91995k5263J40691j8183j21499L3809j24106m03049
4292G38943N4656K70646J31136j40626j06231J00528K55432q3793m18701N4829
$$ plain form
4364 9468837 8518743 7731728 6978596 6653522 6285900 5946629 5381793 5150001 4924402 4612835
4354 4612835 4510170 4255889 4014017 3893153 3790990 3615036 3383004 3243026 3333625 3410198
4344 3410198 3159515 3060751 3274984 3115182 2929500 2926331 2957046 2872116 2906315 2589515 2502900
4333 2502900 2291914 2101332 2210879 2247784 1998510 1843832 1882606 1789722 1829107 1988154
4323 1988154 1826332 1883738 1840398 1582993 1709846 2047468 1996164 1660906 1724196 1800374
4313 1800374 1535160 1611168 1536636 1659697 1650408 1337716 1187465 1282319 1204021 1347384 1645615
4302 1645615 1694108 1448538 1256543 1231280 1371971 1353788 1232289 1266098 1141992 738943
4292 738943 793599 1064245 1195381 1054755 948524 1049052 1304484 1220691 801990 856819
4282H56819J50799N1244j61796p931L3218n7783L49191j48019k49754L40698K32825
4271A389511j17765j71745q7141O999J15164N8851n3461j62810J11663O5230r0217
4260A064279k22726L07761k675l30603O9293N2666j72034q8899J54487P9232K5810
4249I36591J11339k57056m0939m5897J69734J38840j745j16191N1085K38669l1148
4238A153282p9233J13245L33282j14771k3660j33068j22751j46751J08863J25939
4228A214377k80683J0228L9106J2480j04029J32097l4130J5163L8080K46811k4013
4217A265487j9754K5041R8696m1946J61577K02471l2346J32232m9280K77913J89447
4206B209538K03782k27692k19201j63415N2214k52766j07288R8306j80868J70715
$$ plain form
4282 856819 1007618 1058862 897066 889135 922353 864570 1213761 1065742 815988 1156686 1389511
4271 1389511 1271746 1100001 1012860 1019859 1135023 1193874 1140413 977603 1089266 1154496 1064279
4260 1064279 841553 1149314 1146639 816036 885329 937995 765961 677062 831549 910781 936591
4249 936591 1047930 790874 749935 704038 873772 1012612 1010867 894676 945761 1184430 1153282
4238 1153282 1074049 1187294 1520576 1405805 1382145 1249077 1126326 979575 1088438 1214377
4228 1214377 933694 943922 983028 995508 891479 1023576 989446 1004609 1042689 1289500 1265487
4217 1265487 1245733 1270774 1369470 1327524 1489101 1691572 1659226 1791458 1742178 2020091 2209538
4206 2209538 2413320 2185628 1966427 1803012 1855226 1602460 1495172 1593478 1412610 1583325
4196A583325P4065k58797J96896K5012J1683K0045J23590n2558J41521q2848R9025
4185A880959K68406J20219K44846L69941J81550n1289j28278l70886k13307J11988
4175B414149k42985j00078o6893j07543K02856L5135j79966j28551p268n3224
4165A765632j806J20548j04438q5690q5239M2038j18544l05741J76654J91078
4155A594492o1093j31240R6042j82680j3697K34341J26589k50474l6943P2206
4145A447543O613M5816J53518j14933J14823K22466k29267j54180o0523L3137
4135A465013P0724n4060J37957r6659j1570K9244k0176J31519q3834N0291o0982
4124A557467j16375j29010K0521O9308q3527P0652k00223O3999K542K60782j41526
$$ plain form
4196 1583325 1657390 1398593 1595489 1620501 1632184 1652229 1775819 1723261 1864782 1781934 1880959
4185 1880959 2149365 2269584 2514430 2884371 3065921 3014632 2886354 2515468 2302161 2414149
4175 2414149 2171164 2071086 2004193 1896650 2099506 2134641 1954675 1826124 1818856 1765632
4165 1765632 1763826 1884374 1779936 1694246 1609007 1651045 1532501 1226760 1403414 1594492
4155 1594492 1533399 1402159 1498201 1315521 1301824 1536165 1662754 1412280 1375337 1447543
4145 1447543 1454156 1499972 1653490 1538557 1653380 1875846 1646579 1492399 1431876 1465013
4135 1465013 1535737 1481677 1619634 1522975 1511405 1540649 1520473 1651992 1568158 1618449 1557467
4124 1557467 1441092 1312082 1332603 1401911 1318384 1389036 1188813 1252812 1255354 1516136 1374610
4113A374610J86523j99777o1587P2577k6334j37618M8175r092j01524J64692K06449
4102A517094J49542J97482p4331k56175J31933J29631P5877n7803L4285k1599
4092A825936j7157N2163L1476m9435J63748K14453l474j01509m0750o7130J3602
4081B021923N5450J63473O7371k2323j59861J04762k8149L48354K16885j05726
4071B662159k29073n3889o0805J57992J60249P2064N27779j01555j29831J31588
4061C136678P6173Q3663N0988p5904o3262Q7381J20992j858j3741j31340N2513
4050C322283L25977R1017M1402p8411J96910M73496K5301o5838Q9272N1216P0590
4039D543215M4320l7720J78733K68473J461L32952K41165J56130K04648J21173
$$ plain form
4113 1374610 1561133 1361356 1299769 1372346 1346012 1208394 1256569 1247477 1145953 1310645 1517094
4102 1517094 1666636 1864118 1789787 1533612 1665545 1795176 1871053 1813250 1847535 1825936
4092 1825936 1808779 1860942 1892418 1842983 2006731 2221184 2217710 2116201 2075451 2008321 2021923
4081 2021923 2077373 2240846 2308217 2285894 2126033 2230795 2202646 2551000 2767885 2662159
4071 2662159 2433086 2379197 2318392 2476384 2636633 2708697 3236476 3134921 3005090 3136678
4061 3136678 3212851 3296514 3347502 3271598 3208336 3295717 3416709 3414851 3401110 3269770 3322283
4050 3322283 3648260 3739277 3780679 3702268 3899178 4372674 4397975 4332137 4421409 4472625 4543215
4039 4543215 4587535 4549815 4728548 4997021 4998482 5331434 5572599 5728729 5933377 6054550
4029F054550J41620K19752L38851O07886O33898M57360M23304P71056R24736J020152
4019A1593165Q95264J195742J451820J823676K187762K670562K879857L114894
4011B7812742K898348P49051k363201m361186m080262k831304k321880j248980
4003A4253328r96120r11600o24599n46429l83304l37148j93459j72251j41921
3994I946497k6400J56373M0320J1470j03103j481R6395J99641K20776R4718M8989
3983A0684195J05144L7891K60084j30339J78038K14748L6445K01755K09235L94653
3973A2191849M15372L14288K31783M16630K91288K74645L96976O57905M72159
3964A5662895M60816L25964M95357M91321M21835N33800M18534O18126Q01785
$$ plain form
4029 6054550 6196170 6415922 6754773 7362659 7996557 8453917 8877221 9648277 10573013 11593165
4019 11593165 12488429 13684171 15135991 16959667 19147429 21817991 24697848 27812742
4011 27812742 30711090 31460141 29096940 24735754 20655492 17824188 15502308 14253328
4003 14253328 13257208 12345608 11721009 11174580 10791276 10454128 10260669 10088418 9946497
3994 9946497 9920097 10076470 10116790 10128260 10025157 10023676 10120071 10319712 10540488 10635206 10684195
3983 10684195 10789339 10827230 11087314 10956975 11135013 11349761 11386206 11587961 11797196 12191849
3973 12191849 12607221 12921509 13153292 13569922 13861210 14135855 14532831 15190736 15662895
3964 15662895 16123711 16449675 16945032 17436353 17858188 18391988 18810522 19428648 20230433
3955B0230433O49409Q37029O47566P16075Q64670J051919J178992J004343J042598
3946B8223034J204698J565970J686406J971311K166882K200013K556216L194813
3938D4769343L812672M205315N184193O363162P395264Q454237R890224J1716540
3930A01790950J3541136J5797782J8760721K2577266K7830237L4125536L9041190
3923B73464818L7745905K4697151N37729k6051035m1089128m2398232l4703791
3916A92203417k4979860j7254585j2968669j1296350j0481278j0184498r029175
3909I6009002p703282o004546m783874m440425m335251l827455k670964j751804
3901F0491401p76978l02598N89897L61352j4094k462051m451108n063373m220611
$$ plain form
3955 20230433 20879842 21716871 22364437 23080512 23945182 24997101 26176093 27180436 28223034
3946 28223034 29427732 30993702 32680108 34651419 36818301 39018314 41574530 44769343
3938 44769343 48582015 52787330 57971523 64334685 71729949 80184186 90074410 101790950
3930 101790950 115332086 131129868 149890589 172467855 200298092 234423628 273464818
3923 273464818 311210723 335907874 336445603 310394568 269305440 226907208 192203417
3916 192203417 167223557 149968972 137000303 125703953 115222675 105038177 96009002
3909 96009002 88305720 82301174 77517300 73076875 68741624 64914169 62243205 60491401
3901 60491401 59714423 59411825 60001722 60363074 60348980 57886929 53435821 48372448 44151837
3892D4151837k943525k504373j847938j425406j674117j353641r15626j323169
3884C0164042j362692j057374j468609j373376j068669n72320r48049r04874o30692
3875B0777387p53225n95752m16712m14653o63584n5515l07110o6864J08664n15239
3865A7097397m21784r21451p91895m53684q55625m93228m00154M6191k95353k05513
3855A2304901l65859k60718k22587j28201n71882j63635j5050k92701k56900j11491
3845I915877N0000k69376k49805N817l17313k8367p4769j13140J09033r2561o3981
3834H871415m75573j02120j941q6923k58497N1817p3183R8857J01810k91751m5393
3823G788518j77948o0283p3306L41951p4076k10821J32891p3489j60703J62743
$$ plain form
3892 44151837 41208312 38703939 36856001 35430595 33756478 32402837 31487211 30164042
3884 30164042 28801350 27743976 26275367 24901991 23833322 23261002 22312953 21408079 20777387
3875 20777387 20024162 19428410 19011698 18597045 17933461 17877946 17570836 17503972 17612636 17097397
3865 17097397 16675613 15754162 14962267 14508583 13652958 13159730 12759576 12805767 12510414 12304901
3855 12304901 11939042 11678324 11455737 11327536 10755654 10592019 10576969 10284268 10027368 9915877
3845 9915877 9965877 9696501 9446696 9452513 9135200 9106833 9032064 8918924 9027957 8935396 8871415
3834 8871415 8395842 8293722 8291781 8204858 7946361 7998178 7924995 8023852 8125662 7833911 7788518
3823 7788518 7610570 7550287 7476981 7818932 7744856 7534035 7666926 7593437 7432734 7595477
3813G595477r1861j27524J60315K1779n69124r5111o4851J81346p3064k49681
3803F687701O0022M7001J80073K3906M276k31425J77016O4086j19447j75304n3125
3792F664780o5146p6088L95952L0246j38446J24054j21996K63167p6811k25905
3782F773807J91688q9296K01035j99098j03489k19132J00350r6581O4701J05129
3772F729114J39397J14810L8925o8998J38376K42940p2078K80895K00836n3730
3762G690487K17198M92819K97902K05011M83184P0497K05690L54517p1723l40142
3752I605440k42976p3632j98306L3383J88772O6919J1961L53467L0036K57914
3742A0032978N39048M30383P5852K41074J94903j7172l74996m0569R1041J81029
$$ plain form
3813 7595477 7503616 7376092 7536407 7558186 6989062 6893951 6829100 7010446 6937382 6687701
3803 6687701 6747723 6794724 6974797 6998703 7002979 6771554 6948570 7012656 6893209 6717905 6664780
3792 6664780 6599634 6523546 6919498 6949744 6811298 6935352 6813356 7076523 6999712 6773807
3782 6773807 6965495 6876199 7077234 6878136 6774647 6555515 6655865 6559284 6623985 6729114
3772 6729114 6868511 6983321 7022246 6953248 7091624 7334564 7262486 7543381 7744217 7690487
3762 7690487 7907685 8400504 8698406 8903417 9386601 9457098 9662788 10017305 9945582 9605440
3752 9605440 9362464 9288832 9090526 9123909 9312681 9379600 9391561 9745028 9775064 10032978
3742 10032978 10572026 11002409 11078261 11319335 11514238 11497066 11122070 11081501 11172542 11353571
3732A1353571J75088K33081M39934N91242M60765O03400J39740l92927j191362
3723A2412532j150927o43839n24214k21898k45393k46034l8576P7013n7714j04593
3713I256357j99525k26115m69302m16380m1793j88215j10824j77389o0907j40019
3703G225888K9012j66268n839q2392j66017j32664M8013j47908j9758J518l60620
3692F222965q5408J59j72823m6123r0820o9008K56062J04212q9357n260O9647
3681F094246N6951k03231L16502K10855n2670L1156J22817O0699J77262j63814
3671F650773j37396J41002L88152L7775J20139K04348J97552L19121R1790L14576
3661H327832K84543L97581j6131N46016j56054J03296J4997k364J10816L01258
$$ plain form
3732 11353571 11528659 11761740 12201674 12792916 13253681 13857081 13996821 13603894 12412532
3723 12412532 11261605 10617766 10093552 9871654 9626261 9380227 9341651 9418664 9360950 9256357
3713 9256357 9056832 8830717 8361415 7945035 7903242 7715027 7604203 7426814 7365907 7225888
3703 7225888 7254900 7088632 7082793 7000401 6834384 6701720 6749733 6601825 6582067 6583585 6222965
3692 6222965 6137557 6137716 5964893 5918770 5827950 5758942 6015004 6119216 6029859 6024599 6094246
3681 6094246 6151197 5947966 6264468 6475323 6422653 6453809 6576626 6637325 6814587 6650773
3671 6650773 6513377 6654379 7042531 7080306 7200445 7404793 7602345 7921466 8013256 8327832
3661 8327832 8612375 9009956 8993825 9539841 9383787 9487083 9502080 9499716 9610532 9911790
3651I911790K32655L65818M03128J48248O04450N43810M65389M76597O32657O33410
3641A4417952O52134M37919O77133N88051M55688P71846J29031J21883O7484L231
3631A8322352R4490n9901q9399Q2587K35195N68264M90464N99103Q23395J239124
3621B2305674J101744J138512J484369J351872J890126J833212J699042K136937
3613C4941488J749496J719072J607816J027751Q41254O67736L33367K43712K37585
3604D3369277J54228l39015k74880l06082j45352P7657K92361M88148N99273Q36442
3594D4752057R95829J068354J011518J172863J469281J597441J641719J841933
3586E5550995J995230J698956J895741J720957J675444J224259J344836J377439
$$ plain form
3651 9911790 10144445 10510263 10913391 11061639 11666089 12209899 12675288 13151885 13784542 14417952
3641 14417952 15070086 15508005 16185138 16773189 17228877 18000723 18129754 18251637 18319121 18322352
3631 18322352 18416842 18356941 18267542 18350129 18585324 19153588 19644052 20243155 21066550 22305674
3621 22305674 23407418 24545930 26030299 27382171 29272297 31105509 32804551 34941488
3613 34941488 36690984 38410056 40017872 41045623 41886877 42554613 42887980 43131692 43369277
3604 43369277 43523505 43184490 42909610 42603528 42458176 42535833 42828194 43316342 43915615 44752057
3594 44752057 45747886 46816240 47827758 49000621 50469902 52067343 53709062 55550995
3586 55550995 57546225 59245181 61140922 62861879 64537323 65761582 67106418 68483857
3578F8483857R01117N06132L52351N68473J42256R8770R1613m78847n07018o51154
3568F9507550q63352q34402j272646j493027j216852r71115o78446P4900J43326
3559F2395936N77074O09616J021429J225063J460429J285978J750057J555674
3551G1881256J152294J560707J210056N83282L40509m08449j268735j243574j640485
3542G2166861j925525j503654j251695j277071j148025j124205j209693r21185
3534F1805808p63907o60913q54778l66346n70584l98985j59737m10911j13713
3525E7505934K62355O19211N15635M35895P38349K36456N59245Q32331J034121
3516F2739532J584066K286559L274321M133403N256522N445605M407939J84569
$$ plain form
3578 68483857 69384974 69891106 70243457 70811930 70954186 71052956 71144569 70665722 70158704 69507550
3568 69507550 68644198 67809796 66537150 65044123 63827271 62856156 62177710 62252610 62395936
3559 62395936 62973010 63582626 64604055 65829118 67289547 68575525 70325582 71881256
3551 71881256 73033550 74594257 75804313 76387595 76728104 76319655 75050920 73807346 72166861
3542 72166861 70241336 68737682 67485987 66208916 65060891 63936686 62726993 61805808
3534 61805808 61041901 60380988 59526210 59159864 58589280 58190295 58030558 57619647 57505934
3525 57505934 57768289 58387500 58903135 59339030 60077379 60313835 60873080 61705411 62739532
3516 62739532 64323598 66610157 69884478 74017881 79274403 84720008 89127947 89312516
3508H9312516m138378o002438o531368o617484o083067n039030m099372l514787
3500D7286592k712113k482906k029750j772970j483565j141364j015015q55352
3492C3793557p72492m65162l52277J12760l99670Q2126L34368M3703l53932n23469
3482C1499512p00166j289671r05380q53266j123017j034210q25534o88384n35872
3473B3544012m94302o22317n21513l70816m24917l37646l62896m86606l10435
3464A9612564o95470k50623J30155l11982j16257l58525j31915J4584q3952j05480
3454A7703099k27704j30863r1971L9606j84492K6818K15859K46184J47826j80924
3444A7563438L17198K6031J14508k8847q9530J73733j28865L10192K07901K02886
$$ plain form
3508 89312516 85174138 79171700 72640332 66022848 59939781 54900751 50801379 47286592
3500 47286592 44574479 42091573 40061823 38288853 36805288 35663924 34648909 33793557
3492 33793557 33021065 32555903 32203626 32316386 31916716 31998842 32333210 32376913 32022981 31499512
3482 31499512 30799346 29509675 28604295 27751029 26628012 25593802 24768268 24079884 23544012
3473 23544012 23049710 22427393 21905880 21535064 21110147 20772501 20409605 19922999 19612564
3464 19612564 18917094 18666471 18796626 18484644 18368387 18009862 17877947 17892531 17808579 17703099
3454 17703099 17475395 17344532 17252561 17292167 17107675 17134493 17350352 17596536 17744362 17563438
3444 17563438 17880636 17906667 18021175 17992328 17902798 18076531 17947666 18257858 18465759 18668645
3434A8668645J10937J4482L79787R2362M21890O17478N0285J49116K40322K12807
3424B0958111L94091j53725L04256L60865L79821K48959M81183M89132M83785
3415B3946478P27426O99149P94363O64104P03997N31991P84005N91432N46277
3406B9989222N70854P21257K84909L282n03162p38572n47888j45070L00567K89596
3396C0224995K02792O51668J043561J142514R99877J232506Q56098M91409J57247
3387C7002667K07753k9472n64152k95913k81300L45041O44995P10412J131813
3378C8871844J621201J189574J170659J264571Q05721K21256l78468j001904q44280
3369D2920174j182457n57282m27502m13541k76774L53699k3829m45635m73236
$$ plain form
3434 18668645 18779582 18794064 19173851 19266213 19688103 20305581 20355866 20504982 20745304 20958111
3424 20958111 21352202 21198477 21502733 21863598 22243419 22492378 22973561 23462693 23946478
3415 23946478 24673904 25373053 26167416 26831520 27535517 28067508 28851513 29442945 29989222
3406 29989222 30560076 31281333 31566242 31569524 31066362 30327790 29779902 29634832 29935399 30224995
3396 30224995 30427787 31079455 32123016 33265530 34265407 35497913 36354011 36845420 37002667
3387 37002667 37210420 37180948 36616796 36320883 36039583 36384624 37029619 37740031 38871844
3378 38871844 40493045 41682619 42853278 44117849 44923570 45144826 44766358 43764454 42920174
3369 42920174 41737717 41180435 40752933 40339392 40062618 40416317 40392488 39946853 39473617
3360C9473617o67388m70769l25524l35776P1710J43678J39202K52253M51595R65856
3350C9698454R58101Q99896J116391J153624K44260k81388q76038j352207j480355
3341D0080738q69144o86977n24889q95243q86715q87182j022621p29444p02965
3332C2875558n04036p717l15985k2876K39k69625l65102l83599m27915m83330
3322C0095612o87561m27179k07762j20043k14476j87543l11830j97934q0112N8022
3312B7719194j10162J46368P7826j85689l41326q31403p87907j066801j162373
3303B3457727p97283n10576n51718k71829m66114l24266j70390l52326j45339
3294A9867886k18264j51430K1556r8798K35213j85766k23104j0422l29796l61685
$$ plain form
3360 39473617 38806229 38335460 38009936 37674160 37745870 37889548 38028750 38281003 38732598 39698454
3350 39698454 40656555 41556451 42672842 43826466 44070726 43789338 42913300 41561093 40080738
3341 40080738 39211594 38524617 37999728 37104485 36217770 35330588 34307967 33578523 32875558
3332 32875558 32371522 32363805 32047820 32024944 32025183 31755558 31390456 31006857 30578942 30095612
3322 30095612 29408051 28980872 28773110 28653067 28438591 28251048 27939218 27741284 27661172 27719194
3312 27719194 27609032 27755400 27833226 27647537 27306211 26474808 25686901 24620100 23457727
3303 23457727 22660444 22149868 21598150 21326321 20860207 20535941 20365551 20013225 19867886
3294 19867886 19649622 19498192 19519748 19420950 19656163 19470397 19247293 19236871 18907075 18545390
3284A8545390n8706j12282j25608O6066J2998j77624J07280k20533j86780j967
3274A7848234L0802j5410j81229j91551Q453p0182J09877J47495J87080M42742
3264A8316311K21000N16182N57432O88983J061982P28978J097500J641196J723441
3255B6553005K100014K621720K962758K443408o046k615297l455852l253333k086237
3246B5264140j361929j037817o12733k17748l76291q1792j84831J04947J88036
3237B1683982M61638M66145N38742Q91502J013865J329672J364018J621083J859765
3228C1230412K480662L237659L894665N053947N635460M945245K77414n543169
3220E1212295p757443o638745m029936k970515k205873j501938j237039j075262
$$ plain form
3284 18545390 18486684 18374402 18248794 18314860 18327858 18150234 18257514 18036981 17850201 17848234
3274 17848234 17879036 17863626 17682397 17490846 17499299 17429117 17538994 17686489 17873569 18316311
3264 18316311 18537311 19053493 19610925 20299908 21361890 22090868 23188368 24829564 26553005
3255 26553005 28653019 31274739 34237497 36680905 36674859 34059562 30603710 27350377 25264140
3246 25264140 23902211 22864394 22251661 22033913 21657622 21575830 21390999 21495946 21683982
3237 21683982 22145620 22611765 23150507 24042009 25055874 26385546 27749564 29370647 31230412
3228 31230412 33711074 36948733 40843398 45897345 51532805 56478050 56755464 51212295
3220 51212295 43454852 36816107 32786171 29815656 27609783 26107845 24870806 23795544
3212B3795544q75738n87401l63739l32559l10485r5491J80697l2194K70402L31941
3202B1980977N10452N04347P79591R31938J287425J713766K515237K356427K154310
3193C4734470M1008k561393l671723l370491k400040j470596r54847o66431r15832
3184A8764125r67426k27111k89059m06078m12979l9625l20589l05475m44554j98269
3174A5152960m25538j26732P4887o969k56023k5287o6503j4902k05097j23487
3164A3977309R3279N8042j72271j5620j52873K30263l7223k12224j79540K5251
3154A3614393j18718J75222n4507n9298J77205r2263j70079J50046J18766l5930
3144A3704837p0129M547K24544J08912K08467j09050J05261K13467J2483M11379
$$ plain form
3212 23795544 22919806 22332405 21968666 21636107 21325622 21230131 21410828 21378634 21649036 21980977
3202 21980977 22491429 22995776 23775367 24707305 25994730 27708496 30223733 32580160 34734470
3193 34734470 34775478 32214085 28542362 25171871 22771831 21301235 20346388 19679957 18764125
3184 18764125 17796699 17569588 17280529 16874451 16461472 16421847 16101258 15795783 15351229 15152960
3174 15152960 14727422 14600690 14675577 14668608 14412585 14387298 14320795 14305893 14100796 13977309
3164 13977309 14070588 14128630 13956359 13940739 13787866 14018129 13980906 13768682 13589142 13614393
3154 13614393 13495675 13670897 13616390 13557092 13734297 13642034 13471955 13622001 13740767 13704837
3144 13704837 13634708 13639255 13863799 13972711 14181178 14072128 14177389 14390856 14403339 14814718
3134A4814718K36148M444L36555j90373K10616p2778L45284L3589Q5650o0683
3124A5743170M16082M39447J29628K51653K85483L50695J96828J23571Q4629J51763
3114A8172949K62568M4446K54908K80756K08629L02190N17754M11301P07501N38536
3104B1701538P17451Q88124Q43683J167178J176210J332309J379145J801092J841268
3095C2847998K050212K241049K167053K094627K154467J855449J194253O19781
3087D7224889m55059o17615q19654p88904m93491q90001k018065k817491k768060
3078C5556549k898189k345123j962263k039416j683812j201331j119430o93531
3070B1613454o76893l77485l56850n3296K57723J57011J57442N35464Q35682J041481
$$ plain form
3134 14814718 15050866 15055310 15391865 15201492 15412108 15339330 15684614 15718203 15803853 15743170
3124 15743170 16159252 16598699 16728327 16979980 17265463 17616158 17812986 17936557 18021186 18172949
3114 18172949 18435517 18479963 18734871 19015627 19224256 19526446 20044200 20455501 21163002 21701538
3104 21701538 22418989 23307113 24150796 25317974 26494184 27826493 29205638 31006730 32847998
3095 32847998 34898210 37139259 39306312 41400939 43555406 45410855 46605108 47224889
3087 47224889 46769830 46152215 45332561 44543657 44050166 43160165 41142100 38324609 35556549
3078 35556549 32658360 30313237 28350974 26311558 24627746 23426415 22306985 21613454
3070 21613454 20936561 20559076 20202226 20148930 20406653 20563664 20721106 21256570 22092252 23133733
3060B3133733J086153J326467J562722K282857K681725L640715L391286K242233
3052D1347891m12931k387351l761409l735997l011214k844478j755675j818984
3044B1619852j331378j243837j012742o88450n42282l69427m05860l45750j56358
3035A5523768J84649J40870P616J81970N19953L99024N68855P25355R66070J921962
3025B1140092J494835J156249m6824j266215j846883j880860j255656j217325
3017A6277413j007519k94905o93270l77545p95037o68372m87906m74368m43466
3008A1035025l09160j21522l29183j37946p9017k44028j95998L2182m18800J62722
2998I394275K03665N594J24787o5540k10580k22007j23099J51255k33569L5823
$$ plain form
3060 23133733 24219886 25546353 27109075 29391932 32073657 35714372 39105658 41347891
3052 41347891 40934960 38547609 34786200 31050203 28038989 25194511 23438836 21619852
3044 21619852 20288474 19044637 18031895 17343445 16801163 16431736 16025876 15680126 15523768
3035 15523768 15708417 15849287 15856903 16038873 16558826 16957850 17526705 18252060 19218130 21140092
3025 21140092 22634927 23791176 23744352 22478137 20631254 18750394 17494738 16277413
3017 16277413 15269894 14974989 14281719 13904174 13109137 12440765 11952859 11478491 11035025
3008 11035025 10725865 10604343 10275160 10137214 10058197 9814169 9618171 9650353 9231553 9394275
2998 9394275 9597940 9603534 9728321 9662781 9452201 9230194 9107095 9258350 9024781 9060604
2988I060604j15668n9580O9148j64077l52908j68433m3123k56846j86710K05514
2978G987921k68085J9922P3489r8574R223O9062n1326j40087K54800K47988j28351
2967G975982J04173L19039j08739j78519k84358j12923k90076k77608k16502O2315
2957F992784K0397k07232p1473j01658j00779K9345j93614k00961j67075J8218
2947F017952J15332j12656l4039J27257r805M4132k16739Q0881J16834K56886
2937F386035m3727k10691R9491l6599k15584p4281R6382r1383m23454n0608J2883
2926E448464j51503n7898l8192j35037j09040K0032l07493J71533l1995j12232
2916D696639J21277O5252l20800q4722j67036Q4981j10367J60063Q410k31568
$$ plain form
2988 9060604 8944936 8885356 8954504 8790427 8437519 8269086 8225963 7969117 7782407 7987921
2978 7987921 7719836 7739758 7813247 7714673 7723896 7792958 7741632 7601545 7856345 8104333 7975982
2967 7975982 8080155 8399194 8290455 8111936 7827578 7714655 7424579 7146971 6930469 6992784
2957 6992784 7013181 6805949 6734476 6632818 6532039 6561384 6367770 6166809 5999734 6017952
2947 6017952 6133284 6020628 5986589 6113846 6104041 6148173 5931434 6012315 6129149 6386035
2937 6386035 6342308 6131617 6231108 6194509 5978925 5904644 6001026 5909643 5486189 5435581 5448464
2926 5448464 5296961 5239063 5200871 5065834 4956794 4976826 4669333 4840866 4808871 4696639
2916 4696639 4817916 4883168 4562368 4477646 4310610 4395591 4285224 4445287 4453697 4222129
2906D222129K10911O9766J11695q6596J87997J82194k7082k89888K45209J95802
2896E022137j31057k77843k04263k93355P5396j08106l3604J91466J1020M4750
2886D296541p7044J95422k616k57049j69995J75931J2588O9150K41909K10525
2876D695362p8629o5659K648J77027N9295J88535K24423K57132J0978q9993j70935
2865E210184j20092J28460L3577J4316j82873j60336n2566Q2944J07952J35280
2855E196846r8495R4184L78984J11277k08932P4689L6529l8308J29524J60384
2845E836682J27P6001J54012j0048J60441m7561N4057K43249J12664k23497M948
2834F361075O9648p0995J49108n1164j68467j63533q0215p2119J75482J50554
$$ plain form
2906 4222129 4433040 4502806 4614501 4527905 4715902 4898096 4871014 4581126 4826335 5022137
2896 5022137 4891080 4613237 4408974 4115619 4191015 4082909 4049305 4240771 4251791 4296541
2886 4296541 4219497 4414919 4412303 4155254 3985259 4161190 4173778 4242928 4484837 4695362
2876 4695362 4616733 4551074 4553722 4730749 4790044 4978579 5203002 5460134 5471112 5381119 5210184
2865 5210184 5090092 5218552 5252129 5266445 5083572 4923236 4870670 4953614 5061566 5196846
2855 5196846 5098351 5192535 5571519 5682796 5473864 5548553 5585082 5546774 5676298 5836682
2845 5836682 5836809 5912810 6066822 6056774 6217215 6169654 6223711 6466960 6579624 6356127 6361075
2834 6361075 6430723 6359728 6508836 6457672 6289205 6125672 6045457 5973338 6148820 6299374
2824F299374J26652j5026K16293j05770J26110l48206R9002K43285k61184K65534
2814F646064K45326J49809L7065N5972J41980K17243j99722O9988J50343m5148
2804G468920j22704k09197q7661j22309R8545R1069n6963k4856j42821q2951K83248
2793G092320P7888p6258K69564j08210j75583K49674P7597K14513K33821p048
2783G848278J70482Q5690j84895o3337n60774j98661j73099k84203k83155j73907
2773F182419J6496p5414J19227k8155j28790J3994P0020k93369J56024j50820
2763E881632J13754K33577O0650j05028Q6528k29320M0439j04979n89k8924l61606
2752E586134l01970j498k66609l02770o8747p5840j42636j10246P3995q4850q4237
$$ plain form
2824 6299374 6426026 6411000 6627293 6521523 6647633 6299427 6398429 6641714 6380530 6646064
2814 6646064 6891390 7041199 7078264 7134236 7276216 7493459 7293737 7363725 7514068 7468920
2804 7468920 7346216 7137019 7049358 6927049 7025594 7116663 7059700 7034844 6892023 6809072 7092320
2793 7092320 7170208 7093950 7363514 7255304 7079721 7329395 7406992 7621505 7855326 7848278
2783 7848278 8018760 8104450 7919555 7856218 7295444 7096783 6923684 6639481 6356326 6182419
2773 6182419 6198915 6123501 6242728 6214573 6085783 6099777 6169797 5876428 6032452 5881632
2763 5881632 5995386 6228963 6289613 6184585 6271113 6041793 6082232 5977253 5976664 5947740 5586134
2752 5586134 5284164 5282666 5016057 4713287 4644540 4568700 4426064 4315818 4389813 4304963 4220726
2741D220726J54558l670k64529j02269j64751k77876j70695P0159m2932j8231
2731C400490k59804k38549l02349o5164o0800J67167q9644n5046K06383j72802
2721B529882j59662j91916J2462r406J28419P1109L9053k55525k22487r0748j08752
2710A742429m4381M17657O6473l73409J41370j33613j66191J57910K16521p5229
2700A949537k39691o2973j48285J0237J76371k11474j28462r6366J22281j551
2690A369624n8617L6003K41487l7823k16345K51965k04757j99888O9893j85793
2680A065749o9246K31694R088j57324R6652j63820j1343O241K42116j7275k01937
2669A030595k26622J85887k0266k11336P8454j287R9359J3717M3674j60333Q3835
$$ plain form
2741 4220726 4375284 4371614 4107085 4004816 3840065 3562189 3391494 3461653 3418721 3400490
2731 3400490 3140686 2902137 2599788 2534624 2473824 2640991 2551347 2496301 2702684 2529882
2721 2529882 2370220 2178304 2190766 2181360 2309779 2380888 2419941 2164416 1941929 1851181 1742429
2710 1742429 1698048 2115705 2182178 1808769 1950139 1816526 1650335 1808245 2024766 1949537
2700 1949537 1709846 1646873 1498588 1508825 1685196 1473722 1345260 1248894 1371175 1369624
2690 1369624 1311007 1347010 1588497 1550674 1334329 1586294 1381537 1181649 1251542 1065749
2680 1065749 996503 1228197 1237285 1079961 1176613 1012793 1001450 1007691 1249807 1232532 1030595
2669 1030595 803973 989860 969594 758258 836712 835425 934784 948501 992175 831842 915677
2658I15677j63935K31484p2255j28035r8006M4499J58721k36949L4317j20674
2648E64844J45987K4847o0598K74743p5408j23459j35757m5183L5661p1166J56077
2637F90588J15071q4931l9650J25626l08192K4029J81569K3181k980j06735j08205
2626E09371j40179n9188K88939n3921k8364L2921L6246J51467J6388j63435M6482
2615F36727j31036Q1437J63133j19999j47302L69016j59982p711j04q1380j19071
2604D83728l3024K22737O6900j14599r2373J65910j10127K578p5291J57419j37434
2593E36424L4999p704j99474J33900R7654j21666j35742m3828J96578K7615J08607
2582F27363m3877l6572l3770m5407J43312P1151l39047J32539O9496r8576q1419
$$ plain form
2658 915677 751742 983226 910971 782936 684930 729429 888150 651201 685518 564844
2648 564844 710831 735678 675080 949823 874415 750956 615199 570016 605677 534511 690588
2637 690588 805659 720728 681078 806704 498512 522541 704110 727291 724311 617576 509371
2626 509371 369192 310004 598943 545022 516658 549579 585825 737292 753680 590245 636727
2615 636727 505691 587128 750261 630262 482960 851976 691994 684283 684179 602799 483728
2604 483728 450704 673441 740341 625742 533369 699279 589152 591730 516439 673858 536424
2593 536424 571423 563719 364245 498145 595799 474133 338391 294563 491141 518756 627363
2582 627363 583486 546914 513144 467737 611049 682200 343153 475692 545188 446612 365193
2571C65193J02940M5201j8459j48088j8411q1922O3830J23243o6490L26709j3916
2560F79830o951r1138k00290K8934K46322l6943k20565Q5082n5866M9776q1813
2549C96378K1169J53032M7711Q251Q0893m7109J34629J22228J79403k16020k47045
2538F33520J00068J68905Q6967o5081j32656r9342n1101j02958J32869L52768
2528A023959l7115j81062K9183M0460J0137J89436J82300K10973k7766m07180
2518A033325j65868j01105M506J48883J59760p4044J4907K1583k03280k58590
2508E80077J80159J24733n762Q3890m2007k4228Q8869K14487k7955p2355J39328
2497A239236l65495q4376K89387l6324j30301M8763K0360R6309j7874o9058p4649
$$ plain form
2571 365193 468133 513334 494875 346787 328376 246454 310284 433527 367037 693746 679830
2560 679830 672879 581741 381451 410385 656707 619764 399199 484281 428415 478191 396378
2549 396378 417547 570579 618290 626541 707434 660325 794954 917182 1096585 880565 633520
2538 633520 733588 902493 989460 924379 791723 692381 641280 538322 671191 1023959
2528 1023959 986844 805782 834965 875425 885562 1074998 1257298 1468271 1440505 1033325
2518 1033325 867457 766352 770858 919741 1079501 1005457 1020364 1041947 838667 580077
2508 580077 760236 884969 879207 963097 921090 896862 985731 1200218 1172263 1099908 1239236
2497 1239236 873741 789365 1078752 1042428 912127 960890 981250 1077559 1059685 990627 915978
2486I15978P00K2293k98953K0118K30055j24905k7450j81497L02245J02993q6927
2475H74650k045K2166P8711j04690j71914j51748J66751J36096N7826R8206r9188
2464I04821j39634M8336r4566R6231j09117l44796J72503M3509j1393M4258J82714
2453G92866o9545j07905O985J39793M2398k87143M637K2518l5395k9991j02467
2442C76751M0618K5966r6541J9678J1932m124K43536m7576O0058j50033k41340
2431B38925J18957R2089K06420k05506k72251j76912K10011r0258O3304J85547
2421C70326p6648k45394R9165j28194K9489J43192K523J240l47066K28871K70869
2410C48373k35073L457K2008n0261K67875K0782j77483j45959J7531k3224L43409
$$ plain form
2486 915978 916678 938971 640018 660136 890191 765286 737836 556339 858584 961577 874650
2475 874650 872605 894771 973482 868792 696878 545130 711881 847977 905803 1004009 904821
2464 904821 765187 813523 718957 815188 706071 361275 533778 577287 565894 610152 792866
2453 792866 723321 615416 622401 762194 804592 517449 522086 544604 509209 479218 376751
2442 376751 417369 443335 346794 366472 378404 374280 617816 570240 630298 480265 238925
2431 238925 357882 449971 656391 450885 178634 1722 211733 121475 184779 370326
2421 370326 293678 48284 147449 19255 48744 191936 194459 195699 -151367 77504 348373
2410 348373 113300 116757 138765 88504 356379 377161 199678 53719 71250 48026 391435
2399C91435n7043k36640M4451k9024m8049M4213K0397K44203p4281k3938j31263
2388A44461j58159m330r0095J45076O1674J53627J31803p4772j058J88956j09232
2377C87951j36853j13600J23405k34060q7054L8788L36658K4194j15112P7548
2367C01865j45914j7703n9827r934l4810j4090k3802Q108p8895O5682J99858J97764
2355C88302K2882n1276j60722j82818P6075J32901p2640k02190m4775n2825R8903
2344d8183J2678J13811j69580J00171o9554J77061L7189k6422l1663j2893J80695
2333B63310j37034O3745J23948Q5110k02932J14323L5504l5833j86044Q2362M0669
2322B47128J51743L9184k15788p7349j23087m2710J21755K35n5768J57216J09588
$$ plain form
2399 391435 334392 97752 142203 113179 65130 109343 129740 373943 299662 275724 144461
2388 144461 -13698 -18028 -108123 36953 98627 252254 384057 309285 308227 497183 387951
2377 387951 251098 137498 260903 26843 -60211 -21423 315235 339429 224317 301865
2367 301865 155951 138248 78421 68487 33677 19587 -4215 3893 -75002 -9320 190538 388302
2355 388302 411184 359908 199186 16368 92443 225344 152704 -49486 -94261 -147086 -48183
2344 -48183 -35505 78306 -91274 8897 -60657 116404 153593 127171 95508 82615 263310
2333 263310 126276 190021 313969 399079 196147 310470 345974 310141 124097 206459 247128
2322 247128 398871 438055 222267 144918 21831 -20879 100876 101111 45343 202559 312147
2311C12147O9725J93360j50055J43075J2297Q7873P2750n1320J14680N2930j37043
2300G20419o8499Q5384j93238j05443j6848m4297K3127j95034R2294o3904j23765
2289A10196j2797N444Q2466J65022o9124k05159J08824j84947j0478K04288M6706
2278B40441M3656j02210j63340J17655p8071j23641J36838J0891k2347j09144
2268d9272J01835J12420N2879r1951m4315L3831O7635j92593Q3031K00943p8046
2257A96397j08559P1270j01017k43572K48886r1294K54750M347k17259j54697
2247a40748L63389j86476q6875O0710k1681l147J16924K43673q896j24061k3251
2236A89561j03594j03333o909J90393J14500K4747j2883j85759J07992L42268
$$ plain form
2311 312147 381872 575232 425177 568252 580549 668422 741172 689852 804532 857462 720419
2300 720419 651920 737304 544066 438623 421775 377478 400605 205571 297865 233961 110196
2289 110196 97399 102843 185309 350331 281207 76048 184872 -75 -10553 193735 240441
2278 240441 284097 181887 18547 136202 58131 -65510 71328 82219 59872 -49272
2268 -49272 52563 164983 217862 125911 81596 115427 183062 -9531 73500 274443 196397
2257 196397 87838 159108 58091 -185481 63405 -27889 226861 231208 13949 -140748
2247 -140748 222641 36165 -50710 10000 -11681 -14828 102096 345769 336873 212812 189561
2236 189561 85967 -17366 -24275 166118 280618 305365 292482 106723 214715 556983
2226E56983k64101l7109P5284m2556M5728R7508j10644M4439p4973q3664J6027
2215B22922O2163n5690K8037M985J56076j40444J9391k11634J00833K36632J33187
2204E56458r5559j0599Q1963k16612j27531L6653L0698J3302J64101j41875J69986
2193D60985k6922M7362j80794L03180j59618n2365K01865j05722j03188K04485
2183E89268j89837p9192Q0689K28358M7786J11683p5791m2703j18033K6648P8386
2172F57262O5757q9558J2437m19J12785k0562k8751M8871k1593J19300n438N8076
2160I08167J11316r1769j31417m4177Q0485j36249K64865Q2204j01257k58874
2150F83294J05830K53502q0981N1610j46721K0413K95689k56267J98880K70255
$$ plain form
2226 556983 292882 255773 331057 288501 334229 431737 321093 365532 290559 206895 222922
2215 222922 285085 229395 257432 262417 418493 278049 297440 85806 186639 423271 556458
2204 556458 460899 450300 532263 315651 188120 224773 255471 268773 432874 290999 460985
2193 460985 434063 481425 300631 603811 444193 391828 593693 487971 384783 589268
2183 589268 399431 320239 400928 629286 677072 788755 712964 670261 552228 578876 657262
2172 657262 723019 633461 645898 645479 758264 737702 708951 757822 736229 855529 850091 908167
2160 908167 1019483 927714 796297 752120 832605 696356 961221 1043425 942168 683294
2150 683294 789124 1042626 961645 1013255 866534 886947 1182636 926369 1125249 1395504
2140A395504j05739J8740L22016k01490M1186J91290J38293L280p0910K7287k3154
2129A736303P8531J34543K0669J79232K659L22210n7269j22943K1803K06587J46899
2118B669224p9662M16136J55993o4161L29239K43775q2251J73582r0936K09276
2108C880215K79296p0947K9534L08820R9096K95113J85475K08763K37784L48055
2098E801204k5665K55917J38502N56821M64986L12361K42268L50663J93717O72282
2088H963056L56258N77881P66157P92642Q41251R46718Q73725J014666J308230
2079A6440584J671680J773862K533411K514396K817907K880684L249100M818254
2071C8699878N695657N840171P638318R303246J2371802J5068578J9772201K2256443
$$ plain form
2140 1395504 1289765 1308505 1630521 1429031 1470217 1661507 1799800 1803080 1732170 1759457 1736303
2129 1736303 1814834 1949377 1970046 2149278 2151937 2474147 2416878 2293935 2315738 2522325 2669224
2118 2669224 2589562 3005698 3161691 3097530 3426769 3670544 3588293 3761875 3670939 3880215
2108 3880215 4159511 4088564 4118098 4426918 4526014 4821127 5006602 5215365 5453149 5801204
2098 5801204 5775539 6031456 6169958 6726779 7191765 7504126 7746394 8097057 8290774 8963056
2088 8963056 9319314 9897195 10663352 11455994 12297245 13243963 14117688 15132354 16440584
2079 16440584 18112264 19886126 22419537 24933933 27751840 30632524 33881624 38699878
2071 38699878 44395535 50235706 57874024 67177270 79549072 94617650 114389851 136646294
2063A36646294J8590362l420270k3325937k7227710k2416106j3968571j0157468
2056E4720594p255163o044767m268731l595430k412908k221451j483770j555306
2048B5883068k016484k144054j851656j695177j086363j284766j032328n87226
2040A4185014o07697q25688n64707n05341k57538r24090m77489k16446p4946l58648
2030I372424q32364k14706k47412l72058l32936j36316l96207k78936m2247m06104
2020F113138j68533j17858j71102m53900p5475j65757K16903j79693k03257j01009
2010D693457j08568p5224k41162n9357J7575k7445k56882k04072j90215p3310
2000C474797l8400o4504J36548k00690o7238K6143j85942J8900K0104l63202l03470
$$ plain form
2063 136646294 155236656 151816386 128490449 101262739 78846633 64878062 54720594
2056 54720594 47465431 41420664 37151933 33556503 31143595 28922144 27438374 25883068
2048 25883068 23866584 21722530 19870874 18175697 17089334 15804568 14772240 14185014
2040 14185014 13577317 12751629 12186922 11681581 11424043 10499953 10022464 9806018 9731072 9372424
2030 9372424 8540060 8325354 8077942 7705884 7372948 7236632 6840425 6561489 6519242 6113138
2020 6113138 5944605 5826747 5655645 5201745 5126270 4960513 5177416 4997723 4794466 4693457
2010 4693457 4584889 4509665 4268503 4209146 4226721 4199276 3942394 3738322 3548107 3474797
2000 3474797 3436397 3371893 3508441 3307751 3240513 3266656 3080714 3099614 3119718 2756516 2453046
1989B453046j85655P3815J4018Q8408k35610K2520J50691N7797j40663k99624
1979A998743J50098k5858j91178j38463m7741P4423j6743j78991k2219N9026O5893
1968A726990J18252p4787j93555J59166q8702k19588k03999K04727J77647n42293
1958A063858J77087L07534k1784l07606l0775Q6550r0197K7569J63413J0020l01534
1947A084135j73462p9191J2426J28222P2525k0566N2566Q5436j24424J63229k66371
1936I34525j07575J11398q2599k3049L3349K52452k19606j04831J16647N4262
1926I64973q9479p5852p4575Q7483j48838j08986K57192K73472k90591j54063
1916F40736j22671K34809N2410J7012r4803O2630m0872r9124k06850P8745p1872
$$ plain form
1989 2453046 2267391 2341206 2355224 2443632 2208022 2230542 2381233 2439030 2298367 1998743
1979 1998743 2148841 2122983 1931805 1793342 1745601 1820024 1803281 1624290 1602071 1661097 1726990
1968 1726990 1845242 1770455 1576900 1736066 1647364 1427776 1223777 1428504 1606151 1063858
1958 1063858 1240945 1548479 1526695 1219089 1188314 1274864 1184667 1212236 1375649 1385669 1084135
1947 1084135 910673 831482 843908 972130 1044655 1024089 1076655 1162091 1037667 1200896 934525
1936 934525 826950 938348 855749 832700 866049 1118501 898895 794064 910711 964973
1926 964973 875494 799642 725067 812550 663712 554726 811918 1085390 794799 640736
1916 640736 518065 752874 805284 822296 727493 790123 749251 650127 443277 522022 450150
1905D50150K28710L7913o3063j05886J611j4978l9852j57299N619q470J18938
1894D53393N208j55901J38862N6806J35524j1275J60636l59790p1977O8761k29732
1883A90515J77486J93895j31160k2368Q3457J45988K12178l1542j21172p2053
1873F25224R2R5150J3319J2094j37078j4690j03512k71200J32314J40325J14540
1862F06578k08319J1753k7465n2588J04087J20587q1201K0625M2303K27360K3079
1851G86799l90702P783O730j483j17177P5775l6302j45639R3662J42087q6976
1840C34557O5337K7193j03755L33477k43244k26384p0062N0680L18214k8751q8964
1829C68298M1088L24144p7350p6410J29890J13325q2842K19859k7234J55671p1314
$$ plain form
1905 450150 678860 716773 653710 547824 549435 534457 494605 337306 342925 334455 453393
1894 453393 458601 302700 441562 498368 633892 622617 783253 423463 351486 420247 190515
1883 190515 368001 561896 430736 408368 491825 637813 849991 818449 697277 625224
1873 625224 625316 720466 733785 745879 608801 594111 490599 219399 351713 492038 606578
1862 606578 398259 410012 382547 329959 434046 554633 473432 494057 536360 763720 786799
1851 786799 396097 403880 410610 409127 291950 367725 331423 185784 279446 421533 334557
1840 334557 399894 427087 323332 656809 413565 187181 117119 167799 486013 457262 368298
1829 368298 409386 733530 656180 579770 709660 822985 740143 960002 932768 1088439 1017125
1818A017125k16653j47487j5658R1287r8850k30363J53608J071o8334J74421j2271
1807F47896p7698K67336k87660k99907R8048r0403Q5705o8577N4128K5208Q2385
1796D36461r2037p037n9281j22559R15l603J27881M1081j69447j12457K48567
1785B88484J495n6243j5755q9423J70165J62830j23838P658r7983K4058O6289
1774C37737O1238r9835M8729k3620j29499j57845K26135J87084k19881n1765P8317
1763B56795j08783M5804k29995P5498K14154l04999L7440K47561L6903O102k4750
1752B51730j82723L1587n1077M0884J86748n9399j02170L2314o4065J20194Q6622
1741B90645j56573r5000K32m1734q6603R4283K38570m4417k19114j10098L14379
$$ plain form
1818 1017125 800472 652985 637327 728614 629764 399401 553009 554080 485746 660167 647896
1807 647896 570198 837534 549874 249967 348015 257612 343317 274740 328868 354076 436461
1796 436461 344424 337387 278106 155547 156462 152859 280740 321821 152374 39917 288484
1785 288484 289979 233736 217981 128558 298723 461553 337715 345373 247390 271448 337737
1774 337737 398975 299140 347869 324249 194750 36905 263040 450124 230243 178478 256795
1763 256795 148012 193816 -36179 39319 253473 -51526 -14086 233475 270378 276480 251730
1752 251730 69007 100594 49517 90401 277149 217750 115580 147894 83829 204023 290645
1741 290645 134072 39072 39304 -2430 -89033 5250 243820 199403 -19711 -129809 184570
1730A84570j16831j39272M1438J2211K4383N7727l7699l9573O6620K4075r2644
1719a4995k6965J88242J9160j0725R1395J0133l3532k12887K3629J52835J34047
1708C20337p1140j67554K31392j20771O137n07j17898K58690k18200k91935J21737
1697d9712K38937P6007j13527M1232J42727j42042p582l0015k33728J23249P9448
1686A24994q9050L3351J4307K4631q3006p7236J24300N7158p1948L1067l9841
1675D8727K04710R3086k4416k72154K87785j9573j25736j70181k44158K49230
1665B7320Q7903j8336j64014j0136l5060J0031J70480r5285N1048o519K26610
1654B44042j21564r7705J58469P7585N2609k6846l4516j37750j55752L6049q0505
$$ plain form
1730 184570 67739 -71533 -30095 -17884 6499 64226 26527 -13046 53574 77649 -14995
1719 -14995 -41960 146282 165442 154717 246112 256245 222713 9826 33455 186290 320337
1708 320337 249197 81643 313035 192264 198401 197894 79996 338686 120486 -171449 -49712
1697 -49712 189225 265232 151705 192937 335664 193622 186040 156025 -77703 45546 124994
1686 124994 35944 69295 83602 108233 25227 -52009 72291 129449 57501 88568 48727
1675 48727 253437 346523 322107 49953 337738 318165 192429 22248 -221910 27320
1665 27320 115223 96887 -67127 -77263 -112323 -102292 68188 -27097 23951 17432 244042
1654 244042 122478 24773 183242 260827 313436 286590 252074 114324 -41428 -5379 -85884
1643h5884J06903K78176j94213M1855j08948J08887q2067R237J18051l5653K62879
1632D19223j17237k08133k9465J96037j17222j3875J19181k59835J2781j67381
1622a65926K46813j14095r2512Q3878N1394o4425J35685j3710M6481j24655N6237
1611D5165P9820J44959J95330l31104m3668k33220K447J89844P2347k58081K6366
1600a09795J06140K4512j23424J37873m0546J19689J17326n4421j17265q6645
1590b6556o8133J04489K35682k39441J4429r0944k081L167R7398q9620j1415O5549
1578g476K51437r1653j07949m4426J50484k09340m7380r874K13631J14700j17781
1567I4373Q952Q0333m7057j38577j7276k18276J71764J85167k73197P9385L5127
$$ plain form
1643 -85884 21019 299195 104982 146837 37889 146776 64709 73946 191997 156344 419223
1632 419223 301986 93853 64388 260425 143203 129328 248509 -11326 1455 -165926
1622 -165926 80887 -33208 -125720 -41842 9552 -54873 80812 67102 113583 -11072 45165
1611 45165 124985 269944 465274 134170 90502 -142718 -140271 49573 121920 -136161 -109795
1600 -109795 -3655 20857 -102567 35306 -5240 114449 231775 177354 60089 -26556
1590 -26556 -94689 9800 245482 6041 20470 -70474 -72555 -69388 28010 -61610 -73025 -7476
1578 -7476 243961 152308 44359 -67 150417 -58923 -106303 -116177 97454 212154 94373
1567 94373 103325 183658 136601 -1976 -19252 -237528 -65764 119403 -153794 -74409 -39282
1556c9282j02993K02187J23866q8988j08731M8547j05179J90193P8437k11755
1546a3698k07398j25209M8100J24233L39538J74742j16851R2582j35958n3550
1536A26531P5328K21333l51271k19648J85782k46478J83338n3034k79462M2859
1526c14722K71497Q9820L8729K6834r2480K23862j23185k95396l0781p9754l2710
1515c18286K00380J06017K05089k28584J3370N1094J55564q3325j55195P9238
1505B5362j3944q9255R110m2714j4151R7386K37893R8881n0014n4090O6467Q5343
1493C56274j85346j6978J54177o8438j00660k78L1665q2244o3345M9694m109r3030
1481b2618j42274O9517K07333k08039M5884J38961J35237r7031q5826J03878n4038
$$ plain form
1556 -39282 -142275 59912 183778 94790 -13941 34606 -70573 119620 198057 -13698
1546 -13698 -221096 -346305 -298205 -173972 165566 340308 223457 316039 180081 126531
1536 126531 201859 423192 71921 -147727 38055 -208423 -25085 -78119 -357581 -314722
1526 -314722 -43225 46595 85324 112158 19678 243540 120355 -175041 -205822 -285576 -318286
1515 -318286 -117906 -11889 193200 -35384 -22014 29080 184644 101319 -53876 25362
1505 25362 11418 -77837 -68727 -111441 -125592 -28206 209687 308568 258554 204464 270931 356274
1493 356274 170928 153950 308127 239689 139029 138751 170416 88172 24827 74521 70412 -22618
1481 -22618 -164892 -95375 111958 -96081 -50197 88764 224001 126970 41144 145022 90984
1470I0984M1852k90885K24480j086K8984K34669n4267q1602q2305j85038J37829
1459F3615N992p6996m443R2120K33504m8671j56317k92806J09293M1098j11936
1448a45547j62127J53185j83360P1496J51447J55742k18321K9404K08435p0467
1438a0113J34761j28936L4928J4064J18159q4911J53609j22649K6680j57278l0609
1427e2295O3607J5093L3768J20175p7528n983j06638p3381Q3513Q6578k0936q8767
1415b2794R196q3216K18307j7423n8984P9910p6733P0860j51942L0227k3996J14787
1403H8199K0191j28786L0495J04508Q6766k7097p8102j4845j84919J12185r4135
1392h5540J62044k267o9060M8116O0858M886j02027J13328j48606J34286j69408
$$ plain form
1470 90984 132836 -158049 66431 65345 94329 328998 274731 193129 110824 -74214 63615
1459 63615 69607 -7389 -11832 80288 313792 265121 108804 -184002 -74709 -33611 -145547
1448 -145547 -307674 -154489 -337849 -266353 -114906 40836 -177485 -148081 60354 -10113
1438 -10113 124648 -4288 30640 44704 162863 77952 231561 108912 135592 -21686 -52295
1427 -52295 11312 26405 60173 180348 102820 96837 -9801 -83182 331 86909 65973 -22794
1415 -22794 -13598 -96814 121493 104070 45086 124996 48263 119123 -32819 -2592 -26588 88199
1403 88199 108390 -20396 10099 114607 201373 174276 96174 81329 -103590 8595 -85540
1392 -85540 76504 74237 5177 53293 114151 119037 17010 130338 -18268 116018 -53390
1381e3390k5278J05430M4135L2034q1781J68766k17368k0310J33281j12208J15798
1370H9109R5228M6076k08650k1512J35339J50583j01817l8611n3028O973j75081
1359g5391L00338o6875l0609j57204m0506r7657N4270j2787K14594K21091p0524
1348B38740j15617j88139r9669j7807K1476K68006J12674j81001J29742m8128
1338A20277L2567j19653j46876m2407J06070J28827M2524K25899j70916k23422
1328d7110J63528o300j09535j92808J44081j80226j37092K52859k8668K63180
1318A21909j32738K3778K69498j47922j47994O5486J18848J9269L2106k54272
1308c2032r5198J36104o7293j22827J35567J95659J089j87622L375J56694J39430
$$ plain form
1381 -53390 -78668 26762 70897 102931 21150 189916 -27452 -47762 85519 -26689 89109
1370 89109 184337 230413 21763 251 135590 286173 184356 145745 92717 99690 -75391
1359 -75391 224947 158072 127463 -29741 -70247 -167904 -113634 -126421 88173 309264 238740
1348 238740 123123 -65016 -164685 -182492 -161016 106990 219664 38663 168405 120277
1338 120277 152844 33191 -113685 -156092 -50022 78805 121329 347228 176312 -47110
1328 -47110 116418 110118 583 -192225 -48144 -228370 -365462 -112603 -141271 121909
1318 121909 -10829 12949 282447 134525 -13469 52017 170865 190134 222240 -32032
1308 -32032 -127230 8874 -58419 -181246 -45679 149980 151069 -36553 -33178 123516 262946
1297B62946k42072J11918K19439k84730r9676R994K13270j44887k47407J97685
1287c520o5050J75071r3009K67597j22651l20106J27242J24083N729k4571j15235
1276d4420l4149J34592j08302J50515n2703k42337O5938K25452m0705l55336K83712
1265a7743J4881R9545k5931P3944J30017j82589j09129n6309J463N4156J56921
1254A39226n3242J72707m1392k13307j62991O8773J33417m0096j05304M5980M6044
1243a0185j4930j3133J3910j17295p657J19287P711r007N0196P3028j89060j1109
1231a08244K57671l11506Q9310r5298m4741N1144K1509R6311Q5267j62135J2471
1220a08241J18786j61621J32247q373K5312j13551k15636J18005Q6156j04680
$$ plain form
1297 262946 20874 132792 352231 67501 -32175 -22181 191089 46202 -201205 -3520
1287 -3520 -68570 106501 13492 281089 158438 -161668 -34426 89657 95386 70815 -44420
1276 -44420 -78569 56023 -52279 98236 45533 -196804 -130866 94586 53881 -301455 -17743
1265 -17743 -2862 96683 70752 144696 274713 92124 -17005 -73314 -71851 -17695 139226
1254 139226 85984 258691 217299 3992 -158999 -90226 43191 3095 -102209 -56229 -10185
1243 -10185 -25115 -38248 -24338 -141633 -149290 -30003 -22292 -31299 18897 91925 -97135 -108244
1231 -108244 149427 -162079 -72769 -168067 -212808 -161664 -140155 -43844 41423 -120712 -108241
1220 -108241 10545 -151076 -18829 -27202 -1890 -115441 -331077 -213072 -126916 -231596
1210b31596J44313L2648J11890K26200m1087m39o2573j7900M2105j32112n4778
1199A6671j014K9456R2719J96p3210J80083k41689J31153P7096k19623j68859
1188a77021J63859j44905m5783J73137P479M5282j37785k55847J67905M5848j42091
1177b99922L56855J01666k2058J67654j8657k68016K1126L4576o161R8620p6338
1166H9345k3592J0252J62943j8576q5279p2675N8313J59086l04014r5977J6415
1155a03759J83219l867j73626P2387J30923k2196J73874j23421l35358o1893K85935
1144B2218n486J6645q2712L32622j11753N6061J690j04272j6782j21541J41423
1133A28113M2088j59099J27371j82436L8552O2465n8333O6319J57587j94468l3833
$$ plain form
1210 -231596 -87283 -54635 57255 283455 242368 241929 179356 161456 203561 71449 16671
1199 16671 15657 45113 137832 138028 64818 244901 3212 134365 211461 -8162 -177021
1188 -177021 -13162 -158067 -203850 -30713 -23234 22048 -115737 -371584 -203679 -157831 -299922
1177 -299922 56933 158599 136541 304195 285538 17522 38648 73224 67063 165683 89345
1166 89345 65753 76005 238948 220372 135093 62418 120731 279817 -24197 -120174 -103759
1155 -103759 79460 75593 -98033 -25646 105277 83081 256955 133534 -201824 -263717 22218
1144 22218 16732 33377 -49335 283287 171534 227595 229285 125013 108231 -13310 128113
1133 128113 170201 11102 138473 -43963 -5411 57054 -1279 65040 222627 28159 -5674
1122e674n0655j39110R6021j06826K07085o5567q3988o9537N9799M5850K11785
1111I9183J24864P4390k02012M3930N2847j30585j01485N5098O3125m1670l226
1100C4459o9168R4215M9017j7227k46989Q5890O8377n5959K18033j88761l72j09416
1088a37901m4952J30242J10130l6947M1012j62298L3669J12783j860j65019J49487
1077B8346j7869j81874O5838m0617j16125J84847J67262O4822n2363j2398j97441
1066a07572J43425K22914l51262k78078J08800N6595P956J70054l7473o3056M4173
1055h3524J66319j37179Q3053o6043n0644j21416j04663K91254m1403j0307j7817
1044i2370j1406o2157J31191J03494o047r9333J304m6259r260m7204J18720m4808
$$ plain form
1122 -5674 -56329 -195439 -99418 -206244 841 -64726 -148714 -218251 -158452 -112602 99183
1111 99183 224047 298437 96425 140355 193202 62617 -38868 16230 79355 37685 34459
1100 34459 -34709 59506 108523 91296 -155693 -69803 -1426 -57385 160648 -28113 -28485 -137901
1088 -137901 -182853 -52611 57519 20572 61584 -100714 -67045 45738 43878 -121141 28346
1077 28346 10477 -171397 -105559 -146176 -262301 -77454 89808 154630 102267 89869 -107572
1066 -107572 35853 258767 -92495 -370573 -261773 -205178 -197222 -27168 -64641 -127697 -83524
1055 -83524 82795 -54384 28669 -37374 -88018 -209434 -314097 -22843 -64246 -74553 -92370
1044 -92370 -103776 -165933 -34742 68752 62705 -36628 -35324 -81583 -90843 -138047 -19327 -64135
1032f4135j1170p964k8953K06878j02477j18833J00932j0442P466k03824L144
1021b29378K203L8895J03611J88245o4411n5175J28288k66044M6608J08072K84840
1010B85754k50418L9523j23774p350N30P7380k12501J72034l0386j10625J87226
999B7393r7683R1454r9783m1309n783k8871K40937j91286j44688J75123L04141
988B29645p5697j80833J18179L2980o5736m6028j7709K95093r3540j84043j04045
977i1734K48795l090k33940Q5364r4794l3305j65929L02754M4271J20725j32463
966D6654o3229n6667J92014j2292j71450o2604K8245M6097j06414L42507j30142
955E2719o5192n6831j17109N5712J00751L4457K38405J07733k00571k18815O5000
$$ plain form
1032 -64135 -75305 -83269 -112222 94656 -7821 -126654 -25722 -36164 -28698 -232522 -229378
1021 -229378 -227175 -188280 -84669 103576 39165 -16010 112278 -153766 -107158 914 285754
1010 285754 35336 74859 -48915 -56265 -55735 21645 -190856 -18822 -49208 -159833 27393
999 27393 -70290 21164 -78619 -119928 -125711 -154582 86355 -104931 -249619 -74496 229645
988 229645 153948 -26885 91294 124274 58538 12510 -5199 289894 196354 12311 -91734
977 -91734 157061 153971 -79969 5395 -89399 -122704 -288633 14121 58392 179117 46654
966 46654 -16575 -73242 118772 106480 -64970 -127574 -99329 -53232 -159646 182861 52719
955 52719 -12473 -69304 -186413 -130701 -29950 4507 242912 350645 150074 -68741 -3741
944c741k3283k0796N2039j12073k5590l4079M70986L8933k39222j69969k8107
$$ plain form
944 -3741 -27024 -47820 4219 -107854 -133444 -167523 303463 342396 103174 -66795 -94902
$$ [...]
##END NTUPLES=NMR SPECTRUM
##END=
