##TITLE=1H_EC-3260(6)
 CDCl3, 8 sc, 
 23.08.2021
##JCAMPDX= 6.0         $$ Bruker NMR JCAMP-DX V2.0
##DATA TYPE= NMR SPECTRUM
##DATA CLASS= NTUPLES
##ORIGIN= UXNMR, Bruker Analytische Messtechnik GmbH
##OWNER= root
$$ XWIN-NMR		Version 3.5
$$ Mon Aug 23 08:52:38 2021 Russian Standard Time (UT+4h)  she@DPX200
##.OBSERVE FREQUENCY= 200.131506
##.OBSERVE NUCLEUS= ^1H
##.ACQUISITION MODE= SIMULTANEOUS
##.ACQUISITION SCHEME= undefined
##.AVERAGES= 8
##.DIGITISER RES= 18
##SPECTROMETER/DATA SYSTEM= spect
##.PULSE SEQUENCE= zg30
##.SOLVENT NAME= CDCl3
##.SHIFT REFERENCE= (INTERNAL, CDCl3, 0, 17.4971)
##AUDIT TRAIL= $$ (NUMBER, WHEN, WHO, WHERE, WHAT)
$$ ##TITLE= Audit trail, XWIN-NMR		Version 3.5
$$ ##JCAMPDX= 5.01
$$ ##ORIGIN= Bruker BioSpin GmbH
$$ ##OWNER= she
$$ F:/spectra/data/she/nmr/H-F/1/pdata/1/auditp.txt
$$ ##AUDIT TRAIL=  $$ (NUMBER, WHEN, WHO, WHERE, WHAT)
(   1,<2021-08-23 08:50:06.62 +0400>,<she>,<DPX200>,
      <created by zg, POWCHK disabled, PULCHK disabled
       configuration hash MD5:
       00 E9 B6 7A A2 85 ED C7 34 08 36 98 17 FE 4E 26
       data hash MD5: 16K
       58 35 7F F9 F1 F0 EB 97 81 8F 3E 39 39 5C E1 39>)
(   2,<2021-08-23 08:50:08.96 +0400>,<she>,<DPX200>,
      <Start of raw data processing
       efp BC_mod = 2 LB = 0.24 FT_mod = 6 PKNL = 1 PHC0 = -13358.91 PHC1 = 11.80099 SI = 16K 
       data hash MD5: 16K
       3A 08 41 9B 47 04 7E 8F E8 D0 EF D5 EA 6D 5B A3>)
(   3,<2021-08-23 08:50:34.84 +0400>,<she>,<DPX200>,
      <pk PHC0 = 3.875414 PHC1 = -1.4 
       data hash MD5: 16K
       C7 44 DF DB 83 B2 05 CE CD FA F6 AC FA E9 16 7F>)
(   4,<2021-08-23 08:50:38.70 +0400>,<she>,<DPX200>,
      <abs ABSG = 5 
       data hash MD5: 16K
       31 73 F4 10 A0 49 D4 A3 EE 63 37 09 D7 EE 30 01>)
$$ ##END=
$$ 
$$ hash MD5
$$ B9 54 49 E5 20 BA AC 9F 9B DA ED 85 EB 65 B3 62
##$RELAX= 
##$RELAX= 
##$RELAX= 
##$RELAX= 
##$RELAX= 
##$RELAX= 
$$ Bruker specific parameters
$$ --------------------------
##$DU= <F:/spectra>
##$EXPNO= 1
##$NAME= <H-F>
##$PROCNO= 1
##$TYPE= <nmr>
##$USER= <she>
##$AMP= (0..31)
100 100 100 100 100 100 100 100 100 100 100 100 100 100 100 100 100 100 
100 100 100 100 100 100 100 100 100 100 100 100 100 100 
##$AQSEQ= 0
##$AQ_mod= 1
##$AUNM= <au_zg>
##$AUTOPOS= <>
##$BF1= 200.13
##$BF2= 200.13
##$BF3= 200.13
##$BF4= 200.13
##$BF5= 200.13
##$BF6= 200.13
##$BF7= 200.13
##$BF8= 200.13
##$BYTORDA= 1
##$CFDGTYP= 0
##$CFRGTYP= 5
##$CHEMSTR= <none>
##$CNST= (0..31)
1 1 145 1 1 1 1 1 1 1 1 1 1 1 1 1 1 1 1 1 1 1 1 1 1 1 1 1 1 1 1 1 
##$CPDPRG= <>
##$CPDPRG1= <>
##$CPDPRG2= <>
##$CPDPRG3= <>
##$CPDPRG4= <mlev>
##$CPDPRG5= <mlev>
##$CPDPRG6= <mlev>
##$CPDPRG7= <mlev>
##$CPDPRG8= <mlev>
##$CPDPRGB= <>
##$CPDPRGT= <>
##$D= (0..31)
0 1.2 0 0 0 0 0 0 0 0.06 0 0.03 0 0 0 0 0.0002 0 0 0 0 0 0 0 0 0 0 0 0 
0 0 0 
##$DATE= 1629694206
##$DBL= (0..7)
120 120 120 120 120 120 120 120 
##$DBP= (0..7)
150 150 150 150 150 150 150 150 
##$DBP07= 0
##$DBPNAM0= <>
##$DBPNAM1= <>
##$DBPNAM2= <>
##$DBPNAM3= <>
##$DBPNAM4= <>
$$ [...]
##$SUBNAM3= <"">
##$SUBNAM4= <"">
##$SUBNAM5= <"">
##$SUBNAM6= <"">
##$SUBNAM7= <"">
##$SUBNAM8= <"">
##$SUBNAM9= <"">
##$SW= 20.0188882624521
##$SWIBOX= (0..15)
0 0 2 0 0 0 0 0 0 0 0 0 0 0 0 0 
##$SW_h= 4006.41025641026
##$TD= 16384
##$TD0= 1
##$TE= 0
##$TE2= 300
##$TE3= 300
##$TEG= 300
##$TL= (0..7)
0 120 120 120 120 120 120 120 
##$TP= (0..7)
150 150 150 150 150 150 150 150 
##$TP07= 0
##$TPNAME0= <>
##$TPNAME1= <>
##$TPNAME2= <>
##$TPNAME3= <>
##$TPNAME4= <>
##$TPNAME5= <>
##$TPNAME6= <>
##$TPNAME7= <>
##$TPOAL= (0..7)
0.5 0.5 0.5 0.5 0.5 0.5 0.5 0.5 
##$TPOFFS= (0..7)
0 0 0 0 0 0 0 0 
##$TUNHIN= 0
##$TUNHOUT= 0
##$TUNXOUT= 0
##$USERA1= <user>
##$USERA2= <user>
##$USERA3= <user>
##$USERA4= <user>
##$USERA5= <user>
##$V9= 5
##$VALIST= <valist>
##$VCLIST= <CCCCCCCCCCCCCCC>
##$VD= 0
##$VDLIST= <DDDDDDDDDDDDDDD>
##$VPLIST= <PPPPPPPPPPPPPPP>
##$VTLIST= <TTTTTTTTTTTTTTT>
##$WBST= 1024
##$WBSW= 4
##$XGAIN= (0..3)
0 0 0 0 
##$XL= 0
##$YL= 0
##$YMAX_a= 133349
##$YMIN_a= -173577
##$ZGOPTNS= <>
##$ZL1= 120
##$ZL2= 120
##$ZL3= 120
##$ZL4= 120
##$ABSF1= 17.49711
##$ABSF2= -2.521927
##$ABSG= 5
##$ABSL= 3
##$ALPHA= 0
##$AQORDER= 0
##$ASSFAC= 0
##$ASSFACI= 0
##$ASSFACX= 0
##$ASSWID= 0
##$AUNMP= <proc_1d>
##$AZFE= 0.1
##$AZFW= 0.1
##$BCFW= 0
##$BC_mod= 2
##$BYTORDP= 0
##$COROFFS= 0
##$CY= -3
##$DATMOD= 1
##$DC= 0
##$DFILT= <>
##$DTYPP= 0
##$F1P= 0
##$F2P= 0
##$FCOR= 1
##$FTSIZE= 16384
##$FT_mod= 6
##$GAMMA= 0
##$GB= 0
##$INTBC= 1
##$INTSCL= 1.334414e-10
##$ISEN= 128
##$LB= 0.24
##$LEV0= 0
##$LPBIN= 0
##$MAXI= 10000
##$MC2= 0
##$MEAN= 0
##$ME_mod= 0
##$MI= 1.114404
##$NCOEF= 0
##$NC_proc= -8
##$NLEV= 6
##$NOISF1= 3.799351
##$NOISF2= 2.8
##$NSP= 0
##$NTH_PI= 0
##$NZP= 0
##$OFFSET= 17.49711
##$PC= 1
##$PHC0= -13355.04
##$PHC1= 10.40099
##$PH_mod= 1
##$PKNL= yes
##$PPARMOD= 0
##$PSCAL= 0
##$PSIGN= 0
##$REVERSE= no
##$SF= 200.130007508526
##$SI= 16384
##$SIGF1= 3
##$SIGF2= 2
##$SINO= 5.538805
##$SIOLD= 16384
##$SREGLST= <1H.CDCl3>
##$SSB= 0
##$STSI= 16384
##$STSR= 0
##$SW_p= 4006.41025641026
##$SYMM= 0
##$S_DEV= 0
##$TDeff= 16384
##$TDoff= 0
##$TI= <>
##$TILT= no
##$TM1= 0
##$TM2= 0
##$TOPLEV= 0
##$USERP1= <user>
##$USERP2= <user>
##$USERP3= <user>
##$USERP4= <user>
##$USERP5= <user>
##$WDW= 1
##$XDIM= 16384
##$YMAX_p= 368430533
##$YMIN_p= -1405360
$$ End of Bruker specific parameters
$$ ---------------------------------
##NTUPLES= NMR SPECTRUM
##VAR_NAME=  FREQUENCY,     SPECTRUM/REAL,   SPECTRUM/IMAG
##SYMBOL=    X,             R,               I
##VAR_TYPE=  INDEPENDENT,   DEPENDENT,       DEPENDENT
##VAR_FORM=  AFFN,          ASDF,            ASDF
##VAR_DIM=   16384,         16384,           16384
##UNITS=     HZ,            ARBITRARY UNITS, ARBITRARY UNITS
##FACTOR=    0.24454680195387, 1,            1
##FIRST=     3501.69682908945, 0,            0
##LAST=      -504.713427320807, 0,           0
##MIN=       -504.713427320807, -1405360,    0
##MAX=       3501.69682908945, 368430533,    0
$$ Real data points
##PAGE= N=1
##DATA TABLE= (X++(R..R)), XYDATA
$$ [...]
4909A4114913N11357L350j77800N11462O30832J27488J06858r884J053806L54632
$$ 14114913 14626270 14629620 14451820 14963282 15594114 15721602 15828460 15818576 16872382 17227014
4899A7227014L2121P0242J51356J083872K13017M12532M68923J470564N58417
$$ 17227014 17259135 17329377 17480733 18564605 18777622 19190154 19659077 21129641 21688058
4890B1688058J18070M49299j089080k27025o04476o67410J8251N75366K82561
$$ 21688058 21806128 22255427 21166347 20939322 20334846 19667436 19685687 20261053 20543614
4881B0543614L69963P4433M1152L79022l32238M86013r5607L95614K85761K42044
$$ 20543614 20913577 20988010 21029162 21408184 21075946 21561959 21466352 21861966 22147727 22389771
4871B2389771j97879m00151r547j85427J07934N7739n64894K27737L73220m86099
$$ 22389771 22191892 21791741 21782194 21596767 21704701 21762440 21197546 21425283 21798503 21312404
4861B1312404L26565L07312j77482j50347J80621J13313J08933K05691J12468
$$ 21312404 21638969 21946281 21768799 21618452 21799073 21912386 22021319 22227010 22339478
4852B2339478O76990j0538O8986L99700n67752l26891o43868q27204l64454j11709
$$ 22339478 23016468 23005930 23074916 23474616 22906864 22579973 21936105 21108901 20744447 20632738
4842B0632738L0580l29613o33744k63063M75682K3109p7140j22565J84351j37717
$$ 20632738 20663318 20333705 19699961 19436898 19912580 19935689 19858549 19735984 19920335 19782618
4832A9782618m05188l14161k83429L87473m1922k00670j69598k07645Q2636k73266
$$ 19782618 19377430 19063269 18779840 19167313 19125391 18924721 18755123 18547478 18630114 18356848
4822A8356848k15281j53071k19601m02470k55663l18320J29626k72104L86546
$$ 18356848 18141567 17988496 17768895 17366425 17110762 16792442 16922068 16649964 17036510
4813A7036510J23031l01748j95907K08523K5597m52872l11065m13358k58453p4448
$$ 17036510 17159541 16857793 16661886 16870409 16896006 16443134 16132069 15718711 15460258 15385810
4803A5385810j31541R3774k60150k86421l87544l60936l6071q56389K48439j04864
$$ 15385810 15254269 15348043 15087893 14801472 14413928 14052992 14016921 13160532 13408971 13304107
4793A3304107L21174k53469l76114L41449K23282o99428P9406j84462J37074N13681
$$ 13304107 13625281 13371812 12995698 13337147 13560429 12861001 12940407 12755945 12893019 13406700
4783A3406700M8026L19521m15947j52397r4274J98330N1033m94107m86464l71358
$$ 13406700 13454726 13774247 13358300 13205903 13111629 13309959 13360992 12866885 12380421 12009063
4773A2009063J52345l11575l37679j6014l9811m27048l1470j37319J70511n2649
$$ 12009063 12161408 11849833 11512154 11496140 11456329 11029281 10997811 10860492 11031003 10978354
4763A0978354q32654L46845j84744N8487n1781K02420k23810l36839j87052M01904
$$ 10978354 10145700 10492545 10307801 10366288 10314507 10516927 10293117 9956278 9769226 10171130
4753A0171130K55325m72842M79653l15406k45270o96154m6509n1835J16828j60371
$$ 10171130 10426455 9953613 10433266 10117860 9872590 9176436 9129927 9078092 9194920 9034549
4743I034549n8336l11911l89131n6570m40284j20443K63247j046158R3152m6568
$$ 9034549 8976213 8664302 8275171 8218601 7778317 7657874 7921121 6874963 6968115 6921547
4733F921547M35439l02814o43479K00312K26218P3537n54794M2386M8393m05473
$$ 6921547 7356986 7054172 6410693 6611005 6837223 6910760 6355966 6398352 6446745 6041272
4723F041272l73411L78657m19150L1488O47179j30766l34674Q9747R9111k83620
$$ 6041272 5667861 6046518 5627368 5658856 6306035 6175269 5840595 5930342 6029453 5745833
4713E745833L07542J5282l86195Q75644j01280k53787L3144J28917l070n32259
$$ 5745833 6053375 6068657 5682462 6558106 6456826 6203039 6236183 6365100 6362030 5829771
4703E829771K45502K38099j65304k2398o11304k02545j825O7612K02034j09565
$$ 5829771 6075273 6313372 6148068 6125670 5514366 5311821 5309996 5377608 5579642 5470077
4693E470077L1714Q1986J41604l35488L58934n23602l03421k40618j40615N49089
$$ 5470077 5501791 5583777 5725381 5389893 5748827 5225225 4921804 4681186 4540571 5089660
4683E089660J6710j30508q072K7347q22544L38658k80317J71152n9757n02859
$$ 5089660 5106370 4975862 4967790 4995137 4172593 4511251 4230934 4402086 4342329 3839470
4673C839470n84P5442n22968J37107j18389k3959K16939k19487N3076q4718m61798
$$ 3839470 3838886 3914328 3391360 3528467 3410078 3386119 3603058 3383571 3436647 3351929 2890131
4662B890131q7801L20445j69955K91608l04802K32236m56150L3096J69058J76928
$$ 2890131 2802330 3122775 2952820 3244428 2939626 3171862 2715712 2748808 2917866 3094794
4652C094794K85547l54273j68711n502O04069l78414P3824q85691O1057J37630
$$ 3094794 3380341 3026068 2857357 2851855 3455924 3077510 3151334 2265643 2326700 2464330
4642B464330k39574l10670R81790j16432j04777j50673J17314m02845P9216N74896
$$ 2464330 2224756 1914086 2895876 2779444 2674667 2523994 2641308 2238463 2317679 2892575
4632B892575j1304l98499o1837j79871R1561L34660J79420m45178L66810l5973
$$ 2892575 2881271 2482772 2420935 2241064 2332625 2667285 2846705 2401527 2768337 2732364
4622B732364l7483K03506O224L06150r4872q4771q14797l28554l0527J280044
$$ 2732364 2694881 2898387 2904611 3210761 3115889 3031118 2216321 1887767 1857240 3137284
4612C137284j75012q6500m41049K36234k22767L69090J32245n46490j05917M89424
$$ 3137284 2962272 2875772 2434723 2670957 2448190 2817280 2949525 2403035 2297118 2786542
4602B786542K85282l03362J31735j74333P4042l686o4571L82810j63302j18437
$$ 2786542 3071824 2768462 2900197 2725864 2799906 2796220 2731649 3114459 2951157 2832720
4592B832720Q9458Q35160o06227M9007M16985n3747M31372j98297l98242j37536
$$ 2832720 2922178 3757338 3151111 3200118 3617103 3563356 3994728 3796431 3398189 3260653
4582C260653M94708K88226n1008M18257K87n3210K25752N82526n70271q5168K54078
$$ 3260653 3755361 4043587 3992579 4410836 4411123 4357913 4583665 5166191 4595920 4510752 4764830
4571D764830L87300L6469m38620L86817J98716J6392K06985K04553j40387K1577
$$ 4764830 5152130 5188599 4749979 5136796 5335512 5351904 5558889 5763442 5623055 5644632
4561E644632P8610K70263L55779k56859k8637L20775m1169J19128M5003K5634
$$ 5644632 5723242 5993505 6349284 6092425 6063788 6384563 6343394 6462522 6507525 6533159
4551F533159O0308J90115M1460O59056M91838j42893J9364K17331N3867L20013
$$ 6533159 6593467 6783582 6825042 7484098 7975936 7833043 7852407 8069738 8123605 8443618
4541H443618O62762j95121M12029K96039J76422O5280M52764P14177O21938K01653
$$ 8443618 9106380 8911259 9323288 9619327 9795749 9861029 10313793 11027970 11649908 11851561
4531A1851561L05592N48842N16229J123936N31661L17234R95595Q76675N83736
$$ 11851561 12157153 12705995 13222224 14346160 14877821 15195055 16190650 17067325 17651061
4522A7651061J189566J318380J005747J124346J078479J947064J913699K314377
$$ 17651061 18840627 20159007 21164754 22289100 23367579 25314643 27228342 29542719
4514B9542719K474708K255051L076362L117904K471999K957564K998186L378021
$$ 29542719 32017427 34272478 37348840 40466744 42938743 45896307 48894493 52272514
4506E2272514L381666L022955K918986K046475K235098L708377N277635P369801
$$ 52272514 55654180 58677135 61596121 63642596 65877694 69586071 74863706 82233507
4498H2233507R980671J0669806N566161m985586j1659838j2068990q472619n481714
$$ 82233507 92214178 102883984 108450145 103464559 91804721 79735731 71263112 65781398
4490F5781398l629883j999718r65909j13292K106725K615763M229983M843750
$$ 65781398 62151515 60151797 59185888 59072596 61179321 63795084 68025067 72868817
4482G2868817L322599J746457J638638J615246l28326k749950m346505m979492
$$ 72868817 76191416 77937873 79576511 81191757 80863431 78113481 73766976 68787484
4474F8787484m549189l922965l833008m632181m456882m587872l750168m010297
$$ 68787484 64238295 60315330 56482322 51850141 47393259 42805387 39055219 35044922
4466C5044922l989967l246440k412259j536477j886839j673081j490807j270842
$$ 35044922 31054955 27808515 25396256 23859779 21972940 20299859 18809052 17538210
4458A7538210n60149q57585r27234p37960o33332q48552k70320o68160l30508
$$ 17538210 16978061 16120476 15193242 14455282 13821950 12973398 12703078 12034918 11704410
4449A1704410m65794J40005j8281l63200m78712m15063j15446j2092m34054r75693
$$ 11704410 11238616 11378621 11360340 10997140 10518428 10103365 9987919 9975827 9541773 8566080
4439H566080M72563o7966j57388o7448j13028q7003j2274k89682J5633j0147q2176
$$ 8566080 9038643 8970677 8813289 8745841 8632813 8545810 8533536 8243854 8259487 8249340 8167164
4428H167164m67037k32341j80834l88590r58535l77909J64815j52929k27811K63967
$$ 8167164 7700127 7467786 7286952 6898362 5939827 5561918 5726733 5573804 5345993 5609960
4418E609960j7578j97625k90569k82081j00314k72646J35431k35108M1813j04307
$$ 5609960 5592382 5394757 5104188 4822107 4721793 4449147 4584578 4349470 4391283 4286976
4408D286976j13103l42573P91356l37447j98705k2390k96752j84178j25649J40831
$$ 4286976 4173873 3831300 4622656 4285209 4086504 4064114 3767362 3583184 3457535 3598366
4398C598366k55316N77925k46651l81415m13425K63150j86148o2528j40417p8759
$$ 3598366 3343050 3920975 3674324 3292909 2879484 3142634 2956486 2893958 2753541 2674782
4388B674782J83908M29177o29961k13224j72294J076497n16347m21696j7176L32198
$$ 2674782 2858690 3287867 2657906 2444682 2272388 3348885 2832538 2410842 2393666 2725864
4378B725864L65767l58146l91289k64355L09862k47512K59457j24773M12325L27888
$$ 2725864 3091631 2733485 2342196 2077841 2387703 2140191 2399648 2274875 2687200 3015088
4368C015088N2935m74915k52432K2629R5060r2648p0945J9430J98007J68225M07455
$$ 3015088 3068023 2593108 2340676 2363305 2458365 2365717 2294772 2314202 2512209 2680434 3087889
4357C087889o4664R7360j52321k44723J96976R2557J12735q114l95227q54920
$$ 3087889 3023225 3120585 2968264 2723541 2920517 3013074 3125809 3117695 2722468 1867548
4347A867548P46276J39127O5523j84075J78034m51332L70151J85280j77365k21573
$$ 1867548 2613824 2752951 2818474 2634399 2812433 2361101 2731252 2916532 2739167 2517594
4337B517594j85023Q9873l94911L50134J78953N17905r71760L09471j32522q9297
$$ 2517594 2332571 2422444 2027533 2377667 2556620 3074525 2102765 2412236 2279714 2190417
4327B190417M82842k5906M18495o04701m79643N15162l53456L65372k42967O8698
$$ 2190417 2673259 2647353 3065848 2461147 1981504 2496666 2143210 2508582 2265615 2334313
4317B334313j37192N2862r2108K00184L0469p47766M98061K61715P3122p49240
$$ 2334313 2197121 2249983 2157875 2358059 2388528 1640762 2138823 2400538 2473660 1724420
4307A724420J05998J03774R19214m9082j19035j70271K67987k30753m16508M15766
$$ 1724420 1830418 1934192 2853406 2804324 2685289 2515018 2783005 2552252 2135744 2551510
4297B551510K1483k58742k84952P31328j95316M12105k07936J59903r8158l66607
$$ 2551510 2572993 2314251 2029299 2760627 2565311 2977416 2769480 2929383 2831225 2464618
4287B464618m7975l67438l56400N02734k12769L98065j28994L53773l99361K0235
$$ 2464618 2416643 2049205 1692805 2195539 1982770 2380835 2251841 2605614 2206253 2226488
4277B226488l3895q9381k77131K38816O39756p8556K99343o37005L65926j94950
$$ 2226488 2192593 2103212 1826081 2064897 2704653 2626097 2925440 2288435 2654361 2459411
4267B459411L73986l90924J88801M41564o2511k40564O97079n36763M5139J27880
$$ 2459411 2833397 2442473 2631274 3072838 3010327 2769763 3466842 2930079 2975218 3103098
4257C103098N59294j98422p1794q421l8966j20279K47498l87791l15987J84367
$$ 3103098 3662392 3463970 3392176 3383755 3344789 3224510 3472008 3084217 2768230 2952597
4247B952597K42054k67728K68325M38275n33480k03456j84714M55113l79793L74226
$$ 2952597 3194651 2926923 3195248 3633523 3100043 2896587 2711873 3166986 2787193 3161419
4237C161419K82795K07120m65106N59224k68801K03625m20514p8410M59214L79099
$$ 3161419 3444214 3651334 3186228 3745452 3476651 3680276 3259762 3181352 3640566 4019665
4227D019665l53308k08538R7132N72133j74921K12012m7931L78719L26529q78198
$$ 4019665 3666357 3457819 3554951 4127084 3952163 4164175 4116244 4494963 4821492 3943294
4217C943294P36360n34772J57108K3359k49350M00290N58115n17012q29183M03801
$$ 3943294 4679654 4144882 4301990 4325349 4075999 4476289 5034404 4517392 3688209 4092010
4207D092010O58765j66473J29990K69010m9492O86938o6068M1464l54900J05839
$$ 4092010 4750775 4584302 4714292 4983302 4933810 5620748 5554680 5596144 5241244 5347083
4197E347083M92199N85148M2222k91051l76050M03223P97363J36374l45998M11459
$$ 5347083 5839282 6424430 6466652 6175601 5799551 6202774 7000137 7136511 6790513 7201972
4187G201972k92939j8871J58429m82294l92092m246P7050P1352K53567J25395
$$ 7201972 6909033 6890162 7048591 6566297 6174205 6169959 6247009 6318361 6571928 6697323
4177F697323r6539n86019P30235k20806L32472m21134L69620l4867q4577k07629
$$ 6697323 6600784 6014765 6745000 6524194 6856666 6435532 6805152 6770285 6685708 6478079
4167F478079Q14808j24510M7330M18621k28205J91320J1108q0482J782K22890
$$ 6478079 7292887 7168377 7215707 7634328 7406123 7597443 7608551 7528069 7529851 7752741
4157G752741n99990k75946M1572L4087j89003L87953n65674M39536n40467L82688
$$ 7752741 7152751 6876805 6918377 6952464 6763461 7151414 6585740 7025276 6484809 6867497
4147F867497j22844o90961N69900K3575m05488k97611L33801J98343l63948N61449
$$ 6867497 6744653 6053692 6623592 6647167 6241679 5944068 6277869 6476212 6112264 6673713
4137F673713m25483j97678M97983k03776K01077k6860j28246j52478K74678n61169
$$ 6673713 6248230 6050552 6548535 6344759 6545836 6518976 6390730 6238252 6512930 5951761
4127E951761J73968p7407J57139K04885k6632l22948K4540k71521J96823k52722
$$ 5951761 6125729 6048322 6205461 6410346 6383714 6060766 6085306 5813785 6010608 5757886
4117E757886k20585L75858N77235p75936K63221j49443n6532N65759k5668J03146
$$ 5757886 5537301 5913159 6490394 5714458 5977679 5828236 5771704 6337463 6311795 6414941
4107F414941q28260r7432l7238N5341J01408k48216L52596K88523L60289k67087
$$ 6414941 5586681 5489249 5452011 5507352 5608760 5360544 5713140 6001663 6361952 6094865
4097F094865R7687O96232j91743m58106J9920J52013m08956K50168R34765n14972
$$ 6094865 6192552 6888784 6697041 6238935 6258855 6410868 6001912 6252080 7186845 6671873
4087F671873K10444K64635k29453j35971K50782R0918n1756R890r556M87379p79395
$$ 6671873 6882317 7146952 6917499 6781528 7032310 7123228 7071472 7081362 7071806 7559185 6779790
4076F779790M76954M66495J02125J29066L4326j86608Q26867l64244J0747j70686
$$ 6779790 7256744 7723239 7825364 7954430 7988756 7802148 8629015 8264771 8275518 8104832
4066H104832K52054K24280P57001J33908j00004M44687K57186M94023N61678M50044
$$ 8104832 8356886 8581166 9338167 9472075 9372071 9816758 10073944 10567967 11129645 11579689
4056A1579689k16577M58273K30803L58512J63525R44323M73164k54311M56944
$$ 11579689 11363112 11821385 12052188 12410700 12574225 13518548 13991712 13737401 14194345
4047A4194345O8258O06853P24894q6811Q07851O88129K83090N8391P58375l14885
$$ 14194345 14262603 14869456 15594350 15507539 16315390 17003519 17286609 17345000 18103375 17788490
4037A7788490O03493L57063m91921M77777J02796M1301J41130O51887o1550P30728
$$ 17788490 18391983 18749046 18257125 18734902 18837698 18878999 19020129 19672016 19610466 20341194
4027B0341194k31193L14656P72803N37300N16721N50835P02049L20309M18692
$$ 20341194 20110001 20424657 21197460 21734760 22251481 22802316 23504365 23824674 24243366
4018B4243366P11459K68132P24031K05656M2507l5883m9671N87896O08165j1049
$$ 24243366 24954825 25222957 25946988 26152644 26195151 26159268 26109597 26697493 27305658 27294609
4008B7294609J41246r0849l27755R3621J60949J53768j11902M25794J32907j04378
$$ 27294609 27435855 27345006 27017251 27110872 27271821 27425589 27313687 27739481 27872388 27768010
3998B7768010K69280J77527J74031N78877O84349r0117N3088K15887N19800K67330
$$ 27768010 28037290 28214817 28388848 28967725 29652074 29561957 29615045 29830932 30350732 30618062
3988C0618062P1294N08201O79107K40300K53388N32145J17293L36901Q99962P1055
$$ 30618062 30689356 31197557 31876664 32116964 32370352 32902497 33019790 33356691 34256653 34327708
3978C4327708N14988J50531l01813N8670J47375L19180j02618J49989P2735M97943
$$ 34327708 34842696 34993227 34691414 34750084 34897459 35216639 35114021 35264010 35336745 35834688
3968C5834688K75984K62022J84745J92464Q59095k47369L59489J484038K48339
$$ 35834688 36110672 36372694 36557439 36749903 37608998 37361629 37721118 39205156 39453495
3959C9453495R94631P94277R51346M11536O29577R73574J019339R94422J652331
$$ 39453495 40448126 41242403 42193749 42605285 43234862 44208436 45227775 46222197 47874528
3950D7874528J090951J001623J172663Q17114J310909K045128J674122J354389
$$ 47874528 48965479 49967102 51139765 51956879 53267788 55312916 56987038 58341427
3942E8341427K051593K034213K390386K689733L373443M258879M074924M756361
$$ 58341427 60393020 62427233 64817619 67507352 70880795 75139674 79214598 83970959
3934H3970959N739933O975745Q275930Q639064J0168617J0892826J3084040J4141607
$$ 83970959 89710892 96686637 104962567 113601631 123770248 134663074 147747114 161888721
3926A61888721J3164556J0371208O187833J644352l297967m062449l880189l107253
$$ 161888721 175053277 185424485 191612318 193256670 189958703 185896254 182016065 178908812
3918A78908812j809258m32756j65889L23051k14678j149204j849752q92982j684393
$$ 178908812 177099554 176666798 176500909 176823960 176609282 175460078 173610326 172717344 171032951
3909A71032951l754872p857620j1232860j3085080j2697682j1176275q791191
$$ 171032951 167278079 159420459 148187599 135102519 122404837 111228562 102437371
3902A02437371o870289n894159l937784k625110k408184j411109j376354n88937
$$ 102437371 95567082 89672923 85735139 83110029 80701845 79290736 77914382 77325445
3894G7325445k98751K84361J379418J822261K577574K579124M076824M425392
$$ 77325445 77026694 77311055 78690473 80512734 83090308 85669432 89746256 94171648
3886I4171648N647967M984334L365071O52659j163321k189457k987150l746668
$$ 94171648 99819615 104803949 108169020 108821679 107658358 105468901 102481751 98735083
3878I8735083n026448n046082m269931l993473l464585l093827j759385k260129
$$ 98735083 93708635 88662553 84392622 80399149 76934564 73840737 72081352 69821223
3870F9821223k178904j007788j546317j102851j296078o34602j264621o64780
$$ 69821223 67642319 66634531 65088214 63985363 62689285 62054683 60790062 60125282
3862F0125282n32658j070245p37393n34201k47892r64160j050360l70070p61666
$$ 60125282 59592624 58522379 57784986 57250785 57002893 56038733 54988373 54618303 53856637
3853E3856637j53953L54204J14969Q9752r38962j513828j893978j774132j422005
$$ 53856637 53702684 54056888 54171857 54261609 53322647 51808819 49914841 48140709 46718704
3844D6718704r14373j417652o01610r66325o84634j07183m21253l38377m88871
$$ 46718704 45804331 44386679 43785069 42818744 42134110 42026927 41605674 41267297 40778426
3835D0778426o9577n60338p14588R75255K3012J34127q6285N86400J230601N16394
$$ 40778426 40708849 40148511 39433923 40409178 40432190 40566317 40480032 41066432 42297033 42813427
3825D2813427P6993o97038k34743n38638P70L67558k24405j00333r8289N99233
$$ 42813427 42890420 42193382 41958639 41420001 41420771 41788329 41563924 41463591 41365302 41964535
3815D1964535J51601J3690k76022p99187o61149p72447m22107m58383j334812
$$ 41964535 42116136 42129826 41853804 41054617 40393468 39621021 39198914 38740531 37405719
3806C7405719q0443l25908l92133j97081N20470n20188K02970m14067M39522P89978
$$ 37405719 37325276 36999368 36607235 36410154 36930624 36410436 36613406 36199339 36638861 37428839
3796C7428839Q63174Q89521n25301K39713J04573M40933P65047K64233J063224
$$ 37428839 38292013 39181534 38656233 38895946 39000519 39441452 40206499 40470732 41533956
3787D1533956J272327J764735J589828J157083L46042j663541j885851k460078
$$ 41533956 42806283 44571018 46160846 47317929 47663971 46000430 44114579 41654501
3779D1654501k261585k450738j229448p03676n65713P95466l62753l46099K17419
$$ 41654501 39392916 36942178 35712730 35009054 34443341 35238807 34876054 34529955 34747374
3770C4747374K82002O54704M96840M00392j19789m96125o9646k68144m31573J63755
$$ 34747374 35029376 35684080 36180920 36581312 36461523 35965398 35895752 35627608 35196035 35359790
3760C5359790j63451n58696O23648O61997l83531J64567M36571J345152Q73099
$$ 35359790 35196339 34637643 35261291 35923288 35539757 35704324 36140895 37486047 38359146
3751C8359146J475325J293843J287141J688317J749063J887943J784164J626471
$$ 38359146 39834471 41128314 42415455 44103772 45852835 47740778 49524942 51151413
3743E1151413O74036j271584k538369k429875j668326j204731j092372j610368
$$ 51151413 51825449 50553865 48015496 45585621 43917295 42712564 41620192 40009824
3735D0009824n53010o02602m03356q7887k57112k39579k31763o29776J15508o95158
$$ 40009824 39456814 38854212 38450856 38362969 38105857 37866278 37634515 37004739 37120247 36425089
3725C6425089j327153q91565o24137q68918p41273m95434o62022j78665k06683
$$ 36425089 35097936 34206371 33582234 32713316 31972043 31476609 30814587 30635922 30429239
3716C0429239m28471m02453J91173J4853r59339M09950M96210l12500q73873K26869
$$ 30429239 30000768 29598315 29789488 29804341 28845002 29254952 29751162 29438662 28564789 28791658
3706B8791658l73194p0821L92653P63511q4626K69353j97536l5005n86640Q231
$$ 28791658 28418464 28347643 28740296 29503807 29419181 29688534 29490998 29455993 28869353 28877584
3696B8877584j18959L7355O98405P7988L45316N96931J86156n44653j471758j010938
$$ 28877584 28758625 28795980 29494385 29572373 29917689 30514620 30700776 30156123 28684365 27673427
3686B7673427j129613j097224p30996M7948K57K7650q78353m52298k26423p3180
$$ 27673427 26543814 25446590 24715594 24763542 24763799 24791449 23913096 23460798 23234375 23161195
3676B3161195j51378o60923m64352o56769q0332n45166j89603m95045Q20197n45517
$$ 23161195 23009817 22348894 21884542 21227773 21147441 20602275 20412672 19917627 20737824 20192307
3666B0192307l14484q16441o19270K30892n36075j00114o37333n36502N22352
$$ 20192307 19877823 19061382 18442112 18673004 18136929 18036815 17399482 16862980 17385332
3657A7385332p68399J8898j88110l5352P8797k71764q309K30285p9058M63674
$$ 17385332 16616933 16635831 16447721 16412369 16491166 16219402 16211093 16441378 16362320 16825994
3647A6825994j46575N57526P0273L56532J75348l80081M7858J97174p740L68867
$$ 16825994 16679419 17236945 17307218 17663750 17839098 17459017 17506875 17704049 17696309 18065176
3637A8065176M0458L6928N1745K92556n98563o6487j1069M50581q33284P45074
$$ 18065176 18105634 18142562 18194307 18486863 17888300 17821813 17810744 18261325 17428041 18173115
3627A8173115P61147K30K81651P52619L59421M96380N27667J99156O48583n717
$$ 18173115 18934262 18934492 19216143 19968762 20328183 20824563 21352230 21551386 22199969 22194252
3617B2194252O99675Q72611N09570L75129j53268O1341P69259J79485O17000m38955
$$ 22194252 22893927 23766538 24276108 24651237 24497969 24559310 25328569 25508054 26125054 25686099
3607B5686099j65220O81712M1307J81922K177P90277O76411J18324N89580O02680
$$ 25686099 25520879 26202591 26243898 26425820 26427997 27218274 27894685 28013009 28602589 29205269
3597B9205269N82660M60534P18785P63843O84462M70209Q10888R58718n2908Q41629
$$ 29205269 29787929 30248463 30967248 31731091 32415553 32885762 33696650 34655368 34602460 35444089
3587C5444089J306557P74967K19683R71020O61772N08051J76788L08544N79735
$$ 35444089 36750646 37525613 37745296 38716316 39378088 39886139 40062927 40371471 40951206
3578D0951206M0413L79012M01100P0257P28251K31193r4827L99464j80861M05113
$$ 40951206 40991619 41370631 41771731 41841988 42570239 42801432 42706605 43106069 42925208 43330321
3568D3330321j94967K79742Q91008P3450j00247M66049L99503R29971O48763Q87618
$$ 43330321 43135354 43415096 44306104 44379554 44279307 44745356 45144859 46074830 46723593 47611211
3558D7611211P7491N43407Q38642J59637K06174O31288O22330N19754K75941P41961
$$ 47611211 47688702 48232109 49070751 49230388 49436562 50067850 50690180 51209934 51485875 52227836
3548E2227836k43082k56838m12455J50605N2994k30512q9673j2945k16635M79939
$$ 52227836 51984754 51727916 51315461 51466066 51519060 51288548 51198875 51185930 50969295 51449234
3538E1449234k48005N2037J52084K61085j67855p8155J76639M19277k53659N00710
$$ 51449234 51201229 51253266 51405350 51666435 51498580 51420425 51597064 52016341 51762682 52263392
3528E2263392J080402J60730J91045J019682N4142P01239J87281n913K34469J31762
$$ 52263392 53343794 53504524 53695569 54715251 54769393 55470632 55657913 55652000 55886469 56018231
3518E6018231N70422L43703J256750P78472N80066J049374R54977L95572N74258
$$ 56018231 56588653 56932356 58189106 58967578 59547644 60597018 61551995 61947567 62521825
3509F2521825J11093Q05619P87926J418431J341708J214915K014945K199804K532160
$$ 62521825 62632918 63438537 64226463 65644894 66986602 68201517 70216462 72416266 74948426
3500G4948426J987753J968928J318243N05068l09262r19534n26692k028171j910729
$$ 74948426 76936179 78905107 80223350 80728418 80419156 79499622 78972930 76944759 75034030
3491G5034030j911834k545436k146655k156007j832322k039461j559958j345384
$$ 75034030 73122196 70576760 68430105 66274098 64441776 62402315 60842357 59496973
3483E9496973j272795j588894q68882j499313o59617k96538n63713p44709j044667
$$ 59496973 58224178 56635284 55766402 54267089 53607472 53310934 52747221 52002512 50957845
3474E0957845p824O03724M8157J86514L54645o76297R9041J67660K61472J7806
$$ 50957845 50950021 51553745 51601902 51788416 52143061 51466764 51565805 51733465 51994937 52012743
3464E2012743k03724j27719m97025l42310L20156o12682l39780m24545K20377
$$ 52012743 51809019 51681300 51184275 50841965 51162121 50549439 50209659 49785114 50005491
3455E0005491L48263o85389L94673P36318l2172l01320O45437M07467L75378Q01164
$$ 50005491 50353754 49668365 50063038 50799356 50767184 50465864 51111301 51518768 51894146 52695310
3445E2695310M60137P57673K4172M02001J31754L09127M30929R44015N753N21271
$$ 52695310 53155447 53913120 53937292 54339293 54471047 54780174 55211103 56155118 56160871 56682142
3435E6682142L55650K25480L01691j83411J61935O21620j23572M19509O18321
$$ 56682142 57037792 57263272 57564963 57381552 57543487 58165107 58041535 58461044 59079365
3426E9079365O30860J15204j43959N34252L04538J46421J269500N54752p05984
$$ 59079365 59710225 59825429 59681470 60215722 60520260 60666681 61936181 62490933 61784949
3417F1784949K64035J005607Q98078J40353L50271Q17399L34667J76990N53400
$$ 61784949 62048984 63054591 63952669 64093022 64443293 65260692 65595359 65772349 66325749
3408F6325749Q66076N08972L91594M13735j34736k7610M7588j17179j51092K7498
$$ 66325749 67191825 67700797 68092391 68506126 68371390 68343780 68391368 68274189 68123097 68150595
3398F8150595L65420P7767K26468M66375N24345M28115K29793M53756P7398O45311
$$ 68150595 68516015 68593782 68820250 69286625 69810970 70239085 70468878 70922634 71000032 71645343
3388G1645343P72822J39470K94881n71898K91218N04237O36007K62696L95874
$$ 71645343 72418165 72557635 72852516 72280618 72571836 73076073 73712080 73974776 74370650
3379G4370650P56402P46L3470l9906j07139n32474o0449k86041k55403K01652
$$ 74370650 75127052 75127798 75161268 75121362 75014223 74481749 74421300 74135259 73879856 74081508
3369G4081508O0303J10370K15623L09124m44603K37548j95551K38134K88689j77633
$$ 74081508 74141811 74252181 74467804 74776928 74332325 74569873 74374322 74612456 74901145 74723512
3359G4723512l90566L47216K26815M35729M2002J43774N35575o7396L16622K97222
$$ 74723512 74332946 74680162 74906977 75342706 75384708 75528482 76064057 75996661 76313283 76610505
3349G6610505k13538o72233J46831n10499j6820m43658k89564n50579l33393m35749
$$ 76610505 76396967 75724734 75871565 75361066 75344246 74900588 74611024 74060445 73727052 73291303
3339G3291303j85667k02976j9800l28209L73715l08884K92437o86060M12616k27282
$$ 73291303 73105636 72902660 72882860 72554651 72928366 72619482 72911919 72225859 72638475 72411193
3329G2411193p68450N69203l18529M31384k50142K663M6979k59905L10641j67739
$$ 72411193 71642743 72211946 71893417 72324801 72074659 72077322 72124301 71864396 72175037 72007298
3319G2007298o0729k41059n17601J01016L1745J22721K22542n39957Q5563J51530
$$ 72007298 71946569 71705510 71187909 71288925 71320670 71443391 71665933 71125976 71211539 71363069
3309G1363069m82696L61342n93306m79475K52344N82750k67437m09320k88900
$$ 71363069 70880373 71241715 70648409 70168934 70421278 71004028 70736591 70327271 70038371
3300G0038371q60245j60643M9429l89243l66511j88305p68895j22522o70095M81344
$$ 70038371 69178126 69017483 69066912 68677669 68311158 68122853 67353958 67231436 66561341 67042685
3290F7042685j86041l22096m99402m98223J90686l44367J44136k57617k84904
$$ 67042685 66856644 66534548 66035146 65536923 65727609 65383242 65527378 65269761 64984857
3281F4984857j32110m52005J23335k27663j79123j75070r21627L2115p62928m93296
$$ 64984857 64852747 64400742 64524077 64296414 64117291 63942221 63020594 63052709 62289781 61796485
3271F1796485j74322n21676o81479k79197L35733k78902m19918J25306l11612
$$ 61796485 61622163 61100487 60419008 60139811 60475544 60196642 59776724 59902030 59590418
3262E9590418m18044P8834m25923j11043k67028L38453k78457p1817J87608j97439
$$ 59590418 59172374 59251208 58825285 58714242 58447214 58785667 58507210 58435393 58623001 58425562
3252E8425562o55866N01634o05280l36934K78392q3208m92598p60732m11383o40972
$$ 58425562 57769696 58271330 57666050 57329116 57607508 57524300 57031702 56270970 55859587 55218615
3242E5218615j99909J26182k21342j103605k11478j79570q37278l99628J52938
$$ 55218615 55018706 55144888 54923546 53819941 53608463 53428893 52591615 52191987 52344925
3233E2344925m23007q9543J5679o64226o32065M49763J87438K13425o50726k21347
$$ 52344925 51921918 51832375 51848054 51183828 50551763 51001526 51188964 51402389 50751663 50530316
3223E0530316n04223j00540K26302n59948M06834j6553o47131m7799k39366l41018
$$ 50530316 50026093 49925553 50151855 49591907 49998741 49982188 49335057 49287258 49047892 48706874
3213D8706874l09561J28043o26753l94441l41589m55241L78601m07693j91163
$$ 48706874 48397313 48525356 47898603 47504162 47162573 46707332 47085933 46678240 46487077
3204D6487077l22948p48731j9005l41295o36026J89154L46710l12250q2168j33878
$$ 46487077 46164129 45415398 45396393 45055098 44419072 44608226 44954936 44642686 44560518 44426640
3194D4426640K09981n03291k68990J28918n8221o55828O9575l34844K28488l57816
$$ 44426640 44636621 44133330 43864340 43993258 43935037 43279209 43348784 43013940 43242428 42884612
3184D2884612M08573q90774Q045k51827j88188n4340j033508l25276j28944l30297
$$ 42884612 43293185 42402411 42410456 42158629 41970441 41916101 40882593 40557317 40428373 40098076
3174D0098076j02217l24761k36212J44888k98067q8644l51836K33279J05676J62937
$$ 40098076 39995859 39671098 39434886 39579774 39281707 39193063 38841227 39074506 39180182 39343119
3164C9343119j028771k15759K79923J86711m39116J16802k04267k27021l37496
$$ 39343119 38314348 38098589 38378512 38565223 38126107 38242909 38038642 37811621 37474125
3155C7474125l63645K38438m13727J13989k68656n06350l1089J99553l32757o71839
$$ 37474125 37110480 37348918 36935191 37049180 36780524 36274174 36243085 36442638 36109881 35438042
3145C5438042o0772J18915o12661O34384k20330L2151l48271k75158L05820O8942
$$ 35438042 35377270 35496185 34883524 35517908 35297578 35329729 34981458 34706300 35012120 35081062
3135C5081062K30835m00447Q3966j83559O3275M39548l15593l37783K26926n3036
$$ 35081062 35311897 34911450 34995416 34811857 34875132 35314680 34999087 34661304 34888230 34835194
3125C4835194K85628l48863m508J79552L51060n42782L40208L82800l22621k94967
$$ 34835194 35120822 34771959 34767451 34947003 35298063 34755281 35095489 35478289 35155668 34860701
3115C4860701J84573J83205K85656K38002P5992k48315N78645P68251N18260J27244
$$ 34860701 35045274 35228479 35514135 35752137 35828129 35579814 36158459 36926710 37444970 37572214
3105C7572214O05683Q00962N78731Q04801P88285J562341M85257N37993N47157
$$ 37572214 38177897 38978859 39557590 40362391 41150676 42713017 43198274 43736267 44283424
3096D4283424Q03639O48526J38688J027026O46720M86756K34439l40306m48657
$$ 44283424 45087063 45735589 45874277 46901303 47548023 48034779 48269218 47928912 47480255
3087D7480255o56098r19007r86188o02420l71344j021870p70417K2693J84807
$$ 47480255 46824157 45905150 44918962 44316542 43945198 42923328 42152911 42175604 42360411
3078D2360411m63321K96024m58502n343R0313P36718L70039k36990n65523o22184
$$ 42360411 41897090 42193114 41734612 41729269 41819582 42556300 42926339 42689349 42123826 41501642
3068D1501642o56719l59092q409P13835l84865m82091J4071m55433L2163j54323
$$ 41501642 40844923 40485831 40477422 41191257 40806392 40324301 40338372 39882939 39915102 39760779
3058C9760779r57092r37866O5838k59203p57838l52701R105l69327n52310k51777
$$ 39760779 38803687 37865821 37931659 37672456 36914618 36561917 36571022 36201695 35649385 35397608
3048C5397608j26756l81924K65784p9257n46548p5501J29937k59763o59249k08995
$$ 35397608 35270852 34888928 35154712 35075455 34528907 34453406 34583343 34323580 33664331 33455336
3038C3455336q13677n64806r7698l19266r20911j52750j75150o31817j76612l08136
$$ 33455336 32641659 32076853 31979155 31659889 30738978 30586228 30411078 29779261 29602649 29294513
3028B9294513n83151L45162k98920m96946J13400k99270l99023K07521l45508
$$ 29294513 28711362 29056524 28757604 28260658 28374058 28074788 27675765 27883286 27537778
3019B7537778k13056j92186m98414M69230k43925k44136J11013j54512L92371
$$ 27537778 27324722 27132536 26634122 27103352 26859427 26615291 26726304 26571792 26964163
3010B6964163P80131O9009n12431l17521L35348p08870L01712n1606n0216j24144
$$ 26964163 27744294 27813303 27300872 26983351 27318699 26609829 26911541 26859935 26809719 26685575
3000B6685575l22010j14458M69822j34088M43254m66800j6117J94457j77433K92044
$$ 26685575 26363565 26249107 26718929 26584841 27028095 26561295 26545178 26739635 26562202 26854246
2990B6854246R7173j16198k44296m5008L89363K86355l5472J9070K05309J25294
$$ 26854246 26951419 26835221 26590925 26545917 26935280 27221635 27186163 27205233 27410542 27535836
2980B7535836m66352O48742K1858K92930N13210j46594M165k31827J80036m67799
$$ 27535836 27069484 27718226 27740084 28033014 28546224 28399630 28403795 28171968 28352004 27884205
2970B7884205p2970l25078j16158n77480j16529k72447P90123J15888M59862n53084
$$ 27884205 27811235 27486157 27369999 26792519 26675990 26403543 27193666 27309554 27769416 27216332
2960B7216332L95502K83841L73930J03951O8831J34653p6201j51965l84025K38748
$$ 27216332 27611834 27895675 28269605 28373556 28442387 28577040 28500839 28348874 27964849 28203597
2950B8203597M15267K0104m050j28063l38458N0157q0737K22267l63431N15292
$$ 28203597 28618864 28638968 28634918 28506855 28168397 28218554 28137817 28360084 27996653 28511945
2940B8511945j43244m7080m18898J04238J26386p48289q3090n246Q750j1627J96145
$$ 28511945 28368701 28321621 27902723 28006961 28133347 27385058 27301968 27296722 27305472 27293845 27489990
2929B7489990K11543r6235o26970N81182Q357K04781L43341L4140j31620o24038
$$ 27489990 27701533 27605298 26978328 27559510 27567867 27772648 28115989 28150129 28018509 27394471
2919B7394471q82411m69882j97574p6611l92073p6345K11798n65396l64177k72403
$$ 27394471 26512060 26042178 25844604 25767993 25375920 25299575 25511373 24945977 24581800 24309397
2909B4309397O1104o66700q3665j24503K87396J02397j96852j011037J81007M44878
$$ 24309397 24370501 23703801 23620136 23495633 23783029 23885426 23688574 22677537 22858544 23303422
2899B3303422M87579j03050O84532M2721J6749l47934K54684j1422l45278j026737
$$ 23303422 23791001 23687951 24372483 24415204 24431953 24084019 24338703 24327281 23982003 22955266
2889B2955266o38887k01908n85601r19516l26571j71190j66609P6180J50990l48199
$$ 22955266 22316379 22114471 21528870 20609354 20282783 20111593 19944984 20021164 20172154 19823955
2879A9823955q85677K2336l71932j95351R6594k20382k89449l59044O98923k22832
$$ 19823955 18938278 18960614 18588682 18393331 18489925 18269543 17980094 17621050 18319973 18097141
2869A8097141n79108k08566L0386j32864m9265L02343k54763k03853j76571q78145
$$ 18097141 17518033 17309467 17339853 17206989 17157724 17460067 17205304 17001451 16824880 15946735
2859A5946735j99665k98410j13166k76882K61101l67480j59267m4276Q1665n69039
$$ 15946735 15747070 15448660 15335494 15058612 15319713 14952233 14792966 14748690 14830355 14261316
2849A4261316l74888O6771l49067K9398J22981l6275k73029j47402N02486k79704
$$ 14261316 13886428 13953199 13604132 13633530 13756511 13720236 13447207 13299805 13802291 13522587
2839A3522587o1301j91843k50994m01559J85328M45419p51840n00005l58096M69896
$$ 13522587 13461286 13269443 13018449 12616890 12802218 13247637 12495797 11995792 11637696 12107592
2829A2107592J58804K89889n81843k99047M56067O9922p46180J13152M96146k14671
$$ 12107592 12266396 12556285 11974442 11675395 12131462 12201384 11455204 11568356 12064502 11849831
2819A1849831n87943J36419l18925K0584k53528j38528j06357j14815J78335J96982
$$ 11849831 11261888 11398307 11079382 11099966 10846438 10707910 10601553 10486738 10665073 10862055
2809A0862055k35180m7214l60808j9920M93288K76598m12420m32437J14190m94112
$$ 10862055 10626875 10579661 10218853 10198933 10692221 10968819 10556399 10123962 10238152 9744040
2799I744040j45080J82535k63241O51544R2259l10658m44101K6730j53296K73598
$$ 9744040 9598960 9781495 9518254 10169798 10262057 9951399 9507298 9534028 9380732 9654330
2789I654330L09599J33970K49781l06702k33488L1001l83202P2942m47464l73527
$$ 9654330 9963929 10097899 10347680 10040978 9807490 9838491 9455289 9528231 9080767 8707240
2779H707240m22588M03598K4303m82822k94627K0644N31372l0951m00103k20534
$$ 8707240 8284652 8688250 8712553 8229731 7935104 7955748 8487120 8456169 8056066 7835532
2769G835532J5957k19810k49736J13706L9103k39314j42136J63327k03622m15893
$$ 7835532 7851489 7631679 7381943 7495649 7534752 7295438 7153302 7316629 7113007 6697114
2759F697114J4686n6699m19696K79099L18520k52396k81568r4224m19908l27745
$$ 6697114 6711800 6655101 6235405 6514504 6833024 6580628 6299060 6204836 5784928 5457183
2749E457183m2045K85921o94o82464K24791K49830n771M45374n7039k36099p02813
$$ 5457183 5415138 5701059 5700365 5017901 5242692 5492522 5486751 5932125 5875086 5638987 4936174
2738D936174o8027l42793N47456p53545j47823J36799j59215K84148m15698K29192
$$ 4936174 4868147 4525354 5072810 4319265 4171442 4308241 4149026 4433174 4017476 4246668
2728D246668l76991J45924J29666m76682k59082J28801k8799l72399k80355M3342
$$ 4246668 3869677 4015601 4145267 3668585 3409503 3538304 3509505 3137106 2856751 2900093
2718B900093K7831L24891J959m145l77871K70030n19475L11561o20273J50215
$$ 2900093 2927924 3252815 3254774 3250629 2872758 3142788 2623313 2934874 2314601 2464816
2708B464816M17626k9521k39867k86135J41462j80379m33856J23965j37518l01221
$$ 2464816 2882442 2852921 2613054 2326919 2468381 2288002 1854146 1978111 1840593 1539372
2698A539372K00869m7943J03555l91106K16554N2038J84923n12972K62049K99549
$$ 1539372 1740241 1692298 1795853 1404747 1621301 1673339 1858262 1345290 1607339 1906888
2688A906888l65706m96682L6280m41K56600n01136q3153L84810L42632J41249
$$ 1906888 1541182 1044500 1080780 1080339 1336939 835803 752650 1137460 1480092 1621341
2678A621341M0719J27011K2104M59878j42296j4700p11931k92316j94164K69946
$$ 1621341 1662060 1789071 1811175 2271053 2128757 2114057 1402126 1109810 915646 1185592
2668A185592q4043J57660n33034j60629J34325N8116m68546J95839K61372Q35258
$$ 1185592 1101549 1259209 726175 565546 699871 757987 289441 485280 746652 1581910
2658A581910o99398Q5784J16115m44303O40535p21744K0422k66692k9952M57330
$$ 1581910 882512 968296 1084411 640108 1280643 558899 579321 312629 282677 740007
2648G40007k05046m8653l11921K91347J06847j13054K71222j39455j57027k25727
$$ 740007 534961 486308 174387 465734 572581 459527 730749 591294 434267 208540
2638B08540J4451M18994m02783M18477k51892K78475j57806K50035j60637J62624
$$ 208540 222991 641985 239202 657679 405787 684262 526456 776491 615854 778478
2628G78478K81695j11052j81752n06183O05576J215o27801m8333o6722Q6436q8172
$$ 778478 1060173 949121 767369 261186 866762 867977 240176 191843 125121 211557 123385
2617A23385P29647k21095j19685O38104k55870l04807j28449J03012m32083N5809
$$ 123385 853032 631937 512252 1150356 894486 589679 461230 564242 132159 187968
2607A87968k42364q897j16450K39114l40963M40576l4281L7329r224l74556J43158
$$ 187968 -54396 -63293 -179743 59371 -281592 158984 124703 162032 152808 -221748 -78590
2596g8590J42150l80961Q18605Q1999m09472j02759M25867k46642K33650j00961
$$ -78590 63560 -317401 501204 583203 173731 70972 496839 250197 483847 382886
2586C82886k50505j91561j1667j62834r1976R8385O07551Q3431o64407L92321
$$ 382886 132381 -59180 -70847 -233681 -325657 -227272 380279 463710 -200697 191624
2576A91624j71681q793k67972k16755J38911K39331M3974j61154J53382m9311
$$ 191624 19943 11150 -256822 -473577 -334666 -95335 -51361 -212515 -59133 -108444
2566a08444p6226K05762J45459K70134k13424M037j78667J39381j18552K47232
$$ -108444 -184670 21092 166551 436685 223261 227298 48631 188012 69460 316692
2556C16692K22812m22861M76294l36999K09209k7756p43904j23451J70454J27497
$$ 316692 539504 116643 592937 255938 465147 437391 -306513 -429964 -259510 -132013
2546a32013q2529k27812N49999q2900J71984l34094n1588j84727Q286N49979k35957
$$ -132013 -214542 -442354 107645 24745 196729 -137365 -188953 -373680 -365394 184585 -51372
2535e1372l6531L16513p12650K02441O47453J82404K36230J70557l46834k17680
$$ -51372 -87903 228610 -484040 -281599 365854 548258 784488 955045 608211 390531
2525C90531r8234l63183j81978L81723J45223J96893M172p18417L49201r3266
$$ 390531 292297 -70886 -252864 128859 274082 470975 475147 -243270 105931 12665
2515A2665j26444o0967j0457L64750l06776l6480L38444M98603o35250k41675
$$ 12665 -113779 -174746 -185203 179547 -127229 -163709 174735 673338 38088 -203587
2505b03587Q69591o35334l98140M58351K22491j87800N25359j0089l50277k5516
$$ -203587 666004 30670 -367470 90881 313372 125572 650931 640842 290565 265049
2495B65049k6023k15768N1636k53241r9487k7188k97165P9159N00488J39433n0140
$$ 265049 239026 23258 74894 -178347 -277834 -305022 -602187 -523028 -22540 116893 66753
2484F6753p3774M41247l7112l35791l17693R3794J74532J2560k0616O20035N17521
$$ 66753 -7021 434226 397114 61323 -256370 -162576 11956 24516 3900 623935 1141456
2473A141456o41329q5050j72593L81922j49247L63444m05691l30075O35981n36585
$$ 1141456 500127 415077 242484 624406 475159 838603 432912 102837 738818 202233
2463B02233j67573j80175j06152k66599M9855N44939j9531j19645o1922K2513
$$ 202233 34660 -145515 -251667 -518266 -468411 76528 56997 -62648 -124570 -102057
2453a02057j13608K63970J57566m16541J04322J77920P9729J7669j14604j46054
$$ -102057 -215665 48305 205871 -210670 -106348 71572 151301 168970 54366 -91688
2443i1688L15948n5244j64424j32645k34918R4564L68632n86400M45805M38M8790
$$ -91688 224260 169016 4592 -128053 -362971 -268407 100225 -486175 -40370 -39932 8858
2432H858L78368j16237m6168N17411j76624k17502r0357K45221J43741l69942
$$ 8858 387226 270989 224821 742232 565608 348106 257749 502970 646711 276769
2422B76769P9536l55516K46208j23920p9451m7097k6289L22242l07692K07935
$$ 276769 356305 789 246997 123077 43626 -3471 -29760 292482 -15210 192725
2412A92725M89557m02076K58259P22o48978L7295k59810K96762P1458j13934m4137
$$ 192725 682282 280206 538465 539187 -109791 -72496 -332306 -35544 35914 -78020 -122157
2401a22157L13307J36593l0557o57452m3852K48932J2779M6421J61054J2388j40761
$$ -122157 191150 327743 297186 -360266 -404118 -155186 -142407 -95986 65068 77456 -63305
2390f3305j58826J84220j12555M9414M61417j43090l24771q746k33103J95233
$$ -63305 -222131 -37911 -150466 -101052 360365 217275 -107496 -116242 -349345 -154112
2380a54112J58139l36397K0886L39901J74828Q1654M23457l44404J06108l77776
$$ -154112 4027 -332370 -311484 28417 203245 284899 708356 363952 470060 92284
2370I2284m61393R1045j1154j53699P0616o4280L24640J7850j3466L36769q2816
$$ 92284 -369109 -278064 -289218 -442917 -372301 -436581 -111941 -94091 -107557 229212 146396
2359A46396j38958l3763K69845j97957m8271l98583L4550m62893k08904M81989
$$ 146396 7438 -26325 243520 45563 -2708 -401291 -366741 -829634 -1038538 -556549
2349e56549N77212K37690j75490L46456j96033o04096L80560l5296n28289K32917
$$ -556549 20663 258353 82863 429319 233286 -370810 9750 -25546 -553835 -320918
2339c20918j77427K61816J44511L42587p54036L97163k24215M21634j52359L52729
$$ -320918 -498345 -236529 -92018 250569 -503467 -106304 -330519 91115 -61244 291485
2329B91485k56106J86023J3360p4938J4565M00365K74875l72636M58569l47119
$$ 291485 35379 221402 234762 159824 174389 574754 849629 476993 935562 588443
2319E88443o41906N0078K01465M27736L76287l08707R6010m56244J73204O90947
$$ 588443 -53463 -3385 198080 625816 1002103 693396 789406 333162 506366 1197313
2309A197313j72320J06806l39924M51538L52065J18260j51118m28529o51294P2594
$$ 1197313 1024993 1131799 791875 1243413 1595478 1713738 1562620 1134091 482797 555391
2299E55391l72733M2054L24007j78468m91453j01520J16595Q2246Q224K01825
$$ 555391 182658 224712 548719 370251 -121202 -222722 -106127 -23881 -15657 186168
2289A86168j39534q6417P49606o78321j51867Q6464P93986m14976p3339r6526
$$ 186168 46634 -39783 709823 31502 -120365 -33901 760085 345109 271770 175244
2279A75244K46634L56433k58823n5936M00L91645M0875m84660M0199l78173M97534
$$ 175244 421878 778311 519488 463552 463952 855597 896472 411812 452011 73838 571372
2268E71372J20203k10813m05099M49714M13818k82285k77323K22373R6620j05336
$$ 571372 691575 480762 75663 525377 939195 656910 379587 601960 698580 593244
2258E93244M3818j57816R6763K18825K25631k65987N3287J42089j26716m06140
$$ 593244 637062 479246 576009 794834 1020465 754478 807765 949854 823138 416998
2248D16998J63476K67192l06855k83115K05741j69950k9117Q80720o63922m80480
$$ 416998 580474 847666 540811 257696 463437 293487 264370 1145090 481168 688
2238F88n00174K8085O25646j12425K14514m8890J52949k2178j85059K19706M23995
$$ 688 -499486 -471401 154245 41820 256334 207444 360393 338215 153156 372862 796857
2227G96857M52203n26078K29854J72388m32586J01497j41904M23191k67093P1924
$$ 796857 1249060 722982 952836 1125224 692638 794135 652231 1075422 808329 880253
2217H80253l20710J05451P01727q7748m36667k33208K81439j68787K58105L03006
$$ 880253 559543 664994 1366721 1278973 842306 609098 890537 721750 979855 1282861
2207A282861J76067j74068j11158N1432n67865J64214M07302k53325O14230J61379
$$ 1282861 1458928 1284860 1173702 1225134 657269 821483 1228785 975460 1589690 1751069
2197A751069j99298p2875N316l97387M2185Q203n256l12633K45641k42813M3508
$$ 1751069 1551771 1478896 1484212 1086825 1129010 1137213 1131957 819324 1064965 822152 865660
2186H65660K0673J04043j77656N6313K62561r3394n67440n52761P24162K5745
$$ 865660 886333 990376 812720 869033 1131594 1038200 470760 -82001 642161 667906
2176F67906O29851k61242O7396M7927N84743j98861J07762j3922J35207K67590
$$ 667906 1297757 1036515 1103911 1151838 1736581 1537720 1645482 1631560 1766767 2034357
2166B034357j11141K19402J94350N4426J10025n7436j8675O194k9213N24625j68041
$$ 2034357 1923216 2142618 2336968 2391394 2501419 2443983 2425308 2431502 2402289 2926914 2758873
2155B758873P91778k52443k40834K9457k4968K0125N73462j99090k09710M89107
$$ 2758873 3550651 3298208 3057374 3086831 3061863 3081988 3655450 3456360 3246650 3735757
2145C735757K81993l93717K92068M6436m13357j84384Q01998L60312j3742K56242
$$ 3735757 4017750 3624033 3916101 3962537 3549180 3364796 4166794 4527106 4513364 4769606
2135D769606L30575j0153K26388M06374j63300L48715K60482k5328l8288K66969
$$ 4769606 5100181 5090028 5316416 5722790 5559490 5908205 6168687 6143359 6105071 6372040
2125F372040j77648K4990K24112N34929l63262N20410K38252j0727K61090P52411
$$ 6372040 6194392 6219382 6443494 6978423 6615161 7135571 7373823 7363096 7624186 8376597
2115H376597O00248L40689M28086k9351P16297o9498K81422p3403R96699N37817
$$ 8376597 8976845 9317534 9745620 9716269 10432566 10363068 10644490 10571087 11567786 12105603
2105A2105603K81379K22704P39336P64790R0359R74710O28395M76584j7338J506573
$$ 12105603 12386982 12609686 13349022 14113812 14204171 15178881 15807276 16283860 16266522 17773095
2095A7773095J004918Q80451O10591Q44116J23393J338282J168176J499545J892317
$$ 17773095 18778013 19658464 20269055 21113171 21236564 22574846 23743022 25242567 27134884
2086B7134884J561330J052462K381455K502118K543871L069056L743494M776881
$$ 27134884 28696214 29748676 32130131 34632249 37176120 40245176 43988670 48765551
2078D8765551N276364O131998N336142N238917O830750J0287102J1775830J3095517
$$ 48765551 54041915 60173913 65510055 70748972 77579722 87866824 99642654 112738171
2070A12738171J6033900K0137118K5715901L1992704M1283292N0560112K7663246
$$ 112738171 128772071 148909189 174625090 206617794 247901086 298461198 326124444
2063C26124444l4342548n4917046n1270495m2429950k6643707j9729394j3230911
$$ 326124444 291781896 236864850 185594355 143164405 116520698 96791304 83560393
2056H3560393j0327051p033178n602399m225554m126042k670405l176492l852276
$$ 83560393 73233342 66200164 60597765 56372211 52246169 49575764 46399272 42546996
2048D2546996l611589l451480l262744k962034j937842j392239j659391j228395
$$ 42546996 38935407 35483927 32221183 29259149 27321307 25929068 24269677 23041282
2040B3041282j136775j260226j243362j111301n22529r68022o94334j73671j252271
$$ 23041282 21904507 20644281 19400919 18289618 17767089 16799067 16104733 15931062 14678791
2031A4678791j88882p87109q09964o83946j68071j66954m48007m70668m28213
$$ 14678791 14489909 13702800 12892836 12208890 12040819 11873865 11425858 10955190 10526977
2022A0526977k36665k4790j108448j26185j7982m10107q57785l07989o0043P0481
$$ 10526977 10290312 10265522 9157074 9030889 9012907 8602800 7745015 7437026 7376983 7447464
2012G447464m64379j61813l89275j05918J89396j78776p34475m1993M04038o16676
$$ 7447464 6983085 6821272 6431997 6326079 6515475 6336699 5602224 5560231 5964269 5347593
2002E347593k61160M21437k48297k55538O0329k4738m13945m03717L6608L27913
$$ 5347593 5086433 5507870 5259573 5004035 5064364 5039626 4625681 4221964 4258572 4586485
1992D586485m25527L26265j2845m02743m67146M21195n39652k32760L32528j58298
$$ 4586485 4160958 4487223 4474378 4071635 3604489 4025684 3486032 3253272 3585800 3427502
1982C427502o67319R3870k26124k3390q7254J70906m28754j08723K86947l05084
$$ 3427502 2760183 2854053 2627929 2604539 2517285 2688191 2259437 2150714 2437661 2132577
1972B132577J7625j23014O1132l09299J39972o15515k7495K52432j48446k85078
$$ 2132577 2150202 2027188 2088320 1779021 1918993 1303478 1275983 1528415 1379969 1094891
1962A094891j28154K98895P6345k09029J78218J22279J84813k61646l09181k38706
$$ 1094891 966737 1265632 1341977 1132948 1311166 1433445 1618258 1356612 1047431 808725
1952H08725L13494K43013r5594j98329O68633k39666l80592j58843M32197l54893
$$ 808725 1122219 1365232 1269638 1071309 1739942 1500276 1119684 960841 1393038 1038145
1942A038145J24563J25488o72199J16435M71691J97205l18627j35044L07314j08321
$$ 1038145 1162708 1288196 615997 732432 1204123 1401328 1082701 947657 1254971 1146650
1932A146650M4877K0873K91505J55682o15750j24518n28321J71561J52423j85770
$$ 1146650 1191527 1212400 1503905 1659587 1043837 919319 390998 562559 714982 529212
1922E29212o4524L52620R4161k12382k27960M11372K98409k75837M9035l32191
$$ 529212 464688 817308 911469 699087 471127 882499 1180908 905071 954106 621915
1912F21915k9587K35374j120l71576k9229k2267o32016M74099Q17323m45613M0513
$$ 621915 592328 827702 826582 455006 425777 403510 -228506 245593 1062916 617303 657816
1901F57816o05860Q0057j76288O28894l03308K59146j52012k55484j29579J56834
$$ 657816 51956 132013 -44275 584619 281311 540457 388445 132961 3382 160216
1891A60216J716J81514j08854k79742J97304J86714k17437n7708K9289P4921L29113
$$ 160216 161932 343446 234592 -45150 152154 338868 121431 63723 93012 167933 497046
1880D97046m95929J50993j49838j20059j78106K66937R5741N32992K72169p45572
$$ 497046 1117 152110 2272 -117787 -295893 -28956 66785 599777 871946 126374
1870A26374k73986Q9051J94792r2404j62176O82092j19961k67116K72008m06540
$$ 126374 -147612 -58561 136231 43827 -118349 563743 443782 176666 448674 42134
1860D2134L93345k87604J96238p46773R4196K78842J58562j48657j02810O28386
$$ 42134 435479 147875 344113 -402660 -308464 -29622 128940 -19717 -122527 505859
1850E05859m68758k8307m24098j02763J46708J20704l76611L6382K57200N60598
$$ 505859 37101 8794 -415304 -518067 -371359 -250655 -627266 -590884 -333684 226914
1840B26914j19924J09636m54213L70406K03651L50632j56979K9945k89131J2315
$$ 226914 106990 216626 -237587 132819 336470 687102 530123 560068 270937 283252
1830B83252L6317L40581Q3408j42365N3663K50322O5737L48608O05135j96335
$$ 283252 319569 660150 743558 601193 654856 905178 970915 1319523 1924658 1728323
1820A728323l38764p09941M07215o67455L93366l0578n29809n16046N05987j82048
$$ 1728323 1389559 679618 1086833 419378 812744 782166 252357 -263689 242298 60250
1810F0250K03825k0177R5006q1580l67367p338j55406L4498K71229l46203K16521
$$ 60250 264075 243898 338904 257324 -110043 -117381 -272787 -238289 32940 -313263 -96742
1799i6742O29239k13817j07567o60230O16255k19850M38591n97102J66692J60808
$$ -96742 532497 318680 211113 -449117 167138 -52712 385879 -211223 -44531 116277
1789A16277j26384m78493J60220N05114L00993p94033K05787j15157k68926j19552
$$ 116277 -10107 -488600 -328380 176734 477727 -316306 -110519 -225676 -494602 -614154
1779f14154N53175J6826j33365P8871J8820L81875r6733J55214q49983N28464
$$ -614154 -60979 -44153 -177518 -98647 -79827 302048 205315 360529 -489454 39010
1769C9010K8461k32340K94093O6911J0018N1822j07806l6862o77601K49421N6991
$$ 39010 67471 -164869 129224 196135 206153 257975 150169 113307 -564294 -314873 -257882
1758b57882j1796p3461K0266K49631n1460j87541n41967P43958m9829J24185k43067
$$ -257882 -269678 -343139 -322873 -73242 -124702 -312243 -854210 -110252 -160081 -35896 -278963
1747b78963J54580N4780j54677l23382L90341J80034l20471K41572l67353J10782
$$ -278963 -124383 -69603 -224280 -547662 -157321 22713 -297758 -56186 -423539 -312757
1737c12757L00791j33447m9382M25713m02495j06650p1705K79275k95347M3264
$$ -312757 -11966 -145413 -194795 230918 -171577 -278227 -349932 -70657 -366004 -322740
1727c22740o8551L09771k53517N66410m90407K14729J09544q177L32638j48171
$$ -322740 -391291 -81520 -335037 231373 -259034 -44305 65239 57062 389700 241529
1717B41529J66404l53765k3218N3565l6255j68320J07947m4604M30560l61908
$$ 241529 407933 54168 30950 84515 48260 -120060 -12113 -56717 373843 11935
1707A1935K22283l55327k19405m5212Q37709l78433J4703k94923j29801K25029
$$ 11935 234218 -121109 -340514 -385726 451983 73550 88253 -206670 -336471 -111442
1697a11442M6930l16985K74527J6904J50103L0803p83088O57350j54552L64867
$$ -111442 -64512 -381497 -106970 -90066 60037 90840 -692248 -34898 -189450 175417
1687A75417p12941J18448J13918N7974O2427l91480k04M309j86643M34562N2291
$$ 175417 -537524 -419076 -305158 -247184 -184757 -576237 -576441 -572132 -758775 -324213 -271922
1676b71922n3986j19932M65607K71680m89025m33725L50399K52388n79846L49201
$$ -271922 -325908 -445840 19767 291447 -197578 -631303 -280904 -28516 -608362 -259161
1666b59161j40261M060P20619j96063m01522j3083M18229j46232K06658k55817
$$ -259161 -399422 -395362 325257 129194 -272328 -285411 132818 -13414 193244 -62573
1656f2573l4820k17873L23001j21043p7009K64934K21037N6777n06352M0115M32830
$$ -62573 -97393 -315266 7735 -113308 -190317 74617 295654 352431 -153921 -113806 319024
1645C19024L42889m58660j63749m36227j72095j46672K29434J1J99967P6904k42776
$$ 319024 661913 203253 39504 -396723 -568818 -715490 -486056 -486045 -286078 -209174 -451950
1634d51950K69978O1447J76209N7856O503n26038K11507r6336k54772K23671k15939
$$ -451950 -181972 -120525 55684 113540 120043 -405995 -194488 -290824 -545596 -321925 -537864
1623e37864K86800j8069J47110L71288l77406j30184N7773N8083K20761J01839
$$ -537864 -251064 -269133 -122023 249265 -128141 -258325 -200552 -142469 78292 180131
1613A80131n06880l59556J31384J63526N8784l37666L14587M4482K16323J48082
$$ 180131 -326749 -686305 -554921 -391395 -332611 -670277 -355690 -311208 -94885 53197
1603E3197j86867K68802K33620j67028l90996N43639M25227p55630R6961p6584
$$ 53197 -133670 135132 368752 201724 -189272 354367 779594 23964 120925 44341
1593D4341N6935J39458n64878j16844j9209K94176K63742K92502J6938k22160
$$ 44341 101276 240734 -324144 -440988 -460197 -166021 97721 390223 407161 185001
1583A85001N2104m59375J0477J08556k11014N3882j10077l09578N33509l2040
$$ 185001 237105 -222270 -211793 -103237 -314251 -260369 -370446 -680024 -146515 -178555
1573a78555k16328r1844L81411l04662l68599q0376K138J41196K22260j7799l34966
$$ -178555 -394883 -486727 -105316 -409978 -778577 -858953 -856815 -715619 -493359 -511158 -846124
1562h46124O28753P4771p6051j44910J75367J34922J03655j54381j85808j81415
$$ -846124 -217371 -142600 -218651 -363561 -188194 -53272 50383 -103998 -289806 -471221
1552d71221K9991n7890L98346p7355K54849J81215l64041k96090n62312M62512
$$ -471221 -441230 -499120 -100774 -178129 76720 257935 -106106 -402196 -964508 -501996
1542e01996n3827M0572K22358L53420n01514K11474N48668R797L7093n87155Q8347
$$ -501996 -555823 -515251 -292893 60527 -440987 -229513 319155 328952 366045 -221110 -132763
1531a32763K20087j77089r1189j72980J89117l7135K13930k20416k68103M67118
$$ -132763 87324 -89765 -180954 -353934 -164817 -201952 11978 -208438 -476541 -9423
1521i423J63485q0363k71989K7399K97453J27712L57448k70847j20917M1042k12033
$$ -9423 154062 73699 -198290 -170891 126562 254274 611722 340875 219958 261000 48967
1510D8967j54470O12681l47121L7698K58305l04488k80680l743J1430j17232j8911
$$ 48967 -105503 507178 160057 197755 456060 151572 -129108 -132851 -121421 -238653 -257564
1499b57564k3730J01423n0475k2418P07940n91442O2865L91081l82809m40741
$$ -257564 -281294 -179871 -230346 -252764 455176 -136266 -73401 317680 -65129 -505870
1489e05870M55030R11617m65165o68804J25685r4742K88310J85840r0895j46373
$$ -505870 -50840 860777 395612 -273192 -147507 -242249 46061 231901 141006 -5367
1479e367k17087L00158n59861P02517J23561J57553k55404j3770j18384k00022
$$ -5367 -222454 77704 -482157 220360 343921 501474 246070 232300 113916 -86106
1469h6106J30492m35234L08608K74023l15485k63875M61600l1274l06440J84658
$$ -86106 44386 -390848 -82240 191783 -123702 -387577 74023 42749 -263691 -79033
1459g9033o76467N00962P48109K0502o85152j15589O5470o6112j76858L77329
$$ -79033 -755500 -254538 493571 514073 -171079 -286668 -221198 -287310 -464168 -86839
1449h6839J07407q0020l75921Q9283k48800o8897K44551J68451K4086k00890n5455
$$ -86839 20568 -59452 -435373 -346090 -594890 -663787 -419236 -250785 -226699 -427589 -483044
1438d83044P3764K7466Q5359Q4350J37904k51511K95647L7367l30585P0316O70029
$$ -483044 -409280 -381814 -296455 -212105 -74201 -325712 -30065 7302 -323283 -252967 417062
1427D17062J8849l59630j97426R6380M7819l62349O0907J89733R3856J44007j33215
$$ 417062 435911 76281 -121145 -24765 23054 -339295 -278388 -88655 5201 149208 15993
1416A5993n02183K37471L3465L35863L0102K52094L8846n89360N3112K97066l18192
$$ 15993 -486190 -248719 -215254 120609 150711 402805 441651 -147709 -94597 202469 -115723
1405a15723J40888J53036K51707o7131k18329P9954j8422j88019k40777L21576
$$ -115723 25165 178201 429908 362777 144448 224402 205980 17961 -222816 98760
1395I8760l87217k61471J51668J00827l51140K53890K4385O87228O1123q75935
$$ 98760 -288457 -549928 -398260 -297433 -648573 -394683 -370298 316930 378053 -497882
1385d97882o4758k08608K30342k24671O1712L05788J84207Q6987m32741J98437
$$ -497882 -562640 -771248 -540906 -765577 -703865 -398077 -213870 -126883 -559624 -361187
1375c61187R5248O516N42249o49228K04094J48250J10574K70942k73260K29063
$$ -361187 -265939 -259423 282826 -366402 -162308 -14058 96516 367458 94198 323261
1365C23261j42265l16416K53858j92547P2116L91105p91607r7474j04895k06315
$$ 323261 180996 -135420 118438 -74109 -1993 389112 -402495 -499969 -604864 -811179
1355h11179N3177Q224N88602L3264J76206l30978O35371j78686k62944n73L30518
$$ -811179 -758002 -749778 -161176 -127912 48294 -282684 352687 174001 -88943 -89516 241002
1344B41002r5300K06359k59025k10284P0782k20587L12101q9716l45910p8087
$$ 241002 145702 352061 93036 -117248 -46466 -267053 45048 -44668 -390578 -468665
1334d68665L72745j60888n87027M56801m7450K48362M47853k21384J5965Q9987
$$ -468665 -95920 -256808 -843835 -387034 -434484 -186122 261731 40347 56312 146299
1324A46299l50169K55387n7724n48982k04433M7500N33435J80950N5350K89041
$$ 146299 -203870 51517 -6207 -555189 -759622 -712122 -178687 2263 57613 346654
1314C46654j58825k99952J75742J47901J19850k34617K71012l0958q1747J33294
$$ 346654 187829 -112123 63619 211520 331370 96753 367765 336807 255060 388354
1304C88354m68157J89423M9863l61767j5024l8157P10893m24711L11996r8494
$$ 388354 -79803 109620 159483 -202284 -217308 -255465 455428 30717 342713 244219
1294B44219j17696J3427l24600k58578K25875M70602k13933j99111j73096N94295
$$ 244219 126523 139950 -184650 -443228 -217353 253249 39316 -159795 -332891 261404
1284B61404j28474o9677k96530j61954o0808J79700R5865J72965K15193m6902
$$ 261404 132930 63253 -233277 -395231 -456039 -276339 -180474 -7509 207684 160782
1274A60782n55080K19377k22176l30028j8742J78147O79124j38069m5037k26949
$$ 160782 -394298 -174921 -397097 -727125 -745867 -567720 111404 -26665 -71702 -298651
1264b98651j00623M7000M20628K21803L31156o01731L94962l3418l11537l45440
$$ -298651 -399274 -352274 68354 290157 621313 19582 414544 381126 69589 -275851
1254b75851l67451J76497R6536K02102L16259j20005j04721l91301J43774M11885
$$ -275851 -643302 -466805 -370269 -168167 148092 28087 -76634 -467935 -324161 87724
1244H7724j68723J92899j2889r6047K57176l30906k82923o8876J92316J55742
$$ 87724 -80999 111900 99011 2964 260140 -70766 -353689 -422565 -230249 -74507
1234g4507k25875J96704j14357m27844j75637N55115m1484J06867M79058j33241
$$ -74507 -300382 -103678 -218035 -645879 -821516 -266401 -307885 -201018 278040 144799
1224A44799P7480m21162k68706K2744o3886K71958k28482J40244K17496k37625
$$ 144799 222279 -198883 -467589 -444845 -508731 -236773 -465255 -325011 -107515 -345140
1214c45140O5714N2052M63901m96223P8094j17997N9777K76082M20236L10555
$$ -345140 -279426 -227374 236527 -259696 -181602 -299599 -239822 36260 456496 767051
1204G67051n67874J11423J51048J2712m37728m27530n8942N39946N49048j41829
$$ 767051 199177 310600 461648 474360 36632 -390898 -449840 90106 639154 497325
1194D97325J14993P6283n12711K63484J05283l51576j06248N3263N9883j34788
$$ 497325 612318 688601 175890 439374 544657 193081 86833 140096 199979 65191
1184F5191L52074l41769J31l19010M38475m09067l58234M85866j64888m06005
$$ 65191 417265 75496 75627 -243383 195092 -213975 -572209 -86343 -251231 -657236
1174f57236r0236M24932L25247l9350l74044k54068R2763j80374k50548M89912
$$ -657236 -747472 -322540 2707 -36643 -410687 -664755 -571992 -752366 -1002914 -513002
1164e13002J75085N71854k89974m03568l51156O35667L5380K95764m57121o0239
$$ -513002 -337917 233937 -56037 -459605 -810761 -175094 -139714 156050 -301071 -361310
1154c61310l6482O18368o55387Q1257j33278k28259L11859J21937k9387K07146
$$ -361310 -397792 220576 -434811 -353554 -486832 -715091 -403232 -281295 -310682 -103536
1144a03536J82481l30721j12082M73635M61932l61287J11292m59328J42277J33254
$$ -103536 78945 -251776 -363858 109777 571709 210422 321714 -137614 4663 137917
1134A37917N38327k22484r0262l34786l14090m7934O08330l46363M54262j6287
$$ 137917 676244 453760 363498 28712 -285378 -333312 275018 -71345 382917 366630
1124C66630l43131Q9176l07582N81976J97606n33201l87139L12234n97424K29539
$$ 366630 23499 112675 -194907 387069 584675 51474 -335665 -23431 -620855 -391316
1114c91316J01097L58494j98315L86577J86850m51776n55624M47506K49697K79720
$$ -391316 -290219 68275 -130040 256537 443387 -8389 -564013 -116507 133190 412910
1104D12910J78872M6922L4423m02893M35693m43070j78144K23387L79958p73704
$$ 412910 591782 638704 673127 270234 705927 262857 84713 308100 688058 -85646
1094h5646L94865L93947k2111k59535j61938k95553L30119k41641M40200o77396
$$ -85646 309219 703166 681055 421520 259582 -35971 294148 52507 492707 -184689
1084a84689L73171K25837n08352L06126m64278Q70733j43085k00633j05247o01203
$$ -184689 188482 414319 -94033 212093 -252185 618548 475463 274830 169583 -431620
1074d31620j66205O44260p91904J91191J14223K82427L32998n41013J88307p49299
$$ -431620 -597825 46435 -745469 -554278 -440055 -157628 175370 -365643 -177336 -926635
1064i26635P31179P4541m33311O20116j37153l64518k70348O95799k18481K98352
$$ -926635 -195456 -120915 -554226 65890 -71263 -435781 -706129 -10330 -228811 69541
1054F9541j81857m1352K42436m38524P0620K42928Q4915n80814M03009r3621L46292
$$ 69541 -112316 -153668 88768 -349756 -279136 -36208 48707 -532107 -129098 -222719 123573
1043A23573K50172k36895L79788j91520N5532k24796q3267N3108J4484o2789k81034
$$ 123573 373745 136850 516638 325118 380650 155854 72587 125695 140179 77390 -203644
1032b03644L97280M63007j20554l01884J35717n61305J63229O11073k42481m6167
$$ -203644 193636 656643 536089 234205 369922 -191383 -28154 582919 340438 294271
1022B94271j46716K18589J02131J1038l51471l62880L80801M20820m57866j6984
$$ 294271 147555 366144 468275 479313 127842 -235038 145763 566583 108717 91733
1012I1733J3364M77903l07943j87289L33241j59089K06749l2382n5447l00167
$$ 91733 105097 583000 275057 87768 421009 261920 468669 436287 380840 80673
1002H0673O7544N2263l66442k9951L85668j23733l48172K18522L32983j34543
$$ 80673 148217 200480 -165962 -195913 189755 66022 -282150 -63628 269355 134812
992A34812K84972l35546q9174K68677j36313k88954q9323n0029M14857j60556
$$ 134812 419784 84238 -4936 263741 127428 -161526 -250849 -300878 113979 -46577
982d6577q9144K32055l49861J29209K77450j71350J28846n9650p7904j78945k95844
$$ -46577 -135721 96334 -253527 -124318 153132 -18218 110628 50978 -26926 -205871 -501715
971e01715K54423L9123N19285m20599l61322M27371l15772J11464Q0244J09610
$$ -501715 -247292 -208169 311116 -109483 -470805 -43434 -359206 -247742 -167498 -57888
961e7888j48558l54662M36625J30447k03154N36062j7111n3831j84518P1342n89332
$$ -57888 -206446 -561108 -124483 5964 -197190 338872 321761 267930 83412 154754 -434578
950d34578N93595J10748j9302K177P8017o8598k46142m80792M90967P1888k42412
$$ -434578 159017 269765 250463 252640 330657 262059 15917 -464875 26092 97980 -144432
939a44432N13787m51021k73163m99188J42375K15149M85492k77100L36068l25124
$$ -144432 369355 -81666 -354829 -854017 -711642 -496493 -11001 -288101 47967 -277157
929b77157M69358p9801K3502j32838J07205j74292R2276j17618K1817K37982m2251
$$ -277157 192201 112400 135902 3064 110269 -64023 28253 -89365 -67548 170434 128183
918A28183o3371k18625K27181l40131J88948j05106J08969K70142O1268l8598
$$ 128183 64812 -153813 73368 -266763 -77815 -182921 -73952 196190 257458 218860
908B18860l85415P1035L99394k06778k71679P58249j71727K4059k68091m4401
$$ 218860 -166555 -95520 303874 97096 -174583 583666 411939 435998 167907 123506
898A23506k24140J39514J7002j09624n7704n35437p4068L29291L04880L11819
$$ 123506 -100634 38880 55882 -53742 -111446 -646883 -720951 -391660 -86780 225039
888B25039j0520k51989K95265M8380o966j57883L40897l19916j58859J30553o1957
$$ 225039 214519 -37470 257795 306175 299209 141326 482223 162307 3448 134001 72044
877G2044l85366J37178j79892J58389R048r003P8794K4698K0241o17031J75288
$$ 72044 -313322 -176144 -356036 -197647 -188599 -197602 -118808 -94110 -73869 -690900 -515612
866e15612K93960j25620K08892K22630p4115n87994L99216K08610n18670J59982
$$ -515612 -221652 -347272 -138380 84250 10135 -577859 -178643 29967 -488703 -328721
856c28721K77239J01703K64622K71604k7093n15525k524k59428K0566J75325L70828
$$ -328721 -51482 50221 314843 586447 559354 43829 41305 -218123 -197557 -22232 348596
845C48596M3470l7227L49691n59851K85718L49124k06768l20489k2641M62228
$$ 348596 392066 354839 704530 144679 430397 779521 572753 252264 229623 691851
835F91851n93982Q9724j10545k15084k07898J00007M87932l63452J89518K2081
$$ 691851 97869 187593 77048 -138036 -345934 -245927 242005 -121447 68071 90152
825I0152k20451N22315o68328J09429K45687K55456Q8375k10007j80486j70183
$$ 90152 -130299 392016 -276312 -166883 78804 334260 422635 212628 32142 -138041
815a38041J59338K16031J75606n70975L7499r0221K01228o2408M99430k24939
$$ -138041 21297 237328 412934 -158041 -120542 -210763 -9535 -71943 427487 202548
805B02548r887K85852K89258j000213o9998j2044J43990k90628P71973J70161
$$ 202548 192661 478513 767771 -232442 -302440 -314484 -170494 -461122 310851 481012
795D81012n81361L35858j3707P6153j02649J1489j162m36960N46593j50136m01976
$$ 481012 -100349 235509 221802 297955 195306 206795 205633 -231327 315266 165130 -236846
784b36846J55506j0085K86883M2469R4534k79105l817J89741j78516o23522p8973
$$ -236846 -81340 -91425 195458 237927 332461 53356 49539 239280 60764 -562758 -641731
773f41731P91376J25142J2053L609p17563K52597L0090J28589l59493K17877k99042
$$ -641731 149645 274787 286840 290449 -427114 -174517 -144427 -15838 -375331 -157454 -456496
762d56496L5032L7460K36339K23870m93501P18252p84812j99806P19781l16676
$$ -456496 -421464 -384004 -147665 76205 -417296 300956 -483856 -683662 36119 -280557
752b80557J66010K01589m99110k65424L89555L36644k81614N15360L5696q97202
$$ -280557 -114547 87042 -412068 -677492 -287937 48707 -232907 282453 318149 -579053
742e79053N73729Q5579L91884k20054q2789j84056K04692K74447p4082m49489
$$ -579053 -5324 80255 472139 252085 169296 -14760 189932 464379 390297 -59192
732e9192n2226J92950j41783L40565K46114m22275o2729M80294L08556k66700
$$ -59192 -111418 81532 -60251 280314 526428 104153 41424 521718 830274 563574
722E63574m9262q2054n7749k06886L1099l62747k70126O39414J39908m53014K0259
$$ 563574 514312 432258 374509 167623 198722 -164025 -434151 205263 345171 -107843 -87584
711h7584K4161l5042K29988J55738k60936m95472N5793l00211K58821j29537J47268
$$ -87584 -63423 -98465 131523 287261 26325 -469147 -413354 -713565 -454744 -584281 -437013
700d37013j15360p4256O67914n8489k27114r6612K60464j58558M38335q352l40277
$$ -437013 -552373 -626629 41285 -17204 -244318 -340930 -80466 -239024 199311 190959 -149318
689a49318k7672L59671K49123k22321n9459n69657M10610L84681j14406j08984
$$ -149318 -176990 182681 431804 209483 150024 -419633 -9023 375658 261252 152268
679A52268k17116J77689j63709J88850Q245L59612K77448j9676m15009k30263
$$ 152268 -64848 112841 -50868 137982 146227 505839 783287 763611 348602 118339
669A18339K24981J31271Q8615m17339j17050o82183P39751J48298l96996J05208
$$ 118339 343320 474591 563206 145867 28817 -653366 86385 234683 -162313 -57105
659e7105O55867n82666r0968N2774M0810j77334l39958K4906L84998J72898K60924
$$ -57105 598762 16096 -74872 -22098 18712 -158622 -498580 -473674 -88676 84222 345146
648C45146o84922p4302J43025P17495l11258l85367J24887j77700M05880n3017
$$ 345146 -339776 -414078 -271053 446442 135184 -250183 -125296 -302996 102884 49867
638D9867L16796p1263K40238m09482k11471M68262J29349j14994R6869K87373
$$ 49867 366663 295400 535638 126156 -85315 382947 512296 397302 494171 781544
628G81544m79175m78443M45231K4149m8859m0289K16907l02170n8278k39824K3098
$$ 781544 302369 -176074 269157 293306 244447 204158 421065 118895 60617 -179207 -156109
617a56109Q7542j92940M66793o3901j81940J65122l71055m26629M83166M17157
$$ -156109 -68567 -261507 205286 141385 -40555 124567 -246488 -673117 -189951 227206
607B27206l27391m85262L21862J71528M576r6721p70459N21121J50290j51508
$$ 227206 -100185 -585447 -263585 -92057 -87481 -184202 -954661 -433540 -283250 -434758
597d34758K57893J61099k87060j01310K92045K56343l6780J12593k47310J98131
$$ -434758 -176865 -15766 -302826 -404136 -112091 144252 107472 220065 -27245 170886
587A70886k6613k1007N25687k90662L04083l8701n07151o1437P03373m65177m35299
$$ 170886 144273 123266 648953 358291 662374 623673 116522 55085 758458 293281 -142018
576a42018L71097J53187j76845l78477N14630L08036J72069j02819m70054N31157
$$ -142018 229079 382266 205421 -173056 341574 649610 821679 718860 248806 779963
566G79963k48009j41155n24796j70505K03700l54156L84797J52464J82948p2602
$$ 779963 531954 390799 -133997 -304502 -100802 -454958 -70161 82303 265251 192649
556A92649M03029l77964j73046n9943P069j00651J16153m72367K33213j04319
$$ 192649 595678 217714 44668 -15275 -8206 -108857 7296 -465071 -231858 -336177
546c36177k2392p7563J71092k62696k14764J3316M95901K46782p1583k8926k17533
$$ -336177 -358569 -436132 -265040 -527736 -742500 -729184 -233283 13499 -58084 -87010 -304543
535c04543J36289m0933L5057N6268J70580j39604M59652l45703k07990M2191J71567
$$ -304543 -168254 -209187 -174130 -117862 52718 -86886 372766 27063 -180927 -138736 32831
524C2831J65246O85002o00959J26059n1525m00519l09901K35595N79595n01440
$$ 32831 198077 883079 282120 408179 356654 -43865 -353766 -118171 461424 -40016
514d0016k36093R7800J08043K95422r943k09609j05527J25070K34956l9882J91589
$$ -40016 -276109 -178309 -70266 225156 215213 5604 -99923 25147 260103 220221 411810
503D11810k66095M8718L66116r69j11611J46062m06784n46501k1554O21153j21498
$$ 411810 145715 194433 560549 559580 447969 594031 187247 -359254 -380808 240345 118847
492A18847l60049n0371q2142K72363j13285K39601j69194l77787j11255O17351
$$ 118847 -241202 -291573 -373715 -101352 -214637 24964 -144230 -522017 -633272 -15921
482a5921q5748j21178J49137J34874J31029l32877J47596j61164M89356K5245
$$ -15921 -101669 -222847 -73710 61164 192193 -140684 6912 -154252 335104 360349
472C60349j24992j64384K81275j44486k81599J74915k71305M94268k51729j67979
$$ 360349 235357 70973 352248 207762 -73837 101078 -170227 324041 72312 -95667
462i5667M55978K8913K6109n34516L13718q0563j01326l12888J98883k15277l73984
$$ -95667 360311 389224 415333 -119183 194535 113972 12646 -300242 -101359 -316636 -690620
451f90620N49673R9601M02040l67735L19937m38015K40494J40307n9274j09715
$$ -690620 -140947 -41346 360694 -7041 312896 -125119 115375 255682 196408 86693
441H6693J4425R0651J79569o23512P3060k22528O37058l68424J48803j03566K9959
$$ 86693 101118 191769 371338 -252174 -179114 -401642 235416 -133008 15795 -87771 -57812
430e7812M61049n79922P6745o6928k23676L83738K96248m05696M35075m0145M5089
$$ -57812 403237 -176685 -99940 -166868 -390544 -6806 289442 -116254 318821 278676 323765
419C23765Q1873M83607M9674k64652k58468M57772m64585P2800k73777J72857
$$ 323765 405638 889245 938919 674267 415799 873571 408986 481786 208009 380866
409C80866l35409J8068j65417J76277M11967J63898m83021K90976J29965j44680
$$ 380866 45457 63525 -101892 74385 486352 650250 167229 458205 588170 443490
399D43490j31075l79686K71896k51961O85194l76401M2404p7809J84338j00960
$$ 443490 312415 -67271 204625 -47336 637858 261457 303861 226052 410390 309430
389C09430l70200j1099k71032O58188K6436l94418k48854N0398k8534K59055K05336
$$ 309430 -60770 -71869 -342901 315287 341723 -52695 -301549 -251151 -279685 -20630 184706
378A84706j53544n1595J91584P5620k80893q1565L66249J34809k1198m49651M14151
$$ 184706 31162 -20433 171151 246771 -34122 -115687 250562 385371 364173 -85478 328673
367C28673l9238p18802O53946j21342l49565K19908J51629n597R2167J71354l57113
$$ 328673 289435 -429367 224579 103237 -246328 -26420 125209 119612 211779 383133 26020
356B6020M0923m5502l54092N11365n0110J22917m1144J8808k16874j11873M34947
$$ 26020 66943 21441 -332651 178714 128604 251521 210377 229185 12311 -99562 335385
345C35385q5978J92353r4903j54341j61287M04239j03571N35422J24314n3109
$$ 335385 249407 441760 346857 192516 31229 435468 331897 867319 991633 938524
335I38524k84722k93353k33291k57650M06997J19562J08895O6655q0086j2015
$$ 938524 653802 360449 127158 -130492 276505 396067 504962 571617 491531 479516
325D79516L6854p34287j49596R2616O85108l6086k82190j27709K94100q1543k01983
$$ 479516 516370 -217917 -367513 -274897 410211 374125 91935 -35774 258326 176783 -25200
314b5200k92999Q53562L4261j50287n23236j38468M22853r368K75297Q3811J1867
$$ -25200 -318199 535363 569624 419337 -103899 -242367 180486 171118 446415 530226 542093
303E42093j59478n79745L4170J76607l25694J92017N9341K24695k40697n00149
$$ 542093 382615 -197130 -162960 13647 -312047 -120030 -60689 164006 -76691 -576840
293e76840M98670J00543N4476L88998j91535j32928J66209K72501k93477K50607
$$ -576840 -78170 22373 76849 465847 274312 141384 307593 580094 286617 537224
283E37224J05131l98810J37403l15033O7872J28647k46402J12683j00497m59775
$$ 537224 642355 243545 380948 65915 133787 262434 16032 128715 28218 -431557
273d31557l1756L7844N13032M40702k83395j88748J9084P9499J03611q3537L24666
$$ -431557 -463313 -425469 87563 528265 244870 56122 75206 154705 258316 174779 499445
262D99445K83470n08116k38741K35867k63828k15807M55392l31623K4174O23302
$$ 499445 782915 274799 36058 271925 8097 -207710 247682 -83941 -59767 563535
252E63535o70220r0495L49794k03142N77959j82461p1713J52030J5315L1144j72077
$$ 563535 -106685 -197180 152614 -50528 527431 344970 273257 425287 440602 471746 299669
241B99669n52823k956J48538P8733j5492N14682o43584M70126k21104n995n3874
$$ 299669 -253154 -256110 -107572 -28839 -44331 470351 -173233 296893 75789 69794 15920
230A5920J96445J39863j72771k92527M60506K7019l53470N59072j33909j79013
$$ 15920 212365 352228 179457 -113070 347436 374455 20985 580057 446148 267135
220B67135J76700l40151j80300N11217L84784j89028O4756J48274k74240k62809
$$ 267135 443835 103684 -76616 434601 819385 630357 695113 843387 569147 306338
210C06338K18128j7052p5279r4229j46767j23939j41351L98802l37923L84967
$$ 306338 524466 507414 432135 337906 191139 67200 -74151 324651 -13272 371695
200C71695j0151J21451j3289k82894J49130n54602P6861J40173l92629N95925
$$ 371695 361544 482995 469706 186812 335942 -218660 -141799 -1626 -394255 201670
190B01670j09483K88021l85368M0735K45632k76535K33422K31801l26617J83924
$$ 201670 92187 380208 -5160 35575 281207 4672 238094 469895 143278 327202
180C27202l315l41048K32812m51308n2335J29884K42465N08306o48442N43081
$$ 327202 323887 -17161 215651 -235657 -287992 -158108 84357 592663 -55779 487302
170D87302j34692j70882p9250L8449J70537l48268J38647J17853J97106r7030
$$ 487302 352610 181728 102478 140927 311464 -36804 101843 219696 416802 319772
160C19772p01618N73352k09992l38220M04218K74815K61407k55098l69871K77349
$$ 319772 -381846 191506 -18486 -356706 47512 322327 583734 328636 -41235 236114
150B36114j17197j93903N8316p1582K46649J03921k41144l6779p6681L19018J30910
$$ 236114 118917 -74986 -16670 -88252 158397 262318 21174 -15605 -92286 226732 357642
139C57642r8678N8091J6173n3116p07123J10201K04292J86789l70858R2490P50751
$$ 357642 258964 317055 333228 280112 -427011 -316810 -112518 74271 -296587 -204097 546654
128E46654j66389k16884L85252n84467J95178J17416K2473K06719j69837J87943
$$ 546654 380265 163381 548633 -35834 159344 276760 299233 505952 336115 524058
118E24058n57744L32454m14455l04496N40886L2192L3989M2025K4581R4490M5159
$$ 524058 -33686 298768 -115687 -420183 120703 152895 186884 228909 253490 347980 393139
107C93139R1293K5841k29789m7435P2580K4736L19669k39740K11350j1329m92464
$$ 393139 484432 510273 280484 233049 305629 330365 650034 410294 621644 610315 117851
96A17851p8011J60349M83898l91624k71924L8540J2847N5613k11890r3433k97592
$$ 117851 39840 200189 684087 292463 20539 59079 71926 127539 -84351 -177784 -475376
85d75376M73480L12951l70578P86348j92925L6872l0280j75809l55451Q4120J62260
$$ -475376 -1896 311055 -59523 726825 533900 570772 540492 364683 9232 93352 255612
74B55612k74228L5255l0612K35879K71910l0002L24414l3509k37063k94790j66650
$$ 255612 -18616 16639 -13973 221906 493816 463814 788228 754719 517656 222866 56216
63E6216k03904L63755N2607j66105K56951k8890j63157k52891O6744J85865k49376
$$ 56216 -147688 216067 268674 102569 359520 330630 167473 -85418 -18674 167191 -82185
52h2185L33465Q60k07574J35620j39113J11915k31040K3966K51710n9332K15314
$$ -82185 251280 252140 44566 180186 41073 152988 -78052 -54086 197624 138292 353606
41C53606k29106O6421J2487J484k99899k8117L61799J21391J13655j80028k13534
$$ 353606 124500 190921 203408 204892 -95007 -123124 238675 360066 473721 293693 80159
30H0159n1987J12964k49341n2764P04886m00274J18827j87986L27026P8880k29213
$$ 80159 28172 141136 -108205 -160969 543917 143643 262470 74484 401510 480390 251177
19B51177J86182k87703P0585N5685Q8938p8784j43121L20548J45201l40416K88598
$$ 251177 437359 149656 220241 275926 364864 286080 142959 463507 608708 268292 556890
8E56890p0394l37984m10077J07481L2267L45695q0257l3607
$$ 556890 486496 148512 -261565 -154084 -121817 223878 143621 110014
0A10014
$$ 110014
$$ Imaginary data points
##PAGE= N=2
##DATA TABLE= (X++(I..I)), XYDATA
16383b682208J2017l3546J00056K08717M7220l38071m07651J06940J30643K78706
$$ -2682208 -2670191 -2703737 -2603681 -2394964 -2347744 -2685815 -3093466 -2986526 -2855883 -2577177
16373b577177j1199J18709L14479j37964J15196l9655J39409q1544l37747M66666
$$ -2577177 -2588376 -2469667 -2155188 -2293152 -2177956 -2217611 -2078202 -2159746 -2497493 -2030827
16363b030827j31879O7838L30407K67352j1791m1665J70583j73579j40796J07034
$$ -2030827 -2162706 -2094868 -1764461 -1497109 -1508900 -1550565 -1379982 -1553561 -1694357 -1587323
16353a587323J63872j18628K65234P1940j37965K90345O5074Q8149l33580J7694
$$ -1587323 -1423451 -1542079 -1276845 -1204905 -1342870 -1052525 -987451 -899302 -1232882 -1215188
16343a215188p5612k8507K94311o5910l09221J46746M54554l02905L29253K97572
$$ -1215188 -1290800 -1319307 -1024996 -1090906 -1400127 -1253381 -798827 -1101732 -772479 -474907
16333d74907O8239j47129J88242m14131p6680l9069N27836J30345L15453k26435
$$ -474907 -406668 -553797 -365555 -779686 -856366 -895435 -367599 -237254 78199 -148236
16323a48236k43158J61749j22720P95338J83346m64418J78048k74414J24721q4938
$$ -148236 -391394 -229645 -352365 442973 626319 161901 339949 65535 190256 105318
16313A05318j33411K34006k22337K50189j4915q1330L70148J23029j30594p1235
$$ 105318 -28093 205913 -16424 233765 218850 137520 507668 630697 500103 428868
16303D28868n67534J47389K45364l38626M90517K82597o6970l60282o8365Q2172
$$ 428868 -138666 8723 254087 -84539 405978 688575 621605 261323 192958 275130
16293B75130m9313L38012j47432k07745L83314j64756k2040L18683L48764l00645
$$ 275130 225817 563829 416397 208652 591966 427210 405170 723853 1072617 771972
16283G71972l20974M41693j97331M71010K90322k35591k8384k1681l03283P6197
$$ 771972 450998 892691 695360 1166370 1456692 1221101 1192717 1171036 867753 943950
16273I43950r4621J06780O30057k89092L11980J79480r8259J6292o443j17579
$$ 943950 849329 956109 1586166 1297074 1609054 1788534 1690275 1706567 1700124 1582545
16263A582545l2250o5840J27192K81582J93862n15997K14187m18560P1091N30602
$$ 1582545 1550295 1484455 1611647 1893229 2087091 1571094 1785281 1366721 1437812 1968414
16253A968414M69153o9803r8613l78843J35334j12225n5947L06203j6524J39097
$$ 1968414 2437567 2367764 2269151 1890308 2025642 1913417 1857470 2163673 2147149 2286246
16243B286246m40986K82324k15485r0219j84116K72084J53639L85456J42999l13439
$$ 2286246 1845260 2127584 1912099 1821880 1637764 1909848 2063487 2448943 2591942 2278503
16233B278503K91113J28677k37225k32595N5447J27347j43166O8568O5061M70391
$$ 2278503 2569616 2698293 2461068 2228473 2283920 2411267 2268101 2336669 2401730 2872121
16223B872121l62313j93261J69330N82080j72851p9043L41929j03517m37905J89327
$$ 2872121 2509808 2316547 2485877 3067957 2895106 2816063 3157992 3054475 2616570 2805897
16213B805897K63007j81738p7204J60654O4935n9013m09868N2752Q9470J26527
$$ 2805897 3068904 2887166 2809962 2970616 3035551 2976538 2566670 2619422 2708892 2835419
16203B835419N8185K30691l70612N51139l05602m74452M97437n94941K08953L73824
$$ 2835419 2893604 3124295 2753683 3304822 2999220 2524768 3022205 2427264 2636217 3010041
16193C010041J7600j30499l04893R3502j7596J14511P67467l13173m61472R5039
$$ 3010041 3027641 2897142 2592249 2685751 2668155 2782666 3550133 3236960 2775488 2870527
16183B870527M78230J1187n77710l0167M62395j31827J84119l53679M08011K25634
$$ 2870527 3348757 3359944 2782234 2752067 3214462 3082635 3266754 2913075 3321086 3546720
16173C546720k29606J59729l72386M24440j54251L9822L36632k14961n07197M8300
$$ 3546720 3317114 3476843 3104457 3528897 3374646 3414468 3751100 3536139 3028942 3077242
16163C077242j21049K54148j6568k86389j04116K94482N13287l56700L79369l75121
$$ 3077242 2956193 3210341 3193773 2907384 2803268 3097750 3611037 3254337 3633706 3258585
16153C258585j61370K40970M3446O6130l38819M77295J92450m69760p084J08777
$$ 3258585 3097215 3338185 3381631 3447761 3108942 3586237 3778687 3308927 3301843 3410620
16143C410620m7114K6888j66168N7669O6599L10399n9656p1797L62658o98707
$$ 3410620 3363506 3390394 3224226 3281895 3348494 3658893 3599237 3527440 3890098 3191391
16133C191391K91026m22553L53665M76548k89510K58688k59368K4105J64521k51958
$$ 3191391 3482417 3059864 3413529 3890077 3600567 3859255 3599887 3623992 3788513 3536555
16123C536555J44343J23454m17414K51544j66124J3115L86426k27385M15137l85930
$$ 3536555 3680898 3804352 3386938 3638482 3472358 3485473 3871899 3644514 4059651 3673721
16113C673721j34430J63922l7070M44880j95146K68638k28936l48096k33181r2142
$$ 3673721 3539291 3703213 3666143 4111023 3915877 4184515 3955579 3607483 3374302 3282160
16103C282160M71364J46493n4014r7137j27629R8955J79326l90751M14734n02316
$$ 3282160 3753524 3900017 3846003 3748866 3621237 3720192 3899518 3508767 3923501 3421185
16093C421185l03937Q0580J37588l47785R6318J96446l3322j95223J91555O9803
$$ 3421185 3117248 3197828 3335416 2987631 3083949 3280395 3247073 3051850 3243405 3313208
16083C313208K39854K81132r18009q8594J76176M34097k5579J94783N97395n19010
$$ 3313208 3553062 3834194 2916185 2827591 3003767 3437864 3412285 3607068 4204463 3685453
16073C685453L6098L37151l97243N087j4679Q4736k71779M69422m7825l84776
$$ 3685453 3721551 4058702 3661459 3666546 3651867 3736603 3464824 3934246 3886421 3501645
16063C501645k62690L29753m24334M13014l8987M1007q5317R4824O83753l48921
$$ 3501645 3238955 3568708 3144374 3557388 3518401 3559408 3474091 3568915 4252668 3903747
16053C903747n07414K05042J32182M0802J9404l62848j39496K98576L24979n05460
$$ 3903747 3396333 3601375 3733557 3774359 3793763 3430915 3291419 3589995 3914974 3409514
16043C409514m448J15291O28473m70631k38216j2861M78526k01473Q8991l59551
$$ 3409514 3405066 3520357 4148830 3678199 3439983 3427122 3905648 3704175 3793166 3433615
16033C433615K98541j9417o5401N24300p34187L0352l57774N82863O67342l90471
$$ 3433615 3732156 3712739 3647338 4171638 3437451 3467803 3110029 3692892 4360234 3969763
16023C969763n18895J77643K25168L95095k06739J08979j38623J75417M8954o20375
$$ 3969763 3450868 3628511 3853679 4248774 4042035 4151014 4012391 4187808 4236762 3616387
16013C616387M72370J50751n02184J48388N8128j70230l64987M94868j56815m70289
$$ 3616387 4088757 4239508 3737324 3885712 3943840 3773610 3408623 3903491 3746676 3276387
16003C276387K97650J08531K92455j53684K93936o05428j9555R7379m8606M5902
$$ 3276387 3574037 3682568 3975023 3821339 4115275 3509847 3490292 3587671 3539065 3584967
15993C584967M74657p7592k20735J60061m07062K61993L7671L7128o9476r8002
$$ 3584967 4059624 3982032 3761297 3921358 3514296 3776289 3813960 3851088 3781612 3683610
15983C683610m3450M6676n552k73478m49624L15853K94954Q94j47429L51220M8417
$$ 3683610 3640160 3686836 3681284 3407806 2958182 3274035 3568989 3569883 3422454 3773674 3822091
15972C822091N15524j0761q06710N1375m01M32000j51651n07386j61512L6105
$$ 3822091 4337615 4326854 3520144 3571519 3571118 4003118 3851467 3344081 3182569 3218674
15962C218674K42931Q15626k82628j16636K48465k3688k35388l18861k1246K48394
$$ 3218674 3461605 4277231 3994603 3877967 4126432 4102744 3867356 3548495 3527249 3775643
15952C775643J7655j23123J50642k8084j66103J9005k86505J98518k14555P0134
$$ 3775643 3793298 3670175 3820817 3792733 3626630 3645635 3359130 3557648 3343093 3413227
15942C413227M56978j77843Q2447m24960N2858Q17682j25218Q6276K02570l58737
$$ 3413227 3870205 3692362 3774809 3349849 3402707 4220389 4095171 4181447 4384017 4025280
15932D025280P05242n15436l52258k18498J34776J43156K72683j76935l25093
$$ 4025280 4730522 4215086 3862828 3644330 3779106 3922262 4194945 4018010 3692917
15923C692917O57096k01228n6325k49707N3974j50604q0986L89758k11577k61223
$$ 3692917 4350013 4148785 4092460 3842753 3896727 3746123 3665137 4054895 3843318 3582095
15913C582095J90149J99183q0738k44378J7580k72137L18883P4423J02785R1856
$$ 3582095 3772244 3971427 3890689 3646311 3663891 3391754 3710637 3785060 3887845 3979701
15903C979701K61842l45280K36494o4154l17070k00855L92448L78212l85980j00592
$$ 3979701 4241543 3896263 4132757 4068603 3751533 3550678 3943126 4321338 3935358 3834766
15893C834766k39683O20370m16813R0676j29143J67035j57716K5409p5545n51330
$$ 3834766 3595083 4215453 3798640 3889316 3760173 3927208 3769492 3794901 3719356 3168026
15883C168026J59887N1309M5686J69993K30789K12038m83781l47359N7815P9138
$$ 3168026 3327913 3379222 3424908 3594901 3825690 4037728 3553947 3206588 3264403 3343541
15873C343541M5939M46780J36586j90318j04493O18985k02087o7910J49120l58248
$$ 3343541 3389480 3836260 3972846 3782528 3678035 4297020 4094933 4027023 4176143 3817895
15863C817895Q2966J5540n4462j02847M6551J66780l1767k08797L72426k73513
$$ 3817895 3900861 3916401 3861939 3759092 3805643 3972423 3940656 3731859 4104285 3830772
15853C830772K22209l462o28710L61430J13163M9923M04762k76029o02212P05936
$$ 3830772 4052981 4049519 3420809 3782239 3895402 3945325 4350087 4074058 3471846 4177782
15843D177782l50990R0909M12562m54731j80437K55527J52728o7876K33049l80336
$$ 4177782 3826792 3917701 4330263 3875532 3695095 3950622 4103350 4035474 4268523 3888187
15833C888187L65253l19612j93391O9939n3150m0200L79871J83779j47580K08883
$$ 3888187 4253440 3933828 3740437 3810376 3757226 3717026 4096897 4280676 4133096 4341979
15823D341979r5622l54715j98359k19467M4345J61724P4970L57161N397J39161
$$ 4341979 4246357 3891642 3693283 3473816 3518161 3679885 3754855 4112016 4117413 4256574
15813D256574L77512l64657l16559Q6329k90838K70893j89300J73188P09345j1205
$$ 4256574 4634086 4269429 3952870 4039199 3748361 4019254 3829954 4003142 4712487 4701282
15803D701282n15342o44660J37420K34711j54081L13574n0650k66546K69610N4202
$$ 4701282 4185940 3541280 3678700 3913411 3759330 4072904 4022254 3755708 4025318 4079520
15793D079520l22548l43177J94231K67356K42523j13439l52699K1695J58117n49842
$$ 4079520 3756972 3413795 3608026 3875382 4117905 4004466 3651767 3673462 3831579 3281737
15783C281737K24508J1101L16999q2236k59843J39001k31998k45374P72980j51330
$$ 3281737 3506245 3517346 3834345 3752109 3492266 3631267 3399269 3153895 3926875 3775545
15773C775545r1806L0408j3632o27678k11790L24429n9444Q77255j72494n2886
$$ 3775545 3683739 3714147 3700515 3072837 2861047 3185476 3126032 4003287 3830793 3777907
15763C777907k24871k29126M11554K78805m73237M05970N59707l19977K20136
$$ 3777907 3553036 3323910 3735464 4014269 3541032 3947002 4506709 4186732 4406868
15754D406868M125j40456o1519l31350r2797K82502k46602n3813O9728L38995
$$ 4406868 4410993 4270537 4209018 3877668 3784871 4067373 3820771 3766958 3836686 4175681
15744D175681q2895L06609K8588l15797k05703j13189k22059O7298N91082j07105
$$ 4175681 4092786 4399395 4427983 4112186 3906483 3793294 3571235 3638533 4229615 4122510
15734D122510J58523K81959n15390k20609k44916q9063N42239k24249K1011R9057
$$ 4122510 4281033 4562992 4047602 3826993 3582077 3493014 4035253 3811004 3832015 3931072
15724C931072L8532m14732N23534L84637p8531Q1261n26711l450k19720n12639
$$ 3931072 3969604 3554872 4078406 4463043 4384512 4465773 3939062 3935612 3715892 3203253
15714C203253M86382k95067K00150O508P50791n02827P7277J83981L5676l79213
$$ 3203253 3689635 3394568 3594718 3601226 4352017 3849190 3926467 4110448 4146124 3766911
15704C766911m11665N4103L29251J08574m21632M70561J55090n96141K45908L62442
$$ 3766911 3355246 3409349 3738600 3847174 3425542 3896103 4051193 3455052 3700960 4063402
15694D063402l17461p1734k18420N31643o0609K16254q81140j94700O47081j4379
$$ 4063402 3745941 3674207 3455787 3987430 3926821 4143075 3261935 3067235 3714316 3699937
15684C699937r7543J63772q6202K91256n12135O9603K85370m81137M18374O9991
$$ 3699937 3602394 3766166 3679964 3971220 3459085 3528688 3814058 3332921 3751295 3821286
15674C821286l93770o0247K68390J99949l13103q9300N44632j23341J40007n30966
$$ 3821286 3427516 3367269 3635659 3835608 3522505 3433205 3977837 3854496 3994503 3463537
15664C463537N93063l60409j2393K15798P7892o7747l16096k11312P53413N37029
$$ 3463537 4056600 3696191 3683798 3899596 3977488 3909741 3593645 3382333 4135746 4672775
15654D672775J40745j15208n94103J85365m0043K11849j76306L03595R69L07409
$$ 4672775 4813520 4698312 4104209 4289574 4249531 4461380 4285074 4588669 4589638 4897047
15644D897047m43701k75511j54461n7370K70568j80021J41604M9689K10042k52458
$$ 4897047 4453346 4177835 4023374 3966004 4236572 4056551 4198155 4247844 4457886 4205428
15634D205428o3714k67847k78164L22339M75252m21269K58882K89178l57579J10973
$$ 4205428 4141714 3873867 3595703 3918042 4393294 3972025 4230907 4520085 4162506 4273479
15624D273479l67899L0402J89668O3201l21620O8711k866q9174l0950j13124q819
$$ 4273479 3905580 3935982 4125650 4188851 3867231 3935942 3933076 3843902 3812952 3699828 3691009
15613C691009N3736r706m70079J09816K2077M04220K02015r7353Q5445l02561
$$ 3691009 3744745 3735039 3264960 3374776 3396853 3801073 4003088 3905735 3991180 3688619
15603C688619M53747p74847j70129K32326M59038K10215M4547k83766Q318O7594
$$ 3688619 4142366 3367519 3197390 3429716 3888754 4098969 4143516 3859750 3868068 3935662
15593C935662j54241j13405N57213j61464O553o66197K85380P801R9336K21599
$$ 3935662 3781421 3668016 4225229 4063765 4070318 3404121 3689501 3697302 3796638 4018237
15583D018237o4341m33273K48964m51454J53981o6940n410M12853p375Q2015R5721
$$ 4018237 3953896 3520623 3769587 3318133 3472114 3405174 3399764 3812617 3805242 3887257 3982978
15572C982978K05143p39366N18092j62169J7031n53905K69580O16111K27118j54222
$$ 3982978 4188121 3448755 3966847 3804678 3821709 3267804 3537384 4153495 4380613 4226391
15562D226391n0014L68786l80849q2785k9767m42832M20092k40833l16128J61969
$$ 4226391 4176377 4545163 4164314 4081529 4051762 3608930 4029022 3788189 3472061 3634030
15552C634030L12864n7785j04347Q9515R4010M50533k88578K65427l70716j6527
$$ 3634030 3946894 3889109 3784762 3874277 3968287 4418820 4130242 4395669 4024953 4008426
15542D008426K25972l34068l1554j05013L87125j01984K9501j44585R6938P8596
$$ 4008426 4234398 3900330 3868776 3763763 4150888 4048904 4078405 3933820 4030758 4109354
15532D109354K95610l91739l0000K07493j70971j13637J34802k32036j07853J14498
$$ 4109354 4404964 4013225 3983225 4190718 4019747 3906110 4040912 3808876 3701023 3815521
15522C815521J95208O3086K27406l29152l05436m28912O83322k36932J9705K78826
$$ 3815521 4010729 4073815 4301221 3972069 3666633 3237721 3921043 3684111 3703816 3982642
15512C982642m52615j1825O913J72737K2855j31691J65475K32396j32048k83690
$$ 3982642 3530027 3518202 3525115 3697852 3720707 3589016 3754491 3986887 3854839 3571149
$$ [...]
##END NTUPLES=NMR SPECTRUM
##END=
