##TITLE=1H_EC-3260(5)
 CDCl3, 8 sc, 
 23.08.2021
##JCAMPDX= 6.0         $$ Bruker NMR JCAMP-DX V2.0
##DATA TYPE= NMR SPECTRUM
##DATA CLASS= NTUPLES
##ORIGIN= UXNMR, Bruker Analytische Messtechnik GmbH
##OWNER= root
$$ XWIN-NMR		Version 3.5
$$ Mon Aug 23 08:59:43 2021 Russian Standard Time (UT+4h)  she@DPX200
##.OBSERVE FREQUENCY= 200.131506
##.OBSERVE NUCLEUS= ^1H
##.ACQUISITION MODE= SIMULTANEOUS
##.ACQUISITION SCHEME= undefined
##.AVERAGES= 8
##.DIGITISER RES= 18
##SPECTROMETER/DATA SYSTEM= spect
##.PULSE SEQUENCE= zg30
##.SOLVENT NAME= CDCl3
##.SHIFT REFERENCE= (INTERNAL, CDCl3, 0, 17.4971)
##AUDIT TRAIL= $$ (NUMBER, WHEN, WHO, WHERE, WHAT)
$$ ##TITLE= Audit trail, XWIN-NMR		Version 3.5
$$ ##JCAMPDX= 5.01
$$ ##ORIGIN= Bruker BioSpin GmbH
$$ ##OWNER= she
$$ F:/spectra/data/she/nmr/H-F/1/pdata/1/auditp.txt
$$ ##AUDIT TRAIL=  $$ (NUMBER, WHEN, WHO, WHERE, WHAT)
(   1,<2021-08-23 08:57:51.84 +0400>,<she>,<DPX200>,
      <created by zg, POWCHK disabled, PULCHK disabled
       configuration hash MD5:
       00 E9 B6 7A A2 85 ED C7 34 08 36 98 17 FE 4E 26
       data hash MD5: 16K
       BB 9C 6E F9 DC 11 95 1E 08 00 84 E6 3B BB 8F 9A>)
(   2,<2021-08-23 08:58:13.71 +0400>,<she>,<DPX200>,
      <Start of raw data processing
       efp BC_mod = 2 LB = 0.24 FT_mod = 6 PKNL = 1 PHC0 = -13355.04 PHC1 = 10.40099 SI = 16K 
       data hash MD5: 16K
       62 4B 67 71 03 5E D0 F0 4D B4 D0 5E 03 53 DB E2>)
(   3,<2021-08-23 08:58:34.82 +0400>,<she>,<DPX200>,
      <pk PHC0 = -1.889291 PHC1 = 3.4 
       data hash MD5: 16K
       D5 31 B8 76 E3 F2 52 BF 38 EB AE 41 10 DA EF C7>)
(   4,<2021-08-23 08:58:38.56 +0400>,<she>,<DPX200>,
      <abs ABSG = 5 
       data hash MD5: 16K
       28 4A 25 C5 BE 59 C1 55 A1 4C E0 D9 66 35 32 3E>)
$$ ##END=
$$ 
$$ hash MD5
$$ B8 80 7E 36 21 8E F4 66 A6 7A C4 88 EC 54 13 97
##$RELAX= 
##$RELAX= 
##$RELAX= 
##$RELAX= 
##$RELAX= 
##$RELAX= 
$$ Bruker specific parameters
$$ --------------------------
##$DU= <F:/spectra>
##$EXPNO= 1
##$NAME= <H-F>
##$PROCNO= 1
##$TYPE= <nmr>
##$USER= <she>
##$AMP= (0..31)
100 100 100 100 100 100 100 100 100 100 100 100 100 100 100 100 100 100 
100 100 100 100 100 100 100 100 100 100 100 100 100 100 
##$AQSEQ= 0
##$AQ_mod= 1
##$AUNM= <au_zg>
##$AUTOPOS= <>
##$BF1= 200.13
##$BF2= 200.13
##$BF3= 200.13
##$BF4= 200.13
##$BF5= 200.13
##$BF6= 200.13
##$BF7= 200.13
##$BF8= 200.13
##$BYTORDA= 1
##$CFDGTYP= 0
##$CFRGTYP= 5
##$CHEMSTR= <none>
##$CNST= (0..31)
1 1 145 1 1 1 1 1 1 1 1 1 1 1 1 1 1 1 1 1 1 1 1 1 1 1 1 1 1 1 1 1 
##$CPDPRG= <>
##$CPDPRG1= <>
##$CPDPRG2= <>
##$CPDPRG3= <>
##$CPDPRG4= <mlev>
##$CPDPRG5= <mlev>
##$CPDPRG6= <mlev>
##$CPDPRG7= <mlev>
##$CPDPRG8= <mlev>
##$CPDPRGB= <>
##$CPDPRGT= <>
##$D= (0..31)
0 1.2 0 0 0 0 0 0 0 0.06 0 0.03 0 0 0 0 0.0002 0 0 0 0 0 0 0 0 0 0 0 0 
0 0 0 
##$DATE= 1629694671
##$DBL= (0..7)
120 120 120 120 120 120 120 120 
##$DBP= (0..7)
150 150 150 150 150 150 150 150 
##$DBP07= 0
##$DBPNAM0= <>
##$DBPNAM1= <>
##$DBPNAM2= <>
##$DBPNAM3= <>
##$DBPNAM4= <>
$$ [...]
##$SUBNAM3= <"">
##$SUBNAM4= <"">
##$SUBNAM5= <"">
##$SUBNAM6= <"">
##$SUBNAM7= <"">
##$SUBNAM8= <"">
##$SUBNAM9= <"">
##$SW= 20.0188882624521
##$SWIBOX= (0..15)
0 0 2 0 0 0 0 0 0 0 0 0 0 0 0 0 
##$SW_h= 4006.41025641026
##$TD= 16384
##$TD0= 1
##$TE= 0
##$TE2= 300
##$TE3= 300
##$TEG= 300
##$TL= (0..7)
0 120 120 120 120 120 120 120 
##$TP= (0..7)
150 150 150 150 150 150 150 150 
##$TP07= 0
##$TPNAME0= <>
##$TPNAME1= <>
##$TPNAME2= <>
##$TPNAME3= <>
##$TPNAME4= <>
##$TPNAME5= <>
##$TPNAME6= <>
##$TPNAME7= <>
##$TPOAL= (0..7)
0.5 0.5 0.5 0.5 0.5 0.5 0.5 0.5 
##$TPOFFS= (0..7)
0 0 0 0 0 0 0 0 
##$TUNHIN= 0
##$TUNHOUT= 0
##$TUNXOUT= 0
##$USERA1= <user>
##$USERA2= <user>
##$USERA3= <user>
##$USERA4= <user>
##$USERA5= <user>
##$V9= 5
##$VALIST= <valist>
##$VCLIST= <CCCCCCCCCCCCCCC>
##$VD= 0
##$VDLIST= <DDDDDDDDDDDDDDD>
##$VPLIST= <PPPPPPPPPPPPPPP>
##$VTLIST= <TTTTTTTTTTTTTTT>
##$WBST= 1024
##$WBSW= 4
##$XGAIN= (0..3)
0 0 0 0 
##$XL= 0
##$YL= 0
##$YMAX_a= 133938
##$YMIN_a= -218120
##$ZGOPTNS= <>
##$ZL1= 120
##$ZL2= 120
##$ZL3= 120
##$ZL4= 120
##$ABSF1= 17.49711
##$ABSF2= -2.521927
##$ABSG= 5
##$ABSL= 3
##$ALPHA= 0
##$AQORDER= 0
##$ASSFAC= 0
##$ASSFACI= 0
##$ASSFACX= 0
##$ASSWID= 0
##$AUNMP= <proc_1d>
##$AZFE= 0.1
##$AZFW= 0.1
##$BCFW= 0
##$BC_mod= 2
##$BYTORDP= 0
##$COROFFS= 0
##$CY= -3
##$DATMOD= 1
##$DC= 0
##$DFILT= <>
##$DTYPP= 0
##$F1P= 0
##$F2P= 0
##$FCOR= 1
##$FTSIZE= 16384
##$FT_mod= 6
##$GAMMA= 0
##$GB= 0
##$INTBC= 1
##$INTSCL= 1.334414e-10
##$ISEN= 128
##$LB= 0.24
##$LEV0= 0
##$LPBIN= 0
##$MAXI= 10000
##$MC2= 0
##$MEAN= 0
##$ME_mod= 0
##$MI= 1.114404
##$NCOEF= 0
##$NC_proc= -7
##$NLEV= 6
##$NOISF1= 3.799351
##$NOISF2= 2.8
##$NSP= 0
##$NTH_PI= 0
##$NZP= 0
##$OFFSET= 17.49711
##$PC= 1
##$PHC0= -13356.93
##$PHC1= 13.80099
##$PH_mod= 1
##$PKNL= yes
##$PPARMOD= 0
##$PSCAL= 0
##$PSIGN= 0
##$REVERSE= no
##$SF= 200.130007508891
##$SI= 16384
##$SIGF1= 3
##$SIGF2= 2
##$SINO= 5.538805
##$SIOLD= 16384
##$SREGLST= <1H.CDCl3>
##$SSB= 0
##$STSI= 16384
##$STSR= 0
##$SW_p= 4006.41025641026
##$SYMM= 0
##$S_DEV= 0
##$TDeff= 16384
##$TDoff= 0
##$TI= <>
##$TILT= no
##$TM1= 0
##$TM2= 0
##$TOPLEV= 0
##$USERP1= <user>
##$USERP2= <user>
##$USERP3= <user>
##$USERP4= <user>
##$USERP5= <user>
##$WDW= 1
##$XDIM= 16384
##$YMAX_p= 277035546
##$YMIN_p= -719601
$$ End of Bruker specific parameters
$$ ---------------------------------
##NTUPLES= NMR SPECTRUM
##VAR_NAME=  FREQUENCY,     SPECTRUM/REAL,   SPECTRUM/IMAG
##SYMBOL=    X,             R,               I
##VAR_TYPE=  INDEPENDENT,   DEPENDENT,       DEPENDENT
##VAR_FORM=  AFFN,          ASDF,            ASDF
##VAR_DIM=   16384,         16384,           16384
##UNITS=     HZ,            ARBITRARY UNITS, ARBITRARY UNITS
##FACTOR=    0.24454680195387, 1,            1
##FIRST=     3501.69682909584, 0,            0
##LAST=      -504.713427314421, 0,           0
##MIN=       -504.713427314421, -719601,     0
##MAX=       3501.69682909584, 277035546,    0
$$ Real data points
##PAGE= N=1
##DATA TABLE= (X++(R..R)), XYDATA
$$ [...]
6865B99708K04660k72219K2288J0354j45359J68922J6431J06731r8938j15027
6855A97551l039O4942q5166P0968j44751J86645r2854k28038P4839j44883J16456
6844A2670j8674j67404J83862j03210J32437m0330j17126L97888k72940n7123
6834d9950L3559J4271j59137O7398J02138K8377j46483j17130J71219m834m564
6823f5136J16330M0672Q6930r2492j16940K22133j72098K0392K27839k52068M1902
6812E7464J54101m1831Q2134j46670J6407l20488J6151J74527q0732K35177k2560
6801A23680j65126j42126O208L9335K92017k905j57234K07228q1577j09925J09985
6790A19560Q3666J11428k03865L4439p7141j52556J30397J95819l9940P0591k46450
$$ y = [299708, 504368, 232149, 254437, 264791, 119432, 288354, 304785, 411516, 312578, 197551, 194512, 259454, 174288, 245256, 100505, 287150, 194296, -33742, 41097, -103786, 12670, -6004, -173408, 10454, -92756, 39681, -649, -117775, 280113, 7173, -49950, -16391, -2120, -161257, -93859, 8279, 36656, -109827, -226957, -55738, -60572, -65136, 51194, 91866, 178796, 86304, -30636, 191497, 19399, 39791, 267630, 15562, 57464, 211565, 169734, 251868, 105198, 121605, -198883, -182732, -8205, -88937, 146240, 123680, -41446, -183572, -177364, -138029, 153988, 151083, -6151, 201077, 119500, 9575, 119560, 203226, 314654, 110789, 145228, 68087, -84469, 45928, 241747, 201807, 272398, 25948]
6779B5948N2106O8038j69392J05312R3844L1563l3338o2616n6301j38944p3173
6768a56953Q9772Q1087K20729K4966Q3794k90795m493K01375J58819k73269q486
6757A26546K4447K20605J18479j91539P7801j29623N5451K05793j10791j60699
6747B36470N4785q6061J56939M2020q0384r4283k55626J48398J77595k05661N8662
6736A52854j86844j61689J73577K65252l39813n1420J80972J11864P8286j81699
6726D1340M4584j34201K24754J60002J30153j19170n5760m5K28972N2854N4666
6715F28149J10568j14485j38628J51988L4571k18219q1879J16996q5472J64691
6705E68280M921k20017J86975P4116o6952k04750J65091J10061k6990l7582k03310
$$ y = [25948, 78054, 146092, -23300, 82012, 175856, 207419, 174081, 111465, 55164, -83780, -156953, -67181, 13906, 234635, 259601, 343395, 52600, 48107, 249482, 408301, 135032, 126546, 150993, 371598, 490077, 298538, 376339, 246716, 302167, 507960, 397169, 236470, 291255, 205194, 362133, 404153, 323769, 229486, -26140, 122258, 299853, 94192, 152854, -33990, -195679, -22102, 243150, -96663, -148083, 32889, 144753, 223039, 41340, 85924, -48277, 176477, 336479, 466632, 347462, 291702, 291657, 520629, 573483, 628149, 738717, 624232, 485604, 637592, 672163, 453944, 372065, 489061, 403589, 568280, 573201, 353184, 540159, 614275, 547323, 342573, 507664, 617725, 590735, 553153, 349843]
6694C49843L2455j3656k209r297l9215J74106o1197q0445m4461L0687J7919j61499
6682A93031Q5173J64946Q1979k65546J4661j5553N917m7120O0771J99870j82454
6671B95675J14039j38702P480K00918Q2J36619J09925m9470O9904m659J32086
6660H73897K15034j90848Q753J06534j11885K50933J70929o8085r999M9800J86672
6649A481735j73112r701m1352L6967j09369m3985J04848J25573Q5692j39342R9470
6638A417424J6135j91166J2226M00022Q3817k64509l9839J40867j53928J3144
6628A434193m5607J04671J37662k10167J15855K41018K7736P1987K10600j37374
6618A950574K408J77929M9995K01349N4572J04149l65572J89867J47604l5388
$$ y = [349843, 382298, 368642, 366433, 357136, 317921, 492027, 430830, 350385, 305924, 336611, 354530, 193031, 278204, 443150, 525129, 259583, 274244, 258691, 264608, 217488, 278259, 478129, 295675, 409714, 271012, 278492, 479410, 479492, 616111, 726036, 676566, 746470, 741811, 873897, 1088931, 898083, 906836, 1013370, 901485, 1152418, 1323347, 1255262, 1245263, 1295063, 1481735, 1308623, 1298922, 1257570, 1294537, 1185168, 1141183, 1246031, 1371604, 1457296, 1317954, 1417424, 1433559, 1242393, 1254619, 1654641, 1738458, 1473949, 1434110, 1574977, 1421049, 1434193, 1388586, 1493257, 1630919, 1420752, 1536607, 1777625, 1805361, 1877348, 2087948, 1950574, 1952982, 2130911, 2180906, 2382255, 2436827, 2540976, 2175404, 2365271, 2512875, 2477487]
6608B477487P5697J15055J00559k6121Q7272K83972P778J67332O417j09888K42251
6597C427811J7882Q7231P5911J14277J74897O3042n6410r7155L79763J07836O7739
6586D362824K22914K22237J02854M7215j05594L51529J54939n372L87014O21381
6576F361941M12739Q0315L11891M19038L93590M63560M96987L92590O98569P70195
6566A0801415N81565Q22828J116391J208109J430905J799008K015759K613249
6558B2389229K739888L211381L132842L017602L708037M272972N024529O326522
6550E3823002O658175N307709K233372k580302o192745p571185o662403n428790
6542C9586833l882826k022896j035391K81176Q46061N27092K56939r93197k620172
$$ y = [2477487, 2553184, 2668239, 2768798, 2742677, 2829949, 3113921, 3121699, 3289031, 3295448, 3185560, 3427811, 3445693, 3532924, 3608835, 3723112, 3898009, 3961051, 3904641, 3807486, 4187249, 4295085, 4362824, 4585738, 4807975, 4910829, 4958044, 4852450, 5203979, 5358918, 5353546, 5740560, 6361941, 6774680, 6854995, 7166886, 7585924, 7979514, 8443074, 8940061, 9332651, 10031220, 10801415, 11382980, 12205808, 13322199, 14530308, 15961213, 17760221, 19775980, 22389229, 25129117, 28340498, 31473340, 34490942, 38198979, 42471951, 47496480, 53823002, 60481177, 65788886, 68022258, 65441956, 59249211, 51678026, 45015623, 39586833, 35704007, 33681111, 32645720, 32926896, 33772957, 34300049, 34556988, 33563791, 30943619]
6533C0943619l291865l147259k947262j909362j725177j379516r19329o98778
6525A4925071o24759m49904l63071q1952o58128l21901p9470N4444J19168L51446
6515A2870944O60956Q92236R36219J444216J375907J722462J281022P37260m04017
6506B1517205j751291k276662k271936j996431j696155j267737q94426p40683
6498H621884p15890n32163m83971n18797m17187k23064m74949l87487j21162k4951
6488D722263l67536l96805K2531n0303l27378l27850o4520J28353l04442p4697
6478B959616J23500l03947k39751j93096j72205k3952L14050m37766l00855J83646
6468A909240K13640j43196j95081n5574l78414P7972J20297N3079j54912p6457
$$ y = [30943619, 27651754, 24504495, 21557233, 19647871, 17922694, 16543178, 15623849, 14925071, 14300312, 13850408, 13487337, 13405385, 12747257, 12425356, 12345886, 12400330, 12519498, 12870944, 13531900, 14424136, 15360355, 16804571, 18180478, 19902940, 21183962, 21921222, 21517205, 19765914, 17489252, 15217316, 13220885, 11524730, 10256993, 9362567, 8621884, 7905994, 7373831, 6889860, 6371063, 5953876, 5730812, 5255863, 4868376, 4747214, 4722263, 4354727, 3957922, 3980453, 3930150, 3602772, 3274922, 3210402, 3338755, 3034313, 2959616, 3083116, 2779169, 2539418, 2346322, 2174117, 2150165, 2464215, 2026449, 1725594, 1909240, 2122880, 1979684, 1784603, 1729029, 1350615, 1428587, 1548884, 1601963, 1447051, 1370594]
6458A370594L4176J89488k25822M7565j6283J16197j57911j56529K51490k48057
6448A204908j62515J02514j90404Q0687Q086l30689L2290K22610k9864j24815
6438H12808M7534J72181m533L659k69981K6922K19339l11n0106j56061J18856
6427I20307N2748r5312J6440l09174J42374J55891L1885N8740N0126k26292j37677
6416F60056j53505K86761l06320k77582L01388J41785p1172K78729k19923k59197
6406C81020p2625K43961p0381l03409J14830N8926J48509k30300j89481J39624
6396B20674l17721K3880J87973J2675p200J1514K05015j33981k09017m469L46709
6385C36052o4989P1868j17769K88504Q8215l00182J49268J63348M4318Q9238M4444
$$ y = [1370594, 1404770, 1594258, 1368436, 1416001, 1399718, 1515915, 1358004, 1201475, 1452965, 1204908, 1042393, 1144907, 954503, 1035190, 1043276, 712587, 744877, 967487, 937623, 812808, 860342, 1032523, 1027990, 1031649, 761668, 788590, 1007929, 1007618, 957512, 801451, 920307, 973055, 877743, 894183, 585009, 727383, 883274, 915159, 973899, 1024025, 797733, 660056, 506551, 793312, 486992, 209410, 510798, 652583, 581411, 860140, 640217, 381020, 308395, 552356, 481975, 178566, 293396, 352322, 500831, 270531, 81050, 220674, -97047, -73167, 114806, 127481, 120281, 131795, 336810, 202829, -6188, -10657, 336052, 271063, 342931, 225162, 513666, 601881, 301699, 450967, 614315, 658633, 747871, 792315]
6374G92315o5841k00858J34315k97479k53324n4596K1589J39099r8957J34974
6364B51237j06157M9850J63524k14058J6965m4801k49784J56670R7392m3960j29725
6353e2847r4913K45180q381N3325k75621p6115L47708M5172q7608P3663M5172
6342B14735j895q2400m9127k7827K35349L2775Q3414R095m5772k4933l9306n5903
6330B48205k23581K07514N4250r8594J15800l8660k02045l3155J65647p5423m3496
6319G6462o8119M0791Q6492j18334m6982P5755j75542J7103J7967J01369J71212
6308A78174m3726m7459P8488j6484M0504k31769m4879j35739J46702P0058k40896
6297b47026K80900J56618j07720j17612j46828N2648J50162l1757J2193k13352
$$ y = [792315, 726474, 525616, 659931, 362452, 109128, 54532, 76121, 215220, 116263, 251237, 145080, 194930, 358454, 144396, 161361, 116560, -133224, 23446, 120838, 76878, -52847, -147760, 97420, 89039, 142364, -133257, -209372, 138336, 183508, 95900, 169563, 214735, 212840, 130440, 81313, 53486, 288835, 321610, 405024, 414119, 368347, 343414, 304108, 248205, 24624, 232138, 286388, 187794, 303594, 264934, 62889, 29734, 195381, 119958, 76462, 8343, 49134, 135626, 17292, -29690, 46065, -129477, -112374, -94407, 6962, 178174, 134448, 86989, 165477, 148993, 189497, -42272, -87151, -222890, -76188, -6130, -247026, 33874, 190492, 82772, -34840, -181668, -129020, 21142, -10615, 1578, -211774]
6287b11774K96226K54833j88719J25757J14846J4018j05662n121j67910j77318
6277e0824J47108J30585Q7399j42858j7665j69636K93521n6349n5052N6751j16055
6266A06925N2900J06396j71561k0076J24606k32112Q3892J23212K58616j55621
6256B77177k94270K59684m8500k27196K41018j72702Q1538O6m5057k864J92455
6245B61349l16282j44562L62245Q5634j86191j12877J22755o0632K09896m2125
6235A79210l05717m181J34415k65037J5231l4314J44166J83267P5101k39597k417
6224a19873l3910J84966k2240K62962K2424r3695l4733j53586p1813J48328R3523
6213A82353J40429k4866J28639j86295l88104K39638k5961l3208J26401l8319
$$ y = [-211774, 84452, 339285, 150566, 276323, 391169, 405187, 299525, 294404, 126494, -50824, 96284, 226869, 314268, 171410, 153745, -15891, 277630, 221281, 166229, 222980, 106925, 159825, 266221, 94660, 74584, 199190, -32922, 50970, 174182, 432798, 277177, -17093, 242591, 194091, -33105, 207913, 35211, 116749, 116815, 71758, 68894, 261349, -54933, -199495, 162750, 248384, 62193, -50684, 72071, 11439, 221335, 179210, -126507, -130688, 3727, -261310, -246079, -280393, -136227, 47040, 122141, -117456, -119873, -153783, 31183, 8943, 271905, 294329, 200634, 165901, 12315, -59498, 88830, 182353, 322782, 297916, 426555, 240260, -147844, 91794, 65833, 32625, 159026, 120707]
6203A20707J45719q6524j92666K11473n7656p4750j1631j70053K34760q4158P9642
6192A14863N4573k77009K47406K13253k14769J9165K42934k79101J04217J35589
6182C61121k42532k05730J09135j67567L06543J20864j07149r1423J26685J7914
6172B27861J80504L430k52230J9183J85064m75152O0385L63304j26171J66398
6162C52576l24706J4997j13711M2308L42612k7027j08682J7242o8539R4759P1467
6151B93296n2633m3746L10044j41981l03565R3779R4513k4932L73316J10596n48805
6140A59882J00900J90857j69041j3404J46084k03838k6504p5527j23089o5739
6130g9419J87148J97703j38935k08167o4140O7907P8918L8322j55544r8244L1473
$$ y = [120707, 266426, 179902, -12764, 198709, 141053, 66303, 54672, -115381, 119379, 35221, 114863, 169436, -107573, 139833, 353086, 138317, 157482, 400416, 121315, 225532, 361121, 118589, -87141, 21994, -145573, 160970, 281834, 174685, 83262, 209947, 227861, 408365, 411795, 159565, 178748, 363812, -111340, -50955, 312349, 186178, 352576, 27870, 42867, -70844, -28536, 314076, 287049, 178367, 195609, 127070, 221829, 293296, 240663, 196917, 506961, 364980, 61415, 155194, 249707, 224775, 598091, 708687, 159882, 260782, 451639, 282598, 269194, 415278, 211440, 184936, 109409, -13680, -79419, 107729, 305432, 166497, -41670, -105810, -37903, 41015, 79337, -76207, -174451, -142978]
6119a42978j06501J8247L4930J04676q6122J92773m7407j66918J5200J6458J16264
6108e1378L4896p6831J13982J04046L8231j8776j90115j73041o0969K59934J61574
6097A41553J09925j47151K19245k16867o0643K59011L0758k3586J19j0149k10816
6086I1399M0583j8000r5333K01673j89682L3681J65945q0124p643j7370J52076
6075B77205K1894J67261k7570k23422j69455j09513K74710J54095k00081J7484
6065A82608J80322K54661k36310q2761P2498r5908l6875J06699j37767p8165o3654
6054F5348q4168p5205j62197J55726j05834L600L46886l9875o4153O4404j75786
6043g1254n225O3746k46882J40174J05347p0832q7195P180P1233q187J19589j06840
$$ y = [-142978, -249479, -231232, -196302, -91626, -177748, 15025, -32382, -199300, -184100, -167642, -51378, -16482, -93313, 20669, 124715, 162946, 144170, -45945, -218986, -279955, -20021, 141553, 251478, 104327, 323572, 106705, 46062, 305073, 335831, 312245, 312364, 302215, 91399, 131982, 113982, 18649, 220322, 30640, 64321, 230266, 150142, 142499, 125129, 277205, 299099, 466360, 438790, 215368, 45913, -63600, 211110, 365205, 165124, 182608, 362930, 617591, 381281, 298520, 371018, 275110, 238235, 344934, 207167, 129002, 65348, -18820, -94025, -256222, -100496, -206330, -202730, 144156, 104281, 40128, 104532, -71254, -76479, -12733, -259615, -119441, -14094, -84926, -172121, -164941, -93708, -101895, 17694, -89146]
6031h9146R6700J20000k9195k975J19990k42997j13337K45001p29j3731J81208
6020B70789P5299k08033J438J95923l41481o3607M14534j48235q0736J00436J17334
6009C33661R7890l3191R0215l82415j12538L12324M4250O6110j3497l09118k41050
5998a47359k550R5391L18513J11395k72676j13282K04576O7695j48511j4291l7835
5987F1066L0420k2170n1399k31556m9729L2288J74943R9695l43069J50895K14131
5976F5515N5798R6760M1782k89895L480P2419k50932o5147L0866L76573J9021
5965A56240r90q7960o9961J69349r4334R5399J01282O1582l9920M3745R8093N3731
5953D86256r5918j3140K63147L9582j25927j19919M2562L0859j67855j27466J13283
$$ y = [-89146, 7554, 127554, 98359, 95384, 215374, -27623, -140960, 104041, 103312, 89581, 270789, 346088, 138055, 139493, 335416, -6065, -69672, 344862, 196627, 115891, 216327, 333661, 431551, 398360, 488575, 106160, -6378, 305946, 350196, 416306, 402809, 93691, -147359, -149909, -54518, 263995, 375390, 102714, -10568, 194008, 261703, 113192, 98901, 61066, 91486, 69316, 17917, -213639, -263368, -231080, -56137, 43558, -299511, -148616, 65515, 121313, 218073, 259855, -30040, -26560, 45859, -205073, -270220, -239354, 137219, 156240, 155250, 67290, -2671, 166678, 72344, 167743, 269025, 330607, 290687, 334432, 432525, 486256, 390338, 377198, 640345, 679927, 554000, 434081, 476643, 507502, 339647, 212181, 325464]
5942C25464r1118L16240m7940l24242K23172m6752j35028q5357q0097L09237P6903
5931D40482l48762J16187k44300l7096P9568L8234j22140k20732J05801J13627
5921g9131J93489N6188n7083j41417J04858j09144J14089J4446j34704J57586
5911A19177j07637N9428K06538r8286K49388L6633o8316J70245k06103j1278P2694
5900D22483j28374o6096l8952N3254J52100j52120J2208R6653K8894j36708j23944
5889A19398J02409J53611Q1736m9011j04890r0092K53794n5612J02331j60624
5879C53050J8790Q6118L3327r9429n5558Q0089K22277k07523M6649J5768k22264
5868B71294Q6730j07112O0617O4058j38405j09346J73912j67213N53855j61904
$$ y = [325464, 234346, 550586, 502646, 178404, 401576, 354824, 219796, 134439, 54342, 363579, 440482, 91720, 207907, -36393, -73489, 6079, 44313, -77827, -298559, -192758, -79131, 114358, 170546, 113463, -27954, 76904, -32240, 81849, 96295, -38409, 119177, 11540, 70968, 277506, 179220, 428608, 465241, 396925, 567170, 361067, 349789, 422483, 294109, 228013, 189061, 242315, 394415, 242295, 254503, 351156, 380050, 243342, 119398, 221807, 375418, 457154, 408143, 303253, 213161, 466955, 411343, 513674, 353050, 371840, 457958, 491285, 391856, 336298, 416387, 638664, 431141, 477790, 493558, 271294, 358024, 250912, 311529, 375587, 237182, 127836, 301748, 134535, 688390, 526486]
5858E26486l09532J43122n8973P5544l295j17516K42576q8766q4767j13585J87409
5847C98703o8169J73135R0486K83580j75627j11955J19112k60251K01089p4483
5837E75620k30323K76332J4672N9060m8406j44428J16146j0576Q5741k13199k6369
5826D54270J0960J76583j33998p3689q9811J78631N6609j64294K3920r2804j11601
5815B34776N8821L56048j43685j47552K09987n9287J63972J3376j63024p0345
5805D53087M25375j01853l93210K0342k8878K3207J59388P0418Q6042J17910j86445
5794F45383k00p807n7401N6489n2092J17253k09068j35287N2411j01379P4636
5783C82938K74897j95296L1964J6233O2874L78509k56393k14563P2822N8338j1523
$$ y = [526486, 216954, 360076, 301103, 376647, 373352, 255836, 498412, 409646, 324879, 211294, 398703, 330534, 503669, 594155, 877735, 702108, 590153, 709265, 449014, 650103, 575620, 345297, 621629, 636301, 695361, 646955, 502527, 618673, 608097, 693838, 480639, 454270, 465230, 641813, 507815, 434126, 344315, 522946, 579555, 415261, 439181, 346377, 234776, 293597, 649645, 505960, 358408, 568395, 509108, 673080, 686456, 523432, 453087, 878462, 776609, 383399, 403741, 374863, 398070, 557458, 627876, 713918, 831828, 645383, 645183, 637376, 579975, 636464, 584372, 701625, 492557, 357270, 409681, 308302, 382938, 657835, 462539, 494503, 510736, 573610, 952119, 695726, 481163, 553985, 612323, 600800]
5772F00800q9894P8796J73839l88795L6238J89611O7441j58805j17217K09110
5762F01124m1794K74335Q8713n244j60364J63490j07224L4712j33613j26455J39490
5751G27170j33086n0995k84293J45103K20580J16552J18095N9388j47108L16185
5741A087591O6239k42440J98696n227l17214M8987J1077Q9615q7762m1083K3179
5730H31658J48697J205L345L06058J982j02585q115o4002k34309J09287R8813
5719A092034j16171j2159j21549j63306K86485r3670j5649j36818o8307N4232
5709G05122J23512M7362k67625j0869J53392K05519j41798m3283J16249M12180
5699A299761j28236j67556r5557J26973N01178j07831q174j97789n0181J46862
$$ y = [600800, 510906, 589702, 763541, 374746, 410984, 600595, 668036, 509231, 392014, 601124, 559330, 833665, 922378, 917134, 756770, 920260, 813036, 847748, 714135, 587680, 727170, 594084, 543089, 258796, 403899, 624479, 741031, 859126, 918514, 771406, 1087591, 1153830, 911390, 1110086, 1104859, 787645, 836632, 847709, 937324, 849562, 808479, 831658, 980355, 981560, 984905, 1290963, 1292945, 1190360, 1182245, 1118243, 883934, 993221, 1092034, 975863, 963704, 842155, 678849, 965334, 871664, 856015, 719197, 650890, 705122, 828634, 875996, 608371, 597502, 750894, 956413, 814615, 771332, 887581, 1299761, 1171525, 1003969, 908412, 1035385, 1536563, 1428732, 1420558, 1222769, 1172588, 1319450]
5689A319450O1491J06887j63919K31483l18172j42209L5076q8317L37049J4935
5679A393754J83150j3102m2268O499M2477p4544J17339j30732j08257J55117J66665
5668A696098J02791o4664j26284j01198j58042K79486J35593k98982j76811J27648
5658A415635l805K22887J58607j92969k72096j41269K35123L5545P275J61056
5648A625989n5907q867J98524J6237m7979n4353j65870J83575j16259J24653L0705
5637A730448m9930K92410m4067k2893R4992R5686l8711j3778j82378M77535l4144
5626B305170p9247J28161J5742L12813k8191j69611J72061r801K66023J36907
5616C050027O7430j00249m4793j12056O6712J82473J40726o2179M5173M8866J84206
$$ y = [1319450, 1380941, 1487828, 1323909, 1555392, 1237220, 1095011, 1130087, 1041770, 1378819, 1393754, 1576904, 1563802, 1521534, 1528033, 1570510, 1495966, 1613305, 1482573, 1374316, 1529433, 1696098, 1798889, 1734225, 1607941, 1506743, 1348701, 1628187, 1763780, 1464798, 1287987, 1415635, 1411830, 1634717, 1793324, 1600355, 1328259, 1186990, 1422113, 1457658, 1464933, 1625989, 1570082, 1561215, 1759739, 1775976, 1727997, 1673644, 1507774, 1691349, 1575090, 1699743, 1730448, 1680518, 1972928, 1928861, 1905968, 2000960, 2096646, 2057935, 2044157, 1861779, 2339314, 2305170, 2225923, 2354084, 2369826, 2682639, 2654448, 2484837, 2656898, 2647097, 2913120, 3050027, 3117457, 3017208, 2972415, 2860359, 2927071, 3109544, 3250270, 3188091, 3233264, 3282130, 3466336]
5605C466336L35753r7596L9497J63662j36080r662M22181j9507r9962K21441m9105
5594D236958K6451n2172o8414K91533J70705J11632K7689k4899M7087J16840K31633
5583E115043M49012Q267k6524J12465K16571J14983J20858K79163J25959L16526
5573F832323L34359J67857n2849J84341K90011K90181K77139L36830L29328K62537
5563I252057M85900M60318J81801M73623O81656Q03272R02427O16984J234430
5554A5092468J172856J204208J734818J577123J835937K246368K474642K980743
5546C0319163L058876K628280Q95304j442583k417540k651315k193647j250968
5538B6945570q96178q32975j57685O6589R3549M24887Q23346J133033J171571
$$ y = [3466336, 3802089, 3704493, 3743990, 3907652, 3771572, 3761910, 4184091, 4164584, 4064622, 4286063, 4236958, 4263409, 4211237, 4142823, 4434356, 4605061, 4716693, 4744382, 4719483, 4766570, 4883410, 5115043, 5564055, 5572322, 5545798, 5658263, 5874834, 5989817, 6110675, 6389838, 6515797, 6832323, 7166682, 7334539, 7281690, 7466031, 7756042, 8046223, 8323362, 8660192, 8989520, 9252057, 9737957, 10198275, 10380076, 10853699, 11535355, 12338627, 13241054, 13858038, 15092468, 16265324, 17469532, 19204350, 20781473, 22617410, 24863778, 27338420, 30319163, 33378039, 36006319, 36901623, 35459040, 33041500, 30390185, 28196538, 26945570, 26049392, 25216417, 25058732, 25125321, 25218870, 25643757, 26467103, 27600136, 28771707]
5529B8771707J475065K050467K217996K575373L289542L664847M688003N455689
5521E4188689N808117N493967K146245k498118o116202p421819o584321n174200
5513C9842358l491112k371798j496084j313823p72385n79500l14757l95728l66209
5504B8740962j7820j9234K50656O71499P66940J569598K010383K316959K921793
5495C9211736K816206K277340P81295j510635l233442l241463k740897k383118
5487C1977022j792662j309532r36636j289492j316434r68504p81274q87241p03939
5478B1991308q84017m98331k27650m09115p2857j24230J01859N53778N60966M89002
5468B1480713R22511P39313J019938R89159J269226J093337R54751K08789n57100
$$ y = [28771707, 30246772, 32297239, 34515235, 37090608, 40380150, 44044997, 48733000, 54188689, 59996806, 65490773, 67637018, 65138900, 59022698, 51600879, 45016558, 39842358, 36351246, 33979448, 32483364, 31169541, 30397156, 29817656, 29502899, 29107171, 28740962, 28723142, 28703908, 28954564, 29626063, 30393003, 31962601, 33972984, 36289943, 39211736, 42027942, 44305282, 45086577, 43575942, 40342500, 37101037, 34360140, 31977022, 30184360, 28874828, 27938192, 26648700, 25332266, 24363762, 23582488, 22695247, 21991308, 21107291, 20608960, 20381310, 19972195, 19899338, 19775108, 19876967, 20430745, 20991711, 21480713, 22403224, 23142537, 24162475, 25151634, 26420860, 27514197, 28468948, 28677737, 28120637]
5459B8120637j101719j555464j209875p73901p05634n87981o37386j50787K12452
5450B1610342J74722L11634L14739O75361M63967Q62736J033677J319495J626273
5441B8392946J476031J717086K116403K070217J715479J596573J565716J155832
5433D1806283J979149K070929J359376P70999p69455k202552k541128k322238
5425D0151363j695393j117583n69663p0179L54879P58514J120508J375153J929336
5416D2236935J797872J823822K161939K016377K186405K558948K898823L425164
5408F1106285M245115N158527N294442K922176n19221l926046n743469n108614
5400F3429195l782357l262750k618418k729155k358445j483863p67458p1020J4822
$$ y = [28120637, 27018918, 25463454, 24253579, 23479678, 22774044, 22186063, 21548677, 21397890, 21610342, 21785064, 22096698, 22411437, 23086798, 23550765, 24413501, 25447178, 26766673, 28392946, 29868977, 31586063, 33702466, 35772683, 37488162, 39084735, 40650451, 41806283, 43785432, 45856361, 47215737, 47986736, 47217281, 45014729, 42473601, 40151363, 38455970, 37338387, 36768724, 36698545, 37053424, 37811938, 38932446, 40307599, 42236935, 44034807, 45858629, 48020568, 50036945, 52223350, 54782298, 57681121, 61106285, 65351400, 70509927, 75804369, 78726545, 78207324, 74281278, 68537809, 63429195, 59646838, 56384088, 53765670, 51036515, 48678070, 47194207, 46426749, 46355729, 46370551]
5391D6370551L24560J17251n02409q36479q55919l32853K52238P76078P50562
5382D6063580J675993J833362P72397k80419j740965l577933l698735l221882
5374C7825398k639525k077839j452475j253897q29125o51325m66581k40668j75178
5365B8038785j79532o15894p16855r85518o25913k71455n47857m27543j40576
5356B3527642o76681n86123m41760q48195n36431m05215k12592m04037l87189
5347A9029419k35799m95289n59338l35989l31788j02075L8479N0729M05268L55702
5337A7819319L62178O90866P77390R19298J067493M53796N70690Q9282j005728
5328B1744584j246095j137918j372020q24650q36801n76148l70141l93283m43820
$$ y = [46370551, 46695111, 46812362, 46309953, 45473474, 44617555, 44284702, 44536940, 45313018, 46063580, 47739573, 49572935, 50345332, 50064913, 48323948, 44746015, 41047280, 37825398, 35185873, 33108034, 31655559, 30401662, 29572537, 28921212, 28454631, 28213963, 28038785, 27859253, 27243359, 26526504, 25540986, 24915073, 24643618, 24095761, 23668218, 23527642, 22850961, 22264838, 21823078, 20974883, 20438452, 20033237, 19820645, 19416608, 19029419, 18793620, 18298331, 17738993, 17403004, 17071216, 16969141, 17007620, 17058349, 17463617, 17819319, 18181497, 18872363, 19649753, 20569051, 21636544, 22090340, 22661030, 22750312, 21744584, 20498489, 19360571, 17988551, 17163901, 16327100, 15750952, 15380811, 14987528, 14543708]
5319A4543708n47998o14661l76149k40063m55830m42331L02436K88928j60269
5310A2297771j1217K28138N01360K06600J23453l28854m25477m69679n89227q65544
5300A0667324o59353n60684o04024l35814n58077m77144l71331l27105k77486
5291F496306l54996j60086j44173l17079L2829l23882j34749O8987j86371j69021
5281D807765k18892j86915k2940m19504r8867O7517p9393k25892k8419p3879J5722
5270C536303r7840l78230L1406K4423P7301J59345m85806L1750M76051k66096
5260C108607n1951j97704l9969J83668Q0516J23434J53166m6698J2145J8515L1067
5249C374796R7576k53124J40408K7052Q6007q3061k8220K3931J08990j01211J66531
$$ y = [14543708, 13995710, 13381049, 13004900, 12764837, 12309007, 11866676, 12169112, 12458040, 12297771, 12286554, 12514692, 13016052, 13222652, 13346105, 13017251, 12591774, 12122095, 11532868, 10667324, 10007971, 9447287, 8843263, 8507449, 7949372, 7472228, 7100897, 6773792, 6496306, 6141310, 5981224, 5837051, 5519972, 5552801, 5228919, 5094170, 5163157, 4976786, 4807765, 4588873, 4401958, 4379018, 3959514, 3860647, 3928164, 3848771, 3622879, 3594460, 3520581, 3536303, 3438463, 3060233, 3091639, 3116062, 3193363, 3352708, 2866902, 2898652, 3374703, 3108607, 3056656, 2858952, 2818983, 3002651, 3083167, 3206601, 3359767, 3313069, 3325214, 3343729, 3374796, 3472372, 3219248, 3359656, 3386708, 3472715, 3389654, 3361434, 3385365, 3494355, 3393144, 3559675]
5238C559675l6625N9150J25598J96944J44487k70127J78924j1500J39195J31273
5228D216994o6812K3972K03761p9604L23206L62575j13837K7481K59910R5680
5218E253326K42275j8108J40216Q7587L20844K29459J91888M01924K04559J82182
5208G236152O1779m19254o8176J31153K16226K16881J30262J62167L02565M78692
5198H448447Q5376j19732j05311L2978o9293M0138r2476J73402M36248K29270
5188I059047J79168O36616P99420J57576N36669M03728J92578K99088O95304P50577
5178A3709771J009732J232036J726039J498180j5331j633758k626996j957573
5170A2942100j545319j231412p94337o19465m44974n68222l88776M1237j59641
$$ y = [3559675, 3523050, 3582200, 3707798, 3904742, 4049229, 3779102, 3958026, 3946526, 4085721, 4216994, 4150182, 4174154, 4377915, 4298311, 4621517, 4984092, 4870255, 4897736, 5157646, 5253326, 5495601, 5477493, 5617709, 5705296, 6026140, 6255599, 6447487, 6849411, 7053970, 7236152, 7297931, 6878677, 6810501, 6941654, 7157880, 7374761, 7505023, 7667190, 7969755, 8448447, 8533823, 8414091, 8308780, 8341758, 8272465, 8312603, 8220127, 8393529, 8829777, 9059047, 9238215, 9874831, 10674251, 10831827, 11368496, 11772224, 11964802, 12263890, 12959194, 13709771, 14719503, 15951539, 17677578, 19175758, 19160427, 17526669, 14899673, 12942100, 11396781, 10165369, 9371032, 8751567, 8306593, 7738371, 7349595, 7390832, 7231191]
5161G231191k48082K02306j18771l51347j84244n55117l54772J11958k58200r9597
5151E375325K46756R9404l00642k4084k39002k79046k0459m81705j30110l0240
5141D216197k41297k79529o5603O5477k29544j91617J92494l30744j40695K01496
5131C196635j3179M1782j61915l35738M2896J6515j38027r856J1810R9005k69956
5120B479972l66039K46579J44116k90658M875j30826M20729q079k53531L5332
5110B282470j55608j8008J55261j3368L5535J05029j84671J90814j49471J11897
5100B359880q9521k05538j45901j11103K8352P1255k18859j59452q4053N8068
5090A503128N3587r8087R497J25534j45468k8947k934k17050Q4491j05525r8338
$$ y = [7231191, 6983109, 7185415, 7066644, 6715297, 6531053, 5975936, 5621164, 5733122, 5474922, 5375325, 5622081, 5721485, 5420843, 5396759, 5157757, 4878711, 4858252, 4376547, 4246437, 4216197, 3974900, 3695371, 3629768, 3695245, 3465701, 3274084, 3466578, 3135834, 2995139, 3196635, 3183456, 3225238, 3063323, 2727585, 2770481, 2786996, 2648969, 2639113, 2650923, 2749928, 2479972, 2113933, 2360512, 2504628, 2213970, 2218845, 2088019, 2508748, 2500669, 2247138, 2282470, 2126862, 2108854, 2264115, 2250747, 2286282, 2391311, 2206640, 2397454, 2247983, 2359880, 2270359, 2064821, 1918920, 1807817, 1836169, 1907424, 1688565, 1529113, 1445060, 1503128, 1556715, 1458628, 1468125, 1593659, 1448191, 1419244, 1416310, 1199260, 1283751, 1178226, 1079888]
5079A079888J09312j76482J13028k28680p8915L48728n5290N6232J70328j87719
5069A150430L7572O492J41971J73568j65424P1628L3672j84388J11576M1767O7898
5058A486762n8031O6385N7700k70697L1486p1924n6396j8417k43803K3099L07972
5047A254136l15449k7242Q5415r5364k03946p7636J61244k25565K55577K34938
5037A046108r8278j52150p808n2550J61148M92338m35473m2241K64731R2635o4440
5026A204020k32518L123R1471j34218M4008J88435o568k59100J44762J20832j6644
5015A147603j55583j48798q6286m2320P2448L9312M4416K7290j40023j71343O9478
5004F56194O2520O6270j59085j19149p1336k93897J81022L98130l0035j9491n5139
$$ y = [1079888, 1189200, 1012718, 1125746, 897066, 818151, 1166879, 1111589, 1167821, 1338149, 1150430, 1188002, 1194494, 1336465, 1510033, 1344609, 1416237, 1449909, 1265521, 1377097, 1418864, 1486762, 1428731, 1495116, 1552816, 1282119, 1313605, 1241681, 1185285, 1166868, 923065, 946164, 1254136, 938687, 911445, 996860, 901496, 697550, 619914, 781158, 555593, 811170, 1046108, 947830, 795680, 787872, 735322, 896470, 1388808, 953335, 911094, 1175825, 1268460, 1204020, 971502, 974625, 1066096, 931878, 975886, 1164321, 1157753, 898653, 1043415, 1164247, 1147603, 992020, 843222, 756936, 714616, 787064, 826376, 870792, 898082, 758059, 586716, 656194, 718714, 784984, 625899, 506750, 435414, 141517, 322539, 720669, 690634, 671143, 616004]
4993F16004L2933N1623P0917O3548r841R6460j1742R8363k14848j0482j20307
4982F62628J6220p8831K1570r7138K01941K300k04868J03607j56768J03507j46757
4971D27411j6545J55856J37089j95576j84897J79070L57106m18886M0888J37810
4961F19326J27201l1156m7737J25146K52655J77247j7308n4685j40989l9349k6207
4950I44144K20859J7406j35647K2672O2671l3871m3910K83705l35489l7969J51540
4939A116111P3725m9344j97044j46453j12327J87136j50878J155K26199j01235
4929H47045o0138K40197r7256R5167r2348o6181K33125M4541Q801M08543m0880
4918A520616p1378n1337k80283L00217L16189j42167j17951J18542o9269m4315
$$ y = [616004, 648937, 700560, 771477, 835025, 825184, 921644, 909902, 1008265, 793417, 782935, 662628, 678848, 600017, 621587, 524449, 726390, 728690, 523822, 627429, 470661, 574168, 427411, 410866, 566722, 703811, 508235, 323338, 502408, 859514, 440628, 481516, 619326, 746527, 715371, 667634, 792780, 1045435, 1222682, 1205374, 1150689, 1009700, 970351, 944144, 1165003, 1182409, 1046762, 1069434, 1132105, 1098234, 1054324, 1338029, 1002540, 964571, 1116111, 1189836, 1140492, 943448, 796995, 684668, 871804, 720926, 722081, 948280, 847045, 786907, 1027104, 929848, 1025015, 932667, 866486, 1099611, 1144152, 1152953, 1561496, 1520616, 1449238, 1397901, 1117618, 1417835, 1734024, 1591857, 1473906, 1592448, 1523179, 1478864]
4908A478864L0119r2484K31928j15622j11997J31585M4781l08845j17835K08751
4898A379245J55134M5370J60673q2531J98809J40926J38794K88823K93163L14811
4888C033217J2541n1397l5447m54808k5228L6681K0483J36500M4128P4736K55908
4877C047314J11417q5689M97435p5365K74760J65667K8703k49077k54355m3171
4867C417639j74611j59093R7526r4311N1232p7758J87776K46845j01213L12600
4857C706632J67475M16508K11428O4623J84776N21333L71440K18382K64402J67258
4847F294257k22979j00374j94541m72992m41758k08880j80335m21475K9340k71387
4837C808876R606L4720M5119j44788K61759o682l59160K61141O2629Q1089J19699
$$ y = [1478864, 1508983, 1416499, 1648427, 1532805, 1420808, 1552393, 1597174, 1288329, 1170494, 1379245, 1534379, 1579749, 1740422, 1657891, 1856700, 1997626, 2136420, 2425243, 2718406, 3033217, 3045758, 2994361, 2958914, 2504106, 2478878, 2515559, 2536042, 2672542, 2716670, 2791406, 3047314, 3158731, 3073042, 3570477, 3495112, 3769872, 3935539, 3964242, 3715165, 3460810, 3417639, 3243028, 3083935, 3181461, 3087150, 3138382, 3060624, 3248400, 3495245, 3394032, 3706632, 3874107, 4290615, 4502043, 4566666, 4751442, 5272775, 5644215, 5862597, 6126999, 6294257, 6071278, 5970904, 5776363, 5303371, 4861613, 4652733, 4472398, 4050923, 4080263, 3808876, 3818482, 3853202, 3898321, 3753533, 4015292, 4008610, 3649450, 3910591, 3973220, 4054309, 4174008]
4826D174008K03837k16990J16655K09927j91866O609n2849k00885j71896o3369
4816C813181K8951N112n28426J0139K1197J06864J80615J14541j59749k27121
4806C365304l18704K96525q493k33857J33522n9801o3931p3187J30550l92082
4796B775846k99275p2494K3303p9740O8961q631K0284J48105k0862Q239k63970
4785B299766o5010M43576L07477K13834j41107K34786J94698p1186J05074K1191
4775C543099j16554k53701k55925l81151j59545j05055p6345j5738N7676O8211
4765B304972M3854j11080J65892j89934m9805J54494j40717K65740Q9650O5008
4755B598074k75350k48471j08419J71296K20098k65578j72808K12256j58778k19943
$$ y = [4174008, 4377845, 4160855, 4277510, 4487437, 4295571, 4302180, 4249331, 4048446, 3876550, 3813181, 3842132, 3847244, 3318818, 3328957, 3350154, 3457018, 3637633, 3752174, 3592425, 3365304, 3046600, 3343125, 3334632, 3100775, 3234297, 3174496, 3110565, 3037378, 3167928, 2775846, 2476571, 2404077, 2427380, 2347640, 2416601, 2407970, 2428254, 2576359, 2555497, 2563736, 2299766, 2234756, 2678332, 2985809, 3199643, 3058536, 3293322, 3488020, 3416834, 3521908, 3543099, 3426545, 3172844, 2916919, 2535768, 2376223, 2271168, 2194823, 2179085, 2236761, 2304972, 2348826, 2237746, 2403638, 2213704, 2163899, 2318393, 2177676, 2443416, 2533066, 2598074, 2322724, 2074253, 1965834, 2137130, 2357228, 2091650, 1918842, 2131098, 1972320, 1752377]
4745A752377q0566R4392j36749J57891J10997q5527r9027M6053J13217P720K9793
4734A910571j54213j30890N310j06888RR7391k964J66170K23390j10578j76866
4723A720442O7501j81884k03767O0010n6368J28628J46465k66440M2344M00250
4713A857181r120N3326K17843L4614K39536K00326J06614Q2411K30786q4151J47705
4702C077071J60180k18552L8385l15297l20786Q7383P1977R6320k53273j48181
4692B275227Q1531R7525m1833j74471r7298j18885K8925j0877m6950j52286p5607
4681A765001p8038m8513j12133O3832k13804p9977M48061m585r0801j9989K05135
4670A834189m44496R8612Q1965m6720J16015J00244k5073N1413n9168n7776K05852
$$ y = [1752377, 1671811, 1766203, 1629454, 1787345, 1898342, 1812815, 1713788, 1759841, 1873058, 1880778, 1910571, 1756358, 1625468, 1630778, 1523890, 1523899, 1621290, 1618326, 1784496, 2007886, 1897308, 1720442, 1787943, 1606059, 1402292, 1462302, 1405934, 1534562, 1681027, 1414587, 1456931, 1857181, 1848061, 1901387, 2119230, 2153844, 2393380, 2593706, 2700320, 2782731, 3013517, 2929366, 3077071, 3237251, 3018699, 3057084, 2741787, 2421001, 2508384, 2580361, 2676681, 2423408, 2275227, 2356758, 2454283, 2412450, 2237979, 2140681, 2021796, 2050721, 2039844, 1992894, 1840608, 1765001, 1686963, 1638450, 1526317, 1590149, 1376345, 1296368, 1744429, 1739844, 1649043, 1629054, 1834189, 1389693, 1488305, 1570270, 1523550, 1639565, 1739809, 1714736, 1766149, 1706981, 1649205, 1855057]
4659A855057J6219j43584p1239L34292k51097J19578K05456J03035K750M8305
4649B218772k6762j91920P0376k92852L10215R1901M2055o9107j91406K80872
4639B242144K12810k53441J9075J46835j05657L01531j26192J69952J29265O5683
4629B802005J96398J03227L38412J37208k4971N85010n5840K13488k27436p32829
4619C334672k54673j78964m63098P1426k19130J17499l5695p2187K02805l44962
4609B157693M6337M9740R1100L7781P8370j02995J70435P5481j06376J05298J86536
4598B789400J23207j14013K54257M32083j69078j47512K51240P9377N3120o9381
4588C482700o5178L98268M9761K53946r580m5868J71919K40912q6256K55355j26747
$$ y = [1855057, 1871276, 1727692, 1656453, 1990745, 1739648, 1859226, 2064682, 2167717, 2170467, 2218772, 2192010, 2000090, 2070466, 1777614, 2087829, 2179730, 2221785, 2152678, 1961272, 2242144, 2454954, 2201513, 2220588, 2367423, 2261766, 2563297, 2437105, 2607057, 2736322, 2802005, 2998403, 3101630, 3440042, 3577250, 3552279, 4137289, 4081449, 4294937, 4067501, 3334672, 3079999, 2901035, 2437937, 2509363, 2290233, 2407732, 2372037, 2299850, 2502655, 2157693, 2204030, 2253770, 2344870, 2382651, 2461021, 2358026, 2528461, 2603942, 2497566, 2602864, 2789400, 2912607, 2798594, 3052851, 3484934, 3315856, 3168344, 3419584, 3498961, 3552081, 3482700, 3417522, 3815790, 3865551, 4119497, 4109917, 4064049, 4235968, 4476880, 4390624, 4645979, 4519232]
4577D519232J50620J58144o2975M19988L53352q7778J12480r4568J03932R010
4567E581437O4916J86122M3601L21539J72173L8811N9595J20584r700K80382K01375
4556G060835J40107j0769k1195J00847L83646n5573j03304K10997M10922m7836
4546H068677J73313M39686j7236K79738L59206O5763L83281L02568J73911L05718
4536A0534625L87595Q70929Q8539P5434P79907K50835O03669P28393M42988R80169
4526A5743083J031872N39238R31703J091661Q69364J374705J262124N92648N54442
4517B3990840J007990R38232J046030J534517J579973K205611K427477K409738
4509C7140408K997110L651560L946395M855250O269545P157190P441142P256411
$$ y = [4519232, 4669852, 4827996, 4765021, 5185009, 5538361, 5450583, 5563063, 5468495, 5572427, 5581437, 5646353, 5832475, 5876076, 6197615, 6369788, 6408599, 6468194, 6588778, 6579078, 6859460, 7060835, 7200942, 7190173, 7168978, 7269825, 7653471, 7597898, 7494594, 7705591, 8116513, 8068677, 8241990, 8681676, 8664440, 8944178, 9303384, 9369147, 9752428, 10054996, 10228907, 10534625, 10922220, 11793149, 11881688, 11957122, 12737029, 12987864, 13591533, 14319926, 14762914, 15743083, 16774955, 17314193, 18245896, 19337557, 20206921, 21581626, 22843750, 23436398, 23990840, 24998830, 25937062, 26983092, 28517609, 30097582, 32303193, 34730670, 37140408, 40137518, 43789078, 47735473, 52590723, 58860268, 66017458, 73458600, 80715011]
4501H0715011P670663Q313734J0282379J4028920J8045249K0912834K6913542
4494A86882332K6586456P698414k0034434l3843194l2927730k4317525j5741691
4487I4302628j1046934o840941l906155j708150j86425J723114K503662K714762
4479G7555561J447147K128595K538014p37716o455199r415692r647590p484780
4471D9928340n476990l967803l628465l485561k677627k733029k221703j802631
4463B3934531j421130j380880r61024j221204q92318p46693q39801k94997q70472
4454A5306012n98341o37959q68119m58037m81865o07664l01379m43500k75139
4445A0634009m14266n02968m84334l59449o740m41684l61975J9605m35491k20068
$$ y = [80715011, 88385674, 96699408, 106981787, 121010707, 139055956, 159968790, 186882332, 213468788, 221167202, 201132768, 167289574, 134361844, 110044319, 94302628, 83255694, 76414753, 72508598, 70800448, 70614023, 72337137, 74840799, 77555561, 79002708, 81131303, 83669317, 82931601, 76476402, 67060710, 57413120, 49928340, 44451350, 40483547, 36855082, 33369521, 30691894, 27958865, 25737162, 23934531, 22513401, 21132521, 20171497, 18950293, 18057975, 17311282, 16471481, 16176484, 15306012, 14707671, 14069712, 13201593, 12743556, 12261691, 11654027, 11352648, 10909148, 10634009, 10219743, 9716775, 9232441, 8872992, 8866252, 8424568, 8062593, 8082198, 7646707, 7426639]
4435G426639q6657l84642m71982o9645l48131p1158j3778m51429j45781j5785
4425E367651j3938l75625P5506j43938k74577K03071j60272L3494J36812j84438
4415D663746K07573J5599m34299p4011J21665k52554J38606k34635k91620P7534
4405C937604m8934J67304k80635j27590M7059l56601P6909j75466j22914q3645
4395C033091k4685j73945l9526k12063L3643L2726j52255l9078n1075j11592J07448
4384B402689k30341M3147J42566q3683R1293m92892K10253J12020k74798J79551
4374B099805n6012q081N2553j75001k7740j32252J3205L76107j68778k68337J4010
4363A719479j92763J13219J80519k14304J7869k29804L18614j24011m45132L6193
$$ y = [7426639, 7339982, 6955340, 6483358, 6413713, 6065582, 5994424, 5980646, 5529217, 5383436, 5367651, 5353713, 4978088, 5053594, 4909656, 4635079, 4838150, 4677878, 4711372, 4848184, 4663746, 4871319, 4886918, 4452619, 4378608, 4500273, 4247719, 4386325, 4151690, 3860070, 3937604, 3888670, 4055974, 3775339, 3647749, 3694808, 3338207, 3415116, 3239650, 3116736, 3033091, 3008406, 2834461, 2794935, 2582872, 2616515, 2649241, 2496986, 2457908, 2406833, 2295241, 2402689, 2172348, 2215495, 2358061, 2274378, 2365671, 1872779, 2083032, 2195052, 1920254, 2099805, 2043793, 2035712, 2088265, 1913264, 1885524, 1753272, 1766477, 2142584, 1973806, 1705469, 1719479, 1526716, 1639935, 1820454, 1606150, 1624019, 1394215, 1712829, 1588818, 1143686, 1179879]
4353A179879J50700J52788R3309l88746K20852J87607k03647R6226O6187q2432
4343A472723k26700N086Q8690R3571K58035K2856k55134K54346J15169n59626
4333A269016j71029L87028p1200N4216l15211j71909O6549J57857J2345k26795
4323I90867n8312K95088j48725J79817j01465j14711p9865q0761j354p1065p9678
4312G29836Q7025K15807j44718j22260N1689N7293j13752J53759j51246q6126
4302F77307J9838n5049N2147J37104O9573q4981K0601L3181J14263m3080k66102
4291F74802l9236n7426L07691p4886k05542K18190R203k7439J7486N9455k85767
4280E96531K2218N8559K3875p6480J13519N57529j73978J8630M9581l36092K33462
$$ y = [1179879, 1330579, 1483367, 1576676, 1187930, 1408782, 1596389, 1392742, 1488968, 1555155, 1472723, 1246023, 1251109, 1339799, 1433370, 1691405, 1714261, 1459127, 1713473, 1828642, 1269016, 1097987, 1485015, 1413815, 1468031, 1152820, 980911, 1047460, 1205317, 1217662, 990867, 932555, 1227643, 1078918, 1258735, 1157270, 1042559, 962694, 881933, 880579, 809514, 729836, 816861, 1032668, 887950, 765690, 817379, 874672, 760920, 914679, 763433, 677307, 697145, 642096, 694243, 831347, 900920, 815939, 836540, 869721, 983984, 940904, 674802, 635566, 578140, 885831, 810945, 605403, 823593, 832796, 805357, 822843, 882298, 596531, 618749, 677308, 701183, 624703, 738222, 1295751, 1121773, 1140403, 1189984, 853892, 1087354]
4269A087354K44452Q9148j00263j23043J95877j2306j40707m9630j7240J53047
4259A326689K2606k04694L7515n999k63794L26093k48025J92953q3550j32298
4249I67496J70422p9665J66213l22093k78717M01426L2932k37764L04442k41144
4239H83548P4233J03340m4303J40678o4631l66569K46546R4165R1835k35630m0448
4228H82764K72957j12233J81105L8977k00700L26939J9086r7081n406j59854J29796
4217A276350J058J30192L46931N6049j24629k6032J45486K95557J81482m3024
4207B239420j08994J2774o4127j26106l8196P7380j2709l0059R8756j64926k1640
4196A861573J61763j54600L97816j08864K43236J23802j94639Q2572j39102J02931
$$ y = [1087354, 1331806, 1420954, 1320691, 1197648, 1393525, 1381219, 1240512, 1190882, 1173642, 1326689, 1349295, 1144601, 1182116, 1176117, 912323, 1238416, 990391, 1183344, 1099794, 967496, 1137918, 1058253, 1224466, 902373, 623656, 1025082, 1058014, 820250, 1124692, 883548, 957781, 1061121, 1016818, 1157496, 1092865, 726296, 972842, 1067007, 1158842, 923212, 882764, 1155721, 1043488, 1224593, 1263570, 1062870, 1389809, 1408895, 1311814, 1306408, 1146554, 1276350, 1277408, 1407600, 1754531, 1810580, 1685951, 1659919, 1805405, 2100962, 2282444, 2239420, 2130426, 2143200, 2079073, 1952967, 1914771, 1992151, 1979442, 1949383, 2048139, 1883213, 1861573, 2023336, 1868736, 2266552, 2157688, 2400924, 2524726, 2330087, 2412659, 2273557, 2376488]
4186B376488N66185j05626L64927J03026m51465J45605o3122j05011j39138j27535
4176B564334m740K42834k89171o131o9774N8754K84786j64224J57704j5514L5703
4165B794561n8001P6874J80951n6110j48255J6313J84887L2145k2022J30574L98990
4154C530907K05762L3937L57036R1260K31694M76561r058m51219m22707k02599
4144C841574l86607k71512k02320j7940r1478l3703p1177j09708l49581Q0470
4134B388018K08226j84389l9860K47077K4560j01361p6238l2414M5241n5965l7704
4123B385191J2776m3156K61562k52521j14301K83647p1739k98124J64254l0566
4113B297023K94850n5773k65796K15331n1252m058M2124j17301J91170J58549
$$ y = [2376488, 2942673, 2837047, 3201974, 3305000, 2853535, 2999140, 2936018, 2831007, 2691869, 2564334, 2559594, 2802428, 2513257, 2507126, 2437352, 2496106, 2780892, 2616668, 2774372, 2758858, 2794561, 2736560, 2813434, 2994385, 2938275, 2790020, 2806333, 2991220, 3023365, 3001343, 3131917, 3530907, 3736669, 3770606, 4127642, 4218902, 4450596, 4927157, 4918099, 4466880, 4044173, 3841574, 3454967, 3183455, 2981135, 2963195, 2871717, 2838014, 2766837, 2657129, 2307548, 2388018, 2596244, 2411855, 2371995, 2619072, 2643632, 2542271, 2466033, 2433619, 2478860, 2422895, 2385191, 2397967, 2354811, 2616373, 2363852, 2249551, 2533198, 2461459, 2163335, 2327589, 2297023, 2591873, 2536100, 2270304, 2485635, 2434383, 2430325, 2472449, 2355148, 2546318, 2704867]
4103B704867o3846K44459j55135L00319q6589J6582R8110o3398L14512J87969
4093C497850R946k7155o4047j72184L82176R8631r5118J40793j83140l5715M46106
4082C998143j27265J23283j19470l10271J43582j76210L06316J93131j77428m4696
4072C809115j06626J13912j00110K12155J53161q7043K24997Q9589k21923L19342
4062D406569L00075j48846m8728L53724K077K5748J90814J05490K86048K21956
4052E694927j1612K3435N30071j23920R1755P2938J78349K0045M53224J46885
4042G076097k28473J62011L548j08814L16673M1864l3839K61187K66200K06711
4032G963165J28722J11573J37737J86315M4559K89450M52055M11907L59243M73995
$$ y = [2704867, 2641021, 2885480, 2730345, 3030664, 2944075, 2960657, 3058767, 2995369, 3309881, 3497850, 3507796, 3480641, 3416594, 3244410, 3626586, 3725217, 3630099, 3770892, 3587752, 3552037, 3998143, 3870878, 3994161, 3874691, 3564420, 3708002, 3531792, 3838108, 4031239, 3853811, 3809115, 3702489, 3816401, 3716291, 3928446, 4081607, 3994564, 4219561, 4309150, 4087227, 4406569, 4706644, 4557798, 4509070, 4862794, 4864871, 4890619, 5081433, 5186923, 5472971, 5694927, 5683315, 5706750, 6236821, 6112901, 6204656, 6277594, 6455943, 6475988, 6929212, 7076097, 6847624, 7009635, 7013183, 6904369, 7221042, 7262906, 7229067, 7490254, 7756454, 7963165, 8091887, 8203460, 8341197, 8527512, 8572071, 8861521, 9313576, 9725483, 10084726, 10558721]
4022A0558721J07621j1806K14446J23724M26497j0614L090J03478Q8178J36500
4012A1739835J18341K26706m8343J36949O00072k02716J32580P7091l37917j07193
4002A2335405K70074j47892q8208L09875N458K05749K67417K14388L28348L27974
3992A4028588J44972p1294K67265L41368o9318J8796Q4982J5576J49512L1860
3982A4942307J10200L5301L75624q7725r68M79131P2152j4735o8740K05156l4323
3971A6013380K10485Q3770K27054L6941N961L81268O22485N44773M35230N76465
3961A9137812M13169L18497L75034Q56884R86740Q82512O68672O53825J156517
3952B5449662J168272Q34422Q92515J225643J335552J398795J478266J636599
$$ y = [10558721, 10666342, 10654536, 10868982, 10992706, 11419203, 11408589, 11411679, 11515157, 11603335, 11739835, 11858176, 12084882, 12036539, 12173488, 12773560, 12570844, 12703424, 12780515, 12442598, 12335405, 12605479, 12457587, 12369379, 12679254, 12684712, 12890461, 13157878, 13372266, 13700614, 14028588, 14173560, 14102266, 14369531, 14710899, 14641581, 14660377, 14745359, 14760935, 14910447, 14942307, 15052507, 15087808, 15463432, 15375707, 15374739, 15853870, 15926022, 15911287, 15842547, 16047703, 16013380, 16223865, 16307635, 16534689, 16571630, 16577591, 16958859, 17581344, 18126117, 18561347, 19137812, 19550981, 19869478, 20244512, 21101396, 22088136, 22970648, 23639320, 24293145, 25449662, 26617934, 27452356, 28344871, 29570514, 30906066, 32304861, 33783127, 35419726]
3944C5419726J667746K553809K711629K618000K966187L578518M272060N367317
3936F1154992O478440P318412Q661215J0212894J1051677J2493331J4579921J7588318
3928A49539200K0701667K5195063K8860270K9245190K0870183K623973j7801170
3921B59234376l1042074l2990935k8157043k1312973j5557773j1374103p752860
3914A11046615m736004k522738o85231Q11234N59516j734333n594444q623493
3906H8521122r633406q445797o949490n963461m147703l407024l185488k229004
3898D4559749j725876j824031j636330j208761n88117n51599j98422P2562J27638
3889C7026813P58809O44700J099653J467708J344086O67059J77604m48878p18587
$$ y = [35419726, 37087472, 39641281, 42352910, 44970910, 47937097, 51515615, 55787675, 61154992, 67633432, 74951844, 83613059, 93825953, 104877630, 117370961, 131950882, 149539200, 170240867, 195435930, 224296200, 253541390, 274411573, 277035546, 259234376, 228192302, 195201367, 167044324, 145731351, 130173578, 118799475, 111046615, 106310611, 103787873, 103102642, 103913876, 104473392, 102739059, 97144615, 88521122, 78887716, 70441919, 63492429, 57528968, 53381265, 49974241, 46788753, 44559749, 42833873, 41009842, 39373512, 38164751, 37576634, 37025035, 36826613, 36899175, 37026813, 37785622, 38430322, 39529975, 40997683, 42341769, 43008828, 43186432, 42737554, 42018967]
3880D2018967o70544j678554k417733k874856k545373k576744k030178j406395
3872B5818590j367548j063346j072184j095224r36634o15611n61077o92678p59080
3863A7655208r81210n14873l27948n38128o28248k91860k87929j04357j48625
3854A3832030j89627k01510l5394m7059k44759l20820k12141k75168k98087j91936
3844A1815529k68359j87520o7328l68848k31519k35415O9517j88983k71043j85275
3834I880756k59820j80477R7171k86382j05232l3210j30233k59650j19436j87699
3824H415788j48342m6584l28409j50289j18217p1926k90363k2742j61115j53800
3814F924001J16457m7313k06201j76712Q4458R4276n980J84160j18189P8486J73769
$$ y = [42018967, 41348423, 39669869, 37252136, 34377280, 31831907, 29255163, 27224985, 25818590, 24451042, 23387696, 22315512, 21220288, 20283654, 19668043, 19106966, 18414288, 17655208, 16673998, 16159125, 15831177, 15293049, 14664801, 14372941, 14085012, 13980655, 13832030, 13642403, 13440893, 13405499, 13358440, 13113681, 12792861, 12580720, 12305552, 12007465, 11815529, 11547170, 11359650, 11292322, 10923474, 10691955, 10456540, 10526057, 10337074, 10066031, 9880756, 9620936, 9440459, 9537630, 9251248, 9146016, 9112806, 8982573, 8722923, 8603487, 8415788, 8267446, 8220862, 7892453, 7742164, 7623947, 7552021, 7261658, 7238916, 7077801, 6924001, 7040458, 6993145, 6786944, 6610232, 6694690, 6788966, 6782986, 6967146, 6848957, 6927443, 7101212]
3803G101212J08414l7535J46724J56535j50221J68073J44803J46456M55812K2814
3793H263087q2782K88850L04377L07965L34222K17092N41454J85061L87470j82699
3783A0564097m55816J42667j96782l43169J3765j7653k71556K9913J40649O0614
3773I666729M8884J16800K72458K94113L83428L70032J09024N50689N75333O72755
3763A3060245N48662M56759O30733J16850L65392L47706M18101J004493R25641
3754A7874582J211651J772718J325136J835581K259202J742015K793024L570873
3746C4384782L523655M216536M558898L349648O03362k983400n336362n367869
3738C6949250m039378l250608k685532k136260j803614j606349j069544l96660
$$ y = [7101212, 7209626, 7172091, 7318815, 7475350, 7325129, 7493202, 7638005, 7784461, 8240273, 8263087, 8180305, 8469155, 8773532, 9081497, 9415719, 9632811, 10174265, 10359326, 10746796, 10564097, 10108281, 10250948, 10054166, 9710997, 9724762, 9707109, 9435553, 9465466, 9606115, 9666729, 9715613, 9832413, 10104871, 10398984, 10782412, 11152444, 11261468, 11812157, 12387490, 13060245, 13608907, 14065666, 14696399, 14813249, 15178641, 15526347, 15944448, 16948941, 17874582, 19086233, 20858951, 22184087, 24019668, 26278870, 28020885, 30813909, 34384782, 37908437, 42124973, 46683871, 50033519, 50636881, 47653481, 42317119, 36949250, 32909872, 29659264, 26973732, 24837472, 23033858, 21427509, 20357965, 19961305]
3730A9961305n84582p05986o25771m84224k72882m83167n80089k23737J25061
3721A6125928m3496k04342l53808n57507l92425J83628l79674j149j94379k85342
3711A3897434J26464p1786k95050k61942r0231k40996k58975j37988J09255K65450
3701A3041635J0929k73836q29845m21875l55230m41800j18102m00857l73221k97673
3691I540125J28326j39581q9246R868j41440j22475L81140J61683j357M12777
3681A0139820J37496j33187J92541j40560J12141m57514j22414O2007l08766N3701
3671I535265J29743l10522N06402J48160K18362J95532j23136J81130L93444K55454
3661A1129834O1R8909j29299J1633K2034j1683Q2792M7690M55484K38859K79011
$$ y = [19961305, 19376723, 18670737, 18044966, 17560742, 17287860, 16804693, 16224604, 16000867, 16125928, 16082432, 15878090, 15524282, 14966775, 14574350, 14757978, 14378304, 14377155, 14182776, 13897434, 14023898, 13952112, 13657062, 13395120, 13304889, 13063893, 12804918, 12666930, 12776185, 13041635, 13052564, 12778728, 11948883, 11527008, 11171778, 10729978, 10611876, 10211019, 9837798, 9540125, 9668451, 9528870, 9439624, 9449492, 9308052, 9185577, 9566717, 9728400, 9727043, 10139820, 10277316, 10144129, 10336670, 10196110, 10308251, 9850737, 9728323, 9790330, 9481564, 9535265, 9665008, 9354486, 9860888, 10009048, 10227410, 10422942, 10299806, 10480936, 10874380, 11129834, 11129895, 11228804, 11099505, 11111138, 11133172, 11121489, 11204281, 11251971, 11707455, 11946314, 12225325]
3650A2225325O21811L24753N55280M15251L84115N37612M32873M15543L61111
3641A6273674K73558N41861M64889N54613M25377j9924J04752j42091K9517J06065
3631A8612291m461j31869j57046K61672O25007O07480N49472P73293R03379R30491
3621B2969709J146961J375830J458686J459271J412764J999065J581632J628588
3613C5032506J441777J566623Q40234M19539Q99335M02036M59567M40152l60061
3604D1141708l52129j13180j52159J39612L48747M10203L22447M34399R59190
3595D3138838P93109O28015R98320J010994J066296J914065J651859J573551J392960
3586E4168007J433986J414644J442833J386853J539319J172793Q98760R06481
$$ y = [12225325, 12847136, 13171889, 13727169, 14142420, 14526535, 15064147, 15497020, 15912563, 16273674, 16547232, 17089093, 17553982, 18108595, 18533972, 18514048, 18618800, 18476709, 18506226, 18612291, 18607830, 18475961, 18318915, 18580587, 19205594, 19813074, 20362546, 21135839, 22039218, 22969709, 24116670, 25492500, 26951186, 28410457, 29823221, 31822286, 33403918, 35032506, 36474283, 38040906, 38881140, 39300679, 40200014, 40602050, 41061617, 41501769, 41141708, 40789579, 40676399, 40524240, 40663852, 41012599, 41422802, 41745249, 42179648, 43138838, 43931947, 44559962, 45558282, 46569276, 47635572, 49549637, 51201496, 52775047, 54168007, 55601993, 57016637, 58459470, 59846323, 61385642, 62558435, 63457195, 64363676]
3578F4363676O54247R07128P76761P27982M56879q8042k58292n29973o27576n80944
3568F5801846r18181j553877j215019j297578q68871n78698m12318P2401L07118
3559E9336823P99366Q58491O53400J313674J451783J240836J761551J796773J624949
3550G0837646J801014J344177M43365l78039p36512j126921j240147j155679j251545
3541F8537359r38885j262073j193106j008623r67416j040590j020945r86050r00138
3532E9219533o15056m85039l98769l81309R054O6961N09633J163316Q14662Q88036
3522F0791022J126487R74479P80260J109016J142698J951295K294675K694911
3514G2864843L756768M208266N016215O087594N448249J636482n661548r705847
$$ y = [64363676, 65017923, 65925051, 66701812, 67429794, 67886673, 67798631, 67540339, 67010366, 66382790, 65801846, 64883665, 63329788, 62114769, 60817191, 59948320, 59369622, 58957304, 59029705, 59336823, 60136189, 60994680, 61648080, 62961754, 64413537, 65654373, 67415924, 69212697, 70837646, 72638660, 73982837, 74426202, 74048163, 73311651, 72184730, 70944583, 69788904, 68537359, 67598474, 66336401, 65143295, 64134672, 63167256, 62126666, 61105721, 60119671, 59219533, 58604477, 58119438, 57720669, 57339360, 57348414, 57415375, 57925008, 59088324, 59902986, 60791022, 61917509, 62891988, 63672248, 64781264, 65923962, 67875257, 70169932, 72864843, 76621611, 80829877, 85846092, 91933686, 97381935, 99018417, 93356869, 83651022]
3506H3651022j0329008q378630o236680m844999l577852k741650k178567j805119
3498D3558517j270860q00724p59463m21785p10227k64790k43547j899K91756K71193
3488C9648171P52524K78853K08509j39840n70315j187444r26511r45072o66116
3479C6452759p27195q16934o69325o13587l78666l81784l51023j87863J5415j84652
3469C2157145r5240o5513K27034r8101r181N0271j54401j61161m39136m05701
3459C1006016k55053m65987k41389j87936l76083K22644K03812R870K96175K0695
3449C0232764K83530O6655M51192L43764L1688N62723M17796J28257J71437M51939
3439C3141745K07568J85475O4178J15811K65022K55641K12168L04379j49409L18906
$$ y = [83651022, 73322014, 64943384, 58706704, 53861705, 50283853, 47542203, 45363636, 43558517, 42287657, 41486933, 40727470, 40305685, 39595458, 39330668, 39087121, 39085222, 39376978, 39648171, 40400695, 40679548, 40888057, 40748217, 40177902, 38990458, 38063947, 37118875, 36452759, 35725564, 34908630, 34239305, 33625718, 33247052, 32865268, 32514245, 32326382, 32341797, 32157145, 32061905, 31996392, 32223426, 32125325, 32116144, 32166415, 32012014, 31850853, 31411717, 31006016, 30750963, 30284976, 30043587, 29855651, 29479568, 29702212, 29906024, 29915894, 30212069, 30232764, 30516294, 30582949, 31034141, 31377905, 31409593, 31972316, 32390112, 32518369, 32689806, 33141745, 33349313, 33534788, 33598966, 33714777, 33979799, 34235440, 34447608, 34751987, 34602578, 34921484]
3429C4921484r8724L56139K02136j44005M19194k1464J67695K03654J94758N47914
3419C6748781K41628N09543O95129N26138N86838R86408J028974Q14219M74181
3410D2611839M35138M65869N22975N63468L17000M9516j42821l54220n69374j21077
3400D3778313l58067k84275k10638J56659N26615N06839O31205J024490R82165
3391D6753306K74433M48186L05961J36705j5525m0644l4500l6017N23463Q36336
3381D9151704J011555J230565J129392J048991J176019J124417K14091l81197
3373E5705537j062886j495768j054624r67436r25281m25609k56251m767l41967
3364D9170948l73757m47242n50708n42743l81387l56204j20684K47210L5330O35050
$$ y = [34921484, 34822760, 35178899, 35381035, 35237030, 35656224, 35634760, 35802455, 36006109, 36200867, 36748781, 36990409, 37499952, 38195081, 38721219, 39308057, 40294465, 41323439, 42137658, 42611839, 43046977, 43512846, 44035821, 44599289, 44916289, 44965805, 44822984, 44468764, 43899390, 43778313, 43420246, 43135971, 42925333, 43081992, 43608607, 44115446, 44746651, 45771141, 46753306, 47027739, 47475925, 47781886, 47918591, 47903066, 47862422, 47827922, 47791905, 48315368, 49151704, 50163259, 51393824, 52523216, 53572207, 54748226, 55872643, 56086734, 55705537, 54642651, 53146883, 52092259, 51124823, 50199542, 49773933, 49517682, 49512915, 49170948, 48797191, 48349949, 47799241, 47256498, 46875111, 46518907, 46398223, 46645433, 46680763, 47315813]
3354D7315813Q86468R50256J101620J018506J158278J063639K26419m6010p78293
3345E2896696j339706j420624j470421j109783r77096q69960j047962j132770
3337D3528374r19169r07044q39417m05183n21089l27406j41563k11642j80124
3328C9075737r9348j63505l25561m70199o89387j96636L4298k62208j65240J07124
3318C6845075j65147l58740k79340n181J13184K55503q9939j41822k26086j091399
3308C4856108j216758j132056j077753q35119o51297p89128o95884l23598m52798
3299B7681717n18407o03195l42773m51108k69633j12259J24794k01161k16886
3290B5091089j68376n44749j7367r0362j34156k48718j91786k49391n4257P1396
$$ y = [47315813, 48202281, 49152537, 50254157, 51272663, 52430941, 53494580, 53720999, 53674989, 52896696, 51556990, 50136366, 48665945, 47556162, 46579066, 45709106, 44661144, 43528374, 42609205, 41702161, 40862744, 40457561, 39936472, 39609066, 39467503, 39255861, 39075737, 38976389, 38812884, 38487323, 38017124, 37327737, 37131101, 37165399, 36903191, 36737951, 36845075, 36679928, 36321188, 36041848, 36036667, 36149851, 36405354, 36315415, 36173593, 35947507, 34856108, 33639350, 32507294, 31429541, 30594422, 29943125, 29153997, 28458113, 28134515, 27681717, 27163310, 26560115, 26217342, 25766234, 25496601, 25384342, 25509136, 25307975, 25091089, 24922713, 24377964, 24360597, 24270235, 24136079, 23887361, 23695575, 23446184, 23391927, 23463323]
3280B3463323m66545l40464k51886m16105k46397j33363k21317k44873k91237
3271B0851136j64791m72710l01863L301n614O0055j05704l20208J49707K59375
3261A9952684j76293j43899l4760k91730N0099J69269N9820R5401k05568J97655
3251A9672678j10309j78933L4567j47464R8741k5969J67687j7716m2253k53326
3241A9197703k88712R8492p1815j33885M6777j8625K58903L10366k47968p628
3231A9143608K35130J15347j1138K74949l5150p3828L55565L36683j16854j22269
3221B0102043r6195L0047J82036p6300j43406j13526J48369J9896P3886K98451
3211B0425301j82322j48206K62354O061j31033J97929J85818j70910J24091l31871
$$ y = [23463323, 22996778, 22656314, 22404428, 21988323, 21741926, 21608563, 21387246, 21142373, 20851136, 20686345, 20213635, 19911772, 19915073, 19909459, 19969514, 19863810, 19543602, 19693309, 19952684, 19776391, 19632492, 19597732, 19306002, 19356101, 19525370, 19585190, 19680591, 19475023, 19672678, 19562369, 19383436, 19418003, 19270539, 19369280, 19343311, 19510998, 19493282, 19451029, 19197703, 18908991, 19007483, 18935668, 18801783, 18848560, 18829935, 19088838, 19399204, 19151236, 19143608, 19378738, 19494085, 19482947, 19757896, 19722746, 19648918, 20004483, 20341166, 20224312, 20102043, 20005848, 20035895, 20217931, 20141631, 19998225, 19884699, 20033068, 20052964, 20126850, 20425301, 20242979, 20094773, 20357127, 20363188, 20232155, 20430084, 20615902, 20444992, 20569083, 20237212]
3201B0237212j65280J66707R3634K49166J3293L6207Q3764l01475p4139j77599
3191B0161490k11159k6977l20052j01759N2138j24676p2333k9585k99149j77756
3181A8850182n0146L8239p9053k24573k73413m60260k14229l3630l29944j84401
3171A7038772k1443j97543j48796l2857M4004j37071j27203J70817k98918j89356
3161A6100406l27452j35301l30321l12958j61145j09618l91154k63914J22341
3152A4190884l86559J27014o8659k29039j28021k81053Q0159k96658l00782k27729
3142A2479557l71204j33690k11300k93210K34195j85529k28110j70889l25956
3133A0793864J1966l81997l02971j45802k84799j63120N4324Q5498k08154j84176
$$ y = [20237212, 20071932, 20238639, 20332273, 20581439, 20594732, 20630939, 20714703, 20413228, 20339089, 20161490, 19950331, 19923354, 19603302, 19501543, 19553681, 19429005, 19356672, 19327087, 19027938, 18850182, 18800036, 18838275, 18759222, 18534649, 18261236, 17800976, 17586747, 17553117, 17223173, 17038772, 17017329, 16819786, 16670990, 16638133, 16682137, 16545066, 16417863, 16588680, 16289762, 16100406, 15772954, 15637653, 15307332, 14994374, 14833229, 14723611, 14332457, 14068543, 14190884, 13804325, 13931339, 13862680, 13633641, 13505620, 13224567, 13304726, 13008068, 12707286, 12479557, 12108353, 11974663, 11763363, 11470153, 11704348, 11518819, 11290709, 11119820, 10793864, 10805830, 10423833, 10120862, 9975060, 9690261, 9527141, 9581465, 9666963, 9458809, 9274633]
3123I274633J34193j11043l30006L0801q5885k24275l00099j68972p7870k1676
3113H119801k71799m6188k2817o6344L0521k65654M4722r8808p3445K77209M2244
3102G669442o9835K09706j79142P0745J19654j18979k1908L8019L9743R272m6651
3091G720066j90411l22983J16018O4682m33815J4982n1916Q9352j9731j89202
3081F797042m87740j13770n1083R1548j16909j82063m2545j86978R9101J22498
3071E929101j54371j11772O8149J46776J384k93029k11282l3142K42350m1715
3061E542449k3706J58245P4275r9206R0017j15998J44133Q1024j01890L5933J49103
3050E934379k77180j52364L8648L6168J68178Q5232l6074l1876n6698N6193j65353
$$ y = [9274633, 9408826, 9297783, 8967777, 8998578, 8912693, 8688418, 8388319, 8219347, 8141477, 8119801, 7848002, 7801814, 7778997, 7712653, 7743174, 7477520, 7522242, 7423434, 7349989, 7627198, 7669442, 7599607, 7809313, 7630171, 7700916, 7820570, 7701591, 7679683, 7717702, 7757445, 7766717, 7720066, 7529655, 7206672, 7322690, 7387372, 6953557, 6968539, 6916623, 7005975, 6986244, 6797042, 6309302, 6195532, 6144449, 6235997, 6119088, 5937025, 5894480, 5707502, 5806603, 5929101, 5774730, 5662958, 5731107, 5877883, 5879267, 5586238, 5374956, 5341814, 5584164, 5542449, 5518743, 5676988, 5751263, 5652057, 5742074, 5626076, 5770209, 5851233, 5749343, 5785276, 5934379, 5657199, 5504835, 5543483, 5579651, 5747829, 5833061, 5796987, 5765111, 5708413, 5764606, 5599253]
3039E599253q5258n1128K0267L5386K09423q2520L47243o784K05557L46796k97379
3028F240856J74338J95053J15434J00368J02148q3396K85064L8j12018K34410
3018G252295k9237J81213J30351L25801J87918M06364K75149J86596L03095q6860
3008I132685m8714R7906K54731p6145m476L8845J02925J43988J38850r3173J29604
2997I817026K90064l47719J73884P5827J03703J24228L25744L91147K57996K94488
2987A1506388J60548J53382M09722K59974M34763n5608J30435K57988M2396K92985
2977A3592973k43097R7420J29665r1988j38569n789l6052k12924N4476M98885
2967A3645000k02941J30007j97200l54839J96129L73710J7752K64759O9308R1582
$$ y = [5599253, 5513995, 5462867, 5483134, 5518520, 5727943, 5645423, 5992666, 5985882, 6191439, 6538235, 6240856, 6415194, 6610247, 6725681, 6826049, 6928197, 6844801, 7129865, 7129903, 7017885, 7252295, 7223058, 7404271, 7534622, 7860423, 8048341, 8454705, 8729854, 8916450, 9219545, 9132685, 9083971, 9181877, 9436608, 9360463, 9355987, 9394832, 9497757, 9641745, 9780595, 9687422, 9817026, 10107090, 9759371, 9933255, 10009082, 10112785, 10237013, 10562757, 10953904, 11211900, 11506388, 11666936, 11820318, 12230040, 12490014, 12924777, 12869169, 12999604, 13257592, 13299988, 13592973, 13349876, 13447296, 13576961, 13484973, 13346404, 13340615, 13304563, 13091639, 13146115, 13645000, 13442059, 13572066, 13374866, 13020027, 13216156, 13589866, 13607618, 13872377, 13941685, 14033267]
2957A4033267Q6197j7934M475N9625J19405J13910k57183j38489j07204K03632
2947A4099701K2136r2851r7548R2317K8284j28132k93085j92348K3044j66115
2937A3295403j77898M8437J6884l0882k38062J51860l4783m76928j05588k19304
2927A2229139r3742r4659l48910j23696k15794N9403l11403j80681K72460k45372
2917A0946745j31843n928k52395k83121J65460J0534R0175o9705l49211j46179
2907I974532k47701J86361j21509l47415O6175m34508r1923Q8544k55356k39683
2897H577517r4355l53434o6834q9559m37746m04016N4394K23339k61176l24761
2887F823369J00966l02869l1803j54164p258J73744r9509m8328o5972K6828K21902
$$ y = [14033267, 14119464, 14101530, 14106005, 14165630, 14285035, 14398945, 14141762, 14003273, 13896069, 14099701, 14121837, 14028986, 13931438, 14023755, 14052039, 13923907, 13630822, 13438474, 13461518, 13295403, 13117505, 13165942, 13182826, 13151944, 12913882, 13065742, 13030959, 12554031, 12448443, 12229139, 12135397, 12040738, 11691828, 11568132, 11352338, 11411741, 11100338, 10919657, 11192117, 10946745, 10814902, 10808974, 10556579, 10273458, 10438918, 10449452, 10539627, 10469922, 10120711, 9974532, 9726831, 9913192, 9791683, 9444268, 9510443, 9075935, 8984012, 9072556, 8817200, 8577517, 8483162, 8129728, 8062894, 7973335, 7535589, 7131573, 7185967, 7409306, 7148130, 6823369, 6924335, 6621466, 6589663, 6435499, 6428241, 6601985, 6502476, 6454148, 6388176, 6415004, 6636906]
2876F636906j35240l50457k34675k16579K60465l7778P498l87136m89574j6489
2866E036941k30106m277k34280q3435r0195n3143P0596N1983l14658J70837j34421
2855D185842K1637j51438K37186j37663k21625j53982J52213n8723j86443m6495
2845C640509p2148q83j6J53107j22687Q4802j81509O2920K40644k37766k6978
2834C539995P3099l91356j0065r2248p8915o2671j1925k26835J1401j5233j369
2823B733878L778J29574m8297k83153j63754K56843q2607l0009k02218j97658
2813B116377m53L24818O8209k00552k09586O8736J15198L61710j16396n24985
2803B003076J00498R865j23400j20648r3245J46310J74886j67595k3168K1970
$$ y = [6636906, 6501666, 6151209, 5916534, 5699955, 5960420, 5922642, 5930140, 5543004, 5053430, 5036941, 4806835, 4802558, 4568278, 4484843, 4394648, 4341505, 4412101, 4464084, 4149426, 4320263, 4185842, 4207479, 4056041, 4293227, 4155564, 3933939, 3779957, 3932170, 3873447, 3687004, 3640509, 3568361, 3567478, 3567462, 3720569, 3597882, 3682684, 3501175, 3564095, 3804739, 3566973, 3539995, 3613094, 3221738, 3211673, 3119425, 3040510, 2977839, 2965914, 2739079, 2750480, 2735247, 2733878, 2737656, 2867230, 2818933, 2535780, 2372026, 2628869, 2546262, 2516253, 2314035, 2116377, 2115924, 2440742, 2508951, 2308399, 2098813, 2167549, 2282747, 2644457, 2528061, 2003076, 2103574, 2113439, 1990039, 1869391, 1776146, 1922456, 2097342, 1929747, 1906579, 1928549]
2793A928549j29891m9937J35655M9560r6520j39854o0669l6382m7919K02618m7076
2782A708134q4563j54186L667m1140j02696J62603j32576K87617j9900j62119
2772A464841J00936K03117J3823l82056O455j96177k6907L84142n5460q3961J33543
2761A562296K71031l94489J3237o8429j50304K18214M4954k68555j21894j32767
2751I73294j31117J98262P5549r6084M8503m249j46517j54365K04389j28612q8781
2740G50272K55225j10444R4380J8696k26858j36919N2640K32972j45811j21448
2730F62705N1075L02745O3634l09871n9431o8443Q4745j08403j30057J53935J8716
2719F61350P1420J3571k64045L7257n9499J31400j57150p652j25483k1839Q7506
$$ y = [1928549, 1798658, 1748721, 1884376, 1933936, 1837416, 1697562, 1636893, 1600511, 1552592, 1755210, 1708134, 1623571, 1469385, 1473052, 1431912, 1329216, 1491819, 1359243, 1646860, 1626960, 1464841, 1565777, 1768894, 1782717, 1400661, 1407116, 1210939, 1184032, 1568174, 1512714, 1428753, 1562296, 1833327, 1438838, 1452075, 1383646, 1233342, 1451556, 1496510, 1227955, 1106061, 973294, 842177, 1040439, 1115988, 1019904, 1068407, 1064158, 917641, 763276, 967665, 839053, 750272, 1005497, 895053, 989433, 1008129, 781271, 644352, 696992, 929964, 784153, 662705, 713780, 1016525, 1080159, 770288, 710857, 642414, 727159, 618756, 488699, 642634, 661350, 732770, 746341, 482296, 519553, 460054, 591454, 434304, 426652, 301169, 279330, 366836]
2708C66836J26229M9816J24980K3369r3369q5424r668r0647O7210l8843K52758
2697F93247l8122r4724R5499K0422K6161k88458o1902M92K17873j1905k00293
2686C58290J21924K1527l88040k5878L6300m2051K51327k57962j64101j4365J48408
2675D5379j12450J83251q6654M706J61460k43398J7790j90477O9529m3729K26372
2664C1779K41583j03859J08488Q2316l5254P2691l52524M6544M17825k8585j16473
2653C64531J29542j68554o1775K59085n9052j76906m7777j6265J45905k03551
2643A65183L4049p7351J26271K2243n2379p2397j46221j15899M4041J33463R0854
2632A51857l23644O3358q8344j45079J61037K11683J71370m2362Q7001R9206j02175
$$ y = [366836, 493065, 542881, 667861, 691230, 597861, 512437, 502769, 412122, 479332, 440489, 693247, 655125, 560401, 655900, 676322, 702483, 414025, 352123, 352615, 570488, 558583, 358290, 480214, 501741, 113701, 87823, 124123, 82072, 333399, 75437, -88664, -103029, 45379, -67071, 116180, 29526, 34232, 195692, -47706, -29916, -220393, -150864, -194593, 31779, 273362, 169503, 277991, 360307, 325053, 397744, 45220, 91764, 509589, 481004, 364531, 494073, 325519, 263744, 522829, 463777, 286871, 239094, 222829, 368734, 165183, 199232, 121881, 248152, 270395, 218016, 145619, -602, -116501, -72460, 61003, 151857, -171787, -108429, -196773, -341852, -180815, 30868, 202238, 159876, 246877, 346083, 243908]
2621B43908j8159n9951J97483j57904j7407k2368o327K26873j33037q9052k93552
2610a29493o0520L21291J31929r9054K74865l73203J27143J21711k93879L7625
2600E8415k76864J15161K91870k61131j7629K6499J02403L22064l09973j07301
2590e6486J6487N0282K69361J61086L429k18107q2210J80573J0559j26263O4607
2579B73318k46497L0691M8843J6026k10164J52660n1574L11626q0208j72710j867
2568G0144k84535K31534j67671k22389J0602J40564j36241J19648J43088j7064
2558a12320K05952M243l2085n6767p603j78577P1954N4678m1452M47671k68342
2547H7352m1114L9891l92939J0552K76757J72801r1032k32261J26715n2940R2600
$$ y = [243908, 225749, 165798, 363281, 205377, 187970, 165602, 159275, 386148, 253111, 164059, -129493, -190013, 131278, 263207, 164153, 439018, 65815, 192958, 314669, 20790, 58415, -218449, -103288, 188582, -72549, -90178, -63679, 38724, 360788, 50815, -56486, -39999, 10283, 279644, 440730, 444159, 226052, 143842, 324415, 334974, 208711, 273318, 26821, 57512, 106355, 122381, -87783, 64877, 13303, 324929, 244721, 72011, 70144, -214391, 17143, -150528, -372917, -362315, -221751, -357992, -238344, -95256, -112320, 93632, 97875, 65790, 9023, 1420, -177157, -105203, -50525, -91977, 355694, 87352, 46238, 86129, -306810, -296258, -19501, 153300, 62268, -169993, -43278, -96218, -3618]
2536c618J08237k48976J41631J11703J44118L9086k2976m5125J53609j38518N8102
2525B97273j73301k13299K73545J62910m84583K49815k7422n3972K19376j12810
2515A37532J62985O5566n3319j46055q0468M2374O5943p0043R472r0250J04071
2504A47808K29577j25201k52263J80442l00223J98564N6794k79975k376N8530
2494h8323J08800J85989l3109k06822J53456M0305O1439p3710Q4016K0034k43444
2483H631m8496J94709j21656J12543K40492L2135r8105k9175r8378j37668K85428
2472C40460k25332k26154K23671q638J26993K6329l40266J86346m1075O0959n9958
2461F3335R3675l6435k54099j88978L29842o6050k0752K40942j91790J23680J56832
$$ y = [-3618, 104619, -144357, -2726, 108977, 253095, 292181, 269205, 224080, 377689, 239171, 297273, 123972, -89327, 184218, 347128, -137455, 112360, 84938, 30966, 250342, 137532, 300517, 366083, 312764, 166709, 86241, 128615, 194558, 124515, 133987, 43737, 147808, 377385, 252184, -79, 180363, -119860, 78704, 135498, -144477, -146853, -88323, 20477, 206466, 173357, -33465, 119991, 160296, 221735, 148025, 232041, 252075, 8631, -39865, 154844, 33188, 145731, 386223, 418358, 320253, 291078, 192700, 55032, 340460, 115128, -111026, 112645, 104007, 231000, 257329, -82937, 103409, 62334, 123293, 63335, 157010, 120575, -133524, -322502, 7340, -58710, -79462, 161480, -30310, 93370, 250202]
2450B50202m34427j63435O9145J73214p734j6308l43p0573N9529m1625m9611j26434
2438c58400K10203N0820M6686k18593L8464L01468j0979j67822J17196m3589r6284
2427a30830j25327R6150L33917m24201J66544J74406j54137J07895N4653J20667
2417B19737j50765J44778J3545j1730n1038j30195J14198J32255l81572k3582
2407a24369M4290j20488J26853J14840q0368K0912j70306l0463J45355O5917k6331
2396c4158n0543j70323o513P6344j6909K22024L3120R1440k21447J84829J03309
2385B11173l07965J55537k34659j93001N12932m2978k72294j0019l8837K82049
2375F1938J11059N490l39799J04411M98511l27762j70500J63582l24961J06175
$$ y = [250202, -184225, -347660, -278515, -105301, -113035, -129343, -129686, -200259, -140730, -182355, -231966, -358400, -148197, -97377, -50691, -269284, -230820, 70648, 59669, -108153, 9043, -34546, -130830, -256157, -160007, 173910, -250291, -83747, 90659, -63478, 44417, 99070, 219737, 68972, 213750, 227295, 215565, 164527, 34332, 148530, 280785, -100787, -124369, -80079, -200567, -73714, 41126, -39242, -18330, -188636, -219099, -73744, -7827, -34158, -84701, -255024, -261537, -185193, -202102, 19922, 53042, 144482, -76965, 107864, 211173, -96792, 58745, -175914, -368915, 144017, 101039, -171255, -181274, -220111, 61938, 172997, 178487, -161312, -56901, 441610, 113848, -56652, 106930, -218031, -111856]
2365a11856J53674j59555J18875L1109O7907J15850r4809j67637K23165m1327
2355A35396p1221J02936K8683j06073j01241N2350o1768j24079Q2482l2359J24896
2344C0002L27733l2017k81694J2243K61276J16902j16905j5770l33806l2548K18323
2333A53739q8944j54952K96068p4909R9778J4048k23350k9482j04870J66027j42048
2322h8895P9028J86122Q5172j92883L4936J11625J24455p2311j77765L01296L3747
2311D24527j11667L02389l3539k563L14425J88415J19674j50241o9254j91492
2301G90674j41449J3504j3179j13373j92316J2105r0881k4819J30729N3606l34265
2290I0336j4802k37070n7016J32533K49426J44191k70859L3103q8339Q8812N5090
$$ y = [-111856, 41818, -117737, 1138, 32247, 100154, 216004, 121195, -46442, 176723, 135396, 64175, 167111, 195794, 89721, -11520, 40830, -20938, -145017, -62535, -94894, 30002, 357735, 325718, 44024, 56267, 317543, 434445, 317540, 301770, -32036, -64584, 153739, 64795, -90157, 205911, 131002, 230780, 244828, 21478, -8004, -112874, 53153, -88895, -9867, 176255, 261427, 68544, 103480, 215105, 339560, 267249, 89484, 390780, 424527, 312860, 615249, 581710, 579147, 893572, 1081987, 1201661, 1051420, 982166, 790674, 649225, 662729, 649550, 536177, 343861, 355966, 265085, 240266, 370995, 424601, 90336, 75534, -161536, -218552, -86019, 163407, 307598, 36739, 69842, -18497, 70315, 125405]
2279A25405J36052N9896o7697j01740q5948L3763K7610j89572R6089L86764j68730
2268B51892M4850m9847L1705K73690k07747k23030l0232K09526j54344k66144
2258a19681k1304L1329J0235J49763K10104L70P4769j17580P4950K871p3511k4470
2246A97845J2136K40980l12187j32343K01425N237p9686K37210J43379N0757J79480
2235G44233j60511q1259o1141J24492J20987K6231J84788o5202k35054L78128
2225I75692J8238j44371J0532l7789j21637K7941r3523r6006J50257J95289j50056
2214G34567q247j00463j79999O5916J06696j44917q871K05894j19956J01361j746
2203F50235l3472r0344o4329k8600K04245J11190q7748n1992J38072k4239k07217
$$ y = [125405, 261457, 321353, 253656, 151916, 65968, 99731, 127341, -62231, 33858, 420622, 251892, 296742, 246895, 278600, 552290, 344543, 121513, 91281, 300807, 146463, -119681, -140985, -109656, -99421, 50342, 260446, 260816, 335585, 218005, 292955, 295826, 222315, 197845, 209981, 450961, 138774, 6431, 207856, 213093, 133407, 370617, 513996, 564753, 744233, 583722, 502463, 441322, 565814, 686801, 713032, 897820, 832618, 597564, 975692, 993930, 849559, 860091, 822302, 700665, 728606, 635083, 539077, 689334, 884623, 734567, 726320, 625857, 445858, 511774, 618470, 473553, 464682, 670576, 550620, 651981, 650235, 616763, 526419, 462090, 433490, 637735, 748925, 661177, 609185, 747257, 723018, 515801]
2192E15801r8135J77973J02759l2922l0295J45801j32682P7123j06344j54483
2182D64596J01974k09659K48918J95711k29311K78554j71099M8364m2340R8178
2172G83886M4837o4009p5573K46529M95711k98127j737J06486K32848Q8075n0514
2161A508412p2583K54141J20680k6421q8655K00597J65641k61530J79880K77074
2151B257236r5687M0082O7750p8068Q0099J74692Q126J79199K7858n1096J40073
2140B750264p3651J78362J0502P118J29934n5078J39365J26856Q9285Q3983k97529
2129C089411J08992m2015P0567O8694J12712K77805j83998j38575J59735K06469
2119C729797J4411J06193P9469K53626O7672j46396Q8495K4703K14711J52241
$$ y = [515801, 417666, 595639, 698398, 665476, 635181, 780982, 648300, 725423, 619079, 464596, 566570, 356911, 605829, 801540, 572229, 850783, 679684, 728048, 685708, 783886, 828723, 764714, 689141, 935670, 1431381, 1133254, 1131517, 1238003, 1470851, 1558926, 1508412, 1435829, 1689970, 1810650, 1784229, 1695574, 1896171, 2061812, 1800282, 1980162, 2257236, 2161549, 2201631, 2269381, 2191313, 2271412, 2446104, 2454230, 2633429, 2661287, 2610191, 2750264, 2676613, 2854975, 2865477, 2872595, 3002529, 2947451, 3086816, 3213672, 3302957, 3386940, 3089411, 3198403, 3156388, 3226955, 3295649, 3408361, 3686166, 3502168, 3363593, 3523328, 3729797, 3744208, 3850401, 3929870, 4183496, 4251168, 4104772, 4193267, 4217970, 4432681, 4584922]
2109D584922K58699L73296J69551J91069O9360k8503J34649J33259K54071L71143
2099F511516K52008O22011K99415K61619O82082N18063L88892M19729N21103M35526
2089A0911964P08374P51987Q74112Q22351P81370J276693J204310J311804J374577
2080B0017542J609663K187771K440896K853399L154014L417084M358725M878844
2072D4917938N724665O203823P803498J0031034J3013572J4034958J8968446K1874352
2064A42572286R452305j3967316k6026495k5556731j8969538j2630133r318516
2057D5555862o590039m805901l020445k806719j780302j425532r71372j455532
2049B2700020j860607j993857j582734j553138j126866j032475m97539n73099
$$ y = [4584922, 4843621, 5216917, 5386468, 5577537, 5646897, 5618394, 5753043, 5886302, 6140373, 6511516, 6763524, 7385535, 7684950, 7946569, 8628651, 9146714, 9535606, 9955335, 10476438, 10911964, 11620338, 12372325, 13246437, 14068788, 14850158, 16126851, 17331161, 18642965, 20017542, 21627205, 23814976, 26255872, 29109271, 32263285, 35680369, 40039094, 44917938, 50642603, 56846426, 64649924, 74680958, 87694530, 101729488, 120697934, 142572286, 152024591, 138057275, 112030780, 86474049, 67504511, 54874378, 45555862, 38965823, 34159922, 31139477, 28332758, 26552456, 25126924, 24155552, 22700020, 20839413, 18845556, 17262822, 15709684, 14582818, 13550343, 13052804, 12479705]
2041A2479705n98790p52085n05138o07389o72203l12752m48426l01856j21578
2032H159488m75502k19322Q263l75499l39157j29453k61814j85446l28362l309
2022E849887k00640k83956k16322j57039j51591J1386k84360k02177j04835k64051
2012C996302k42693j88856j76715p9875Q0095k28249j2078k0469k71830j45955
2002B709677j59856m1274l30038k91486J97740R3974l26963Q7327k3759K10665
1992B126007J81790j76023j16731j62100J52110j62734J95556J65883j20374l89701
1982A693683J14736Q7504k54965k09138p5424L20415l5869k15081r0136m2115
1972A293610J05988K17736l6047k67362J60244p6254j65674J4978j78490p6871
$$ y = [12479705, 11880915, 11128830, 10623692, 10016303, 9344100, 9031348, 8582922, 8281066, 8159488, 7683986, 7464664, 7472927, 7097428, 6758271, 6628818, 6367004, 6181558, 5853196, 5849887, 5649247, 5365291, 5148969, 4991930, 4840339, 4851725, 4567365, 4365188, 4260353, 3996302, 3753609, 3564753, 3388038, 3308163, 3388258, 3160009, 3147931, 3127462, 2855632, 2709677, 2549821, 2508547, 2178509, 1887023, 2084763, 2178737, 1851774, 1939101, 1915342, 2126007, 2307797, 2131774, 2015043, 1852943, 2005053, 1842319, 2037875, 2203758, 2083384, 1693683, 1808419, 1895923, 1640958, 1431820, 1356396, 1676811, 1640942, 1425861, 1335725, 1293610, 1399598, 1617334, 1581287, 1313925, 1474169, 1397915, 1232241, 1247219, 1068729, 991858]
1962I91858j4311J07919M8099r003j66247o8414l07506q2906J07810j19667J20148
1951F07780R8214O0001J609j67901K53024K82424L0469j79227k08532J64739j55761
1940G86839n1548j49631L97944M9722N5574j03414r4102k76568n155J94819Q3743
1929H88223j87670J87145p9450l21013J03617M2158N8851j08166J42393n9965
1919F66123Q9976o5443k27361K41290j1083l4223Q2482k30036j47944j08046N0585
1908C06320o9427q218J61032Q9242p1831O0366j13038K2712k22766l1814j93472
1897g0894K21106P9220j52171j10624j8948L25174L6588k04758R5208J02301j79988
1886A22214Q1067J0231j70593j41524K20354J14348j37714q7616L85544m3061
$$ y = [991858, 977547, 1085466, 1133565, 1124562, 958315, 889901, 582395, 499489, 607299, 487632, 607780, 705994, 765995, 767604, 599703, 852727, 1135151, 1165620, 986393, 777861, 942600, 786839, 735291, 585660, 983604, 1033326, 1088900, 985486, 891384, 614816, 609661, 804480, 888223, 700553, 887698, 808248, 487235, 590852, 633010, 691861, 583695, 726088, 666123, 756099, 690656, 463295, 704585, 693502, 659279, 741761, 511725, 363781, 255735, 306320, 236893, 228675, 389707, 478949, 407118, 467484, 354446, 377158, 154392, 122578, -70894, 150212, 229432, 77261, -33363, -52311, 272863, 309451, 104693, 199901, 302202, 122214, 203281, 213512, 42919, -98605, 121749, 236097, 98383, 10767, 396311, 353250]
1876C53250l6761k1422r6388j05820K90912l5798J54113j3114j23153l2628K5777
1865C58968j62663r2853o4696J93890L40908k68051O1927j43658K8831J20746
1855C73349j12659j05254J8499j86837K8232k9523m7458J44825j18577K25657
1845A90254Q2097p2515l8840p3060O7927J4568L10804j39677J86862M5927j97510
1834C76837l30002o9856k6270K92502J74253j06978Q8801J52428J73782K2203
1824G47700L8063O0799K490J8749K03492j25014m35355p9135j29439j5328J40014
1813D27036j69248m9539m0045j1665K20493j705j63152r0766L48122l2394j21013
1802C16124M4023O7072j1085l44670N0618J52634l0605o1991K03438K3935l0700
$$ y = [353250, 316489, 295067, 198679, 92859, 383771, 347973, 502086, 488972, 365819, 333191, 358968, 196305, 103452, 38756, 232646, 573554, 305503, 367430, 223772, 252603, 373349, 260690, 155436, 173935, -12902, 15330, -14193, -61651, 83174, -35403, 190254, 272351, 199836, 160996, 87936, 155863, 170431, 481235, 341558, 528420, 574347, 376837, 46835, -23021, -49291, 243211, 417464, 310486, 399287, 551715, 725497, 747700, 785763, 846562, 849052, 867801, 1071293, 946279, 510924, 431789, 302350, 287022, 427036, 257788, 208249, 168204, 156539, 377032, 375327, 212175, 121409, 469531, 437137, 316124, 360147, 427219, 416134, 71464, 122082, 274716, 244111, 182120, 385558, 409493, 378793]
1791C78793m4790r0489M7483k23474j4039q1887j14720M751J35857l43274m3962
1780c89751L67632r0376j06393m0113Q443n330k1774J22606K42232o6626l0623
1769a0073P5133p2612k6922Q933J20372K49994m80957J73348K32J20625O0380
1758B18453j9647m931O2678k26957l8496K02812n7697O4031r9482J08965J98613
1747D08342k39466L1173O4413j97701L2625o5501Q6938N6068r0140J90859K2992
1736C00602j58828J37306j62170j78628R6385J00388j86786N5244R2259N197N9610
1725A60579Q2679j45122q0869J5987O9431n969K23687j83053j83854p7717M0445
1714h3776j04121j84915K28500k5479L9768k04942J0957P27J44393J80106N6161
$$ y = [378793, 334003, 243514, 290997, 67523, 53484, -28403, -143123, -138372, -2515, -345789, -389751, -22119, -112495, -218888, -259001, -250558, -255888, -277662, -155056, 87176, 20550, -10073, 65060, -7552, -34474, -25541, 94831, 344825, -136132, 37216, 37448, 158073, 218453, 198806, 193875, 256553, 29596, -8900, 193912, 136215, 200246, 100764, 209729, 408342, 168876, 200049, 264462, 66761, 99386, 33885, 120823, 176891, 86751, 277610, 300602, 141774, 279080, 116910, -61718, 34667, 135055, -51731, 3513, 95772, 100969, 160579, 243258, 98136, 17267, 33254, 102685, 96716, 320403, 137350, -46504, -124221, -83776, -187897, -372812, -144312, -169791, -130023, -334965, -324008, -323281, -178888, 1218, 57379]
1703E7379j71706J44149O9041j95542K68151J4825r6138Q1314l9274K01992j04365
1692B29826k65067P2151J12368J03814J70458j85944j86691K13755j47433m7689
1682F9548j3241M7638j90781j79753K32580q816J02238j3760k14372j57793n506
1671c32018J78342J85014j8961j50565L02594k42403o0956J56548k56466j02455
1661c41326j4600K65461K06199j39972o4229o3226j1635r7660P3364J43986k28523
1650b72161J68896K36402j58372j17380J46345J3416K13373L873K1900N3884j13048
1639A97128j64235k25635J24598P3565j87569J00869J57456k03885P4168n6449
1629a09989J74672K18193n6596K695j45234J54546k13879j2442J8177n2916j05258
$$ y = [57379, -114327, 29822, 98863, -96679, 171472, 186297, 90159, 171473, 132199, 334191, 229826, -35241, 36910, 149278, 253092, 423550, 237606, 50915, 264670, 117237, 69548, 56307, 103945, -86836, -266589, -34009, -42825, 59413, 45653, -168719, -326512, -332018, -153676, 31338, 12377, -138188, 164406, -77997, -138953, 17595, -238871, -341326, -355926, -90465, 115734, -24238, -88467, -151693, -163328, -260988, -187624, -43638, -272161, -103265, 133137, -25235, -142615, 3730, 17146, 230519, 234392, 256292, 310176, 197128, 32893, -192742, -68144, 5421, -182148, -81279, 76177, -127708, -53540, -109989, 64683, 282876, 226280, 228975, 83741, 238287, 24408, 11966, 30143, -22773, -128031]
1618a28031J67351L1332j11693J19147j16177N9506K27664P8283j71883l33484
1608a77985j90411K26396J14036N4323l18553J38264K5095m5702q3410N1400J4426
1597a92121J2811J74124K41371n520j66242j13213P3662n3317n6831L4342M3786
1586g148J02478L6639r6572J12186k21613K29903K01564n7692j41573j88238K47384
1575B17318N2406R1213k93858k66919P5124K0886j65221J85934l3268J10371J43345
1564A37331j98055n2122J29739Q4303k45878j40501K60871r3125l4166J97409
1554D5806j1343J13650n1535k36628P155J99359j2936j10220P8672p7955n6129
1543a12104J17816K13013k66411M7729K57041j81904j87432R0576j69465O2734
$$ y = [-128031, 39320, 70652, -41041, 78106, -38071, 21435, 249099, 327382, 155499, -177985, -368396, -142000, -27964, 26359, -292194, -153930, -128835, -174537, -257947, -206547, -192121, -179310, -5186, 236185, 230665, 64423, -48790, 24872, -28445, -85276, -50934, -7148, 95330, 131969, 35397, 147583, -74030, 155873, 357437, 299745, 158172, -30066, 217318, 269724, 360937, 67079, -199840, -124716, -103830, -269051, -83117, -116385, -6014, 137331, -60724, -112846, 16893, 101196, -144682, -285183, -24312, -117437, -151603, 45806, 34463, 148113, 96578, -140050, -132895, 66464, 53528, -56692, 21980, -55975, -112104, 5712, 218725, -47686, 43, 257084, 75180, -112252, -21676, -191141, -128407]
1533a28407j2722J48006J56866j24666p4448J41872K2908j42999j67653J58956
1523b2287J95120j17307j43307j20132L6533J50075Q3409L0201p7717j70154J19054
1512c6512M649P3393j68611r4183K63221j81440J0783J23455k22282J3633P3676
1501a40218R5660k25385O7627J26678k85323J47218m1255k43406J02372J09013
1491b87019M1798K14219j11440L597J62240J51145k2041j96797J77591J08281
1481B41574k55022K1025K11516j17654M6809O0377k65166J86625K40242j67691
1471B02635p0427n7117j33244j65243L53679k596l0360M5970l2270O2492p0855
1460A02664k04284k97850K34181K05534k18427N9778J56596M6641N5634j8287
$$ y = [-128407, -141129, 6877, 163743, 39077, -35371, 106501, 129409, -13590, -181243, -22287, 172833, 55526, -87781, -207913, -171380, -21305, 62104, 92305, 14588, -155566, -36512, -31863, 41530, -127081, -221264, 41957, -139483, -128700, -5245, -227527, -213894, -140218, -44558, -269943, -202316, -75638, -360961, -213743, -254998, -498404, -396032, -287019, -245221, -31002, -142442, -138845, 23395, 174540, 152499, -44298, 133293, 241574, -13448, 7577, 219093, 101439, 148248, 208625, -56541, 130084, 370326, 202635, 132208, 75091, -58153, -223396, 130283, 127687, 97327, 143297, 111027, 173519, 102664, -101620, -399470, -165289, 40245, -178182, -118404, 38192, 84833, 140467, 122180]
1450A22180L877J34171J50341Q154j86180j45819j2326m3244j23991L42703m9222
1439B00644k23839l21723K10756L54914l7266j77750j16947R3101j17953M473
1429a31590p664o5623p4553L66344r2081l73291n867L92534O8402q5922j25536
1418a34847q2678q8288K24187Q4487j64763K74513O1656J05138j28798J25614
1408B76221k08561O6623n7889k23623L6878k2609M3160J41795j34659M6940M2538
1397F814K6869j47793J28138O3718j54799n0309j74707O9469l9647o5J37781k3077
1385a57608Q8606m3742j79779K05070m884q2300j06350L09639j71657K4002l774
1374a22777j69010N9023R7970J13044K2269j36541J51919J124N5360J73114j34763
$$ y = [122180, 126057, 260228, 410569, 418723, 232543, 86724, 74398, 31154, -92837, 249866, 200644, -23195, -344918, -134162, 220752, 183486, 5736, -111211, -18110, -136063, -131590, -139254, -204877, -279430, 86914, -5167, -378458, -384325, 8209, 76611, -9311, -134847, -217525, -305813, -81626, 2861, -161902, 112611, 174267, 279405, 150607, 276221, 67660, 134283, 76394, -147229, -110351, -132960, -89800, 51995, -82664, -35724, 6814, 33683, -114110, 14028, 77746, -77053, -127362, -302069, -232600, -272247, -272312, -134531, -157608, -69002, -112744, -292523, -87453, -92337, -174637, -280987, 28652, -143005, -119003, -122777, -291787, -232764, -134794, -21750, 519, -136022, 15897, 17021, 72381, 245495, 110732]
1363A10732p2890J47154Q3746P641p8934M5832k20222p7540N583K22651R3890
1352B67643k35068k02326j574K71186j07750o2581Q1727n2146m9922O7278j90734
1341b14267J7115K40461j56206q2294P2728J87177j21803j87588R2787m0901n0422
1330b43213J23486J19550j00907j40542J00637o5307J87099K18994J2542O1292
1320B73631M2416P7596j42650j6164k59826K3415r877J21150R5390k93765J46547
1309E7863J01973k28879k94912K97264R6045q2121k3352j30228Q9873M7937j9057
1298h7594j11500K51841r7258J23693J02396m5213j33123M6096J82912j2659j21985
1287I7606j74351k42209J67353L3678J76057k1283k99809k01411J0563J76976
$$ y = [110732, 37842, 184996, 268742, 276383, 197449, 243281, 23059, -54481, -48898, 173753, 267643, 32575, -169751, -171325, 99861, -7889, -70470, 11257, -40889, -90811, -23533, -214267, -197152, 43309, -112897, -195191, -122463, 64714, -57089, -244677, -151890, -192791, -243213, -119727, -177, -101084, -241626, -140989, -206296, -19197, 199797, 212339, 273631, 316047, 393643, 250993, 234829, -24997, -1582, -11459, 109691, 205081, -88684, 57863, 159836, -69043, -363955, -66691, 29354, -52767, -76119, -206347, -116474, -68537, -87594, -199094, 52747, -44511, 79182, 181578, 136365, 3242, 49338, 232250, 219591, 97606, -76745, -318954, -151601, -117923, 58134, 36851, -262958, -464369, -453806, -276830]
1277b76830J0564k8327R6918J24998k60075J47978k0018O342J70606j00207k87631
1266d15682J49914K00022o2371j72881J52562K03485j8890k641O887Q1997j05641
1255A6761k46750j6979M9237r2004r7865K29452K56962m0900K8046P8892o4253
1244A00599J5659J51452k4566j35876m8391M9620k0477J19742j53759l29818K35586
1233d0229N6790k15969P7338p4591Q8055l6870j48658l1619P0102M2477j18451
1222c31625J24060J05353n2385Q6378O6708j60478K10032Q9956j53931N5406K7757
1211F7231P5230J43882k25079k33400K63548J51993J64115O4433K1476l31383
1201A62046M8352J64135r3323l11700J38627M8055j38205M9384r7269J46548M3372
$$ y = [-276830, -266266, -294593, -197675, -72677, -332752, -184774, -204792, -198450, -27844, -128051, -415682, -265768, -65746, -128117, -300998, -148436, 55049, 36159, 33518, 40405, 122402, 16761, -229989, -246968, -197731, -289735, -387600, -158148, 98814, 57914, 85960, 164852, 100599, 116258, 267710, 243144, 107268, 58877, 108497, 88020, 207762, 54003, -275815, -40229, 16561, -199408, -122070, -196661, -108606, -145476, -294134, -325753, -255651, -213174, -331625, -207565, -102212, -154597, -68219, -1511, -161989, 48043, 137999, -15932, 39474, 67231, 142461, 286343, 61264, -172136, 91412, 243405, 407520, 471953, 493429, 162046, 210398, 374533, 281210, -30490, 108137, 156192, 17987, 67371, -29898, 116650, 160022]
1190A60022k9123k9402j9153o7922p9724l1542K45255n4917n9022N0953O2797
1179A48222J851j47729R9175p4540Q8415J12565j12096j69627O937m4418j78148
1168b69393J43765j93549J17042J12896q1420N9116j31731q9470J42562k36650
1158d26832Q8402p4400K10524m0009J15939q05o9833j95607R7119J49096j2978
1147a59384p0714m3920J86376j29420J82777J14424q9608J20761o8549m4700J85054
1136A83097q7808j11054J34896K06546O216R1209l15334Q6360P6089q1031m46923
1125b57737J46309K64246p2879o838j09676k02515j0621M29342o8233j75927l1608
1114i6137N7533j60162N1735J03197Q8321K43130k53168r4515K3914J67954k09992
$$ y = [160022, 130899, 101497, 82344, 14422, -65302, -96844, 148411, 93494, 34472, 85425, 148222, 150073, 2344, 101519, 26979, 115394, 227959, 115863, -53764, -46827, -91245, -269393, -125628, -319177, -202135, -89239, -170659, -111543, -243274, -332744, -190182, -426832, -338430, -412830, -202306, -242315, -126376, -127181, -197014, -392621, -295502, -146406, -159384, -230098, -274018, -87642, -217062, -34285, 80139, -9469, 111292, 42743, -1957, 183097, 95289, -15765, 119131, 325677, 331893, 423102, 107768, 194128, 270217, 189186, -257737, -111428, 152818, 79939, 73101, -36575, -239090, -249711, 179631, 111398, -64529, -96137, -38604, -198766, -147031, -43834, 44487, 287617, 34449, -60066, -36152, 131802, -78190]
1103g8190j16381K77093j8677l7641K85J62327J18212j87479j1379j63902J76504
1092A20772J82766j24012J60002k06273P1334N2485j75846n3339p0538k71128
1082c13777K81727J9680k02120J880j24722j9073o0802o311K05528K33515J27318
1071A42843j64151k46127J31212J62735r54n1731K07897j15008j6193J4490q4672
1060a9659j36902J29534J91291k05705M937P3054r9124O7091K30622j7824l26173
1049a08858K9485J34751r8861r7848J12529k71439L5654J86936N7585k68816O9002
1038b19880r1799J59438J37234J86928j0279l31598l843q5984K3241J08712J62384
1027C4554j43551Q5810j13370k4978J9899j2850J41039K13107j5634l99131J6164
$$ y = [-78190, -194571, 82522, 63845, 26204, 26489, 188816, 307028, 119549, 108170, -55732, 120772, 303538, 179526, 339528, 133255, 204589, 257074, 81228, 27889, -42649, -313777, -32050, -12370, -214490, -212610, -337332, -356405, -417207, -423518, -217990, 15525, 142843, -21308, -267435, -136223, 26512, 25558, -26173, 181724, 66716, 50523, 65013, -19659, -156561, -27027, 164264, -41441, -36504, 36550, -62574, 4517, 235139, 217315, -108858, -79373, 55378, -43483, -141331, -28802, -300241, -264587, -77651, -20066, -288882, -219880, -311679, -152241, -15007, 171921, 161642, -169956, -173799, -259783, -236542, -127830, 34554, -108997, -23187, -136557, -161535, -141636, -154486, -13447, 199660, 184026, -215105, -198941]
1016a98941K6510J39689J07041k62634o0595k4466J65173O9613l1874j80912J28175
1005a23221N3371O2491j48365L9298J19490j36071R1007K13637j05492r6404J74274
994A44015k52290K00165k29452N6736J32267p0450J60886k25755P6036K02580
984A94738J9439j48620K59870j98304r6922K29271k66068r8350J48357K0314j36431
973g2706J67255r0826j19984K74264r1784k25559p1153L9270m1977J37708r297
962a04789j76065P3835K26012j4521J12569k23299J15237j07180j05421J40488
952f3134J81317k23670J61008k20593n3400L55462l97461K67869J12906k51395
$$ y = [-198941, -172431, -32742, 74299, -188335, -248930, -273396, -108223, -38610, -70484, -251396, -123221, -69850, -7359, -155724, -116426, 3064, -133007, -42000, 171637, 66145, -30259, 144015, -108275, 91890, -137562, -80826, 51441, -19009, 141877, -83878, -7842, 194738, 214177, 65557, 325427, 127123, 30201, 259472, -6596, -104946, 43411, 63725, -72706, 94549, 3723, -116261, 158003, 66219, -159340, -230493, -191223, -233200, -95492, -104789, -280854, -207019, 18993, 4472, 117041, -106258, 8979, -98201, -203622, -63134, 118183, -105487, 55521, -165072, -218472, 136990, -260471, 7398, 120304, -131091]
$$ [...]
##END NTUPLES=NMR SPECTRUM
##END=
