##TITLE=1H_EC-3260(4)
 CDCl3, 8 sc, 
 23.08.2021
##JCAMPDX= 6.0         $$ Bruker NMR JCAMP-DX V2.0
##DATA TYPE= NMR SPECTRUM
##DATA CLASS= NTUPLES
##ORIGIN= UXNMR, Bruker Analytische Messtechnik GmbH
##OWNER= root
$$ XWIN-NMR		Version 3.5
$$ Mon Aug 23 09:05:33 2021 Russian Standard Time (UT+4h)  she@DPX200
##.OBSERVE FREQUENCY= 200.131506
##.OBSERVE NUCLEUS= ^1H
##.ACQUISITION MODE= SIMULTANEOUS
##.ACQUISITION SCHEME= undefined
##.AVERAGES= 8
##.DIGITISER RES= 18
##SPECTROMETER/DATA SYSTEM= spect
##.PULSE SEQUENCE= zg30
##.SOLVENT NAME= CDCl3
##.SHIFT REFERENCE= (INTERNAL, CDCl3, 0, 17.4995)
##AUDIT TRAIL= $$ (NUMBER, WHEN, WHO, WHERE, WHAT)
$$ ##TITLE= Audit trail, XWIN-NMR		Version 3.5
$$ ##JCAMPDX= 5.01
$$ ##ORIGIN= Bruker BioSpin GmbH
$$ ##OWNER= she
$$ F:/spectra/data/she/nmr/H-F/1/pdata/1/auditp.txt
$$ ##AUDIT TRAIL=  $$ (NUMBER, WHEN, WHO, WHERE, WHAT)
(   1,<2021-08-23 09:04:18.42 +0400>,<she>,<DPX200>,
      <created by zg, POWCHK disabled, PULCHK disabled
       configuration hash MD5:
       00 E9 B6 7A A2 85 ED C7 34 08 36 98 17 FE 4E 26
       data hash MD5: 16K
       D6 90 FE 70 6E C1 E7 6F 56 62 26 A5 D8 B3 E9 99>)
(   2,<2021-08-23 09:04:20.95 +0400>,<she>,<DPX200>,
      <Start of raw data processing
       efp BC_mod = 2 LB = 0.24 FT_mod = 6 PKNL = 1 PHC0 = -13356.93 PHC1 = 13.80099 SI = 16K 
       data hash MD5: 16K
       19 1E 37 0C B2 C3 83 04 B0 C2 70 8B C7 FC 9E 46>)
(   3,<2021-08-23 09:04:40.28 +0400>,<she>,<DPX200>,
      <pk PHC0 = -1.016555 PHC1 = 2.6 
       data hash MD5: 16K
       64 78 9D 24 47 64 DF 8B A9 B5 E6 86 73 8F 3A E0>)
(   4,<2021-08-23 09:04:43.65 +0400>,<she>,<DPX200>,
      <abs ABSG = 5 
       data hash MD5: 16K
       12 05 41 D8 3A CE D4 D1 2C 6C D2 19 EC AC CD 8F>)
$$ ##END=
$$ 
$$ hash MD5
$$ F2 6D DA B2 70 EE 30 9F 9B 52 64 D9 00 D0 D5 AF
##$RELAX= 
##$RELAX= 
##$RELAX= 
##$RELAX= 
##$RELAX= 
##$RELAX= 
$$ Bruker specific parameters
$$ --------------------------
##$DU= <F:/spectra>
##$EXPNO= 1
##$NAME= <H-F>
##$PROCNO= 1
##$TYPE= <nmr>
##$USER= <she>
##$AMP= (0..31)
100 100 100 100 100 100 100 100 100 100 100 100 100 100 100 100 100 100 
100 100 100 100 100 100 100 100 100 100 100 100 100 100 
##$AQSEQ= 0
##$AQ_mod= 1
##$AUNM= <au_zg>
##$AUTOPOS= <>
##$BF1= 200.13
##$BF2= 200.13
##$BF3= 200.13
##$BF4= 200.13
##$BF5= 200.13
##$BF6= 200.13
##$BF7= 200.13
##$BF8= 200.13
##$BYTORDA= 1
##$CFDGTYP= 0
##$CFRGTYP= 5
##$CHEMSTR= <none>
##$CNST= (0..31)
1 1 145 1 1 1 1 1 1 1 1 1 1 1 1 1 1 1 1 1 1 1 1 1 1 1 1 1 1 1 1 1 
##$CPDPRG= <>
##$CPDPRG1= <>
##$CPDPRG2= <>
##$CPDPRG3= <>
##$CPDPRG4= <mlev>
##$CPDPRG5= <mlev>
##$CPDPRG6= <mlev>
##$CPDPRG7= <mlev>
##$CPDPRG8= <mlev>
##$CPDPRGB= <>
##$CPDPRGT= <>
##$D= (0..31)
0 1.2 0 0 0 0 0 0 0 0.06 0 0.03 0 0 0 0 0.0002 0 0 0 0 0 0 0 0 0 0 0 0 
0 0 0 
##$DATE= 1629695057
##$DBL= (0..7)
120 120 120 120 120 120 120 120 
##$DBP= (0..7)
150 150 150 150 150 150 150 150 
##$DBP07= 0
##$DBPNAM0= <>
##$DBPNAM1= <>
##$DBPNAM2= <>
##$DBPNAM3= <>
##$DBPNAM4= <>
$$ [...]
##$SUBNAM3= <"">
##$SUBNAM4= <"">
##$SUBNAM5= <"">
##$SUBNAM6= <"">
##$SUBNAM7= <"">
##$SUBNAM8= <"">
##$SUBNAM9= <"">
##$SW= 20.0188882624521
##$SWIBOX= (0..15)
0 0 2 0 0 0 0 0 0 0 0 0 0 0 0 0 
##$SW_h= 4006.41025641026
##$TD= 16384
##$TD0= 1
##$TE= 0
##$TE2= 300
##$TE3= 300
##$TEG= 300
##$TL= (0..7)
0 120 120 120 120 120 120 120 
##$TP= (0..7)
150 150 150 150 150 150 150 150 
##$TP07= 0
##$TPNAME0= <>
##$TPNAME1= <>
##$TPNAME2= <>
##$TPNAME3= <>
##$TPNAME4= <>
##$TPNAME5= <>
##$TPNAME6= <>
##$TPNAME7= <>
##$TPOAL= (0..7)
0.5 0.5 0.5 0.5 0.5 0.5 0.5 0.5 
##$TPOFFS= (0..7)
0 0 0 0 0 0 0 0 
##$TUNHIN= 0
##$TUNHOUT= 0
##$TUNXOUT= 0
##$USERA1= <user>
##$USERA2= <user>
##$USERA3= <user>
##$USERA4= <user>
##$USERA5= <user>
##$V9= 5
##$VALIST= <valist>
##$VCLIST= <CCCCCCCCCCCCCCC>
##$VD= 0
##$VDLIST= <DDDDDDDDDDDDDDD>
##$VPLIST= <PPPPPPPPPPPPPPP>
##$VTLIST= <TTTTTTTTTTTTTTT>
##$WBST= 1024
##$WBSW= 4
##$XGAIN= (0..3)
0 0 0 0 
##$XL= 0
##$YL= 0
##$YMAX_a= 188988
##$YMIN_a= -302958
##$ZGOPTNS= <>
##$ZL1= 120
##$ZL2= 120
##$ZL3= 120
##$ZL4= 120
##$ABSF1= 17.49711
##$ABSF2= -2.521927
##$ABSG= 5
##$ABSL= 3
##$ALPHA= 0
##$AQORDER= 0
##$ASSFAC= 0
##$ASSFACI= 0
##$ASSFACX= 0
##$ASSWID= 0
##$AUNMP= <proc_1d>
##$AZFE= 0.1
##$AZFW= 0.1
##$BCFW= 0
##$BC_mod= 2
##$BYTORDP= 0
##$COROFFS= 0
##$CY= -3
##$DATMOD= 1
##$DC= 0
##$DFILT= <>
##$DTYPP= 0
##$F1P= 0
##$F2P= 0
##$FCOR= 1
##$FTSIZE= 16384
##$FT_mod= 6
##$GAMMA= 0
##$GB= 0
##$INTBC= 1
##$INTSCL= 1.334414e-10
##$ISEN= 128
##$LB= 0.24
##$LEV0= 0
##$LPBIN= 0
##$MAXI= 10000
##$MC2= 0
##$MEAN= 0
##$ME_mod= 0
##$MI= 1.114404
##$NCOEF= 0
##$NC_proc= -7
##$NLEV= 6
##$NOISF1= 3.799351
##$NOISF2= 2.8
##$NSP= 0
##$NTH_PI= 0
##$NZP= 0
##$OFFSET= 17.49955
##$PC= 1
##$PHC0= -13357.95
##$PHC1= 16.40099
##$PH_mod= 1
##$PKNL= yes
##$PPARMOD= 0
##$PSCAL= 0
##$PSIGN= 0
##$REVERSE= no
##$SF= 200.130007020192
##$SI= 16384
##$SIGF1= 3
##$SIGF2= 2
##$SINO= 5.538805
##$SIOLD= 16384
##$SREGLST= <1H.CDCl3>
##$SSB= 0
##$STSI= 16384
##$STSR= 0
##$SW_p= 4006.41025641026
##$SYMM= 0
##$S_DEV= 0
##$TDeff= 16384
##$TDoff= 0
##$TI= <>
##$TILT= no
##$TM1= 0
##$TM2= 0
##$TOPLEV= 0
##$USERP1= <user>
##$USERP2= <user>
##$USERP3= <user>
##$USERP4= <user>
##$USERP5= <user>
##$WDW= 1
##$XDIM= 16384
##$YMAX_p= 362196278
##$YMIN_p= -809229
$$ End of Bruker specific parameters
$$ ---------------------------------
##NTUPLES= NMR SPECTRUM
##VAR_NAME=  FREQUENCY,     SPECTRUM/REAL,   SPECTRUM/IMAG
##SYMBOL=    X,             R,               I
##VAR_TYPE=  INDEPENDENT,   DEPENDENT,       DEPENDENT
##VAR_FORM=  AFFN,          ASDF,            ASDF
##VAR_DIM=   16384,         16384,           16384
##UNITS=     HZ,            ARBITRARY UNITS, ARBITRARY UNITS
##FACTOR=    0.24454680195387, 1,            1
##FIRST=     3502.18503747728, 0,            0
##LAST=      -504.225218932985, 0,           0
##MIN=       -504.225218932985, -809229,     0
##MAX=       3502.18503747728, 362196278,    0
$$ Real data points
##PAGE= N=1
##DATA TABLE= (X++(R..R)), XYDATA
$$ [...]
6808A04589M67949k27073j68816j54286K16889K4191j32013J56969k14568K22882
6798B96713J66113k00492q9599M6358J53370l70114o2590n3514J37089J66659
6788A89993k17119O4679K22802M2716j77831K03875L627j75566Q0912M2416r1796
6777A88708m7915P4447K55274j51590j41483j47387J28698p7342P3781j5722K19076
6766C58545j859O5635o3779j32435q181p5772j32236o0454J19024j27100j08097
6755a66709N17930j17424o6114K19703j93046O3061K43922J5139j07796J23645
6745E32311J39883N8382k53020p8110m9502n4496l0418M8819K06788p5594J22277
6734E67320L13574j42560l24117O1058J48107l7835q4522j68547r5512R3081K40205
$$ plain form
6808 104589 572538 345465 176649 22363 239252 263443 131430 288399 73831 296713
6798 296713 462826 262334 172735 219093 372463 2349 -60241 -113755 23334 189993
6788 189993 -27126 37553 260355 303071 125240 329115 332742 157176 238088 280504 188708
6777 188708 140793 215240 470514 318924 177441 30054 158752 81410 155191 139469 358545
6766 358545 356686 422321 358542 226107 217926 142154 9918 -50536 68488 -58612 -166709
6755 -166709 351221 233797 167683 387386 194340 257401 501323 516462 408666 532311
6745 532311 672194 730576 477556 399446 349944 295448 265030 313849 520637 445043 567320
6734 567320 880894 738334 414217 475275 623382 585547 501025 332478 236966 330047 570252
6723E70252l563l13488K81538K44380J39969o1728l61783m2698l4711j9356q6025
6712C12787k13140K15201p3739L5303J59662J00709j62585j42279K61426j2195
6702D81150P987O3454J19785l74780N5655J46733K30148r4755k55008n216J14677
6691D89830R9125j9337k43594P2046j16528Q7999L46443r7904j56562N4780K24382
6680G40680k9533n0017K64500O3509n9876J16847L4879l94665j59303K28281j73883
6669E81419Q5660K1395K38806M1019r3800N4932p7389r1602J45701K57277r9618
6658A063800o2785J59834k0280R1592n398j5466r5633N2720R8334R3289J02788
6647A462795k99851k7323o6912j7314O2542p6822J65189L82745k15026j58471
$$ plain form
6723 570252 566689 253201 534739 779119 919088 857360 495577 452879 418168 398812 312787
6712 312787 99647 314848 241109 276412 436074 536783 374198 231919 493345 481150
6702 481150 489137 552591 672376 297596 353251 499984 730132 635377 380369 375153 489830
6691 489830 588955 569618 326024 398070 281542 369541 715984 618080 461518 516298 740680
6680 740680 711147 661130 925630 989139 929263 1046110 1080989 686324 527021 755302 581419
6669 581419 667079 688474 927280 968299 874499 929431 852042 760440 906141 1163418 1063800
6658 1063800 1001015 1160849 1140569 1232161 1226763 1211297 1115664 1168384 1266718 1360007 1462795
6647 1462795 1162944 1135621 1068709 1051395 1113937 1037115 1202304 1585049 1370023 1211552
6637A211552K17525Q7319L4542J07209k03026M2723J91658P2604n7277K85506
6627A990335m9072M1273K09454o4586k2284L8895J01319j36367j6386R6083o9317
6616B119347k76808Q0461J21023J44397R0298M4705J69853K96999J27014K46218
6606C163507J49882l32407R8324q4003j32246O1675L35312j31261j54425k3843
6596B950515Q6480K874K36060J21464J82057K25621K11028q5538L9376L11593
6586D281530K57015j36705J38678q4242K25331J40809k16679M96519K08748L78014
6576E689018L56168K33053K84301K17551Q3729P72972N49996O21363K10351N45665
6566I564167O55997O65912N36379O78997J064357J368413J153562J911939J938503
$$ plain form
6637 1211552 1429077 1516396 1550938 1658147 1455121 1497844 1689502 1762106 1704829 1990335
6627 1990335 1941263 1982536 2191990 2127404 2105120 2144015 2245334 2108967 2092581 2188664 2119347
6616 2119347 1842539 1923000 2044023 2188420 2278718 2323423 2493276 2790275 2917289 3163507
6606 3163507 3313389 2980982 3079306 2995303 2863057 2924732 3260044 3128783 2974358 2950515
6596 2950515 3036995 3039869 3275929 3397393 3579450 3805071 4016099 3930561 3969937 4281530
6586 4281530 4538545 4401840 4540518 4456276 4681607 4822416 4605737 5102256 5311004 5689018
6576 5689018 6045186 6278239 6562540 6780091 6863820 7636792 8186788 8808151 9018502 9564167
6566 9564167 10220164 10886076 11422455 12101452 13165809 14534222 15687784 17599723 19538226
6557A9538226J961209K609718K917283L421090M037210M324650N233565O635171
6549E0678122Q223658R360418P949292M486325p27366n671473p913445p912357
6541E8473174n924157m050664j720392j84064J331460K755898K829647J291835
6533E4802737j072208l913355n547879n839198m999737l882355k715412k041491
6525B4791102j476389p71187p90258n39344o45397j117867j121585q87659j127629
6516A6313787m86349n06147j64059j08538J17775J94933P01857J208156J040479
6507A8311894J059562P46055l52260j150068j811468j865389j320193j131256
6499A2486877j007404j010146r71939n37241p53934o56160n92423l69752m16319
$$ plain form
6557 19538226 21499435 24109153 27026436 30447526 34484736 38809386 44042951 50678122
6549 50678122 58901780 68262198 76211490 80697815 79970449 74298976 66385531 58473174
6541 58473174 52549017 48498353 46777961 46593897 47925357 50681255 53510902 54802737
6533 54802737 53730529 49817174 44269295 38430097 33430360 29548005 26832593 24791102
6525 24791102 23314713 22543526 21753268 21213924 20568527 19450660 18329075 17441416 16313787
6516 16313787 15827438 15321291 15157232 15048694 15166469 15361402 16063259 17271415 18311894
6507 18311894 19371456 20117511 19765251 18615183 16803715 14938326 13618133 12486877
6499 12486877 11479473 10469327 9497388 8960147 8206213 7550053 6957630 6587878 6171559
6490F171559m67139n4234L2551n68320k07782j81967l35740j07657o7433P6223
6480D290061j29947m23381N646j14863l897R2253k47851k82968k36703j10655
6470B837695J28462k53549m23996J95450m1254j39647k15343L5827K51189k15618
6460B159216R4324k4739k5528J6245K03098P4833l39947j43542j03570j52058
6450A758332P6138k0825j60020Q4843j13539l2614p5644o0980j68805r004j72463
6439A105419K30388j01251K939l0862j02195N4935r1776K17861k3448r870j04394
6428A147746m1054M1031k0368N635j49506j71230l3397P6578Q6659R090j55726
6417G95458O5037Q8148J00392L4413k44920J76058k3840j42062k3415n98864J85613
$$ plain form
6490 6171559 5704420 5650186 5682737 5114417 4906635 4724668 4388928 4281271 4213838 4290061
6480 4290061 4160114 3736733 3742379 3627516 3623619 3715872 3468021 3185053 2948350 2837695
6470 2837695 2966157 2712608 2288612 2484062 2442808 2303161 2087818 2123645 2374834 2159216
6460 2159216 2253540 2228801 2203273 2219518 2422616 2497449 2157502 2013960 1910390 1758332
6450 1758332 1834470 1813645 1653625 1738468 1624929 1592315 1516671 1455691 1286886 1277882 1105419
6439 1105419 1335807 1234556 1237495 1206633 1104438 1159373 1067597 1285458 1262010 1252140 1147746
6428 1147746 1106692 1147723 1127355 1132990 983484 812254 778857 855435 942094 951184 795458
6417 795458 860495 948643 1049035 1083448 838528 1014586 990746 848684 825269 226405 412018
6406D12018J64564k34292J74823j56095k23275k544J17639M906j0099M4158o8497
6395B23306o2644O1552l8909J234j42063O5144K99016J86889r6324k5417P1869
6384E43653J04762j71693j57708J99121Q1179q5375J43733k99397l2024j26435
6374A99816j72832L04730j21064P2192j25592J59862O6937q2823K16044j54205
6364C63065p2778j1635j22008M3483k18471J94033K9340k41610N776M9873q7574
6353f8506J00472j00003j0034R421k7118K30196P9766l0338K8858N0060J40695
6342D03469L82479j13531l41909k02991k970O2624j23518l0439O8057j245k64357
6331a64331N097K55327J14533N8175J38430j34966Q867j18275N219J77473j37160
$$ plain form
6406 412018 576582 342290 517113 361018 137743 135199 252838 257744 247645 291803 223306
6395 223306 160662 222214 183305 184539 42476 107620 406636 593525 497201 471784 543653
6384 543653 648415 476722 319014 518135 599314 513939 657672 358275 326251 199816
6374 199816 26984 331714 210650 282842 157250 317112 384049 301226 517270 363065
6364 363065 290287 278652 156644 200127 -18344 175689 205029 -36581 -30805 19068 -68506
6353 -68506 31966 -68037 -78071 -68650 -95768 134428 214194 183856 212714 262774 403469
6342 403469 785948 672417 330508 127517 124547 187171 63653 33214 101271 100026 -164331
6331 -164331 -159234 96093 210626 268801 407231 272265 281132 162857 168076 345549 208389
6320B08389j65030q0530o84J14260M1148K11068J04673j39954l995J99177l9622
6309D48900l2515l9867k00393k90308O7914K20337r3297Q8039L929R369K5627
6298B07735k3113l01311o3347m202k9799p0779K08992L5241J75347m5780L8842
6287A27826P1276Q4637J29643j10420k73725J80061J53578m75374J12085J98836
6277A98423k61198J27919M8893P4465n1112O3268P2768k516j33138J9249o2853
6266I4168l7181n4576j81276j13456J47230J82733j10711K8983Q7398k5744o690
6255A0878K06345J86733l3933L6836J78070r3955J2419P6327k31966j39650P6012
6244B84116K59641L23284j40034l8854k73215j3339M5403k42286m009J27598n604
$$ plain form
6320 208389 43359 -37171 -37855 76405 117553 328621 433294 293340 289345 488522 448900
6309 448900 416385 376518 176125 -114183 -46269 174068 80771 168810 172739 182108 207735
6298 207735 184622 -116689 -180036 -184238 -214037 -284816 -75824 -40583 134764 88984 127826
6287 127826 199102 283739 413382 302962 29237 209298 362876 -112498 -413 198423
6277 198423 -62775 65144 114037 188502 137390 200658 273426 270910 137772 157021 94168
6266 94168 56987 2411 -178865 -292321 -145091 37642 -73069 -44086 43312 17568 10878
6255 10878 217223 403956 370023 406859 584929 490974 503393 579720 347754 208104 284116
6244 284116 543757 867041 727007 688153 414938 401599 447002 204716 200707 328305 322701
6233C22701k8054m5052N8941j73880N1713k36683J88525r6447q187J0425j01065
6222e7063J28103J33597l6240j94588J21602K05972j31675r0870J38706k2980
6212A94564L6151N2073R1740r2580j45671m8698l34305K0242K89192O5606J41219
6201B69533J95316r1089k96280J69762n468r9468m1076K93937M2859j57263p1493
6190B09270J92375J20710L9666k5455J165K02875j5015O5252O0768q1353J1265
6179G81523j14388R181Q9744k89933J40584P7634N3295l9394O1843M7718k65767
6168E52040J42714L7539l12345P2770M96503k64490j0778k3347Q0095j20337j13029
6157E37335J58358j99456j62379K45723j62679j63172K64351m1016p9458J04844
$$ plain form
6233 322701 294647 249595 308536 134656 186369 -50314 138211 41764 33577 44002 -57063
6222 -57063 71040 204637 168397 -26191 95411 301383 169708 78838 217544 194564
6212 194564 230715 282788 374528 281948 136277 87579 -246726 -226484 62708 128314 269533
6201 269533 464849 373760 77480 247242 241774 142306 101230 395167 438026 280763 209270
6190 209270 401645 522355 562021 536566 537731 740606 725591 790843 851611 770258 781523
6179 781523 667135 676316 766060 476127 616711 694345 747640 708246 770089 817807 552040
6168 552040 694754 732293 419948 492718 989221 724731 713953 690606 770701 650364 537335
6157 537335 695693 496237 333858 579581 416902 253730 518081 477065 397607 502451
6147E02451J59694N4155O6404J65534J35585j14546J5292l8143j37824k38691
6137E69911O4369j31827k44653J46576J77661k66768Q1913J26427j23352O2977
6127D63234R967n3956N41J29640r1649P927J33550j59662j48694r2720l3544M7638
6115B12272K07718J62573l2379j76072j27548J06059l44534Q3259J60822j9482
6105B32688J9792o3281j0125j73171L38142J28184l07545r2647K32710P5729r6408
6094B84068o7660K1128J8292n3530m0599N3260J29041j28168J42347j40466p6498
6083A41215K57472k0851J55440j6383j39360J07085p0757j99818J9426J62127
6073C95596J25901j48509R3320R3398k56126o4551q5161j13377K77922Q4601j11077
$$ plain form
6147 502451 662145 716300 782704 948238 1083823 969277 984569 946426 808602 569911
6137 569911 634280 502453 257800 404376 582037 315269 397182 523609 400257 463234
6127 463234 473201 419245 419786 549426 457777 465704 599254 439592 290898 198178 164634 212272
6115 212272 419990 582563 550184 374112 246564 352623 8089 91348 252170 232688
6105 232688 252480 189199 179074 5903 344045 472229 164684 72037 304747 380476 284068
6094 284068 216408 237536 255828 202298 161699 214959 344000 215832 358179 217713 141215
6083 141215 398687 377836 533276 516893 377533 484618 413861 214043 233469 395596
6073 395596 521497 372988 466308 559706 303580 239029 153868 40491 318413 403014 291937
6062B91937P1182p5996M3837o5536R3560K41854j62270l11614j82589J61640m8453
6051E7552j15252K17624j9430M3703O6553k63278j96906P1620m480P3686j79528
6040b48136P3968J60181p9662J72588j48060K05248K46824m22584j09019r9011
6030b47663R2003L14014j99311k41020J72500k4891m262J42989J62319j43637
6020B3041K6417R7100M7926M1259j23210K71741p2186l8536l8453l35435P993
6009i2343K66830r5517m6789J41976N8454k48563N7978Q1296O4840R543q3409
5998A14296M0207m1760Q4234n2838r0065k23167K90411J92155m1357K90534m8141
5987E14509j64112j28371K05544j07308j14235j48314n440j69431j60382K36969
$$ plain form
6062 291937 363119 287123 330960 265424 358984 600838 438568 126954 -55635 106005 57552
6051 57552 -57700 159924 140494 184197 250750 -12528 -209434 -137814 -142294 -68608 -248136
6040 -248136 -174168 -13987 -93649 78939 -69121 136127 382951 -39633 -148652 -247663
6030 -247663 -155660 158354 -40957 -281977 -109477 -134368 -138630 4359 166678 23041
6020 23041 49458 146558 194484 235743 112533 384274 312088 273552 235099 -100336 -92343
6009 -92343 174487 78970 32181 174157 232611 -15952 42026 123322 188162 197705 114296
5998 114296 154503 112743 196977 144139 54074 -169093 121318 313473 272116 562650 514509
5987 514509 350397 222026 427570 320262 206027 57713 52273 -117158 -277540 -40571
5977d0571l6272Q7404M9317l5245j0111O0071R6947j17285L6151p2397o9660J15905
5965F4254J3628J35254k51521m0242K71224k01882j25699j73944Q2959L111L26239
5954A03381J18381J7197r1265K03902P66q4348K00548j37109p7986o4971N9028
5943B47524O1439r0264L40K34016k91388R4749K10556N7338J5434M3152N0151
5932F33047j07509L9256J58531j84829N7028o3201r9914J9293L443p8248j37878
5921B39019K3810J20546k50j24716J29032j25410j1613L9120l75368K71595j79095
5910F670J20119J04534K09783q343j02436M5487P7577K14595n9267r0382K8846
5899E47183J81302k58613l2114l7875o1153j2544K86794p1027k00522K89780j46637
$$ plain form
5977 -40571 -76843 10561 59878 24633 14522 74593 171540 54255 90406 18009 -51651 64254
5965 64254 77882 213136 -38385 -78627 192597 -9285 -134984 -308928 -225969 -222858 103381
5954 103381 221762 238959 147694 351596 352362 268014 468562 331453 253467 188496 247524
5943 247524 308963 218699 219039 453055 161667 256416 466972 524310 539744 582896 633047
5932 633047 525538 564794 723325 538496 595524 532323 432409 451702 455145 376897 239019
5921 239019 262829 383375 383125 258409 387441 262031 250418 289538 -85830 185765 6670
5910 6670 126789 231323 441106 432763 330327 375814 453391 667986 608719 518337 547183
5899 547183 728485 469872 437758 399883 338730 326186 612980 541953 341431 631211 484574
5888D84574m4323K83024J0930q4222j56676J21370m2869n9823l04777N890K67659
5877D80757Q7822q4282j16771K12887j81848J36906j03586J85421k8918p1625
5867E16763J91444l3042n2262J95253M0527j41087r0866J2642j11621l07339L80844
5856F01256J13672J882m7646O1573N0033k60061j03741J57060j84330L55322J02369
5845H47389l36715J35972J28699k5952o4241n0400k6298j5218j37699J40974O2805
5834F59316J0957k6337r7815k31919n9122P6528q178R1854j34561k60756K85142
5823C05109J61710q7119M84938M6400k8911K20368K12358k32481k92381Q3058
5813H73049K38917k51661j80582J04534K16104n661j18684k13409M2126J12197
$$ plain form
5888 484574 440251 723275 734205 649983 493307 614677 571808 511985 207208 213098 480757
5877 480757 568579 484297 367526 580413 398565 535471 431885 617306 588388 516763
5867 516763 708207 675165 622903 818156 858683 717596 626730 639372 527751 220412 601256
5856 601256 714928 716810 669164 730737 780770 520709 416968 574028 389698 745020 847389
5845 847389 510674 646646 775345 749393 685152 634752 608454 593236 455537 596511 659316
5834 659316 670273 643936 546121 314202 255080 331608 323430 415284 280723 19967 305109
5823 305109 466819 379700 864638 911038 882127 1102495 1314853 1082372 789991 873049
5813 873049 1111966 860305 679723 784257 1000361 994700 876016 662607 704733 816930
5803H16930Q5384j32662j23188O7995m5596L75783j95869P2889p2493j72382K13404
5792H90195j00662J51034k8096j43236K7606o2402o0078P0889k34302J70311M4888
5781G26147O2681O5774k4022m69M9452J26635j39485J13748j34106R1158K1781
5770I59294J25799j99066k16706J68592J76521M3140k4717J31430p491j06901
5760A049895j90155j13870M1270L8054l7267L5984K54330o0537j9466P7856J34500
5749A210594J85542k93741L7727J79922j57361k23482j9591J01752k24398K73350
5739A070314K12405j60494r2081J40607J02233J05478M9421j54696L2045j58284
5729A146948O393J56945J28097J51784O9297Q7462n9918k9093j35050J14803J25653
$$ plain form
5803 816930 902314 769652 646464 714459 668863 1044646 848777 921666 849173 676791 890195
5792 890195 789533 940567 912471 769235 796841 734439 674361 745250 510948 681259 726147
5781 726147 788828 854602 830580 830111 879563 1006198 866713 980461 846355 937513 959294
5770 959294 1085093 886027 669321 837913 1014434 1057574 1032857 1164287 1156796 1049895
5760 1049895 859740 745870 787140 825194 787927 823911 1078241 1017704 998238 1076094 1210594
5749 1210594 1396136 1102395 1140122 1320044 1162683 939201 919610 1021362 796964 1070314
5739 1070314 1282719 1122225 1030144 1170751 1272984 1378462 1427883 1273187 1305232 1146948
5729 1146948 1153341 1310286 1438383 1590167 1659464 1746926 1687008 1657915 1522865 1637668 1763321
5718A763321Q219j51959O3424O653j56916L5422r9352r67o4601J37549K27318
5707A768111K22126K19594n9214k1826K12636j48807l15463q9264Q2230j85488
5697A684635J71301L68635j67893J8917J74271J65971Q4599r000k48923j04095
5687B138418R3553J27050j26886Q1899M5090p286K23522J52879J3263o983M7636
5676B782155K28838r2567j05711J36190Q5456j19135J4421m4797k25617Q7619
5666B746852L95659O2492r1996L04136n8343j871n3259m4708J72778L72236j95578
5655C608398K4084K67911K58410k84341K1079K28605J46440K20765Q0328M0574
5645D612253J86167R4466K15804O506P676J02922N95950L29021K39466N17251
$$ plain form
5718 1763321 1771540 1619581 1683005 1689658 1532742 1568164 1468812 1467845 1403244 1540793 1768111
5707 1768111 1990237 2209831 2150617 2128791 2341427 2192620 1877157 1787893 1870123 1684635
5697 1684635 1855936 2224571 2056678 2075595 2249866 2415837 2500436 2491436 2242513 2138418
5687 2138418 2231971 2359021 2232135 2314034 2359124 2351838 2575360 2728239 2741502 2734519 2782155
5676 2782155 3010993 2918426 2812715 2948905 3034361 2915226 2929647 2884850 2659233 2746852
5666 2746852 3142511 3205003 3113007 3417143 3358800 3356929 3303670 3258962 3431740 3803976 3608398
5655 3608398 3632482 3900393 4158803 3874462 3895541 4124146 4270586 4491351 4571679 4612253
5645 4612253 4798420 4892886 5108690 5115196 5122872 5225794 5821744 6150765 6390231 6907482
5635F907482L88105M83142O08688P14268N12209J009582R34650J360874J686125
5626A4605125K401645K159570L31171j343611k198728k299659j011124q23106
5618A1821283m82150l2225k8450l3434j26996L6593o982J06261M48636O26792
5608A2329328N88364R22620J054038J370957J655564J745678K132292K663698
5600B4462539K943508L942672M990828O525021O434848L21983m622151p221162
5592C7778086o628935m480130k994709j779456j536170j200644p05281n92981
5584A7859780m53626k24546p9325J64517J81121O85970N72235P16797R18886J561918
5574B1903727J625246J996656K558485L183533L665638N297574O818981O785918
$$ plain form
5635 6907482 7295587 7778729 8387417 9101685 9613894 10623476 11558126 12919000 14605125
5626 14605125 17006770 19166340 19497511 18153900 15955172 13655513 12644389 11821283
5618 11821283 11339133 11306908 11278458 11245024 11118028 11154621 11147639 11253900 11702536 12329328
5608 12329328 12917692 13840312 14894350 16265307 17920871 19666549 21798841 24462539
5600 24462539 27406047 31348719 36339547 42864568 49299416 49621399 44999248 37778086
5592 37778086 31149151 26669021 23674312 21894856 20358686 19158042 18452761 17859780
5584 17859780 17406154 17181608 17102283 17266800 17447921 18133891 18706126 19422923 20341809 21903727
5574 21903727 23528973 25525629 28084114 31267647 34933285 40230859 47049840 53835758
5566E3835758O69782m955552p279392p093406m565084l195865k202984j448814
5558B3764443r62869m31406m71183l36571Q1458J69224L82072M65176R76890J113046
5548B4750280J464599J830471K399099K650584K995660L583268M518084M919333
5540D9111378L811663K428727K60085l204036m518357n095027m209522k781946
5532C5802965j815677j072713j033288n66832j50661J44526O97774J274351J511583
5523C4792028J949737K624265K882709L619322M508390N774701O761224P612335
5515G0524711N870615Q99208m813085q132830q464312p091729n310187l598681
5507C9883710k400566k121291j455736j283112j037198o71369n44324k77362O0901
$$ plain form
5566 53835758 54505540 49549988 42270596 35177190 30612106 27416241 25213257 23764443
5558 23764443 22801574 22370168 21898985 21562414 21643872 21813096 22195168 22660344 23637234 24750280
5548 24750280 26214879 28045350 30444449 33095033 36090693 39673961 44192045 49111378
5540 49111378 52923041 55351768 55611853 52407817 47889460 42794433 38584911 35802965
5532 35802965 33987288 32914575 31881287 31314455 31163794 31308320 32006094 33280445 34792028
5523 34792028 36741765 39366030 42248739 45868061 50376451 56151152 62912376 70524711
5515 70524711 76395326 77294534 72481449 64348619 55884307 48792578 43482391 39883710
5507 39883710 37483144 35361853 33906117 32623005 31585807 30914438 30370114 30092752 30153653
5498C0153653L66271P99556Q40265J373139J879249K275915K801920L477347L653190
5489D7620505K282813m72729k856018m198279m109536l129617k271870j926974
5481C0938295j354135j336321j576943q39254j130961p79259p53732p30734n51757
5472B1885199q61222q49432l70567J56609M8730k59899k0482L79726Q2164M36692
5462B0627518N43070L55675N88337P31677O71142O25361k24014o92139p18938
5453B2507689o78867l43891k76860k59616p061j09535k16516k17304k9122K75825
5443B0644742J96332M26388N56930P55607P78097J167714J540386J417428J682887
5434B9166511J870442K100820K334932K493759K374144K578629L318593L235369
$$ plain form
5498 30153653 30519924 31319480 32159745 33532884 35412133 37688048 40489968 43967315 47620505
5489 47620505 49903318 49430589 46574571 42376292 38266756 35137139 32865269 30938295
5481 30938295 29584160 28247839 26670896 25831642 24700681 23921422 23167690 22436956 21885199
5472 21885199 21023977 20174545 19803978 19960587 20009317 19749418 19728936 20108662 20190826 20627518
5462 20627518 21170588 21526263 22114600 22846277 23517419 24142780 23918766 23226627 22507689
5453 22507689 21828822 21484931 21208071 20948455 20941394 20831859 20615343 20398039 20368917 20644742
5443 20644742 20841074 21267462 21824392 22579999 23358096 24525810 26066196 27483624 29166511
5434 29166511 31036953 33137773 35472705 37966464 40340608 42919237 46237830 49473199
5426D9473199J839155O6769j545478k517047j923146j398095j123963k70374K03179
5417D2804199R80138J251451J266355J796212J753863J523242J449517J244536
5409E4069513J321114K023795K566476L329855M520704N451033O663716O653151
5401H6599357M087148j79978l992275o397752o204524m775950l616015j864340
5393F3655671j040698n79976O29572J110363J516753J918433O01329p27113k056830
5384F5027504k848216k819383j910221q88294j08853P68839J436680J708609J306184
5375F1672849k63899k455757l541689m223075l357576k490928k120829j394217
5367D1824879q35563j06782J89615M09450K27635R9896l16274j113403j923244
$$ plain form
5426 49473199 51312354 51379123 49833645 47316598 45393452 43995357 42871394 42601020 42804199
5417 42804199 43784337 45035788 46302143 48098355 49852218 51375460 52824977 54069513
5409 54069513 55390627 57414422 59980898 63310753 67831457 73282490 79946206 86599357
5401 86599357 90686505 90506527 86514252 80116500 73911976 69136026 65520011 63655671
5393 63655671 62614973 62034997 62664569 63774932 65291685 67210118 67811447 67084334 65027504
5384 65027504 62179288 59359905 57449684 56561390 56452537 57221376 58658056 60366665 61672849
5375 61672849 61408950 58953193 55411504 51188429 47830853 45339925 43219096 41824879
5367 41824879 40989316 40882534 41072149 41481599 41709234 41809130 41492856 40379453 38456209
5358C8456209k233551k020354j807861j783592j333436j133634j389513j113785
5350B5640483j229731j118029j184591r10213p14722n81331l58764o38988k79709
5341A8624405l05396m8376l65620j16602L15896J73553J07071J14184J92136M07605
5331A9098856M07289K89828M30952L63664q3201n01188j064680j024065p22748
5322A7194707j040451q66080p58986n25552m44688n52588q33174m35956k42729
5313A1494503j73059j73631L6111k31456k88760j5644L65027j57177K364L38158
5303A1196436K28006j30437n6107l81991m68134m90100n18736m33119n08940k45941
5293H190937j65069k42804m33679j42607m68455k78807m96456n2326j97427k53500
$$ plain form
5358 38456209 36222658 34202304 32394443 30610851 29277415 28143781 26754268 25640483
5350 25640483 24410752 23292723 22108132 21197919 20483197 19901866 19543102 18904114 18624405
5341 18624405 18319009 18270633 17905013 17788411 18104307 18277860 18384931 18499115 18691251 19098856
5331 19098856 19506145 19795973 20226925 20590589 20507388 20006200 18941520 17917455 17194707
5322 17194707 16154256 15288176 14529190 14003638 13558950 13006362 12173188 11737232 11494503
5313 11494503 11321444 11147813 11183924 10952468 10663708 10648064 11013091 10855914 10858278 11196436
5303 11196436 11424442 11294005 11237898 10855907 10387773 9897673 9378937 8945818 8436878 8190937
5293 8190937 8025868 7783064 7349385 7206778 6738323 6459516 5963060 5910734 5713307 5459807
5283E459807k53919q2552j98063j07830j49112k23734L5845j56345k65882N2885
5273D111100j21929j37220n0772L6786k87999Q4844l7886m02806J45209K01721
5263C541048j56100l1062j14349N2704J23775o799o639j10335k73992m5039J9156
5252B992368m42338J26964k1280J03484J55305j77257q5424J21977K2888J16201
5242B912888J22006M7120j13681J89560k23455j40173k28947J70585J88704q289
5232B916318k1504p0727q3292k3096K1299o476L33476K87732J5974o6766Q589
5221C311527k74802m3479o6473K21150j59794K2910J76115j87992K38517P6703
5211C314382J28785J71892l0934N8827j7418r0637Q9582p8790J67641k30218j46194
$$ plain form
5283 5459807 5205888 5123336 4925273 4817443 4668331 4444597 4480442 4324097 4058215 4111100
5273 4111100 3989171 3851951 3801179 3837965 3549966 3634810 3596924 3194118 3339327 3541048
5263 3541048 3384948 3353886 3239537 3292241 3416016 3409217 3402578 3292243 3018251 2973212 2992368
5252 2992368 2550030 2676994 2655714 2759198 2914503 2737246 2651822 2773799 2796687 2912888
5242 2912888 3034894 3082014 2968333 3157893 2934438 2794265 2565318 2735903 2924607 2916318
5232 2916318 2894814 2824087 2740795 2717699 2738998 2732522 3065998 3353730 3369704 3302938 3311527
5221 3311527 3036725 2993246 2926773 3147923 2988129 3011039 3187154 2999162 3237679 3314382
5211 3314382 3443167 3615059 3584125 3642952 3625534 3534897 3624479 3545689 3713330 3483112 3336918
5200C336918j7541J49824K32989n9205J1021N584Q2614L30475j8186j75612N4971
5189C933852r617n5830K66055j01144j29987L35820J03108r658j9276j40148J23735
5178D296910J36499j60589P8058J69395P3407O0879J08210K76934K52353p2331
5168E219725l15743j61742l28123j91494l63417k50124N3997k11386L727R561
5158C464981j46817o9635M860j18906j11401J1415J93063k73297R4500O4161k49014
5147B863910l76219j30854n964K52791l18487O8118p0199l0432L2029k13129j30473
5136A941091M17652q699J21552j95280j25945j06724l4411q9892j28640r4567
5126A696137N1479N6818k38311L72945M1443q9327n2658k1033L8744J29142q9895
$$ plain form
5200 3336918 3319377 3469201 3702190 3642985 3654006 3659590 3742204 4072679 4054493 3878881 3933852
5189 3933852 3924235 3868405 4134460 4033316 3903329 4239149 4342257 4332599 4313323 4173175 4296910
5178 4296910 4433409 4272820 4350878 4520273 4593680 4654559 4762769 5039703 5292056 5219725
5168 5219725 4903982 4742240 4414117 4222623 3859206 3609082 3663079 3451693 3455420 3464981
5158 3464981 3318164 3248529 3253389 3134483 3023082 3034497 3227560 2954263 3048763 3112924 2863910
5147 2863910 2487691 2356837 2350873 2603664 2285177 2353295 2283096 2252664 2284693 2071564 1941091
5136 1941091 2358743 2350044 2471596 2276316 2150371 2043647 2009236 1919344 1790704 1696137
5126 1696137 1747616 1804434 1566123 1939068 1980511 1891184 1838526 1817493 1856237 1985379 1895484
5115A895484j51835N8480J28474k13939J0746N9896N087k64100j59023J49594
5105A518864l7428k24938L26007P8973j05586J69083L73882j02293l83668r6537
5095A516359n3042j20272K24700o274q5575j8724n5650o8853p9424j8175L7406
5084A272476j94266M8950J72365J57177q0262Q9986J38581j47740j99002K07956
5074A466221l18006k06176K8695q0804j60084J52486J06548K37876J05789p4056
5064A258489m2168J392K09922N6975o7202o4602P5527k44152r2705L0007Q2002
5053A203485J4218j41641J47886J18029l66145J75184l72697O553L10203j529
5043A093546k7934n6915n7565r8409n2463J18758p5780J22364K63899n8330j09014
$$ plain form
5115 1895484 1743649 1802129 1930603 1716664 1727410 1787306 1792393 1528293 1369270 1518864
5105 1518864 1481436 1256498 1582505 1661478 1555892 1724975 2098857 1996564 1612896 1516359
5095 1516359 1463317 1343045 1567745 1561471 1475896 1457172 1401522 1332669 1253245 1235070 1272476
5084 1272476 1078210 1127160 1299525 1456702 1376440 1466426 1605007 1457267 1258265 1466221
5074 1466221 1148215 942039 970734 889930 729846 882332 988880 1226756 1332545 1258489
5064 1258489 1216321 1217713 1427635 1484610 1417408 1352806 1428333 1184181 1091476 1121483 1203485
5053 1203485 1217703 1076062 1223948 1341977 975832 1151016 778319 784872 1095075 1093546
5043 1093546 1065612 1008697 951132 852723 800260 919018 843238 965602 1229501 1171171 1062157
5032A062157J4020n9404k66230R8709J19752j14601J84982K87535l6996M8407
5022A338331j20175k42556J76886j87341k64416J78822J02093j29021l3252P630
5012H27001k5081L15587R3583P3573o3747j77297n4195J93765k8765O2662J86602
5001A403688l3619m771j19542n7197o2953K16308R2692J16744J05736P512R4221
4990A758819J11815N5626K89007J20580j40375J40287P5412k48664m03566P3219
4980A832160k16204J90479K10752n8168j64559k38295Q6252j97352p73J91621
4970A635913l7662M20349J02207j96517Q9063r4946K61202L2407M23951K71761
4960B907728K18510j42378j74142p6479o8821j48048j59112N1494k73415o9906
$$ plain form
5032 1062157 1076177 1016773 750543 849252 969004 854403 1039385 1326920 1289924 1338331
5022 1338331 1218156 975600 1152486 965145 700729 879551 981644 852623 819371 827001
5012 827001 801920 1117507 1211090 1284663 1220916 1043619 989424 1183189 1154424 1217086 1403688
5001 1403688 1370069 1365298 1245756 1188559 1125606 1341914 1434606 1551350 1657086 1664598 1758819
4990 1758819 1870634 1926260 2215267 2335847 2195472 2335759 2411171 2162507 1758941 1832160
4980 1832160 1615956 1806435 2017187 1959019 1794460 1556165 1642417 1445065 1444292 1635913
4970 1635913 1598251 2018600 2120807 1924290 2013353 1918407 2179609 2212016 2635967 2907728
4960 2907728 3126238 2983860 2809718 2733239 2664418 2516370 2357258 2408752 2135337 2065431
4950B065431j62090J01347J99126k39438j65901j1706J7608K3318J60695K8169
4940B016559j46268R5292P8556k8705J19728Q2311O2722J92091r6386j52108k51524
4929A972268N737K43969j09341j95943J05136J08511J47613o9849j03731J22069
4919B226439j53656k3843K03488j96110j85637j9992o6437K93825j77118l5934
4909A865025K61883N459j64979k00513J40517R1190L8220n2291J88116o0104k67233
4898A845290L9556K65560J23312O8365j44107k09680K60359j92100J41815j27449
4888B070921K5512n7217J62933K31023o0395j5528K85082j53293k13591L64466
4878B639913O6651j62466j6103K46302O2945l4048M11068K10013j46738J37935
$$ plain form
4950 2065431 1903341 2004688 2203814 1964376 1798475 1786769 1804377 1827695 1988390 2016559
4940 2016559 1870291 1965583 2044139 2015434 2135162 2217473 2280195 2472286 2375900 2223792 1972268
4929 1972268 1978005 2221974 2112633 1916690 2021826 2130337 2277950 2208101 2104370 2226439
4919 2226439 2072783 2048940 2252428 2056318 1870681 1850689 1784252 2078077 1900959 1865025
4909 1865025 2126908 2132367 1967388 1766875 1907392 1998582 2036802 1984511 2172627 2112523 1845290
4898 1845290 1884846 2150406 2273718 2342083 2197976 1988296 2248655 2056555 2198370 2070921
4888 2070921 2096433 2039216 2202149 2433172 2372777 2357249 2642331 2489038 2275447 2639913
4878 2639913 2706564 2544098 2527995 2774297 2837242 2803194 3214262 3424275 3277537 3415472
4868C415472J75972M5710j72795K7576O0606k87960M6941o291J1026j56539j85678
4857B974040J20179J4011J00975K72299M83776k3444J41113J95396L55689L23029
4847D957063M4864j19943J16360n3826k62613L5207n1203l19372l410k18021j06955
4836D018151j88819J39028J03225k66160N5723J80229k30091R1942J75589j05534
4826C973283j53267K02329K06567J56833j33917K39306R299P7210L7278j42473
4816D472448l10423j8100M5981J5470K18496K38301j19847L1314j5563r7712k9208
4805D431157K8463K57761j40814k918K37528J45532K1565L45273k26303r7927
4795D999317n3361J03048n7144p2304N0890K3275L2222J74200L39863L86283K76148
$$ plain form
4868 3415472 3591444 3637154 3464359 3491935 3552541 3264581 3311522 3305231 3316257 3159718 2974040
4857 2974040 3094219 3108230 3209205 3481504 3965280 3941836 4082949 4278345 4634034 4957063
4847 4957063 5001927 4881984 4998344 4944518 4681905 4717112 4665909 4346537 4343127 4125106 4018151
4836 4018151 3829332 3968360 4071585 3805425 3861148 4041377 3811286 3903228 4078817 3973283
4826 3973283 3820016 4022345 4228912 4385745 4251828 4491134 4500433 4577643 4614921 4472448
4816 4472448 4162025 4143925 4189906 4205376 4423872 4662173 4542326 4573640 4558077 4460365 4431157
4805 4431157 4459620 4717381 4576567 4573649 4811177 4956709 4978274 5323547 5097244 4999317
4795 4999317 4945956 5049004 4991860 4919556 4970446 4993721 5025943 5200143 5540006 5926289 6202437
4784F202437J97788n9388q0083m3212k8051j90584J12814q4132m9543J37074R1459
4773F206579K20880M9559J38029J42035k79329j57424k03314o969L49825l8442
4763F421429J89960L04758L09833M81411O09956R48519Q80097R09762N73282j45047
4753A1483960q90572o76955j105580p29164m85032k98325l94404l68831r7302
4744F437795l71606J56730q4729J6733L0479K5669M7134O4495j48211K30241L22032
4733F726762L08636N71171K74612O38255Q84217R39526J047564P45937L6976n31733
4723A1641923j037720o42564q26381q54958k15400l76002j4386k06653k8943J54739
4713G593655k01774R0697L10727N05788M88016J50028O39422R11098N80852P70304
$$ plain form
4784 6202437 6400225 6340837 6260754 6217542 6189491 5998907 6111721 6027589 5978046 6115120 6206579
4773 6206579 6427459 6477018 6615047 6757082 6477753 6320329 6117015 6110046 6459871 6421429
4763 6421429 6611389 6916147 7225980 7707391 8317347 9265866 10145963 11055725 11629007 11483960
4753 11483960 10593388 9916433 8810853 8081689 7596657 7298332 6903928 6535097 6437795
4744 6437795 6066189 6222919 6138190 6154923 6185402 6211071 6258205 6322700 6174489 6404730 6726762
4733 6726762 7035398 7606569 7881181 8519436 9403653 10343179 11390743 12136680 12173656 11641923
4723 11641923 10604203 9961639 9135258 8280300 8064900 7688898 7674512 7467859 7438916 7593655
4713 7593655 7391881 7482578 7793305 8299093 8787109 8937137 9576559 10487657 11068509 11838813
4703A1838813Q94500J247104J224309J863151K016755Q98637p59243j603469k071447
4694A5549110k229804j551284j059644j022660l93085l58835k77626j9064j56224
4685H480884k17604l98295l90341P7076j15981m98265k25333l52931k74088j99654
4675E885468k66351k99751K19268J83308l7267o330j62969J15225j56654p7532
4665E396415j47094n1957J71952O8057j76917J18623q0618k87807J96634L5079
4655E242367K58276K17967K78771j93085L340j0485j73213o6752k1130J94093
4645E730149m1421R1104J01170J30065J83315L02966K56640j71205J97381L43476
4635G123640R210r1457N37300L02577N94111J80852M33880P71050P80868J204236
$$ plain form
4703 11838813 12733313 13980417 15204726 17067877 19084632 19983269 19224026 17620557 15549110
4694 15549110 13319306 11768022 10708378 9685718 9292633 8933798 8656172 8637108 8480884
4685 8480884 8263280 7864985 7474644 7551720 7435739 6937474 6712141 6359210 6085122 5885468
4675 5885468 5619117 5319366 5538634 5721942 5684675 5678345 5515376 5630601 5473947 5396415
4665 5396415 5249321 5197364 5369316 5437373 5260456 5379079 5298461 5010654 5207288 5242367
4655 5242367 5500643 5718610 5997381 5804296 5807636 5797151 5623938 5557186 5536056 5730149
4645 5730149 5688728 5779832 5881002 6011067 6194382 6497348 6753988 6582783 6780164 7123640
4635 7123640 7132850 7041393 7578693 7881270 8475381 8656233 9090113 9861163 10642031 11846267
4625A1846267J154802J487081J486480J687173K292315K186112L390846M165028
4617B9696104N853648O665242N28063m635681p190892o513966l958321k891018
4609A7553179j807709j305981j009647r40347m76432o11581l44485p72162l76807
4600I908028l55070o6524j75994r0153J34712k0308o2948n6324k04356J6439k76715
4589H750787r8724J15034j06245n758R0508k49784O7751J9452o8591K67110n9547
4578H721993J2778M32158K5209J69222M3967n961K81938J23933L5348J88064l9306
4567I989343Q9001N0705k6778N0979L13334M74886L4722j4794L39504K63189n8997
4556A1505094L0219N59703M01116j68096M36576L26904L4158M00765L50513K20510
$$ plain form
4625 11846267 13001069 14488150 15974630 17661803 19954118 22140230 25531076 29696104
4617 29696104 35549752 42214994 42743057 38107376 30916484 24402518 20444197 17553179
4609 17553179 15745470 14439489 13429842 12489495 12013063 11401482 11056997 10284835 9908028
4600 9908028 9552958 9486434 9310440 9220287 9354999 9334691 9271743 9215419 9011063 9027502 8750787
4589 8750787 8652063 8767097 8660852 8655094 8745602 8495818 8563569 8583021 8514430 8781540 8721993
4578 8721993 8734771 9166929 9192138 9361360 9405327 9399366 9681304 9805237 9840585 10028649 9989343
4567 9989343 10078344 10129049 10102271 10153250 10466584 10941470 10976192 10961398 11300902 11564091 11505094
4556 11505094 11535313 12095016 12496132 12328036 12764612 13091516 13125674 13526439 13876952 14097462
4546A4097462O35091N15669O83727P26564R77492R80737R48551J380436J091791
4537B2037520P82950J307399R96809J270073J128494J543386J764116J922562
4529C2753309K820652L695889L947284M493226N256577O916232P876240R503346
4521G7262755J0750460J2834349J6187795K1316741K8722433L4622897O920057
4514B08617487j7712870l0862666l1852411k0600527j4351334r521007o372723
4507G7343949l954802k835157j667618r52383J71326J306462K119773K914793
4499G4446343M203834N578267O852098Q372044R899106J2262174J5302165K0426066
4491A57342097K6669953L7088173K8855079p459639k9031623m0742173l3861602
$$ plain form
4546 14097462 14732553 15248222 15931949 16658513 17636005 18616742 19565293 20945729 22037520
4537 22037520 22820470 24127869 25124678 26394751 27523245 29066631 30830747 32753309
4529 32753309 35573961 39269850 43217134 47710360 52966937 59883169 67759409 77262755
4521 77262755 88013215 100847564 117035359 138352100 167074533 201697430 208617487
4514 208617487 190904617 160041951 128189540 107589013 93237679 83716672 77343949
4507 77343949 73389147 70553990 68886372 67933989 68105315 69411777 71531550 74446343
4499 74446343 78650177 84228444 91080542 99452586 109351692 121613866 136916031 157342097
4491 157342097 184012050 221100223 249955302 242495663 213464040 172721867 138860265
4484A38860265k3311332j6217139j1055386p142769m971335l743606k801462j787387
4476F7829849j272723k55643J64296J433731N56570l242899n949297o894771n892109
4467D6477004m257656l149437k313809k156334k362207j717860j669697j428306
4459B7421698j430930j227662j241330j219524r29393r57645n75868o85986q16802
4450A8336558n11054q24989p33015m59479m00455m18321m98971n10208o61585
4441A3318481n79005l04170m92075k70915j82570j03823k33876j14730j36273
4432A0901044n29442l23352J32087r4143l27962l48283m31494k33601k06379k67655
4422H270820l29391m90786j74726J26794j19383k24996p3927l18542J25695j92752
$$ plain form
4484 138860265 115548933 99331794 88276408 81133639 76162304 72418698 69617236 67829849
4476 67829849 66557126 66301483 66465779 67899510 68456080 65213181 59263884 52369113 46477004
4467 46477004 42219348 39069911 36756102 34599768 32237561 30519701 28850004 27421698
4459 27421698 25990768 24763106 23521776 22302252 21372859 20415214 19839346 19153360 18336558
4450 18336558 17825504 17000515 16267500 15808021 15407566 14989245 14490274 13980066 13318481
4441 13318481 12739476 12435306 11943231 11672316 11489746 11385923 11152047 11037317 10901044
4432 10901044 10371602 10048250 10180337 10086194 9758232 9409949 8978455 8744854 8538475 8270820
4422 8270820 7941429 7450643 7275917 7402711 7283328 7058332 6984405 6665863 6791558 6598806
4412F598806k25109J32533j71841J33357N2475l45134J54877k37439K31214K0570
4402F344309j53362K52741O3397r0993N723J12035K94733j87175M2960j83653
4392F500715M9761J76884J58198K14788n5685J23070K51822K20894K44236L82784
4382H267467O81299L86711M18916N02385O28531O78351P84408J210303J573576
4373A5131947K069938K978162K540664J60798j645426k848820l181148k520040
4365A2686075k001725j117027p73224p71121o89115o12729k70486m13424n52175
4356E485049j76171m85921j91381k62164l97702j47742k33830j588j21803k76831
4346C189916j93999K83616J1364j89800j3436J22853L6113K2473j79278j44869
$$ plain form
4412 6598806 6373697 6506230 6334389 6467746 6520221 6175087 6329964 6092525 6323739 6344309
4402 6344309 6190947 6443688 6507085 6416092 6421815 6533850 6828583 6641408 6684368 6500715
4392 6500715 6550476 6727360 6885558 7100346 7044661 7167731 7419553 7640447 7884683 8267467
4382 8267467 8948766 9335477 9754393 10256778 10885309 11563660 12348068 13558371 15131947
4373 15131947 17201885 20180047 22720711 22881509 21236083 18387263 15206115 12686075
4365 12686075 10684350 9567323 8794099 8022978 7333863 6721134 6450648 6037224 5485049
4356 5485049 5308878 4822957 4631576 4369412 3971710 3823968 3590138 3588550 3466747 3189916
4346 3189916 2995917 3279533 3290897 3101097 3087661 3210514 3246627 3269100 3089822 2944953
4336B944953J14522l7962j54522P5480j39557N1510M5467J10031J05949j01398
4326C014473m358P3739j68083k77431l909l8100j33750j14896j36802J28082K11560
4315B550525P5512j56855M2275J05044m16938K99637q7907k67586L8284m9031
4305B132960p3628j01334J06009j14027K1466J09912M6571l13313j6850L95941
4295B193707j89574O7154J31739K0381J6994K14868j05087m1019n7212n4609N9844
4284B257186n7969o04543j274L03412j89564k25034p0759K56103r1551p4133J87618
4273A689492J04190m6522J9788P539L3341N092q5397m130K4027Q3764R9085n6339
4261A873930k0515j0020J75346j02099N121n9574q7841K1673L79106q8811K6192
$$ plain form
4336 2944953 3059475 3021513 2866991 2942471 2802914 2854424 2899891 3009922 3115871 3014473
4326 3014473 3010115 3083854 2915771 2638340 2634431 2596331 2462581 2347685 2210883 2338965 2550525
4315 2550525 2626037 2469182 2511457 2616501 2199563 2499200 2411293 2143707 2181991 2132960
4305 2132960 2059332 1957998 2064007 1949980 1971446 2081358 2127929 1814616 1797766 2193707
4295 2193707 2004133 2071287 2203026 2223407 2240401 2455269 2350182 2309163 2251951 2197342 2257186
4284 2257186 2199217 1594674 1593400 1896812 1707248 1482214 1411455 1667558 1576007 1501874 1689492
4273 1689492 1793682 1747160 1766948 1774487 1807828 1812920 1727523 1723393 1747420 1831184 1930269 1873930
4261 1873930 1853415 1843395 2018741 1916642 1921763 1862189 1774348 1796021 2175127 2086316 2112508
4250B112508j24287p5507j2722q5463J75685M8841j01809Q8499J04966j64637
4240A966074L03538k4215M9202J64497j43119P5363q6657K64985k72963Q8852
4230B385557M34792j57385j19178j74555j62855L8335o4018r1306L47476p000
4220B429863r62Q0887n026K6061k6439M3042j44397K11885r7270K71034J21150
4209B909828j74150J28159O6014K71000K72414K64854r4938n7410o5223L4794
4199C555342j16961j46284K85803J88727N3167j49546L5424K20345J62257Q9077
4189D177351J88619o9341p1249r894k3681j29198L71597O04778J44563K36388
4179E419933L2287J07631n0048j88230r5400k92619M8456J88668k43093q4876
$$ plain form
4250 2112508 1988221 1912714 1899992 1814529 1990214 2039055 1937246 2025745 2130711 1966074
4240 1966074 2269612 2245397 2294599 2459096 2315977 2391340 2304683 2569668 2296705 2385557
4230 2385557 2820349 2662964 2543786 2369231 2206376 2244711 2180693 2089387 2436863 2429863
4220 2429863 2428901 2509788 2504762 2530823 2504384 2547426 2403029 2614914 2517644 2788678 2909828
4209 2909828 2735678 2863837 2929851 3200851 3473265 3738119 3643181 3585771 3520548 3555342
4199 3555342 3438381 3292097 3577900 3766627 3819794 3670248 3705672 3926017 4088274 4177351
4189 4177351 4365970 4296629 4225380 4215486 4191805 4062607 4434204 5038982 5183545 5419933
4179 5419933 5452220 5559851 5509803 5321573 5226173 4933554 4982010 5170678 4927585 4842709
4169D842709J11759J4113l8181J1422j9579J02589k122M5319k30814j18723J08530
4158D827022O5053O1454m7211J84351P4222R2619L26609n0712N7122K94568L38719
4147F223816J66550K00253Q8303n46476k54226L0505k40380l46504j06404j83940
4137E031497n18207l49507n6545J8278m23619L889J1008k14403K36572K59250
4127C998213l92357j19264O4050J52011j49945r2721l6227j68048K34603N3514
4117C543829j12759k48737K63260Q2719j61147K42417R2923j55358q7366R7644
4107C557425p6087Q4136M2620J1612j94212M3869j6j4930m0485R6739J4993N6021
4095C581685K07674P1523k89637M1068M64693j35270r7813K19598J91833J8983
$$ plain form
4169 4842709 4954468 4968581 4930400 4941822 4922243 5024832 5022710 5068029 4837215 4718492 4827022
4158 4827022 4892075 4953529 4906318 5090669 5164891 5257510 5584119 5533407 5590529 5885097 6223816
4147 6223816 6390366 6590619 6678922 6132446 5878220 5908725 5668345 5321841 5215437 5031497
4137 5031497 4513290 4163783 4107238 4125516 3701897 3705786 3716794 3502391 3738963 3998213
4127 3998213 3605856 3486592 3550642 3702653 3552708 3459987 3423760 3255712 3490315 3543829
4117 3543829 3431070 3182333 3445593 3528312 3367165 3609582 3702505 3547147 3459781 3557425
4107 3557425 3481338 3565474 3608094 3619706 3425494 3469363 3469347 3454417 3413932 3510671 3525664 3581685
4095 3581685 3789359 3860882 3571245 3612313 4077006 3941736 3843923 4063521 4255354 4274337
4085D274337K00874j39472J65240l4884j00269j67923J46556L96190k06672M7943
4075D581920N0942R2969K6169p25L56232q5207k10758j54668j35236j39309j2258
4064D370071J97223K11800k87234L51970N9445r1936N418q821J87637K94548J10467
4053E400588O1476N1038j18857J2407J4963M20428L1237M1066J14226j8985R8652
4042F108239J88635Q2076j1586N3823L76392l7346P0351K20650L54341J47786
4032G553361J74035J91499L3438K72918L87467M05267R0239J92541J37312J56369
4022I594446L61482K02987L03896Q55229N73031Q01102O67168P99613J025100
4013A5184054R73190J161663J366080J961876J888695P59264p88686j646738j905775
$$ plain form
4085 4274337 4475211 4335739 4500979 4466095 4365826 4197903 4344459 4740649 4533977 4581920
4075 4581920 4632862 4725831 4752000 4751275 5107507 5022300 4811542 4656874 4521638 4382329 4370071
4064 4370071 4567294 4779094 4491860 4843830 4903275 4811339 4816757 4807936 4995573 5290121 5400588
4053 5400588 5462064 5513102 5394245 5406652 5421615 5842043 5873280 5914346 6028572 6009587 6108239
4042 6108239 6296874 6378950 6367364 6421187 6797579 6760233 6830584 7051234 7405575 7553361
4032 7553361 7727396 7918895 7952333 8225251 8612718 9017985 9108224 9300765 9438077 9594446
4022 9594446 9955928 10158915 10462811 11318040 11891071 12692173 13359341 14158954 15184054
4013 15184054 16157244 17318907 18684987 20646863 22535558 23294822 22506136 20859398 18953623
4004A8953623j239975j219594o61071m49044l80357k81813j1112k56020k89765
3995A4164872k54362j84678k61461J44381j07881j40060L1418J65043M9238L22227
3985A3928737J77166K0786M76233J7664K39295L4950L04578k49236M11158J99317
3975A5560648j32464R2612R5189J76278l3231l3947M12675P5608K13851Q5234
3965A6512453N08174K16295L06785M96843N43301L83742M04521O44359O59846
3956B0676319M60573M35507N03800P91851O13158N43706Q20733J286061J540628
3947B7672336J733943K022044K133723K370681K174285K259030K095015K483725
3939D4944782K733467K819105L494232L762215M850440O089380P127712P920224
$$ plain form
4004 18953623 17713648 16494054 15832983 15383939 15003582 14721769 14710657 14454637 14164872
3995 14164872 13910510 13725832 13464371 13608752 13500871 13360811 13392229 13557272 13606510 13928737
3985 13928737 14105903 14126689 14602922 14620586 14859881 14894831 15199409 14950173 15361331 15560648
3975 15560648 15428184 15520796 15615985 15792263 15759032 15725085 16137760 16213368 16427219 16512453
3965 16512453 17020627 17236922 17543707 18040550 18583851 18967593 19372114 20016473 20676319
3956 20676319 21136892 21572399 22076199 22868050 23481208 24024914 24845647 26131708 27672336
3947 27672336 29406279 31428323 33562046 35932727 38107012 40366042 42461057 44944782
3939 44944782 47678249 50497354 53991586 57753801 62604241 68693621 75821333 83741557
3931H3741557R245106J1550612J3666190J5691737J8886271K1831565K6181239
3924B00794277L2388543M1260798M4293877L4131523R327260k0458280l9268327
3917C02469671m4772661l8153117k8808208j9753401j3806815r916867q391804
3910A38866798o760355n306614l245504k925015m579587p292674r097333q912197
3902I0747519p653037o462617m558251l174051k338438j515310r69717j446959
3894F2629139k835000l453860k895306k761323j965530j582043j288229o58257
3886D5189591o33578n59687j156486m86360o82827p88702q82524m22166m63774
3877C9113487r01801p98645j089434j186636p23636n34770n17495k51707M42041
$$ plain form
3931 83741557 92986663 104537275 118203465 133895202 152781473 174613038 200794277
3924 200794277 233182820 274443618 318737495 352869018 362196278 341737998 302469671
3917 302469671 257697010 219543893 190735685 170982284 157175469 147258602 138866798
3910 138866798 132106443 126799829 123554325 120629310 116049723 108757049 99659716 90747519
3902 90747519 83094482 76631865 72073614 68899563 66561125 65045815 64076098 62629139
3894 62629139 59794139 56340279 53444973 50683650 48718120 47136077 45847848 45189591
3886 45189591 44556013 43996326 42839840 42353480 41670653 40881951 39999427 39577261 39113487
3877 39113487 38211686 37413041 36323607 35136971 34413335 33878565 33361070 33109363 33551404
3868C3551404M20651R61474R37962l53189j565527k305022j806106j523049j170001
3859B7148597o05964p19224j052052p49469k09701o57574p32222l22300p11837
3850B1388254m25866J25837k17967n34061j38090M43324m1308k0694J25794j12767
3840B0592456l3487k81434O1309r2287j07202O9231j76928j98619L6942R7328
3830A9967309k97951M8120Q7272k60662j41967J47807J79147j21188n3633J41072
3820A9695326K13135O24530L40045L57075L76983O97360M37621K23807L03029
3811B3268911N32398M79253Q06726J016183J372903J627655K168109K571120K798946
3802C6642204L584308M279722M524520N189212P389037R452178J0468958K341880
$$ plain form
3868 33551404 33972055 34933529 35871491 35518302 33952775 31647753 29841647 28318598 27148597
3859 27148597 26542633 25823409 24771357 24021888 23812187 23154613 22422391 22100091 21388254
3850 21388254 20962388 21088225 20870258 20336197 20198107 20641431 20600123 20579429 20705223 20592456
3840 20592456 20558969 20277535 20338844 20246557 20139355 20208586 20031658 19833039 19869981 19967309
3830 19967309 19669358 19717478 19804750 19544088 19402121 19549928 19729075 19607887 19554254 19695326
3820 19695326 19908461 20532991 20873036 21230111 21607094 22304454 22742075 22965882 23268911
3811 23268911 23801309 24280562 25087288 26103471 27476374 29104029 31272138 33843258 36642204
3802 36642204 40226512 44506234 49030754 54219966 61609003 71061181 81530139 83872019
3794H3872019n875044j0442736j1081056q173807n711062l504418k348899j693508
3786C5041489j591035j197314j029686j134209j159178r27108j319230j265529
3778B5418200j139682q77356p37644p55602q68011m36313l82808j17456q7821
3769B0015507l15129k40159O3004m42462K3907O3661M32759O72939L73039L81392
3759B1028458L69741K48530L38063L33636K83640L34764L7011P2310R1398O41842
3749B3779393O07870N95538J287935J386794J699063K073174K528193K734156
3741C6692116K953042K023739J08470j785562k982437k761245k880931j994992
3733B9372200j347328j038484q50395n26725n05232n62114j18796N8964k92723
$$ plain form
3794 83872019 77996975 67554239 56473183 48299376 42588314 39083896 36734997 35041489
3786 35041489 33450454 32253140 31223454 30089245 28930067 28002959 26683729 25418200
3778 25418200 24278518 23401162 22663518 21907916 21039905 20603592 20220784 20103328 20015507
3769 20015507 19700378 19460219 19523223 19080761 19104668 19168329 19601088 20274027 20647066 21028458
3759 21028458 21398199 21646729 21984792 22318428 22602068 22936832 22973843 23046153 23137551 23779393
3749 23779393 24387263 24982801 26270736 27657530 29356593 31429767 33957960 36692116
3741 36692116 39645158 41668897 41777367 39991805 37009368 34248123 31367192 29372200
3733 29372200 28024872 26986388 26135993 25609268 25104036 24541922 24423126 24482090 24189367
3724B4189367n52480n54560p71865q39184n9444m6803j04986k17238p57479m83576
3714A9801752n67214m73300m59541l83713m05103l68541n43627k81914k59032
3705A6059767l22299k64434K3536k8196j58488K73047K22424k9862l72591m57437
3695A4945467l16037l60982l78834j71459l34970k91999o4334k22531j32990P0370
3685A2741701j75802l28032j57739k2803j43034n685J89214O6271O1329J91586
3675A2417006j10042J27903J07304j79053j01801K73308J33281O420L4223J64154
3665A2872703k32169J05972M21259K66381P3638K29575M44415Q6026r7785j120
3655A4168895k1539J85642Q2253P6357R8939L34359L64988L06055N82297L91801
$$ plain form
3724 24189367 23636887 23082327 22310462 21471278 21411834 21365031 21260045 21042807 20285328 19801752
3714 19801752 19234538 18761238 18301697 17917984 17512881 17144340 16600713 16318799 16059767
3705 16059767 15737468 15473034 15496570 15468374 15309886 15582933 15805357 15775495 15402904 14945467
3695 14945467 14629430 14268448 13889614 13718155 13383185 13091186 13026852 12804321 12671331 12741701
3685 12741701 12565899 12237867 12080128 12057325 11914291 11908606 12097820 12164091 12225420 12417006
3675 12417006 12306964 12434867 12542171 12363118 12261317 12534625 12667906 12674326 12708549 12872703
3665 12872703 12640534 12746506 13167765 13434146 13507784 13737359 14181774 14267800 14170015 14168895
3655 14168895 14147356 14332998 14415251 14491608 14590547 14924906 15289894 15595949 16178246 16570047
3645A6570047Q15390N29001L26563L85592N51557O50902M80047N44509Q38499
3636B1692107N98695O18301O87848O38504L53933J47461L15481Q6858J02312k99869
3626B4941631J05621J22383L91754M28237N08179P60344J071081R44977J324361
3617C0598568J490004J663054J850811J523650J824411K070855J977451K149837
3609D5148641J810166J234416R29099Q15905Q04539N81428L77628M65351j26718
3600E2040455m16140M3005j07109J66756L62282N71824M33953R51208R76286J200654
3590E6223174J212003J047835J498648J915715J535707J816831K011719J993204
3582F9254836J998737J854359J779382J714577J883624J778036J305949J091701
$$ plain form
3645 16570047 17385437 17914438 18241001 18626593 19178150 19829052 20309099 20853608 21692107
3636 21692107 22290802 22909103 23596951 24235455 24589388 24736849 25052330 25139188 25241500 24941631
3626 24941631 25047252 25169635 25561389 25989626 26497805 27258149 28329230 29274207 30598568
3617 30598568 32088572 33751626 35602437 37126087 38950498 41021353 42998804 45148641
3609 45148641 46958807 48193223 49122322 49938227 50742766 51324194 51701822 52167173 52040455
3600 52040455 51624315 51667320 51560211 51726967 52089249 52661073 53095026 54046234 55022520 56223174
3590 56223174 57435177 58483012 59981660 61897375 63433082 65249913 67261632 69254836
3582 69254836 71253573 73107932 74887314 76601891 78485515 80263551 81569500 82661201
3574H2661201J203450J122796J044044Q11974O28071N78900N12657J33720K44624
3565H8941437J73653J66408n080j10185K12583O50173J075094J816116K760335
3556I5680534L032005M103588M857838N318554L818579J225470n82222p40247
3548A16714099j030986j073092r62860j244440j547634k036472k666919k916970
3540A03234726k935626k562508k627096k426930k078769j802838j866121j448110
3532H5486728j506423j456781j149117q22811p72282j235120r94105j102559r38689
3523G5508841q03471l14621l30199j67268n22827m81109p52157q75817m53316
3514G0808056n87109j67401L0967K06421O84069R18774J198469Q35243p3236o80003
$$ plain form
3574 82661201 83864651 84987447 86031491 86843465 87471536 88050436 88563093 88696813 88941437
3565 88941437 89115090 89281498 89276418 89166233 89378816 90028989 91104083 92920199 95680534
3556 95680534 98712539 102816127 107673965 112992519 116811098 118036568 117454346 116714099
3548 116714099 115683113 114610021 113647161 112402721 110855087 108818615 106151696 103234726
3540 103234726 100299100 97736592 95109496 92682566 90603797 88800959 86934838 85486728
3532 85486728 83980305 82523524 81374407 80551596 79779314 78544194 77550089 76447530 75508841
3523 75508841 74705370 74390749 74060550 73893282 73370455 72889346 72137189 71261372 70808056
3514 70808056 70220947 70053546 70084513 70290934 70975003 71893777 73092246 73927489 73854253 73174250
3504G3174250k062805k644351k778710k253907k093847j975324j218587r61717
3496E7185002p87844r27045n71041o56406l98470m57772k63271m30958j34326
3487E2557869j95556j66015L47528O54289Q57518O56207L73555J17814k25630
3478E4977579m08064o83921o91667k50502l99445m41347l90516n63237o21162
3469E0527718j134368r88631r65774j069134j000793q20861o04679p64476m60197
3460D2718805m10092k50725r3586J65733j43216n7183K70006M35058L81555P04472
3450D3720827Q66935P48458P91529L08754m42399n78853m5370j72658j87845n4821
3440D4954557N77909L09652L13128M52056P21531P69611N93739J63250k29379
$$ plain form
3504 73174250 71111445 68467094 65688384 63434477 61340630 59365306 58146719 57185002
3496 57185002 56397158 55470113 54899072 54242666 53844196 53386424 53123153 52692195 52557869
3487 52557869 52362313 52196298 52543826 53198115 54055633 54711840 55085395 55203209 54977579
3478 54977579 54569515 53885594 53193927 52943425 52543980 52102633 51712117 51148880 50527718
3469 50527718 49393350 48404719 47438945 46369811 45369018 44548157 43943478 43179002 42718805
3460 42718805 42308713 42057988 41964402 42130135 41986919 41929736 42199742 42634800 43016355 43720827
3450 43720827 44587762 45336220 46127749 46436503 45994104 45415251 45369881 45197223 45009378 44954557
3440 44954557 45532466 45842118 46155246 46607302 47328833 48098444 48692183 48855433 48626054
3431D8626054k63530n78342p72912m96078r9871j95344l01414j1907K93359j42381
3421D6057634j38356k4786q6437l1432L10806M85182K71419J021957J136880Q81732
3411D9884599J082548J557936J110317J290356R46410O80181P69880O66166J039527
3402E9027920P97820M20429M6767l63069o00610m2717Q998j55703J35136J59767
3392E9434738O5152N34423M75505O11827M83897L97785M14648l8038l83254m05110
3382F1591573n08546l40999q9076M56632N51392J057791J161221R96842J300044
3373F6176874J454457J016764J69342l53371j101751j707091j344131q30816j238084
3364F2242193m84158l16821o73344l71247j75875m22280o79754p97594m16795
$$ plain form
3431 48626054 48362524 47784182 47011270 46515192 46415321 46219977 45918563 45906656 46200015 46057634
3421 46057634 45919278 45894492 45808055 45776623 46087429 46572611 46844030 47865987 49002867 49884599
3411 49884599 50967147 52525083 53635400 54925756 55872166 56552347 57322227 57988393 59027920
3402 59027920 59825740 60246169 60292936 59929867 59329257 59286540 59295538 59139835 59274971 59434738
3392 59434738 59499890 60034313 60509818 61121645 61605542 62003327 62417975 62379937 61996683 61591573
3382 61591573 61083027 60742028 60652952 61109584 61660976 62718767 63879988 64876830 66176874
3373 66176874 67631331 68648095 68817437 68464066 67362315 65655224 64311093 63480277 62242193
3364 62242193 61758035 61441214 60767870 60396623 60220748 59798468 59118714 58321120 57904325
3355E7904325k00984m8855N48664P38976O57585Q68037J114104Q81746J162688
3346F3626286J130945P09283O5956k00942j011821j426941j613035j643919j490649
3337E8145163j056107p48629j065821j414371j243681r55072j130865q80329n77865
3328D9072423n11452l30673m50529o22135o91944n14430n76823q14030j048625
3319D3511782m47448p60834j46886m5074r2973j42369k67499L8150j54313L3877
3309D1526413J81840O3944k34789j64906r35786j092832r32767j040843j133885
3300C6236389j073349n75858m40834p72165l46033p65048o18267n39517j47483
3291C0957835k53846k84774J82493j28122j78800L07282j19091k47491k93203
$$ plain form
3355 57904325 57703341 57654486 58203150 58942126 59599711 60467748 61581852 62463598 63626286
3346 63626286 64757231 65466514 65532470 65331528 64319707 62892766 61279731 59635812 58145163
3337 58145163 57089056 56340427 55274606 53860235 52616554 51661482 50530617 49650288 49072423
3328 49072423 48560971 48230298 47779769 47157634 46465690 45951260 45374437 44560407 43511782
3319 43511782 43064334 42303500 42156614 42111540 42018567 41876198 41608699 41646849 41492536 41526413
3309 41526413 41708253 41772197 41537408 41372502 40436716 39343884 38411117 37370274 36236389
3300 36236389 35163040 34587182 34146348 33374183 33028150 32263102 31644835 31105318 30957835
3291 30957835 30703989 30419215 30601708 30473586 30294786 30602068 30482977 30235486 29942283
3282B9942283l49501j21168n4082J39425k81606j63219J80471l016k86623N1180
3272B9054144Q8378j4727j43510q773n9599j67494L28620O60582K71663M53097
3262C0462381O01558P86808J493337J510367J540056J497589K323026K192679
3254D2407801K399614L133967M291600N448760P425490P389233K78816m728523
3246F8046758p388962o685950m240594l027861j855482q82816q93405l45781n56912
3237D2168995n63638j00578K82797K56368N91036J078696J304099J639601K140731
3228D8798107L093430L494670M084596M702211N638877P664410R992193J4190136
3220A01658630J4458709M70709r465945j5601631j4528469r715005o884898m536596
$$ plain form
3282 29942283 29592782 29471614 29417532 29556957 29275351 29112132 29292603 29289587 29002964 29054144
3272 29054144 29142522 29127795 28984285 28975512 28915913 28748419 29077039 29737621 30009284 30462381
3262 30462381 31063939 31850747 33344084 34854451 36394507 37892096 40215122 42407801
3254 42407801 44807415 47941382 52232982 57681742 65107232 72496465 72775281 68046758
3246 68046758 60657796 53971846 49731252 46703391 44847909 43965093 43071688 42725907 42168995
3237 42168995 41605357 41504779 41787576 42043944 42634980 43713676 45017775 46657376 48798107
3228 48798107 51891537 55386207 59470803 64173014 69811891 77476301 87468494 101658630
3220 101658630 116117339 116588048 107122103 91520472 76992003 67276998 60392100 55855504
3212E5855504l529203k088333j710115j482703j413950j036034q46779n84049
3204D3164338n58386k46964M54714L66857K70188J076253J192578J598587K144836
3195D9463001K685602L468059M428051O407060O928111P30747m891032p738909
3187F1480690q106609n441099l736269k710963j929115j431371j085600r25263
3179C6114401j155530j147972p34147q93599p03947q84087m49892n62478o59213
3170B8923536o16035l53939j52812n21194J4575j01688k91105l13865o1469l56134
3160B6169870q5747j12732n05419m44522l03347q6898j57139j78508k17740j79820
3150B3897998j01247q8453j05933l27997k64194l5123q2079o4358l70438j06253
$$ plain form
3212 55855504 52326301 50237968 48527853 47045150 45631200 44595166 43748387 43164338
3204 43164338 42605952 42358988 42813702 43180559 43450747 44527000 45719578 47318165 49463001
3195 49463001 52148603 55616662 60044713 66451773 73379884 74110631 69219599 61480690
3187 61480690 53374081 47932982 44196713 41485750 39556635 38125264 37039664 36114401
3179 36114401 34958871 33810899 33076752 32183153 31479206 30595119 30145227 29582749 28923536
3170 28923536 28307501 27953562 27800750 27279556 27294131 27192443 26901338 26587473 26526004 26169870
3160 26169870 26084123 25971391 25465972 25021450 24718103 24631205 24474066 24295558 24077818 23897998
3150 23897998 23796751 23708298 23602365 23274368 23010174 22975051 22892972 22828614 22458176 22351923
3140B2351923J00413j04920k79639q4152J10318j22933j76565p7782l25377r9022
3130B1292264m7345r1618j55536l78311n0989M5118K0098K04021J38010Q5604
3120B1061316J84819K98909J1849q5475J34841M49609k56922J28425K34832M3380
3110B2205583L57948L37263M13786K82695P58680L80532L45926P93489R38481
3101B6814383O73443Q10054J252716Q30933J177208J449634J806553J166642J426673
3092C7408239J516967J402686J201820P66204j83509r05518j042163j345708j892098
3083C6926920j333291o15012n40960j43033o87707j429276j709480j543860j405019
3074B7519282j269337j420330j002093j111016q30557m13280o00969l46950j81047
$$ plain form
3140 22351923 22452336 22347416 22067777 21983625 22093943 21971010 21794445 21716663 21391286 21292264
3130 21292264 21244919 21153301 20997765 20619454 20568465 20613583 20633681 20837702 20975712 21061316
3120 21061316 21246135 21545044 21556893 21471418 21606259 22055868 21798946 21927371 22162203 22205583
3110 22205583 22563531 22900794 23314580 23597275 24355955 24736487 25082413 25875902 26814383
3101 26814383 27487826 28297880 29550596 30381529 31558737 33008371 34814924 35981566 37408239
3092 37408239 38925206 40327892 41529712 42295916 42112407 41206889 40164726 38819018 36926920
3083 36926920 35593629 34978617 34437657 34294624 33606917 32177641 30468161 28924301 27519282
3074 27519282 26249945 24829615 23827522 22716506 21885949 21472669 20871700 20524750 20343703
3065B0343703k07774l94735K36571K93062j12704N70M15638M64410L80995J097344
3055B2517080P51271J300810J353417K228050K064034R35068o25702j849740k275114
3046B6399174j899329j829177j618086j124140p07587o69875p88193l57020o73617
3037A6732150k56264q4407k39094p8801k80943J861p7253j480L79873L59717M19546
3026A6874905M69439O12230N86196O48863R62015L08533k88983m42507j163647
3017A8567044j069512o88490l82273k96502m63676k79143J2970k39417q3849J70858
3007A5248010l38714k12545n06181l62729J30171Q0697J62256k61689j19245J37371
2997A3957402k82145r526L17192K4643P5053j975O0323j58416k83534J1529P0900
$$ plain form
3065 20343703 20135929 19741194 19977765 20270827 20158123 20158693 20574331 21038741 21419736 22517080
3055 22517080 23268351 24569161 25922578 28150628 30214662 31149730 30524028 28674288 26399174
3046 26399174 24499845 22670668 21052582 19928442 19220855 18550980 17762787 17405767 16732150
3037 16732150 16475886 16391479 16152385 16073584 15792641 15794502 15717249 15715769 16095642 16455359 16874905
3026 16874905 17344344 17956574 18542770 19191633 20153648 20462181 20173198 19730691 18567044
3017 18567044 17497532 16809042 16426769 16130267 15666591 15387448 15400418 15161001 15077152 15248010
3007 15248010 14909296 14696751 14190570 13827841 13958012 14038709 14200965 13939276 13820031 13957402
2997 13957402 13675257 13665731 13982923 14007566 14082619 14080644 14140967 13982551 13699017 13710546 13781446
2986A3781446J16276L46017J43587J58340J921N002J6211j68693O1800M0901l3541
2975A4469267J04329K39361j82172n3710L59484m7683O3375J66676K81239k22276
2965A5177890J28961J20436l49100k91827J07461K3078m1947O5800j3765r7443
2955A4829544n5881O8373l08499j93239j51925p0449j84034j7486r8568K9742
2945A3847578j26289K31972k5859K43487Q5729m51301j1715N252M1569j17424
2935A3722999m249j71223m40911J36614J84616j34020o0018j9825l5049J186p8626
2924A3101494j44584k25183m58787n3526j34978k75135j54837O3160j96880k49705
2914A1271039k0737n369k1458l3022o9831m45307K4662J00237r9931j51855J64465
$$ plain form
2986 13781446 13897722 14243739 14387326 14545666 14547587 14552589 14568800 14400107 14461907 14502808 14469267
2975 14469267 14573596 14812957 14630785 14577075 14936559 14888876 14952251 15118927 15400166 15177890
2965 15177890 15306851 15427287 15078187 14786360 14893821 14916899 14874952 14940752 14926987 14829544
2955 14829544 14773663 14842036 14533537 14340298 14188373 14117924 13933890 13916404 13817836 13847578
2945 13847578 13721289 13953261 13927402 14170889 14256618 13805317 13793602 13798854 13840423 13722999
2935 13722999 13718750 13547527 13106616 13243230 13427846 13293826 13233808 13213983 13178934 13180120 13101494
2924 13101494 12956910 12731727 12272940 12219414 12084436 11809301 11654464 11717624 11520744 11271039
2914 11271039 11250302 11244933 11223475 11190453 11120622 10675315 10699977 10800214 10700283 10548428 10712893
2903A0712893K1741k40128O2666j48583j6636q2888M372l1030q251k75404j28476
2892I870276K3874l2839l49014j10378N8945J10652k2172J50978k25115j03981
2882I371226K12905J04981K53053J87964m1672k16757J19107K86077Q9337j26484
2872A0239737J23102J32895m8833k17009K03505K5229M2743j51524j14570k94623
2862I940652m5261Q6017j05216j83465K7139o9654m6422p0224J57186L44916K89985
2851A0325653M5267J29621K2213K40339K84994M1688J54974M80804K70450J76015
2841A2172018O75681p049o0721j00370m07708l14498K2442M6363p0458j47680
2831A1808020J43983k51800l45700k99295j78087j8915J13641j49900k77726j43262
$$ plain form
2903 10712893 10734634 10494506 10557172 10408589 10391953 10309065 10313437 10282407 10274156 9998752 9870276
2892 9870276 9894150 9861311 9512297 9401919 9460864 9571516 9549344 9700322 9475207 9371226
2882 9371226 9584131 9689112 9942165 10130129 10088457 9871700 9990807 10276884 10366221 10239737
2872 10239737 10362839 10495734 10446901 10229892 10433397 10458626 10501369 10349845 10235275 9940652
2862 9940652 9895391 9981408 9876192 9692727 9719866 9650212 9603790 9533566 9690752 10035668 10325653
2851 10325653 10370920 10500541 10522754 10763093 11048087 11089775 11244749 11725553 11996003 12172018
2841 12172018 12847699 12840650 12779929 12679559 12271851 11957353 11979795 12026158 11955700 11808020
2831 11808020 11952003 11700203 11354503 11055208 10877121 10858206 10971847 10821947 10544221 10400959
2821A0400959K27981K64475j20054k64737j90269N7811L22090J38494M82696J43990
2811A1463436K38625K58384K68997K7711k67692l9797q3652n36505l16919J76032
2801A1188620K5497k56149k40151l07295J6364j01166k58830K10095J5904R5377
2791A0388266l7886j9064J62603M0535J84352J86634m9020L43438Q3950J19270
2781A1403078j92785l10001m71766l64786n40597q6535l25344k61711Q3463j61013
2771H772003m4632k38556n4936K90810j74674m1674J00905m5902J00681J22974
2761H786999j26602J18384j9286M6489j7146n8568j95733j62735l7472j71904
2751H162426j35111j28665m60381l67096j85596k523k75563l09248J35703j50368
$$ plain form
2821 10400959 10628940 10893415 10773361 10508624 10318355 10376166 10698256 10836750 11319446 11463436
2811 11463436 11702061 11960445 12229442 12257153 11989461 11949664 11866012 11329507 11012588 11188620
2801 11188620 11214117 10957968 10717817 10410522 10426886 10325720 10066890 10276985 10292889 10388266
2791 10388266 10350380 10331316 10493919 10534454 10718806 10905440 10856420 11199858 11283808 11403078
2781 11403078 11210293 10900292 10428526 10063740 9523143 9436608 9111264 8849553 8933016 8772003
2771 8772003 8727371 8488815 8433879 8724689 8550015 8508341 8609246 8563344 8664025 8786999
2761 8786999 8660397 8778781 8759495 8805984 8788838 8730270 8534537 8371802 8334330 8162426
2751 8162426 8027315 7898650 7438269 7071173 6885577 6883054 6607491 6298243 6433946 6283578
2741F283578l6746j86542j09685j24575j08901p5346P3752l62257n2489k34271
2731E066518l19038l7439j27599L3777l04848o3289n8423k19560P9730l9366N5881
2720D066344n9979l7064q0988j34221j09636j12039n8100N6560j3584j58471k38288
2709C120534N9723J5531J44110m46641n8195K50708k79921J07185j40878p4803
2699B697353R5107j21745o6349J37148j40555j99697r0198J25162j48241k13571
2689B074414m4391K72486j0498j6046J68990l6307n95K1970j60571j65440K44189
2678B348201n1706k03100j74321k4841N3529k57110p0395R0765j31751J30405
2668A709676O507K14880m3591K4689j04836J80489k2894k22552j64373p3277R3738
$$ plain form
2741 6283578 6246832 6060290 5950605 5826030 5717129 5641783 5715535 5353278 5300789 5066518
2731 5066518 4747480 4710041 4582442 4616219 4311371 4248082 4189659 3970099 4049829 4010463 4066344
2720 4066344 4006365 3969301 3888313 3754092 3644456 3532417 3474317 3530877 3517293 3358822 3120534
2709 3120534 3180257 3195788 3339898 2893257 2835062 3085770 2805849 2913034 2772156 2697353
2699 2697353 2792460 2670715 2604366 2741514 2600959 2401262 2311064 2436226 2287985 2074414
2689 2074414 2030023 2302509 2292011 2275965 2444955 2408648 2408053 2430023 2269452 2104012 2348201
2678 2348201 2296495 2093395 1919074 1894233 1947762 1690652 1620257 1711022 1579271 1709676
2668 1709676 1716183 1931063 1887472 1912161 1807325 1987814 1964920 1742368 1577995 1504718 1598456
2657A598456J81062M0750k01220r4509j07129J11105k63186R0619J1566R0362
2647A457876n8893o3374J36441j10928j56216j65134J63120P0318j76520J10756
2637A207446J23774L0390o5997O6864q2302k926k806o8550n0710j36011j60338
2626H58834r5894J47804J36832J42042n0236k27055o1318q7301K22219N48R8114
2615A084589o968J21377J79377j56009q9467O2566J76691o8594R1987n0402k15029
2604A130118j36435j07519j149K5446q2133j41093j8168J35299K34749j15445
2594I23670l34133n939J37999l8489J68253K17031q3510j34057J79651l6067j47670
2583H46739j31671J11293L05832j64039K29779k04011J27194N8564P208k25600
$$ plain form
2657 1598456 1779518 1820268 1619048 1524539 1417410 1528515 1265329 1355948 1367514 1457876
2647 1457876 1398983 1335609 1472050 1361122 1204906 1039772 1202892 1273210 1096690 1207446
2637 1207446 1331220 1361610 1295613 1362477 1280175 1277249 1274443 1205893 1155183 1019172 858834
2626 858834 762940 910744 1047576 1189618 1139382 912327 851009 763708 985927 986475 1084589
2615 1084589 1077621 1198998 1378375 1222366 1132899 1195465 1372156 1303562 1395549 1345147 1130118
2604 1130118 993683 886164 885015 910461 828328 687235 669067 804366 1039115 923670
2594 923670 589537 583598 721597 683108 851361 1068392 984882 850825 1030476 994409 846739
2583 846739 715068 826361 1132193 968154 1197933 993922 1121116 1179680 1186888 961288
2573I61288R5434J28437k3680J24164L7131j45213Q383j02676J01198K14624N2139
2562A451229n2240j87249R3609m0158m2923K27178q5240l4260O7733p6432O2733
2551A383980k99648o8318O4896J27525J44596R0801M4882j44313j75156L94848
2541A564093J17485J21027q5151J89928J95420l8480j14912J03681j41798J56689
2531B067982J31086l3326J32504K7479j96279k234L6155K7151J33633J12622j0377
2520B426396q3406l1660n8481L7000K65950j31764J13344K73414l75712j05368
2510B329713J59629L4835o8049J5112K85348J4555j42994r015P3347J50429k84506
2499B558404L84658l8333k11522J83581o499j21768o5846j46573M9815k88165
$$ plain form
2573 961288 1056722 1185159 1161479 1285643 1322774 1177561 1185944 1083268 1184466 1399090 1451229
2562 1451229 1398989 1211740 1305349 1265191 1222268 1449446 1364206 1329946 1397679 1321247 1383980
2551 1383980 1084332 1016014 1080910 1208435 1353031 1443832 1488714 1344401 1169245 1564093
2541 1564093 1681578 1802605 1717454 1907382 2102802 2064322 1949410 2053091 1911293 2067982
2531 2067982 2199068 2165742 2298246 2325725 2129446 2127212 2163367 2190518 2324151 2436773 2426396
2520 2426396 2342990 2311330 2252849 2289849 2555799 2424035 2537379 2810793 2435081 2329713
2510 2329713 2489342 2524177 2456128 2471240 2756588 2771143 2628149 2619134 2692481 2842910 2558404
2499 2558404 2943062 2904729 2693207 2876788 2870289 2748521 2682675 2536102 2585917 2297752
2489B297752N4572J69677j79720j01378P614j00220N7131r7804r8051j80864K09116
2478B037825K08112k73418r8886K11713j12760p7292m00o964J55010J11655K84524
2467B439119l3629l13893l460j56884l28826J01035r5836j9984j6364K27529j06737
2456A692070l97302j27209J43442k4157M221l8016Q8270P8542J06892k77410L7675
2445A287018K498m7876Q2672p0690J04779k03914J72180K23757k89654j37681
2435A123089J82788O8541l18248Q3284q5280J0305j35941m3924Q4741r0192J3548
2424H92711j3843j50219q0987P6105k1033Q2245N0162J54381m46218l13398K23054
2413D52960j60302l4734k550L9853R0825O1159J54807k41010l5590J49919k4247
$$ plain form
2489 2297752 2352324 2522001 2342281 2240903 2248517 2148297 2205428 2107624 2009573 1828709 2037825
2478 2037825 2245937 1972519 1873633 2085346 1972586 1895294 1894894 1887930 2042940 2154595 2439119
2467 2439119 2405490 2091597 2088137 1931253 1602427 1703462 1607626 1587642 1571278 1798807 1692070
2456 1692070 1294768 1167559 1311001 1286844 1291065 1253049 1341319 1419861 1526753 1249343 1287018
2445 1287018 1289516 1241640 1324312 1253622 1358401 1154487 1326667 1550424 1260770 1123089
2435 1123089 1305877 1374418 1056170 1139454 1054174 1064479 928538 884614 969355 879163 892711
2424 892711 878868 728649 647662 723767 702734 784979 835141 989522 543304 229906 452960
2413 452960 292658 257924 255374 295227 386052 447211 602018 361008 325418 475337 451090
2402D51090Q5956J98548j01727j73631J39217J33573j26431Q6365r1862N0755
2392F51853J70029l4937m22847o5895J43110Q5717j23472k82462L84652K86123
2382G91871k92734k2230J60856k75974l1780L86019k34924q6099k28420R3150
2372B59735J6415J5828J63589J12017J4242J08834l51133J00666R6424q2200r8359
2361C56058J55512J28176j61086n4912K26855K37251l27591l9967N0685M1241
2351F12222L9152n35j12497k64520j06047K06447j18242J59432J27634j57404
2341C85642k85400J17280Q4383L7593Q7487L2854j93294K2381K2741m6349J38116
2330D03434K48014r1081n8747P5690K02057k36979j5834J31878j23536p4487o063
$$ plain form
2402 451090 537046 735594 633867 460236 599453 733026 606595 692960 601098 651853
2392 651853 821882 786945 364098 298203 441313 527030 403558 121096 505748 791871
2382 791871 499137 476907 637763 361789 330009 716028 481104 395005 166585 259735
2372 259735 276150 291978 455567 567584 581826 690660 339527 440193 536617 454417 356058
2361 356058 511570 639746 478660 423748 650603 887854 560263 520296 570981 612222
2351 612222 651374 650839 538342 273822 167775 374222 255980 415412 543046 385642
2341 385642 100242 217522 301905 339498 426985 459839 266545 288926 311667 265318 403434
2330 403434 651448 560367 501620 577310 779367 542388 526554 658432 534896 460409 454346
2319D54346K4077j52137J15291m0152J62831j07496m9865l745P7148K51372J14684
2308H46354q7004m6059l4074p8629K40408K74770J04084k56367M9157k79198j52732
2297E80710P0716r7955k5840K96072r2384l5462k74672K49959O5549k24394j95553
2286C16746N2981j36882J53084J69368k1200k68968L347J30817j42660O2493L3559
2275C52685k7357k01472P9336J99455K7760j35957J4225N6986K42635j00760J1009
2264E18545l30157o1693J12903L8240n4688K31865j7231J17139K45282j98950
2254F01255K62599K9263P5673k45359l1991J50568k69221K48890q6053k18390
2244E17234K07530j03270k52823r052P7237j38097o4312O0606J01277J09577k3040
$$ plain form
2319 454346 478423 326286 441577 401425 564256 456760 406895 403150 480298 731670 846354
2308 846354 759350 713291 679217 600588 840996 1115766 1219850 963483 1012640 733442 580710
2297 580710 651426 553471 527631 823703 731319 695857 421185 671144 736693 512299 316746
2286 316746 369727 232845 385929 555297 534097 265129 268476 399293 256633 319126 352685
2275 352685 325328 123856 203192 402647 430407 294450 308675 365661 608296 507536 518545
2264 518545 188388 126695 239598 277838 223150 455015 437784 554923 800205 601255
2254 601255 863854 893117 968790 723431 691440 842008 572787 821677 735624 517234
2244 517234 724764 621494 368671 359619 436856 298759 234447 295053 396330 505907 482867
2233D82867J05510M7015n8025j60589J38693J24654J31544j45219K62670M9421
2223I78541j83648j49220K98169j55166j23313J33166j90448k8719r6192j30710
2213C52460K93327p9485k10239K72888q7923j36515k1374l0024l4901L2048J70560
2202E20822q5028j84984R1007K69709j39162j96139K33676L08048j46307J34495
2192H06137J05694j26006r9310j54710Q7686J52355K4226J62483J5721k3729K45860
2181A196407k86102r4705K66782j8217L0203j57693R8326n4125K09983J12347
2171A303206k85226k4018P3703l8026J21354L38041J64265k51685k10345p6930
2161A114339j68161K77180L15315L9949j36271L94086Q9480j68344k69755j6504
$$ plain form
2233 482867 588377 635392 577367 416778 555471 680125 811669 666450 929120 978541
2223 978541 794893 645673 943842 788676 665363 798529 608081 579362 483170 352460
2213 352460 645787 566302 356063 628951 541028 404513 383139 353115 318214 350262 520822
2202 520822 435794 250810 341817 611526 472364 276225 509901 817949 671642 806137
2192 806137 911831 785825 686515 531805 619491 771846 796072 958555 974276 950547 1196407
2181 1196407 910305 815600 1082382 1064165 1094368 936675 1035001 980876 1190859 1303206
2171 1303206 1017980 993962 1067665 1029639 1150993 1489034 1653299 1401614 1191269 1114339
2161 1114339 946178 1223358 1538673 1578622 1442351 1836437 1925917 1757573 1487818 1471314
2151A471314P6966J29864K17910j75880Q3830L05958k00256j7223q968L27338
2141B210853J73423M8513J69219k24255l22674Q6423L94121j27227o7104J66845
2131B508137J7242k13752n0112J54999m2840K22622N4287J55774N9250K12770
2121C078377l0957R8627Q6722r9680j5429K61259J07838J31529Q0396J28254j15921
2110C711015j46834R3375k0083k24458J78931J34288K91791J05748J03934L77148
2100D604855L40820J43589j0449r455J86495N3960L44011N3785O32678N79809
2090F920098J98044N03241J037506R05437O92743R12150R89850P52335R17548
2081A3828952J114515J220643Q48557J371378K048018K179304K189170K369159
$$ plain form
2151 1471314 1548280 1678144 1896054 1720174 1804004 2109962 1909706 1892483 1883515 2210853
2141 2210853 2384276 2432789 2602008 2377753 2055079 2141502 2535623 2408396 2341292 2508137
2131 2508137 2525379 2311627 2261515 2416514 2373674 2596296 2650583 2806357 2865607 3078377
2121 3078377 3047420 3146047 3232769 3133089 3117660 3378919 3486757 3618286 3698682 3826936 3711015
2110 3711015 3564181 3657556 3637473 3413015 3591946 3726234 4018025 4123773 4227707 4604855
2100 4604855 4945675 5089264 5078815 5069360 5255855 5309815 5653826 5707611 6340289 6920098
2090 6920098 7118142 7621383 8658889 9564326 10257069 11169219 12159069 12911404 13828952
2081 13828952 14943467 16164110 17012667 18384045 20432063 22611367 24800537 27169696
2073B7169696K501215L169768M529310N521544O663672P975395R281249J1244506
2065G8056355J5350937K1077570K6623386N023533j3647367k3816770k4950360
2058H3717284j6481884j1725888q085623o332173m015569l189561k567634k346036
2050B8972916j530018j335699j494688k336653k230998k164470j532190q16593
2042A5531607j183089r08202p23818q24932n04261n11845j30938l31940m21609
2033I990973k85581l28055m84040J34597m55592l09102m26154k3252l17738l61851
2023G134205k44971l4386l51895j02298r1073m44064k7978m1203l57339k33795
2013E205203k48737k94402o8308j62272M9254n0040k77714k00985l41350m36461
$$ plain form
2073 27169696 29670911 32840679 37369989 42891533 49555205 57530600 66811849 78056355
2065 78056355 93407292 114484862 141108248 146131781 132484414 108667644 83717284
2058 83717284 67235400 55509512 47423889 41091716 37076147 33886586 31318952 28972916
2050 28972916 27442898 26107199 24612511 22275858 20044860 17880390 16348200 15531607
2042 15531607 14348518 13440316 12716498 11891566 11387305 10875460 10744522 10412582 9990973
2033 9990973 9705392 9377337 8893297 9027894 8572302 8263200 7837046 7813794 7496056 7134205
2023 7134205 6889234 6854848 6502953 6400655 6309582 5865518 5837540 5796337 5438998 5205203
2013 5205203 4956466 4662064 4593756 4431484 4480738 4430698 4152984 3951999 3610649 3174188
2003C174188J25632L09705k73728j01696m5730j95248m4673J0550R7690k24619
1993B832071l29172K02057j84509o2765L7643j53680J8543K14109p5058k02316
1983B296923l561R5764j37914k27383K92283J61582m24408M54545j90096m4867
1973B272868J87317j00297o6267n43216K10778K6864k71602J8261K7497j72652
1963A589551P6749K5279q2626O438R1842k01919k43808K54654L03449j50450j43364
1952A525795k0282L20685k01533k2883m52699l02231K31945K60345j70673o7625
1942A100844o1232j05437L050M3276j30530k13498K49593l8270q4026K5631p2951
1931G16450J90092m7338k77930L2138n2414J14123P9683j54788k76466L55973
$$ plain form
2003 3174188 3299820 3609525 3335797 3234101 3188371 2993123 2948450 2959000 3056690 2832071
1993 2832071 2502899 2704956 2520447 2457682 2495325 2341645 2360188 2574297 2499239 2296923
1983 2296923 2293362 2389126 2251212 2023829 2316112 2477694 2053286 2507831 2317735 2272868
1973 2272868 2460185 2359888 2293621 1750405 1961183 1988047 1716445 1734706 1762203 1589551
1963 1589551 1666300 1691579 1608953 1615391 1707233 1505314 1261506 1516160 1819609 1669159 1525795
1952 1525795 1505513 1826198 1624665 1601782 1149083 846852 1078797 1339142 1168469 1100844
1942 1100844 1039612 934175 937225 980501 849971 636473 886066 847796 763770 789401 716450
1931 716450 906542 859204 581274 613412 560998 675121 754804 600016 323550 679523
1921F79523M7212j39717p3719J73476J12955j58327R4570k29240j25294K20115
1911F01554k12002r4449K11961N207k849J55533N4J55340M8445j77116K85825
1900I77503n8186j02198J15748k50800J3962K03117j73093k49140M3219J08866
1890F28998k73426J31853K48251j3125m44817M18229m0491k11472N8544k13873
1880B88671L0878k2110J23729j48773R2200L7299p838P9268K92710n3018j26867
1869E86149k09472R5245j47568j05736M35478j78276o2933J61739k0642j47997
1859D05987J1751Q8494k1898j56015M4373J30642k07070j32691J06841p6701M2442
1848B36155J00068q7274j45635n0088K06570j06829L67896J26683k74778o0994
$$ plain form
1921 679523 726735 587018 513299 686775 799730 641403 735973 506733 381439 601554
1911 601554 389552 295103 507064 512271 509422 664955 665009 820349 868794 691678 977503
1900 977503 919317 817119 932867 682067 696029 899146 726053 476913 520132 628998
1890 628998 355572 487425 735676 722551 277734 695963 655472 444000 502544 288671
1880 288671 319549 297439 421168 272395 364595 401894 394056 473324 766034 713016 586149
1869 586149 376677 471922 324354 218618 654096 475820 412887 574626 553984 405987
1859 405987 417738 506232 484334 328319 372692 503334 296264 163573 270414 193713 236155
1848 236155 336223 248949 103314 53226 259796 152967 520863 647546 372768 311774
1838C11774n3361J30273n5784J02212J25482r3831R0832O5350k75918K63373N8291
1827F68693J7068N7123J85537J0637k7335K60461K5756j66282L4800j4452q4290
1816I67716O2502p6867m7433m11691M0037q6675l2697J87651j37296N3240P6659
1805E95146n1973j86697k75961R2615J7693P17j09134j63270l6472M15552l2315
1794B65901r030J13494k55606m5424J85353q6907N3675j53068k44598J07666J80158
1783A11614K31627j91568l1890j17363n1536k0683m9052J87827K27519O9748J99605
1772E65848O4548k88198K89545j75420m2897J65493j66798n4131J7402k03255
1762A72137j65487R7208J03428P2608K63041j29421k75575L91659l8403l3953
$$ plain form
1838 311774 258413 388686 332902 435114 560596 466765 557597 622947 347029 610402 668693
1827 668693 685761 742884 928421 939058 911723 1172184 1197940 1031658 1066458 1052006 967716
1816 967716 1030218 953351 905918 494227 534264 447589 414892 602543 465247 518487 595146
1805 595146 543173 356476 80515 173130 190823 191540 82406 -80864 -117336 298216 265901
1794 265901 256871 370365 114759 69335 254688 167781 221456 68388 -176210 -68544 111614
1783 111614 343241 151673 119783 2420 -49116 -69799 -118851 68976 296495 366243 565848
1772 565848 630396 342198 631743 456323 413426 578919 412121 357990 375392 172137
1762 172137 6650 103858 207286 279894 542935 413514 137939 529598 491195 457242
1752D57242J10802R2563j09918q5129j71209J97581k02949l53577J166J36313
1742G2885l2196r4846N8719M5961q0545k0550k5705K21828L05019m1894Q601J05851
1730E23128p7711j08187p5689J62221m6868p976j57418j88709Q6145j44865n3371
1719h9300J19637J08471m8929l22206J46267L52108k14912l3121J23081N9173
1709B00269j24153k80862K48600J61556q9350O0383k20707o1347R0389K72118
1699B56896q4005M7854M4588o7357r0553J01081J50029k64129k49270K92778J12635
1688B50547j04919r5504K10929K11614L3892j07939k605J77393M1046l3808j31913
1677D48733N6740j39729p0234N2505l08580k19603K30946j44627P4845O6217Q1375
$$ plain form
1752 457242 568044 660607 550689 465560 294351 491932 288983 -64594 -63428 72885
1742 72885 40689 -54157 4562 50523 -30022 -50572 -76277 145551 450570 408676 417277 523128
1730 523128 445417 337230 261541 423762 376894 368918 211500 22791 108936 -35929 -89300
1719 -89300 30337 138808 89879 -232327 -86060 266048 51136 18015 141096 200269
1709 200269 76116 -204746 43854 205410 116060 176443 -44264 -105611 -15222 256896
1699 256896 172891 220745 265333 197976 107423 208504 358533 94404 -154866 137912 250547
1688 250547 145628 50124 261053 472667 506559 398620 396015 573408 614454 580646 448733
1677 448733 505473 365744 295510 348015 39435 -180168 50778 -93849 -19004 47213 128588
1666A28588j49077K01405J07820O471J05734p9865J54971o6279J16006k8248l26351
1655A71175m6980J0925m01810O9143J14186K96647j64674j84000O1504J68635
1645I4751Q7694J23176q4278j83871L66950r9479m3215J61544j01701k973j48591
1634A70007P7763P3882k54986J53644j76651j01394N4746P2039J02206o8112p3848
1623B9296K0263k99626N3579M0419K51209M8844j4059k28299J10389o2717k16220
1612b66922J83242j5494J68389j53430o3149M971j3147L23775j94560k455P6842
1601D8062O7086K3701j26105l9866O3742J02259j39903J32052M012J93157L3240
1590C61437N4029m50701Q5342p9763k24686J72199L11210l0325j35432M1348r5185
$$ plain form
1666 128588 -20489 180916 288736 295207 400941 321076 476047 409768 525774 497526 171175
1655 171175 124195 135120 -266690 -197547 -83361 213286 48612 -135388 -73884 94751
1645 94751 182445 305621 221343 37472 404422 304943 261728 423272 321571 318598 170007
1634 170007 247770 321652 66666 220310 43659 -57735 -2989 69050 171256 103144 29296
1623 29296 49559 -250067 -196488 -156069 95140 143984 129925 -98374 12015 -50702 -266922
1612 -266922 -83680 -99174 69215 -84215 -147364 -142393 -155540 168235 -26325 -28780 48062
1601 48062 115148 138849 12744 -27122 36620 138879 -1024 131028 135040 328197 361437
1590 361437 415466 -35235 50107 -29656 -254342 -82143 229067 198742 63310 104658 9473
1579I473l53435K00672K3388L6399J0707J50880k28726J33367j35134P615K21428
1568G6634R4542K51228k37702o9777J63922j43232L1008k1026N5259J49724k33016
1557A17564L5664j42644J79997M9895N7908m345K00551k75890N8139k8161Q2719
1546C31397j89570J73778j16735l26746j85382q5010J50063j11218K12860K96903
1536A50340J20751j13056R074K30760k93353J59902K1328q0772r5437l79228j36156
1525d05847M2583K23764l16454m1322P3834L5432L60854J96088m6822j68141J20785
1514G4754o4804M7799j82022O7047J26531l07154K37030K15980k93639p0948J28669
1503b0757M4345l6569J27317O6699K3446J99226j86897J34730k23931q8839L16549
$$ plain form
1579 9473 -343962 -143290 -119902 -83503 -72796 78084 -150642 -17275 -152409 -144794 76634
1568 76634 171176 422404 184702 114925 278847 135615 166623 145597 200856 350580 117564
1557 117564 153228 10584 190581 240476 298384 294039 494590 218700 276839 248678 331397
1546 331397 141827 315605 198870 -127876 -313258 -398268 -248205 -359423 -146563 150340
1536 150340 271091 158035 167109 397869 104516 264418 285746 204974 109537 -269691 -405847
1525 -405847 -363264 -139500 -455954 -497276 -423442 -388010 -27156 168932 122110 -46031 74754
1514 74754 9950 57749 -124273 -57226 69305 -237849 -819 215161 -78478 -149426 -20757
1503 -20757 23588 -12981 114336 181035 204481 403707 216810 351540 127609 38770 355319
1492C55319J96386k35322O9019j67834j20557P3508J26963J28904p6037k7513
1482C22836k9702m1670N0099o0586l42862Q1215j41922q1331J74209j25983P1489
1471a24208K95748L5543k29836L5507L25750p6177k024R3030j57518j90421p2111
1460f6717R5252m5984R0676o394j09997p539n9672j51089k0427L3642K61508J47664
1448A60923j11432r518Q2133q7013R2092K04637j54770l9714n7619j67084r3744
1437a81109j11808K84081l9665j46473R3263R5563j21437r3000J26511j90839
1427b84913L47829K87769j21317j04576Q1932N7535M2475j35651O4742N6120L240
1416B95185K40074O5032l35517m08571K50449L5218j84084N9058J70171l0012
$$ plain form
1492 355319 551705 316383 385402 217568 97011 170519 297482 426386 350349 322836
1482 322836 293134 251464 301563 240977 -101885 -20670 -162592 -243923 -69714 -195697 -124208
1471 -124208 171540 207083 -22753 12754 338504 262327 260303 353333 195815 5394 -66717
1460 -66717 28535 -17449 73227 66833 -43164 -50703 -110375 -261464 -281891 -248249 13259 160923
1448 160923 49491 39973 122106 35093 127185 331822 177052 137338 79719 -87365 -181109
1437 -181109 -292917 -8836 -48501 -194974 -101711 -6148 -127585 -220585 -94074 -284913
1427 -284913 62916 350685 229368 124792 206724 264259 306734 171083 235825 291945 295185
1416 295185 535259 600291 264774 -143797 106652 141870 -42214 16844 187015 157003
1406A57003j70170J92550j70075K2125P0761o0870j7831J57209k8544l01967R7080
1395e2729N2863P8879j44658J83688J71418j07350J09851k46926j34883m3720
1385a33567J12074k61050k41921M09961j0840k56397K80391P6700J32636J78336
1375B86323M3415o9341o2173K87159j11151j85786K0712p7572M7002m2297n0353
1364H5938k21194j50876L9338K70624p3227J51547K72230r0193K48872k65996
1354B67063N0627k5558J90167R7673l74760j12950J97901l10120K6288N3767k26510
1343a66412r1967p091M13919J41234l63316J34186J90097m8138l1624o7421j46588
1332d3121k5014J47740j8750j35555J41552j0848j57825J64411J08331k28495
$$ plain form
1406 157003 -13167 179383 9308 31433 102194 41324 23493 180702 152158 -149809 -52729
1395 -52729 134 79013 -65645 118043 289461 182111 291962 45036 -89847 -133567
1385 -133567 -21493 -282543 -524464 -114503 -125343 -381740 -101349 -24649 107987 286323
1375 286323 329738 260397 198224 485383 374232 188446 209158 131586 178588 136291 85938
1364 85938 -135256 -286132 -246794 23830 -49397 102150 374380 284187 533059 267063
1354 267063 317690 292132 482299 579972 205212 92262 290163 -19957 6331 60098 -166412
1343 -166412 -258379 -265470 148449 289683 -73633 60553 250650 202512 170888 103467 -43121
1332 -43121 -68135 79605 60855 -74700 66852 56004 -101821 62590 170921 -57574
1322e7574o7466N4887P5440M2658O9577k34424q3768J41769p8955P208m0124j53099
1310c23871o0018J52174L96905l1074m12700K98582m2400J53655K46362j59401
1300B18214K9734j25240J5555j14182k45972K44271J28324K02163l83067j7492
1290d7692N9186q7610J58907J64765l5853j53730Q5170J9704K38121J67734j88984
1279C79718k98545K20372q2550l04938K75553K84290k28521m1687m7330k32241
1269g5879L5617N6107L7247j77579K89580J00916l01679k09607P0629R7283J49640
1258G2275n3909L4920O0767k86940J49191j33908l31667K07936J05893J14555
1248f0887j81665L55084k18341N6520K22820r4444j17097K23216j41883j06883
$$ plain form
1322 -57574 -125040 -70153 5287 47945 117522 -116902 -200670 -58901 -137856 -130648 -170772 -323871
1310 -323871 -383889 -231715 165190 134116 -278584 19998 -22402 131253 377615 218214
1300 218214 247948 122708 138263 24081 -221891 22380 150704 352867 -30200 -47692
1290 -47692 11494 -76116 82791 247556 211703 57973 143143 162847 400968 568702 379718
1279 379718 81173 301545 218995 -85943 189610 473900 245379 203692 156362 -75879
1269 -75879 -40262 15845 53092 -124487 165093 266009 -35670 -245277 -174648 -77365 72275
1258 72275 18366 53286 114053 -172887 -23696 -157604 -489271 -281335 -175442 -60887
1248 -60887 -242552 112532 -105809 -49289 173531 79087 -38010 185206 43323 -63560
1238f3560L33376l36227M8602L19996o2568j51776K55010M1656m816k55557j29287
1227e151l6244J92116N707J19962L3833M6969j45515L8800j20507j38728K098
1216f660k43703L0611J69495j06598j56058K98466J04888q4057N3384J25281q3035
1205A02014K0109K7101j95704J35017J34494J9525l50205O7450J26561k92311
1195b05949n5192M19228j19037k98010L6755J52818j61899j4596J76818p1854
1185a40918j62068J15103K51203J7046K2721N5050j72367j92239J35863q8353
1175a58959J54629L19318r6141j44133q8211j07863Q2810o7129M4517q2027r1608
1164b34797J26832m2268j01694M3819K51193M2146N1611m5417n1787j45379m1278
$$ plain form
1238 -63560 269816 -66411 -17809 302187 239619 87843 342853 384509 379693 124136 -5151
1227 -5151 -41395 150721 156428 276390 310223 357192 211677 250477 129970 -8758 -6660
1216 -6660 -250363 -219752 -50257 -156855 -312913 -14447 90441 6384 59768 185049 102014
1205 102014 122123 149224 -46480 88537 223031 242556 -107649 -40199 86362 -205949
1195 -205949 -261141 158087 39050 -258960 -222205 -69387 -231286 -245882 -69064 -140918
1185 -140918 -302986 -187883 63320 80366 103087 158137 -14230 -206469 -70606 -158959
1175 -158959 -4330 314988 218847 74714 -13497 -121360 -38550 -105679 -61162 -143189 -234797
1164 -234797 -107965 -150233 -251927 -208108 43085 85231 136842 91425 39638 -105741 -147019
1153a47019J4097K45293J08352j23155K3062j34680R1751k86128P4552J90208
1143E6333j13336p0980J59580K08171r2215j86623M2433j08495k0197J70106k434
1132D2343J36709j77536J717q0345p4200J84585q0094k0910P105R6545j51640
1121a15721j92052J2858k9455p9237K04953L17368l97631J23667K60830Q0163
1111A85743K9113J4852K85399k63714j6979J88330k07470j86251R8052j13248
1101A3827J23870J93794P560j46260j62688K8520K57735k11109j11162R0029M4001
1090A28117k02395m890K04593m0999m96j82685K1303K60165j50679j58319k04038
1079c30323m3276J33651K9430k09696J93630P4385P2530j93049J02278K40176
$$ plain form
1153 -147019 -132922 112371 220723 97568 120630 -14050 77701 -208427 -133875 56333
1143 56333 -57003 -127983 31597 239768 147553 -39070 3363 -105132 -125329 44777 42343
1132 42343 179052 1516 3233 -77112 -151312 33273 -46821 -67731 -60626 35919 -115721
1121 -115721 -307773 -294915 -324370 -403607 -198654 118714 -278917 -155250 105580 185743
1111 185743 214856 229708 515107 251393 234414 422744 215274 29023 127075 13827
1101 13827 137697 331491 339051 192791 30103 58623 316358 105249 -5913 84116 128117
1090 128117 -74278 -79168 125425 84426 83930 -98755 -77452 182713 32034 -126285 -330323
1079 -330323 -373599 -239948 -210518 -420214 -226584 -152199 -79669 -272718 -170440 69736
1069F9736j66626K25765j14505j61880r4366K27499K02085L9550M4054k06786
1059F4526k07645J52453l40468j03564J45411O4646L9041n4068n2783K1366n7261
1048c28346K99935L3884o4164J32412j62382j58349J75044P0660o1981j34665
1038a97952m9551J81079J69562k48581J44198Q8149k11497L25558J08853j12715
1028A97103k14873L7660k33671O5372J36921L4298q3572N16J97626l29077K00248
$$ plain form
1069 69736 -96890 128875 14370 -147510 -241876 -14377 187708 227258 271312 64526
1059 64526 -143119 9334 -331134 -434698 -289287 -224641 -185600 -239668 -292451 -271085 -328346
1048 -328346 -28411 5473 -58691 73721 -88661 -247010 -71966 -1306 -63287 -197952
1038 -197952 -247503 -66424 103138 -145443 -1245 86904 -124593 200965 309818 197103
1028 197103 -17770 19890 -213781 -148409 -11488 22810 -60762 -60246 137380 -191697 8551
$$ [...]
##END NTUPLES=NMR SPECTRUM
##END=
