##TITLE=1H_EC-3259(V-4)
 CDCl3, 8 sc, 
 2.9.2021
##JCAMPDX= 6.0         $$ Bruker NMR JCAMP-DX V2.0
##DATA TYPE= NMR SPECTRUM
##DATA CLASS= NTUPLES
##ORIGIN= UXNMR, Bruker Analytische Messtechnik GmbH
##OWNER= root
$$ XWIN-NMR		Version 3.5
$$ Thu Sep  2 09:29:07 2021 Russian Standard Time (UT+4h)  she@DPX200
##.OBSERVE FREQUENCY= 200.1312
##.OBSERVE NUCLEUS= ^1H
##.ACQUISITION MODE= SIMULTANEOUS
##.ACQUISITION SCHEME= undefined
##.AVERAGES= 8
##.DIGITISER RES= 18
##SPECTROMETER/DATA SYSTEM= spect
##.PULSE SEQUENCE= zg30
##.SOLVENT NAME= CD2Cl2
##.SHIFT REFERENCE= (INTERNAL, CD2Cl2, 0, 17.8979)
##AUDIT TRAIL= $$ (NUMBER, WHEN, WHO, WHERE, WHAT)
$$ ##TITLE= Audit trail, XWIN-NMR		Version 3.5
$$ ##JCAMPDX= 5.01
$$ ##ORIGIN= Bruker BioSpin GmbH
$$ ##OWNER= she
$$ F:/spectra/data/she/nmr/H-F/1/pdata/1/auditp.txt
$$ ##AUDIT TRAIL=  $$ (NUMBER, WHEN, WHO, WHERE, WHAT)
(   1,<2021-09-02 09:27:42.01 +0400>,<she>,<DPX200>,
      <created by zg, POWCHK disabled, PULCHK disabled
       configuration hash MD5:
       00 E9 B6 7A A2 85 ED C7 34 08 36 98 17 FE 4E 26
       data hash MD5: 16K
       36 F4 F4 AB D1 16 6D E6 2D 47 61 A9 50 BD 6E F4>)
(   2,<2021-09-02 09:27:44.51 +0400>,<she>,<DPX200>,
      <Start of raw data processing
       efp BC_mod = 2 LB = 0.24 FT_mod = 6 PKNL = 1 PHC0 = -13356.4 PHC1 = 8.00097 SI = 16K 
       data hash MD5: 16K
       02 40 47 72 EF A1 11 53 E2 B1 47 57 08 54 4B CD>)
(   3,<2021-09-02 09:28:07.25 +0400>,<she>,<DPX200>,
      <pk PHC0 = -4.060517 PHC1 = 8.399999 
       data hash MD5: 16K
       8B 00 E7 16 8B 8D 1F E9 4B DF 7F 1B 28 9D F0 9B>)
(   4,<2021-09-02 09:28:10.62 +0400>,<she>,<DPX200>,
      <abs ABSG = 5 
       data hash MD5: 16K
       B4 E8 19 53 C9 89 1E 2F 2F 7B 3D 75 A2 94 4E 90>)
$$ ##END=
$$ 
$$ hash MD5
$$ 02 EB 6D 27 A4 9D 27 F1 F7 27 C3 88 5E 3C EE 33
##$RELAX= 
##$RELAX= 
##$RELAX= 
##$RELAX= 
##$RELAX= 
##$RELAX= 
$$ Bruker specific parameters
$$ --------------------------
##$DU= <F:/spectra>
##$EXPNO= 1
##$NAME= <H-F>
##$PROCNO= 1
##$TYPE= <nmr>
##$USER= <she>
##$AMP= (0..31)
100 100 100 100 100 100 100 100 100 100 100 100 100 100 100 100 100 100 
100 100 100 100 100 100 100 100 100 100 100 100 100 100 
##$AQSEQ= 0
##$AQ_mod= 1
##$AUNM= <au_zg>
##$AUTOPOS= <>
##$BF1= 200.13
##$BF2= 200.13
##$BF3= 200.13
##$BF4= 200.13
##$BF5= 200.13
##$BF6= 200.13
##$BF7= 200.13
##$BF8= 200.13
##$BYTORDA= 1
##$CFDGTYP= 0
##$CFRGTYP= 5
##$CHEMSTR= <none>
##$CNST= (0..31)
1 1 145 1 1 1 1 1 1 1 1 1 1 1 1 1 1 1 1 1 1 1 1 1 1 1 1 1 1 1 1 1 
##$CPDPRG= <>
##$CPDPRG1= <>
##$CPDPRG2= <>
##$CPDPRG3= <>
##$CPDPRG4= <mlev>
##$CPDPRG5= <mlev>
##$CPDPRG6= <mlev>
##$CPDPRG7= <mlev>
##$CPDPRG8= <mlev>
##$CPDPRGB= <>
##$CPDPRGT= <>
##$D= (0..31)
0 1.2 0 0 0 0 0 0 0 0.06 0 0.03 0 0 0 0 0.0002 0 0 0 0 0 0 0 0 0 0 0 0 
0 0 0 
##$DATE= 1630560461
##$DBL= (0..7)
120 120 120 120 120 120 120 120 
##$DBP= (0..7)
150 150 150 150 150 150 150 150 
##$DBP07= 0
##$DBPNAM0= <>
##$DBPNAM1= <>
##$DBPNAM2= <>
##$DBPNAM3= <>
##$DBPNAM4= <>
$$ [...]
##$SUBNAM3= <"">
##$SUBNAM4= <"">
##$SUBNAM5= <"">
##$SUBNAM6= <"">
##$SUBNAM7= <"">
##$SUBNAM8= <"">
##$SUBNAM9= <"">
##$SW= 20.0189188712717
##$SWIBOX= (0..15)
0 0 2 0 0 0 0 0 0 0 0 0 0 0 0 0 
##$SW_h= 4006.41025641026
##$TD= 16384
##$TD0= 1
##$TE= 0
##$TE2= 300
##$TE3= 300
##$TEG= 300
##$TL= (0..7)
0 120 120 120 120 120 120 120 
##$TP= (0..7)
150 150 150 150 150 150 150 150 
##$TP07= 0
##$TPNAME0= <>
##$TPNAME1= <>
##$TPNAME2= <>
##$TPNAME3= <>
##$TPNAME4= <>
##$TPNAME5= <>
##$TPNAME6= <>
##$TPNAME7= <>
##$TPOAL= (0..7)
0.5 0.5 0.5 0.5 0.5 0.5 0.5 0.5 
##$TPOFFS= (0..7)
0 0 0 0 0 0 0 0 
##$TUNHIN= 0
##$TUNHOUT= 0
##$TUNXOUT= 0
##$USERA1= <user>
##$USERA2= <user>
##$USERA3= <user>
##$USERA4= <user>
##$USERA5= <user>
##$V9= 5
##$VALIST= <valist>
##$VCLIST= <CCCCCCCCCCCCCCC>
##$VD= 0
##$VDLIST= <DDDDDDDDDDDDDDD>
##$VPLIST= <PPPPPPPPPPPPPPP>
##$VTLIST= <TTTTTTTTTTTTTTT>
##$WBST= 1024
##$WBSW= 4
##$XGAIN= (0..3)
0 0 0 0 
##$XL= 0
##$YL= 0
##$YMAX_a= 274326
##$YMIN_a= -321702
##$ZGOPTNS= <>
##$ZL1= 120
##$ZL2= 120
##$ZL3= 120
##$ZL4= 120
##$ABSF1= 17.89303
##$ABSF2= -2.126047
##$ABSG= 5
##$ABSL= 3
##$ALPHA= 0
##$AQORDER= 0
##$ASSFAC= 0
##$ASSFACI= 0
##$ASSFACX= 0
##$ASSWID= 0
##$AUNMP= <proc_1d>
##$AZFE= 0.1
##$AZFW= 0.1
##$BCFW= 0
##$BC_mod= 2
##$BYTORDP= 0
##$COROFFS= 0
##$CY= -3
##$DATMOD= 1
##$DC= 0
##$DFILT= <>
##$DTYPP= 0
##$F1P= 0
##$F2P= 0
##$FCOR= 1
##$FTSIZE= 16384
##$FT_mod= 6
##$GAMMA= 0
##$GB= 0
##$INTBC= 1
##$INTSCL= 1.334414e-10
##$ISEN= 128
##$LB= 0.24
##$LEV0= 0
##$LPBIN= 0
##$MAXI= 10000
##$MC2= 0
##$MEAN= 0
##$ME_mod= 0
##$MI= 1.114404
##$NCOEF= 0
##$NC_proc= -8
##$NLEV= 6
##$NOISF1= 3.799351
##$NOISF2= 2.8
##$NSP= 0
##$NTH_PI= 0
##$NZP= 0
##$OFFSET= 17.89791
##$PC= 1
##$PHC0= -13360.46
##$PHC1= 16.40097
##$PH_mod= 1
##$PKNL= yes
##$PPARMOD= 0
##$PSCAL= 0
##$PSIGN= 0
##$REVERSE= no
##$SF= 200.129621302914
##$SI= 16384
##$SIGF1= 3
##$SIGF2= 2
##$SINO= 5.538805
##$SIOLD= 16384
##$SREGLST= <1H.CDCl3>
##$SSB= 0
##$STSI= 16384
##$STSR= 0
##$SW_p= 4006.41025641025
##$SYMM= 0
##$S_DEV= 0
##$TDeff= 16384
##$TDoff= 0
##$TI= <>
##$TILT= no
##$TM1= 0
##$TM2= 0
##$TOPLEV= 0
##$USERP1= <user>
##$USERP2= <user>
##$USERP3= <user>
##$USERP4= <user>
##$USERP5= <user>
##$WDW= 1
##$XDIM= 16384
##$YMAX_p= 513497341
##$YMIN_p= -1245737
$$ End of Bruker specific parameters
$$ ---------------------------------
##NTUPLES= NMR SPECTRUM
##VAR_NAME=  FREQUENCY,     SPECTRUM/REAL,   SPECTRUM/IMAG
##SYMBOL=    X,             R,               I
##VAR_TYPE=  INDEPENDENT,   DEPENDENT,       DEPENDENT
##VAR_FORM=  AFFN,          ASDF,            ASDF
##VAR_DIM=   16384,         16384,           16384
##UNITS=     HZ,            ARBITRARY UNITS, ARBITRARY UNITS
##FACTOR=    0.24454680195387, 1,            1
##FIRST=     3581.90178319107, 0,            0
##LAST=      -424.508473219179, 0,           0
##MIN=       -424.508473219179, -1245737,    0
##MAX=       3581.90178319107, 513497341,    0
$$ Real data points
##PAGE= N=1
##DATA TABLE= (X++(R..R)), XYDATA
$$ [...]
10615B97337J47320k99043j57801K67640L05028J68021n59957M9279j95229J06599
10605A29194J66886l12487j73670M79223k83928k80581L11922L578O25460j06409
10595E59188l09432J67477k36923o7313Q4462k22407O8128J87289J8995m08858
10585a59394J38684p1706N0296L47662m62303m4144J02427l16444K44873o0588
10575b30637J61587P1402l51254q89180M81852L14985K26613l64748J25524N53279
10565I9423j1101j91444K55270m22793j81842N18825j46589K73543l57335J42779
10555b1264j05179k41104j30155N8092l13190L01560j1065M91708J44563L27529
10545E01495j11972o85682m4783q6624Q2887n719K3369M41674j97056Q8269N4218
$$ y = [297337, 444657, 145614, -12187, 255453, 560481, 728502, 168545, 217824, 22595, 129194, 296080, -16407, -190077, 289146, 5218, -275363, 36559, 40137, 665597, 559188, 249756, 417233, 180310, 112997, 197459, -24948, 43180, 230469, 249464, -159394, -20710, -92416, -42120, 305542, -156761, -200905, -98478, -414922, -170049, -230637, -69050, 2352, -348902, -1238082, -756230, -441245, -214632, -579380, -453856, 99423, 88322, -103122, 152148, -270645, -452487, 66338, -80251, 193292, -164043, -21264, -126443, -367547, -497702, -439610, -752800, -451240, -462305, 29403, 173966, 501495, 389523, -296159, -340942, -427566, -344679, -350398, -327029, 114645, -82411, 5858, 60076]
10534F0076o0855k63727P8227R0343k35457m6828r8634K38479M19081J1595O1757
10523B54057m5464M60011l05746q31673j01895L12223J94045K26684j95041o2852
10513i5651M67227r11483K6422L41560j67238J23688N28009J13198r0729l0871
10503C04132l65686P6450J39548l6560k7882m51044L32861n06057L55881K18191
10493C9834K66817j47084j94053L8880K85401k35817O195K41986j78850q9785
10483C3524l8668J59890J02503J01185r7786j51453k93810J03854J58545M87940
10473E65724q07955O25746k43522l99305L51253N7764l56947P233r9897L634K18320
10462g7952j18998L62553n7017j11407m42096L63316j75378N28677n04304k2765
$$ y = [60076, -779, -264506, -186279, -95936, -331393, -378221, -476855, -238376, 180705, 192300, 254057, 208593, 668604, 362858, -468815, -570710, -258487, -64442, 162242, -32799, -95651, 371576, -539907, -513485, -171925, -339163, -215475, 312534, 425732, 335003, 304132, -61554, 14896, 154444, 117884, 90002, -361042, -28181, -534238, -178357, 39834, 306651, 159567, -34486, 4394, 289795, 53978, 60173, 302159, 123309, 33524, -5144, 154746, 257249, 358434, 260648, 109195, -184615, -80761, 77784, 565724, -242231, 383515, 139993, -259312, 91941, 149705, -207242, -200009, -299906, -296272, -77952, -196950, 165603, 108586, -2821, -444917, -81601, -256979, 271698, -232606, -255371]
10452b55371j39124K43268J51143j47409q5913m5010O1107j74604l8485L25066
10442a05332K60397k35510K35500r1744j28788o81669l4435K18219j07378M36093
10432b34647N02256N867k13367l9823K72943K6468m3457j89676Q0044k50672k27250
10421c11314L39591j79268l35172k6618O46500J58447l9141J50064k71987k48685
10411a17583j20953j36688n22l9032j09735K94246M2580J19481l08094r410L34457
10400e1253k05956P3706L08961n37840J20753J61473o0115L60621j99566J05064
10390G5848J96329l98442J14175k95261o5113K2498K76885k98776L19163K53650
10380B00956j13081l36905K0298J0514J50768L45162l98459J32021J5378N6644
$$ y = [-255371, -394495, -151227, -84, -147493, -233406, -278416, -217309, -391913, -430398, -105332, 155065, -80445, 155055, 63311, -65477, -747146, -781581, -563362, -670740, -234647, 267609, 273476, 60109, 20286, 293229, 319697, 276240, 86564, 166608, -84064, -311314, 28277, -150991, -486163, -512781, 133719, 292166, 253025, 403089, 131102, -117583, -238536, -375224, -375746, -414778, -524513, -230267, -187687, -68206, -376300, -385710, -51253, -257209, -183503, 125458, -412382, -291629, -130156, -190271, 170350, -29216, 75848, 272177, -126265, -12090, -307351, -372464, -349966, -73081, -371857, -52694, 200956, 87875, -249030, -228732, -218218, -67450, 277712, -120747, 11274, 26652, 83296]
10370H3296l69420Q0263N92224M09327m77919l00049K9693l86283K30124K19654
10360A10910M2133J62241J52156k00236j52145J74358k31941k47359j41151K6493
10350c04541K89060K9032j55070k0402P1140l02934m1325J17832J96742l534P241
10339a16759K95228k6021j7043m9216M13296J28979o68618k1889J33295k33824
10329a62572j10930j06749L3678J09619R7818L52704j392l2507j87321J37389
10319A29737j33528k38618Q4977m02596Q98496J18994n12990k19011K83164M88604
10309D97229n20945j5102j68807Q6451J16515K22799J99725m76504L79714k57244
10299F3831k03024k17016j50148r0546L65886j71031M5841L38023r0627m36982
$$ y = [83296, -286124, -205861, 386363, 795690, 317771, 17722, 47415, -338868, -108744, 110910, 153043, 315284, 467440, 267204, 115059, 289417, 57476, -189883, -331034, -304541, -15481, 13551, -141519, -161921, -90781, -393715, -435040, -317208, -120466, -124000, -116759, 178469, 152448, 135405, 86189, 499485, 628464, -40154, -62043, 71252, -162572, -273502, -380251, -346573, -236954, -139136, 213568, 212176, 179669, -7652, 129737, -3791, -242409, -157432, -560028, 338468, 457462, -55528, -274539, 8625, 497229, -23716, -38818, -207625, -121174, -4659, 218140, 417865, -58639, 321075, 63831, -139193, -356209, -506357, -596903, -231017, -402048, -356207, -18184, -108811, -545793]
10289e45793K63386J37190J13383R808k7207L36848K19721j13991n59738l1553
10279a97946L76596k98028k69523J2786j66757M53935L85743k64474j72995k831
10269a43494K30877l04862k1071K54566M45007j48346j58842L4488l31737L44536
10259B01122o6276l12159O0833K4918j49639O65926j82613l48240l70637L55377
10249a21388k16236K23859N46844n93576M7940J16287n49107p00360L93670Q93873
10239D1806J9631l02986J4154J6338k26224L79203K28491Q1306j01922l17914
10229a68117m92053J44693K26081k9543K19781K6300L4701L65774k30956K51890
10219C48551m45597J71590M42591l80733j78051l03243N21119P7718j04584j49968
$$ y = [-545793, -282407, -145217, -31834, -22026, -49233, 287615, 507336, 393345, -166393, -197946, 178650, -119378, -388901, -376115, -542872, -88937, 296806, 32332, -140663, -143494, 87383, -217479, -238550, 16016, 461023, 312677, 153835, 188323, -143414, 201122, 134846, -177313, -116480, -91562, -241201, 424725, 242112, -106128, -476765, -121388, -337624, -113765, 433079, -160497, -112557, 3730, -545377, -1245737, -852067, 41806, 61437, -241549, -227395, -211057, -437281, -58078, 170413, 251719, 149797, -168117, -660170, -515477, -289396, -318939, -99158, -72858, -38157, 327617, 96661, 348551, -97046, 74544, 517135, 136402, -41649, -344892, 176227, 253945, 149361, -607]
10209f07Q1309j44739J44087j20496j61384K69549K03096j51239r368n3515L83727
10198D40420J96259p08924m28620P2436l69129M56712L66781J29436j38117k15426
10188a98172L09837P7682k05868k47368K07082j21693k43336n470K9778K33922
10178a63606K27071l98805N39033K23010m58447J36215J79631n10233p8895r9310
10168d04336L68551J79189n2281j63511l67469K7085K05700K16746k9179k05724
10158b25229K16104Q8216m24937j43610L23235J40433m47938N80982J95750K73182
10148E76188j23485n0445o9438m53988J81981P8283l00144j29416j60115J25841
10138c24738L45243M04484j54813k58547k55698o6764J02404k36171o3665j21683
$$ y = [-607, 80702, -64037, 80050, -40446, -201830, 67719, 270815, 119576, 110208, 56693, 440420, 636679, -72245, -500865, -428429, -797558, -340846, 25935, 155371, 17254, -198172, 111665, 189347, -16521, -263889, -56807, -178500, -421836, -427306, -397528, -163606, 63465, -335340, 203693, 426703, -31744, 104471, 284102, -226131, -305026, -404336, -35785, 143404, 91123, -72388, -439857, -412772, -207072, 9674, -19505, -225229, -9125, 79091, -345846, -489456, -166221, -25788, -473726, 107256, 303006, 576188, 452703, 402258, 332820, -121168, 60813, 139096, -161048, -290464, -450579, -324738, 20505, 424989, 270176, 11629, -244069, -310833, -208429, -444600, -508265, -629948]
10128f29948O60736m10690r7287J02514j30861M46877J58573k08501n5016j07473
10118b71076j7620K6169J73328R4493j3518l5640k1878k30510J73792J48968j47776
10107a21268J19890j034j84382J11113J47316K40406n6969j36645k57124j82867
10097c21564j52481k78266J30596L20557M98358k01800K38058L63960n13967n45240
10087d61789J78337J34978P7395l14045J95606J48286N30070k9611l44224k44471
10077a29468j23896J80653M74242k49187J0492q269l47087l48750k02370M4194
10067f99446P2785K03495K53885r9179j89329N11379k0177M4067J22951Q8587
10057B89018J42739k09580k84507l98896j63675J14162N8137O37960n1165p6867
$$ y = [-629948, 30788, -379902, -477189, -374675, -505536, -58659, 99914, -108587, -163603, -271076, -288696, -262527, -89199, 5294, -8224, -43864, -65742, -296252, -122460, 26508, -121268, -1378, -2412, -186794, -75681, 71635, 312041, 255072, 118427, -138697, -321564, -474045, -752311, -621715, -301158, 197200, -4600, 233458, 597418, 83451, -461789, -283452, -148474, -71079, -385124, -189518, -41232, 488838, 459227, 115003, -129468, -253364, -72711, 401531, 152344, 162836, 154567, -192520, -541270, -743640, -699446, -626661, -423166, -169281, -268460, -457789, 53590, 33413, 77480, 200431, 289018, 431757, 222177, -62330, -461226, -624901, -510739, -452602, 185358, 134193, 57326]
10047E7326J22093J37537L23238k45351l49341m21238M42535K2825k22432r8355
10037b31163m04599J66431N80588Q7053q09273O70065P4293j9671o41115l0560
10027e57951M84176K65557j0423m52498o42548M84319M10157r8681j89616k51968
10017e59476J80197l08092N8875K55304m115K65546j73142J41171j68394k17922
10007e30048J67358R4142L07233K97497L5359o57565p1919M14772J12455k71773
9997a02489K01757k35175l29179J41137R5535J2586k49428J54063J61008l57442
9987e07627L36216p2550n6281m6043j68908K72351K57319J37349R078j27844j79633
9976a46573L5158K84144l48572k02261k80064L30269L36895l30964M49751L20499
$$ y = [57326, 179419, 316956, 640194, 394843, 45502, -375736, 66799, 89624, -132808, -231163, -635762, -469331, 111257, 198310, -610963, 59102, 133395, 113724, -527391, -557951, -73775, 191782, 181359, -271139, -913687, -429368, -19211, -117892, -307508, -559476, -379279, -687371, -628496, -373192, -377307, -111761, -284903, -143732, -312126, -530048, -362690, -268548, 38685, 336182, 371541, -286024, -357943, 56829, 169284, -102489, 99268, -135907, -465086, -323949, -228414, -215828, -465256, -311193, -150185, -507627, -171411, -243961, -300242, -346285, -515193, -242842, 14477, 151826, 160904, 33060, -146573, -111415, 172729, -175843, -378104, -658168, -327899, 8996, -321968, 127783, 448282]
9966D48282k40372l73260K59434J75867J72118P9587l94620K64481n24213K80224
9956A47528l70594O847j29766M39032l32725J45316L768l37052L15468L74982
9946B62804m36056O6499j6485l05460J75082R3412M01357L12749k45784o3015
9936B45103p2252n22786L27518J7043n49727K00342J27484m73317L57214K22338
9926a21040M3959j96877L75502K73202J50538k02220N6044m27409M61694l46498
9916F6895j4874o3834k7132j47975J87371P0234m08369K73940J9888L06801p4851
9905A88094l52902L71902j14800j5658l17491m16066L7844M47740l2045k31189
9895d34571L35974P5290m59439N5567n3514J40979J58289J39995l30320O5820
$$ y = [448282, 207910, -165350, 94084, 269951, 442069, 521656, 127036, 391517, -132696, 147528, -223066, -216219, -345985, 93047, -239678, -94362, -90594, -427646, -112178, 262804, -173252, -106753, -123238, -428698, -253616, -160204, 241153, 553902, 308118, 245103, 172851, -349935, -22417, -5374, -555101, -354759, -227275, -700592, -343378, -121040, -77081, -273958, 101544, 374746, 525284, 323064, 379108, -48301, 413393, 66895, 52021, -11813, -38945, -186920, 451, 70685, -337684, -63744, -43856, 262945, 188094, -164808, 207094, 92294, 76636, -240855, -656921, -619077, -171337, -203382, -434571, -98597, -23307, -482746, -427179, -480693, -339714, -181425, -41430, -371750, -305930]
9885c05930L38846l30702N21476r4843j26465o130J41464K26899k23670J7477
9875A58422n08977k21261k01624K56534K11424L60420M9694p471n5170k38880
9865a96889L74275l44170L57693J3397r86486M63916L01779K89591O0918K16332
9855E50356m75843n57949K55996m1295J79645J36726k74522J70946k70550j93393
9845e19883K27723O59509l84338k69352M96929k036K25039p58849q3701k02761
9835f11720L0398J18088P9923L01097L07417R5835R5944k21644m58465o6282L16853
9824a2556k55279J1186o19424Q55082j52296N388o2345J270J23754l19626j00004
9813e24850O43106J46858l02276J03379k73012j18807o2627l17944Q12729L1215
$$ y = [-305930, 32916, -297786, 223690, 128847, 2382, -3748, 137716, 364615, 140945, 158422, -350555, -571816, -773440, -516906, -305482, 54938, 104632, 97161, 41991, -196889, 177386, -166784, 190909, 204306, -782180, -318264, -16485, 273106, 334024, 550356, 74513, -483436, -227440, -268735, -89090, 47636, -226886, -55940, -326490, -519883, -292160, 367349, -16989, -286341, 210588, 208552, 433591, -325258, -408959, -611720, -581322, -463234, -383311, -82214, 225203, 321038, 416982, 195338, -263127, -329409, -12556, -267835, -256649, -876073, -20991, -173287, -167899, -230244, -228974, -105220, -424846, -524850, 118256, 265114, -37162, 66217, -206795, -325602, -388229, -706173, 106556, 137771]
9803A37771r2838m509k94760J57633Q4424r3632r0552K14246j57247l35644K43418
9792b31690Q7178l77371O73738j39096k28984K2207k11499j52694L29393j30683
9782c59501K01373N2917L59532P6621k34303j71936m25477J18084Q1481L47534
9772D6325k97493J80503N011K16961l82497j6215K00973o3508L36222J84129m4419
9761C65992r1368p0029j49018M04174l54765K4670j37341N4746j81245k27512
9751c61696J8051L10545L2807M5901K47690l02412k69505K30623j87841M6923
9741a88914L54867k60464P5770R4640j6550j53193l24093J78450K8093L17038
9731A05644M2532m6030Q3395O878K78549k39810k68084k11612O6759p4248J82219
$$ y = [137771, 44933, 40424, -254336, -96703, -12279, -105911, -196463, 17783, -139464, -475108, -231690, -144512, -521883, 151855, 12759, -216225, -194018, -405517, -558211, -228818, -359501, -158128, -105211, 254321, 330942, 96639, -75297, -500774, -382690, -301209, 46325, -251168, -70665, -65654, 151307, -231190, -247405, -46432, -109940, 226282, 410411, 365992, 274624, 204595, 55577, 459751, 104986, 129656, -7685, 47061, -134184, -361696, -343645, -33100, -293, 45608, 293298, -9114, -278619, -47996, -235837, -188914, 165953, -94511, -18741, 75899, 59349, -93844, -417937, -239487, -211394, 105644, 148176, 102146, 185541, 192419, 470968, 231158, -36926, -248538, -181779, -256027, -73808]
9720g3808L83055k72826o2051k02851J25612J05551K9144m61805r8224J58833
9710c69370J73498p7883J55837M66442n2447j48192j60199K6849O5822l17731
9700b37374K15415J5956N6125K79512M61538m16868J8782j90667n28119J77573
9690a48127o1945k877l44929p4434O82751J52655n0266J05119l08305j586j61430
9679b13374j13931M30943N23047m50911L2755k67751l43984K70831M55692k86743
9669C6574q3660M85597j3754m30360J98694n79094M42511N00272o68015l97883
9659e09118J97702N48986p7366k44239m57549J64384j29013O50446L98195o35960
9649i3532k9031L77300k2914l02705K24330K16133l41182k81307M05979K25650
$$ y = [-73808, 309247, 36421, -25630, -228481, -102869, 2682, 31826, -429979, -528203, -369370, -195872, -273755, -117918, 348524, 296077, 147885, -12314, 14535, 80357, -237374, -21959, -6003, 50122, 329634, 791172, 374304, 393086, 202419, -325700, -148127, -210072, -212949, -557878, -632312, 50439, 203094, 152828, 257947, -50358, -51944, -213374, -327305, 103638, 626685, 175774, 208529, -59222, -403206, -132375, 323317, 36574, -47086, 438511, 424757, -5603, 193091, -386003, 56508, 556780, -111235, -509118, -311416, 237570, 160204, -84035, -541584, -377200, -506213, 144233, 542428, -93532, -122563, 254737, 231823, -70882, 153448, 369581, 28399, -252908, 153071, 378721]
9639C78721l62390J7572k05953Q3618l83492j05803J82161j02073M80275K85484
9629B68120j73060k7812J86014j76278p5160j38750J02113J94443K73278Q4243
9619E17151O5186m98141p7594j76899r1829M89587J84314k49115m69930J6462
9609b90808j7304N63959J5737K13339q6212n02033J61555K92829k97418m09522
9599c55878P13172r9092m17615k7166j23900K11602r7167k00622M56420L1887
9589I1641K24650l51918j01412k1750j23907N18232p3102j31889j3521p8466k47523
9578c08965K09832N5088l73889J35496j44185J01370L10897j53612l84613J11872
9568d40709O48461k02323r0150M46622n521j16612L5189r772m25605j39986L47841
$$ y = [378721, 16331, 33903, -172050, -88432, -471924, -577727, -395566, -497639, -17364, 268120, 95060, 67248, 253262, 76984, 1824, -136926, -34813, 159630, 432908, 517151, 582337, 84196, 6602, -170297, -262126, 227461, 411775, 162660, -307270, -290808, -308112, 255847, 271584, 484923, 398711, -103322, 58233, 351062, 53644, -355878, 357294, 258202, -159413, -186579, -310479, -98877, -196044, -396666, 59754, 91641, 316291, -35627, -137039, -158789, -282696, 235536, 162434, 30545, 17024, -61442, -308965, -99133, -44045, -417934, -282438, -426623, -325253, -14356, -167968, -552581, -440709, 207752, 5429, -84721, 361901, 356380, 239768, 274957, 265185, -160420, -300406, 47435]
9557D7435j4683j79656M27358p7786l32393J95561l56178o66938M21909N55305
9547A9934k57050J54965j25476M68670l64717K16700q7755L37859K48912n50825
9537F1217L13340n53247K81899m6724J21595K02738k60068k16389j87165k98879
9527e81683K50777K70200j40770o6339K93600L9520J03102n66195K50344L74088
9517B26644k37285j49870o4986k6192j78354N49054J55520n0080L83664j79140
9507D28975k27751k17206R0089p5417l19785J28290K62578K74760m3275Q1529
9497C82787l22996l65028J59827L19930n8931m19717m1397J99553l48979K65381
9487b29570n9558L19935J54371j26648J96658J95645j74072k34779n22595Q0112
$$ y = [47435, 32752, -146904, 280454, 202668, -129725, 65836, -290342, -957280, -535371, 19934, -237116, -82151, -207627, 261043, -103674, 113026, 25271, 363130, 612042, 61217, 374557, -178690, 103209, 56485, 178080, 380818, 120750, -95639, -282804, -581683, -330906, -60706, -201476, -267815, 25785, 65305, 168407, -397788, -147444, 226644, -10641, -160511, -225497, -251689, -430043, 119011, 274531, 224451, 608115, 428975, 201224, -15982, 74107, -1310, -321095, -192805, 69773, 344533, 301258, 382787, 59791, -305237, -145410, 174520, 115589, -304128, -345525, -145972, -494951, -229570, -289128, 30807, 185178, 58530, 255188, 450833, 276761, 41982, -480613, -400501]
9477d00501L34188j73899m14450K0697J40535L8430N58341J63930J66373l23942
9467A09702l52333K39616Q2430m53438J52304j19511p7807L13428L80372j16628
9457A58135k11897J22290J30097Q139m08474k75175J53012J20492Q4886l8373
9447a56868J95431M30527m58210j44908J4329J15799j94076K07063l8677N327
9437b4263j3458j42116J71274j01453K91315O0800m72483J80331m24320j63168
9427f37541Q88836p8846o25489J65638M33537J13757m44567J09278j5038K50817
9417A60382p4516o65413J1093L73777K11769o9300k07971j35115r4406j30133
9407f19833m2034R5055l67083K57372J07803N9128N5724k42381r1778K95768J20609
$$ y = [-400501, -66313, -240212, -654662, -633965, -493430, -455000, 103341, 267271, 433644, 109702, -242631, -3015, 79415, -374023, -221719, -341230, -419037, -105609, 274763, 158135, -53762, 68528, 198625, 206764, -201710, -476885, -323873, -203381, -118495, -156868, 38563, 469090, 10880, -134028, -119699, -3900, -197976, 9087, -29590, -24263, -37721, -179837, -8563, -110016, 181299, 242099, -230384, -50053, -474373, -637541, 251295, 172449, -453040, -287402, 146135, 259892, -184675, -75397, -90435, 160382, 85866, -579547, -568454, -194677, 17092, -52208, -260179, -395294, -489700, -619833, -661867, -566812, -933895, -676523, -568720, -509592, -453868, -696249, -788027, -492259, -371650]
9396c71650p04351M31668L35504K13804l1149j52212p6096k7595J80691K08662
9386G276J61294l17192k18772L81125l39855J39172j2309L64643N5245m15264
9376a94637L20923j86109K7793K35322K36745J69243m14888m81968k53765N81846
9366D0505J01947m6034l08898j4554N54549P4487j74430M22298k54821k32727
9356A62322p2840l89579J9220N26080K26470l49748k55641J30915j2943J10804
9346I5060n22292K17047K90945n67255r7698k39846P92370J87228k29720j60453
9336b34614O07725J00419m90291J35219K73727l36977j6285L79094k08940m00155
9326a91078n4020N3266k14445J33183j99183J68128L08646k88269J2669J59533
$$ y = [-371650, -1076001, -644333, -308829, -95025, -126174, -278386, -354482, -382077, -201386, 7276, 168570, -148622, -367394, 13731, -326124, -186952, -199261, 165382, 220627, -194637, 126286, -59823, -32030, 203292, 440037, 609280, 194392, -287576, -541341, 40505, 142452, 96418, -212480, -227034, 327515, 402002, 227572, 649870, 395049, 162322, 89482, -300097, -280877, 245203, 471673, 121925, -133716, -2801, -15744, 95060, -427232, -210185, 80760, -486495, -584193, -824039, -31669, 155559, -74161, -234614, 373111, 473530, -16761, 118458, 392185, 55208, 38923, 418017, 209077, -191078, -245098, -191832, -406277, -273094, -472277, -304149, 4497, -283772, -271103, -111570]
9316a11570m37718J79837K80876j50294j94251M38286N19495p7429n30964L33001
9306B49269k2395q1329J71162l35589K1924q8535J51714J75878j15212J80316
9296C07203j67189j81177J36846J04885L92519k47103j31206p8892Q0924J37017
9286C53827o88035j50788M55090l16988N06547k991l25790J91707q4103k23970
9276b85494J7749M96283N9507J50754k31764n25652L61878K18573j87559R8463
9266A72738J1612l81489P1799K35678J687l93316J44055M95843J1609j86586p6655
9255A06975j543j99045m6493J58594L91759k03249k68596L2338k62728m1771j74963
9244e08722j7927M49898L59998j23416k48275k27631R7858M3599K29917L09873
$$ y = [-111570, -549288, -369451, -88575, -238869, -433120, 5166, 524661, 447232, -83732, 249269, 226874, 145545, 316707, -18882, 3042, -85493, 66221, 242099, 126887, 307203, 140014, -41163, 95683, 200568, 593087, 345984, 214778, 135886, 216810, 353827, -334208, -484996, -29906, -346894, 159653, 156662, -169128, 22579, -61524, -285494, -267745, 228538, 288045, 438799, 207035, -318617, 43261, 261834, 74275, 172738, 184350, -197139, -125340, 110338, 112025, -281291, -137236, 358607, 370216, 183630, 106975, 105432, -93613, -140106, 18488, 410247, 206998, -61598, -29260, -291988, -333759, -508722, -526649, -76751, 283247, 159831, -88444, -316075, -218217, -174618, 55299, 365172]
9234C65172R8891Q5173R5336L67505n22802k54837n23041O1014K95071m74490
9224d07008M96365J20187p8433m56445K80848J79269k91243K13216k79725M91849
9214B68880j76722O4819l1723q902P9145m32109j38958k6444K86298m39N04987
9203C88832q257j99559k16205J32088j37837j51064L0316L10744k47192L63622
9193B65488L6779k98731o0568R6060L90006k38436j33878k2853o63580K44513
9183c85200L06750l9738M26266J48538p1889R6211l05202l61017j15752N76714
9173B75681M3466m98242j58239O1533n1388L22572O77611J07230m60386j0817
9163C09021M90083m80372l46047m22818K58361N20454k03599j55385j21436L51994
$$ y = [365172, 464063, 549236, 644572, 1012077, 489275, 234438, -288603, -227589, 67482, -407008, 89357, 209544, 131111, -325334, -44486, 134783, -156460, 56756, -222969, 268880, 92158, 156977, 125254, 116352, 195497, -236612, -375570, -402014, -115716, -116155, 388832, 380575, 181016, -35189, 96899, -40938, -192002, -161686, 149058, -98134, 265488, 302267, 3536, -57032, 39028, 429034, 190598, 56720, 33867, -629713, -385200, -78450, -118188, 308078, 456616, 384727, 480938, 175736, -185281, -301033, 275681, 319147, -179095, -337334, -275801, -327189, -4617, 672994, 780224, 319838, 309021, 799104, 318732, -27315, -450133, -191772, 328682, 125083, -30302, -151738, 200256]
9153B00256R7732n0315J29990n72001L31074N15087j95047l24886j82880K47091
9143A96101R4152n24864O73806J95541n13942J7658L10551j91985J0987J70777
9133D38782r1745l89589J35260L2394K63364l94558p6737M00411m6086k94359
9123b2863j84055k41826J71592L57863J01432P131l0572L31648J04847m33791
9113A61406K04716m76174o9738J34659Q0591K04696M33891l06219m03146K45428
9103B10110k96957l25278M18818L15652j02767k56695o5993L8743L52876M39885
9093G28394p16070m23173N69720K28319j46028L50475l73241j91612L95170N9934
9083D81888l97144l17419M19429M93237p0187K8385k26438k23232J62184k30218
$$ y = [200256, 297988, 247673, 377663, -194338, 136736, 651823, 456776, 131890, -50990, 196101, 290253, -234611, 439195, 634736, 120794, 138452, 449003, 257018, 268005, 438782, 347037, -42552, 92708, 125102, 388466, -6092, -82829, 317582, 271496, -22863, -206918, -448744, -277152, 80711, 182143, 189274, 158702, 490350, 595197, 161406, 366122, -110052, -179790, -45131, 35460, 240156, 674047, 367828, -35318, 210110, -86847, -412125, 6693, 322345, 219578, -37117, -103110, -64367, 288509, 728394, 12324, -410849, 158871, 387190, 241162, 591637, 218396, 26784, 421954, 481888, 84744, -232675, 186754, 679991, 609804, 638189, 411751, 188519, 350703, 120485]
9073A20485m15402L38976L22266K22215o86610j86632J89220J41534O8388k54806
9063a40366r4388J55903J56333L16454j71247j82037r3604m487r4709j02339K93736
9052C9249R993j89869L38433O2144M5723o9588o24187j89711K00207J33119J36029
9041a08458j57822K81016m1034j00482M5367M53115j03879l57054K01400j57490
9031d5321J88439k19323j82698m9249L90718k3771M6074l20029J6510K8087K7219
9020a43344K34834K38005N41086n16848J48082R2274r271j45715j77950K15176
9010D76329j50742m94254M76847N2932j12544K32793k39645R8965m95145l14959
9000d69423O58532J25685j35187j2554K37170m72741j02160K69713j09857J69032
$$ y = [120485, -294917, 44059, 366325, 588540, -98070, -284702, -95482, 46052, 114440, -140366, -234754, -78851, 77482, 393936, 222689, 40652, -52952, -57439, -152148, -254487, 39249, 49242, -140627, 197806, 259950, 305673, 236085, -388102, -577813, -377606, -244487, -108458, -266280, 14736, -26298, -126780, -81413, 371702, 267823, -89231, 112169, -45321, 143118, -76205, -258903, -308152, 82566, 58795, 104869, -215160, -198650, -170563, -143344, 91490, 329495, 870581, 353733, 501815, 594089, 584818, 439103, 261153, 476329, 325587, -168667, 308180, 361112, 248568, 481361, 241716, 340681, -154464, -469423, 189109, 314794, 179607, 167053, 404223, -68518, -170678, 99035, -10822, 158210]
8990A58210m7903k84821L31244J47544k29179K03834k02444m95513L15990K07226
8980A04188J46877q4160j81617k75032L52728R1610j01234o56280M49341Q8813
8970f4766K84643J72481k7875J98180q52027L96862l9819J22176r7870R6810k4948
8959A63847K976l38281N4862K61728j44439J12415j1631R786L2099o40777j48949
8948f46364O62794K65233n94971L82125K74877o7619l71747J47435O18894m60325
8938B10332q203j21417J28930J71014n68035L0047k59523M14599J9069j77997
8928a61184r4166j14429N28286R3227j87223L39467m53041J47481m20218J4933
8918c06867M41587N4281J51370m31406L22450M55813k95664r7435k04282k50721
$$ y = [158210, 110307, -174514, 156730, 304274, 75095, 278929, 76485, -419028, -103038, 104188, 251065, 166905, -14712, -289744, 62984, 154594, 53360, -602920, -153579, -64766, 219877, 392358, 364483, 562663, -289364, 107498, 67679, 189855, 91985, 188795, 163847, 166823, -171458, -116596, 145132, 693, 113108, 101477, 111263, 143362, -497415, -646364, 16430, 281663, -313308, 68817, 343694, 276075, -95672, 51763, 670657, 210332, 202129, 80712, 209642, 380656, -187379, -157332, -416855, -2256, 16813, -161184, -255350, -369779, 158507, 251734, 64511, 403978, -49063, 98418, -321800, -306867, 134720, 189001, 340371, -91035, 231415, 687228, 391564, 294129, 89847, -160874]
8908a60874J9848l31018K07417L42226K79027j56674N9277L9702l6936r9769L8836
8897B01062M43295l85045K8735K00922r2630j6061l76948m05460K53500K15274
8887F6644k4611P133o4711j93815K5208O79708L2969j58091N1552K23520o0335
8876E85171l85098q2092L35704k1027K23582n4473l96390o3956j18284N92776
8866F15913q2059m25016j44934J56345K33031Q2403J31910l2678o7193l27469
8856A40253k08894j70170L808M4113M15117J60671l2829j37027J7955j49650n3113
8845C0234P7267j81865O6678Q0844L15474j57462j06165j72740r4099L74901o9274
8834A63793K67787n86690l2049J50940k8269m0126L90419l88069j97990M81143
$$ y = [-160874, -141026, -472044, -264627, 77599, 356626, 199952, 259229, 298931, 261995, 162226, 201062, 644357, 259312, 288047, 488969, 396339, 380278, 3330, -402130, -148630, 66644, 42033, 49166, -15545, -209360, -184152, 495556, 528525, 370434, 421986, 645506, 585171, 200073, 117981, 453685, 432658, 656240, 601767, 205377, 141421, 23137, 615913, 533854, 108838, -36096, 120249, 353280, 435683, 567593, 534915, 467722, 140253, -68641, -238811, -235003, -190890, 224227, 384898, 352069, 215042, 232997, 83347, 30234, 107501, -74364, -7686, 73158, 388632, 231170, 125005, -47735, -141834, 233067, 163793, 431580, -155110, -187159, -36219, -64488, -104614, 285805, -102264, -300254, 180889]
8824A80889j97621K27146r8895j49250J5360L82577p1861l6226M5525j8693J18942
8813C97893l77298J5215J09555K55960m70269p0186L60143n2709Q6562j56271
8803I8595j35004K45188J57523r3279K92099l93910L22542l5676m79497J37800
8793A16381K12230K34200n6679j26473k9946k04739L2217l055m61023R2164M93898
8782B99175l14015k19122K4644J75813J15177j51087k37691L25272N30973q1485
8772D67654n55630k11994R9648K18194N08027j11593j34558N44127j41615k71007
8762D11253J8389m6040N56310o4553n88038n63577J69071k1491J73821l0544L63890
8751C78491M14488n31614k84042J64619j08885N76426n4275p22345J67144L15774
$$ y = [180889, -16732, 210414, 111519, -37731, -22371, 360206, 288345, 252119, 297644, 278951, 397893, 20595, 35810, 145365, 401325, -68944, -139130, 221013, 168304, 254866, 98595, -36409, 208779, 366302, 273023, 565122, 171212, 493754, 458078, -21419, 116381, 328611, 562811, 506132, 379659, 349713, 144974, 177191, 174136, -286887, -194723, 299175, -14840, -233962, -209318, -33505, 81672, -69415, -307106, 18166, 549139, 467654, -87976, -299970, -200322, 17872, 525899, 414306, 279748, 823875, 682260, 411253, 429642, 383602, 939912, 875359, 287321, -276256, -107185, -128676, 45145, 14601, 378491, 792979, 261365, -22677, 141942, 33057, 609483, 555208, -167137, 7, 315781]
8741C15781L08132k04659j21207m83964l7528M12249L74548M0916j88820j94805
8731B20643l73138N9442J01255k27175l87516K5385R0790M90199p2129n3592K5539
8720a00297j05536j17250M3959n549K51639j15766J03983K80696m15543o6892
8710b46556L0930J59652j99693l4998M94431o086K4804m12285l32348M08574K18277
8699A04702O5674j99099R784J52453L4781m7877j11645J07429O13894l34271j93128
8688B02697j8551L87933P8882J21118j16617k06091J43438j45832l0748k72947
8678A43282k35318R3657p6246J24431j09087J80291J85807J38887L6657l44983
8668A37378k71147M66938M37979K47332n30282l30419J57820n9796l39997J21652
$$ y = [315781, 623913, 419254, 298047, -185917, -223445, 188804, 563352, 604268, 415448, 220643, -152495, -93053, 8202, -218973, -606489, -581104, -490314, -115, -72244, -125836, -100297, -205833, -323083, -279124, -284673, -33034, -148800, -44817, 235879, -179664, -246556, -215626, -55974, -255667, -290665, 203766, 197680, 222484, -189801, -522149, -113575, 104702, 170376, -28723, -18939, 133514, 168295, 120418, 8773, 116202, 730096, 395825, 202697, 184146, 572079, 650961, 772079, 655462, 449371, 592809, 446977, 416229, 143282, -92036, 1621, -74625, 49806, -59281, 121010, 306817, 445704, 482361, 137378, -133769, 333169, 771148, 1018480, 488198, 157779, 315599, 255803, -84194, 37458]
8658C7458n3763J28287J70646m70821J96496K84810k20397R6319K16607m30976
8648d5334O0402K41440K26016k20456r7966K8610m034M4832J72241k78906J07374
8637B34219J78285M00211l0493k77760r5964k92603L50836l1061N8466J42324
8627F36460r924l50171K22005l15099j19350K75077M44199L26597p35386J61410
8617E35818J18817j41038l33059L28629L11512k02979k54621l16511K34118M44827
8607G25513j95805l02l97388k7930M11279l72363p4732M04928J25084j15712J75649
8596F58221K1288m47188J76419n89799P57315M62599r3211j0381n15572L05034
8586G24725J19561l49223j36716K54369j71654M27725n20996M39319m378j46464
$$ y = [37458, -16305, 111982, 282628, -188193, 8303, 293113, 72716, 169035, 385642, -45334, 15068, 256508, 482524, 262068, 164102, 192712, 188678, 233510, 405751, 126845, 234219, 412504, 812715, 782222, 504462, 408498, 115895, 466731, 435670, 494136, 636460, 626536, 276365, 498370, 183271, 63921, 338998, 783197, 1109794, 374408, 535818, 654635, 513597, 180538, 509167, 820679, 617700, 363079, 46568, 280686, 725513, 529708, 529406, 132018, 104088, 515367, 143004, 68272, 473200, 598284, 482572, 658221, 679509, 232321, 408740, -181059, 576256, 1038855, 945644, 935263, 419691, 724725, 844286, 495063, 358347, 612716, 441062, 868787, 347791, 787110, 782732, 636268]
8576F36268l4661N6236K1627L87657k35868M82986l7938k27558k1014o02479J39523
8565E64779J79227k93991k71794Q15428k66443p6695N2848m1450p2392q0790n5989
8554D52738O0257l23605Q8538k77874N4459J21251J66591N04963j48114O8969
8544G68173k7183J6421j52979K51436O43761p37204k17828J94129J75412l34004
8534E80134K03104l49778m1815K17081j75506L27501o3476J56850l74355j96660
8524B83080M47724k44363j37539k25799J63312r9051j95019O89640J67785Q9859
8514I39629J2261o79585M30382N75878n6120J46257k69280q4999j03498k08948
8504G01977j32265Q3257N17533j7037k47682k11387M90886n06114K15405J86893
$$ y = [636268, 601607, 657843, 679470, 1067127, 831259, 1314245, 1276307, 1048749, 1027735, 425256, 564779, 744006, 450015, 178221, 993649, 727206, 650511, 703359, 661909, 589517, 508727, 452738, 512995, 189390, 277928, 54, 54513, 175764, 342355, 847318, 699204, 768173, 740990, 757411, 604432, 855868, 1499629, 762425, 544597, 738726, 914138, 580134, 783238, 433460, 391645, 608726, 433220, 760721, 697245, 854095, 479740, 283080, 730804, 486441, 348902, 123103, 286415, 187364, -7655, 681985, 849770, 939629, 951890, 272305, 702687, 1278565, 1222445, 1368702, 1099422, 1014423, 910925, 701977, 569712, 652969, 1170502, 1153465, 905783, 694396, 1185282, 679168, 894573, 1081466]
8494A081466j30005L45613n17548L71357K8694l60014j80824K55436J76233q2657
8484I87751m97020J37806J36006l31265K88521k3519L3710K19353k2392k29669
8474F99282P0677j42825j86289J61085M3543L43424o88037M5418L94846Q9355
8464H30479n21129Q5511L93116K37447k87801K50508L19308m13408l12952p5520
8454E05559M290J93039k62820p4362M95126J75275n89822K8899J91617J84709
8444H51510K42047J64979l65796j9669L48880L83972m46867n52641K72016M44499
8434A322930k63748J4255j680J38092K33147m13591J09506J59763J6388m03053
8424I12009L56836J7609Q8439J92783k40140k18409L07608n87512k3281K64798
$$ y = [1081466, 951461, 1297074, 779526, 1150883, 1179577, 819563, 638739, 894175, 1070408, 987751, 490731, 628537, 764543, 433278, 721799, 698280, 731990, 951343, 928951, 699282, 769959, 627134, 440845, 601930, 645473, 988897, 300860, 346278, 741124, 830479, 309350, 394861, 787977, 1025424, 737623, 988131, 1307439, 894031, 581079, 505559, 509849, 702888, 440068, 365706, 860832, 1036107, 446285, 475184, 666801, 851510, 1093557, 1258536, 892740, 873071, 1221951, 1605923, 1159056, 606415, 878431, 1322930, 1059182, 1073437, 1071757, 1209849, 1442996, 1029405, 1138911, 1298674, 1315062, 912009, 1268845, 1286454, 1374893, 1567676, 1327536, 1109127, 1416735, 829223, 805942, 1070740]
8414A070740j89403Q9613M86915k97096m71208J89138M46527k3110j69401m8593
8404A084122J32281M69541o13575L45192M55906q0475k23702k3766M11407j9155
8394A937776L3193l06800j7544K48469l35119k60973K33928j82098l02014K17569
8384A266387N70838N3299k94658j53303L1882p6212q0081J79865K77560L04157
8374B079734J26448K23694J30102o89637k15855K74858j80680R1633L82594Q459
8364B231350L10994N8148j02669L84383k89011o9670K2869k89188Q0434M25755
8354B763395k75296j42587l2152L95315l11418j83446N13961j70803N35982j017
8344C091934j43993J62850L27235r6916p5987k96481O99222Q6916J00445N90041
$$ y = [1070740, 881337, 970950, 1457865, 1160769, 689561, 878699, 1325226, 1302116, 1132715, 1084122, 1216403, 1685944, 1072369, 1417561, 1873467, 1792992, 1569290, 1545524, 1956931, 1937776, 1970969, 1664169, 1646625, 1895094, 1559975, 1299002, 1532930, 1350832, 1048818, 1266387, 1837225, 1890524, 1595866, 1442563, 1474445, 1398233, 1318152, 1498017, 1775577, 2079734, 2206182, 2429876, 2559978, 1870341, 1654486, 1929344, 1748664, 1840297, 2222891, 2231350, 2542344, 2600492, 2497823, 2882206, 2593195, 2523525, 2546394, 2257206, 2337640, 2763395, 2488099, 2345512, 2313360, 2708675, 2397257, 2213811, 2727772, 2556969, 3092951, 3091934, 2947941, 3110791, 3438026, 3341110, 3265123, 2968642, 3667864, 3754780, 3855225, 4445266]
8334D445266R6226p19612K32561L69740K89906j20632l8670L22055j36270M13962
8324E154532n83505N2550m82261N71211L8221J97728L63150n6248n83957j24495
8314D546926O07957k40531Q43394M27372k90190o4645j16817N86088N27338j91408
8304F635484L65406N08507M34017K05066k3640P2258K07543M49316J23942N00579
8294I478478N69279M70845K90290J98759L71580N81948N03698O16184J549030
8285A4630091N48125J361403J626399J457689J537793K062896J139595J218705
8277B5582696J277233P94608M9750k83041m64122r36145j680535j770857q90798
8268B1678789j314628j152232j154059r93630o80139l80888m45230k77012k38251
$$ y = [4445266, 4541492, 3821880, 4054441, 4424181, 4714087, 4593455, 4554785, 4876840, 4740570, 5154532, 4571027, 4623577, 4141316, 4712527, 4750748, 4948476, 5311626, 5255378, 4671421, 4546926, 5154883, 4914352, 5757746, 6185118, 5894928, 5830283, 5713466, 6299554, 6826892, 6635484, 7000890, 7509397, 7943414, 8148480, 8124840, 8197098, 8404641, 8853957, 8977899, 9478478, 10047757, 10518602, 10808892, 11007651, 11379231, 11961179, 12464877, 13081061, 14630091, 15178216, 16539619, 18166018, 19623707, 21161500, 23224396, 24363991, 25582696, 26859929, 27654537, 27704287, 27421246, 26957124, 26020979, 24340444, 22569587, 21678789, 20364161, 19211929, 18057870, 17064240, 16384101, 16003213, 15557983, 15280971, 15042720]
8259A5042720k96909l80759K42006L1880M77595K46684J35487L96375N63690O82641
8249A7141410Q02445O04677J172930J487426J079283J512358J598982K385232
8241B7784743K342705K009653K344405K403360K365150K571641K678323K601436
8233D7101416P50973l93060L94944J500409J406949J678j452140l204457l349847
8224D2756865k765083k242705j258926p48570k91775k64879m05820l44927k88252
8215C4145928L61633M00734R46380N91834O38342J220936J770644J325945K016555
8206D3418931K550095K487766J510356K012858Q23260J088820J236057J067899
8198E6196042J144480K59745q72565r55092j798082l89302n873514q489442k976547
$$ y = [15042720, 14745811, 14365052, 14607058, 14638938, 15116533, 15363217, 15498704, 15895079, 16458769, 17141410, 17943855, 18548532, 19721462, 21208888, 22288171, 23800529, 25399511, 27784743, 30127448, 32137101, 34481506, 36884866, 39250016, 41821657, 44499980, 47101416, 47852389, 47459329, 47854273, 49354682, 50761631, 50763309, 49311169, 46106712, 42756865, 39991782, 37749077, 36490151, 35741581, 35449806, 35184927, 34779107, 34434180, 34145928, 34507561, 34908295, 35854675, 36446509, 37084851, 38305787, 40076431, 41402376, 43418931, 45969026, 48456792, 49967148, 51980006, 52803266, 53892086, 55128143, 56196042, 57340522, 57600267, 56727702, 55772610, 53974528, 53585226, 47711712, 39222270, 36245723]
8189C6245723l877113j997068j696225o59090j301697m07998o32277o90102n37279
8180B4446874n85475j83413p87988j159869l35676r02202q50627p95699p51425
8171A8094500p92876r86376m62137l70517r98419o85140n49837k65817j27041
8162A2856340q58576R6285L2578J79480n88163k96550K81112K24705l50430j10943
8152A1465838Q9458J82458L30366M76903R9860R974M71426O0233m51528j68729
8142A2566259K24503N75995m49688p80569k00159P1288r5591p20867l54622l17268
8132A0519281q40218O6491o5510P62045j61859o23045O2445j39530L58600K12076
8122A0150776J51513J97176M41254n4478L18676N45887k78846j61709j59017n34756
$$ y = [36245723, 32368610, 30371542, 28675317, 28016227, 26714530, 26306532, 25674255, 24984153, 24446874, 23861399, 23677986, 22889998, 21730129, 21394453, 20492251, 19641624, 18845925, 18094500, 17301624, 16315248, 15853111, 15482594, 14484175, 13799035, 13249198, 12983381, 12856340, 11997764, 12094049, 12126627, 12306107, 11717944, 11421394, 11702506, 11927211, 11576781, 11465838, 11555296, 11737754, 12068120, 12545023, 12644883, 12654857, 13126283, 13186516, 12734988, 12566259, 12790762, 13366757, 12917069, 12136500, 11936341, 12007629, 11912038, 11191171, 10836549, 10519281, 9679063, 9745554, 9680044, 10442089, 10280230, 9657185, 9719630, 9580100, 9938700, 10150776, 10302289, 10499465, 10940719, 10886241, 11204917, 11750804, 11471958, 11310249, 11151232, 10616476]
8112A0616476n96109l00298J17330k81278k27468n9091m70647J00948J40286m88902
8102H551247L16138J52531P1903j59883j51613O60352K30141j63164M89596j61946
8092I835302k16419N2073j79855m37038Q84798K00760l44273L68724J31043o2142
8082A0232973M26682J44734k04619J96636M49384K71852K51532J10867J18863
8073A1998904K21412q8343J8948M76745K48821J49007L82172M56583j3611M43833
8063A4294471K69028M75855N06340m8233J058009L54017K26582J3061N18566M97184
8053A8164880N51358R94998P29313O64207J082901J333101P06943J182598J333619
8044B6743918J370260J652863K251827K638733L181993L385008L089200L104070
$$ y = [10616476, 10020367, 9720069, 9837399, 9556121, 9328653, 9269562, 8798915, 8899863, 9040149, 8551247, 8867385, 9019916, 9091819, 8931936, 8780323, 9440675, 9670816, 9507652, 9997248, 9835302, 9618883, 9670956, 9491101, 9054063, 9938861, 10139621, 9795348, 10164072, 10295115, 10232973, 10659655, 10804389, 10599770, 10796406, 11245790, 11517642, 11769174, 11880041, 11998904, 12220316, 12131973, 12150921, 12627666, 12876487, 13025494, 13407666, 13864249, 13850638, 14294471, 14563499, 15039354, 15545694, 15497461, 16555470, 16909487, 17136069, 17149130, 17667696, 18164880, 18716238, 19711236, 20440549, 21104756, 22187657, 23520758, 24227701, 25410299, 26743918, 28114178, 29767041, 32018868, 34657601, 37839594, 41224602, 44313802, 47417872]
8036D7417872L451717M888418M897675K643105J107047R82336K349923L256536
8028G0994629K406520m2406k520305m245533m123713l201769j540648m31346O60146
8019E7955575J55291K12965Q48567J306167J375924K531005L996757M752110O734136
8010G9868497O572470P886909Q011553R847497J1662307R574950N482226M326271
8002A43232680N327095P335701Q553535O392404P57520o296256r516931r327167
7994A46458581q093501o831177r118328j0238139q925141q187504o518055m678900
7986H3867836k771060j722110m43397K54924Q21509J788235K729702M073117O029437
7977I4628193O692046O197333N950384M838677M287125M075595O709970Q602193
$$ y = [47417872, 50869589, 55758007, 60655682, 63298787, 64405834, 65388170, 67738093, 70994629, 73401149, 73358743, 70838438, 66592905, 62469192, 59267423, 57726775, 57295429, 57955575, 58110866, 58323831, 59172398, 60478565, 61854489, 64385494, 68382251, 73134361, 79868497, 86440967, 94327876, 102339429, 112186926, 123849233, 133424183, 138906409, 143232680, 148559775, 155895476, 164449011, 170841415, 171598935, 165302679, 155785748, 146458581, 138365080, 131533903, 122415575, 112177436, 103252295, 95064791, 88546736, 83867836, 81096776, 79374666, 78931269, 79186193, 80007702, 81795937, 84525639, 88598756, 94628193, 101320239, 107517572, 113467956, 118306633, 122593758, 126669353, 133379323, 141981516]
7969A41981516M384455N25675p82620k385685n074029j0322252j3707499j3724620
7961A00894941j2439198j0202891o999426o276899m723935l745822l400618l293678
7953D9812474k970281k509327k974578k447360j704106j695857j779520j838357
7945C1893088r31664j311777p01547p35638p64654o40490q37785J29268m94905
7936B5603896o41246P2405L85654q30160n57385m36657Q8410k79834p32626p07999
7926B1964458p13073j175532m05861k8461n11619p83947k79508k44067m54596
7917A7367794l72911m18674j05747n00827m0219m6645j22712l90018K24652k15814
7907A5378879k06090L29520k62373M5455M49093M14581j00632j42975K68995k0564
$$ y = [141981516, 146365971, 146891646, 146109026, 143723341, 138649312, 128327060, 114619561, 100894941, 88455743, 78252852, 71253426, 64976527, 60252592, 56506770, 53106152, 49812474, 46842193, 44332866, 41358288, 38910928, 37206822, 35510965, 33731445, 31893088, 30961424, 29649647, 28948100, 28212462, 27447808, 26807318, 25969533, 26098801, 25603896, 24962650, 25035055, 25420709, 24590549, 24033164, 23596507, 23684917, 23405083, 22672457, 21964458, 21251385, 20075853, 19669992, 19641531, 19129912, 18345965, 18066457, 17822390, 17367794, 16994883, 16576209, 16470462, 15969635, 15929416, 15882771, 15760059, 15370041, 15594693, 15378879, 15172789, 15502309, 15239936, 15285391, 15734484, 16149065, 16048433, 15905458, 16174453, 16153889]
7897A6153889J13785J63534j48028R1510Q3260J65312K20611M4219K5987J98165
7887A7112244L23570k28763o2282N46190R4439P5998k52117L06264K65105N36149
7877A8716797R08459M8275j00945P04740J159306L77824L73463N35738J148063
7868B3871720J205486L95659J120783N88338O2136P51547J60896l98251R57359
7859B8715673L62907L90704J05626L31195Q03145Q53855k76592L50885J345618
7850C2983016N91342J083978J596073J207667J391716J172127J162134K107157
7842D3295210K175713J312127K433705K356878K090969K835243K948084L281470
7834F2729399M026019M209543M431038M711490M654145N354834N231856O453336
$$ y = [16153889, 16267674, 16431208, 16283180, 16374690, 16457950, 16623262, 16843873, 16888092, 16914079, 17112244, 17435814, 17207051, 17144769, 17690959, 17785398, 17861396, 17609279, 17915543, 18180648, 18716797, 19625256, 19673531, 19572586, 20277326, 21436632, 21814456, 22187919, 22723657, 23871720, 25077206, 25472865, 26593648, 27181986, 27244122, 27995669, 28156565, 27758314, 28715673, 29078580, 29469284, 29574910, 29906105, 30709250, 31563105, 31286513, 31637398, 32983016, 33574358, 34658336, 36254409, 37462076, 38853792, 40025919, 41188053, 43295210, 45470923, 46783050, 49216755, 51573633, 53664602, 56499845, 59447929, 62729399, 66755418, 70964961, 75395999, 80107489, 84761634, 90116468, 95348324, 101801660]
7826A01801660P448232Q786126Q128453O642339M994725K850093R47972k342268
7818A39257332k790504k348379k479335m28498K16253q33561k609470m054257
7810A23929581k586723j525682k08690J092743K228213K150512K401788L641242
7802A31122984M122982N302193N710310O570778Q812642J1020551J3690778J5010767
7794B01363985J6548452J4246466J1483005Q934164L543957l343576o260345m493633
7786B42022475k580705l63081k219116p535335j1191064j2315088j1096750r251094
7778A85470242q033724p651691p527546o163202m777714l268506k868421k268612
7770A42910826j913973j409736k18409K460057L154331M492561L390797L889422
$$ y = [101801660, 109249892, 118036018, 126164471, 132806810, 137801535, 140651628, 141599600, 139257332, 136466828, 134118449, 131639114, 131210616, 131426869, 130593308, 127983838, 123929581, 121342858, 119817176, 119608486, 120701229, 122929442, 125079954, 127481742, 131122984, 135245966, 140548159, 146258469, 152829247, 161641889, 172662440, 186353218, 201363985, 217912437, 232158903, 243641908, 252576072, 256120029, 252776453, 246516108, 242022475, 239441770, 239078689, 236859573, 229324238, 218133174, 205818086, 194721336, 185470242, 177436518, 169784827, 162257281, 156094079, 151316365, 148047859, 145179438, 142910826, 140996853, 139587117, 139368708, 141828765, 144983096, 149475657, 152866454, 156755876]
7762A56755876N116101O833830P087276O741384M438707k489138o872440r594883
7754A68016713r596334p606561n285636m469114n706757n785850p456653p868092
7746A14241716p187490o548841n041314m532013l246048k940184l749113k854089
7738G8142624k775711j389712j670889j719254j718256j360316j338872l65127
7730F5804487r70624o88935n84413l42128l65824J01942k88214n855l48756k4437
7720F2287243M28868N96545Q2719J068771O40211K60150L71909M47237J315126
7711F7498779J522026J564991K014824K593722K702480L885851M363915N022975
7703I1169563O595469P880361Q670734R396847J2605132J4613273J7914857K0687292
$$ y = [156755876, 161871977, 168705807, 175793083, 182534467, 186973174, 184484036, 177611596, 168016713, 158420379, 150813818, 145528182, 141059068, 135352311, 129566461, 122109808, 114241716, 107054226, 100505385, 95464071, 90932058, 87686010, 84745826, 80996713, 78142624, 75366913, 73977201, 72306312, 70587058, 68868802, 67508486, 66169614, 65804487, 64833863, 64144928, 63560515, 63218387, 62852563, 62954505, 62666291, 62660436, 62311680, 62287243, 62716111, 63312656, 63395375, 64464146, 65104357, 65364507, 65736416, 66183653, 67498779, 69020805, 70585796, 72600620, 75194342, 77896822, 81782673, 86146588, 91169563, 97765032, 105645393, 114316127, 123712974, 136318106, 150931379, 168846236, 189533528]
7695A89533528K4690948L2388327M1722551M8279862P2159365N3133036m0036056
7688D21871561o3857192n9473864n5223864l7788949k5706886j7926302j4855610
7681A47038894j1725486r880971p689096n400835k953467k806374k617081j388452
7673A02577132r88905J27650J257401K54099j218675m15048n49257j422219r44831
7664I8677347j328753n7677K043266L048240K561488J397034o16351l399154n979878
7655I6345562o296266n405865l425851k132422l29953J207721Q51927p01508q73804
7646G9239541l71167O71904K065576K158423J881580K023815P58618j401616m252954
7637H2773720m049890l682081k209133j270875j261388j416747k013283j569646
$$ y = [189533528, 214224476, 246612803, 288335354, 336615216, 408774581, 461907617, 421871561, 358014369, 298540505, 243316641, 205527692, 179820806, 161894504, 147038894, 135313408, 125432437, 117743341, 112342506, 109389039, 106582665, 103965584, 102577132, 101588227, 101715877, 102973278, 103227377, 102008702, 101593654, 101044397, 99622178, 98677347, 97348594, 97290917, 99334183, 102382423, 104943911, 106340945, 105724594, 102325440, 96345562, 90049296, 84643431, 81217580, 79085158, 78755205, 79962926, 80814853, 80113345, 79239541, 78868374, 79540278, 81605854, 83764277, 85645857, 87669672, 88428290, 87026674, 82773720, 78723830, 75041749, 72832616, 71561741, 70300353, 68883606, 66870323, 65300677]
7629F5300677j223313j772862k629061k006807j652014j245386j542940j925248
7621E1303046o66978l31530n0761L54005O19400R14174P16417O6032M87359R51843
7611E4363007J495613L73626l84476j604608k732856l331687l484857l584480
7603D1109282k539273k277384j448994j780211k004996j152413k209757j400299
7595B6295955p28100p03736q04807q83855n00065n17228j29062K18148k67136
7586B1980114p75112N478L67418M95533K6923m96987o81812O15038m65346j109176
7576A9962071j129829j065360n77984r75728q99092r43785j029254p11993j16680
7567A2512366k00657q09679o38701r98580p35763k54443j43983M45745o6894n63438
$$ y = [65300677, 64077364, 62304502, 59675441, 57668634, 56016620, 54771234, 53228294, 51303046, 50636068, 50304538, 50253777, 50607782, 51227182, 52141356, 52857773, 52923805, 53411164, 54363007, 55858620, 56232246, 55847770, 54243162, 51510306, 48178619, 44693762, 41109282, 38570009, 36292625, 34843631, 33063420, 31058424, 29906011, 27696254, 26295955, 25567855, 24864119, 24059312, 23175457, 22675392, 22158164, 22029102, 22247250, 21980114, 21205002, 21210480, 21577898, 22073431, 22100354, 21603367, 20921555, 21536593, 21071247, 19962071, 18832242, 17766882, 17188898, 16213170, 15314078, 14370293, 13341039, 12629046, 12512366, 12311709, 11502030, 10863329, 9864749, 9128986, 8874543, 8730560, 9176305, 9109411, 8545973]
7557H545973p81474j60172j06793l01291K03967m7473o15333m61668r5784M83400
7547F663352J36058o33718n13976l33170j83651k83384o2657K82958K41333k47335
7537E065810l36286K98276k61104l61557K01374J51924j36152m63593j46870J44612
7527D156434M4145k63551o8901m8927n36227j42180K99564r4564J53034k84228
7517C214599n04609K66116Q3244J03140R2908r6039k4168k18497m55189J1463
7507B472968J99513J73901k64964O3938l6712q4003R1831P4428m21020K54274
7497B524154o9214j09706P16181k00880r6469j32410J75345K10557j38726J37050
7487C015882k35127m95971K88464K46257l31833l01543k83885K19587P0076r2140
$$ y = [8545973, 7764499, 7604327, 7497534, 7196243, 7400210, 7352737, 6737404, 6275736, 6179952, 6663352, 6799410, 6165692, 5651716, 5318546, 5134895, 4851511, 4788854, 5071812, 5313145, 5065810, 4729524, 5027800, 4766696, 4405139, 4606513, 4758437, 4622285, 4158692, 4011822, 4156434, 4200579, 3937028, 3868127, 3819200, 3282973, 3140793, 3440357, 3345793, 3498827, 3214599, 2709990, 2976106, 3059350, 3162490, 3255398, 3159359, 3135191, 2916694, 2461505, 2472968, 2672481, 2846382, 2581418, 2645356, 2608644, 2524641, 2616472, 2690900, 2269880, 2524154, 2454940, 2345234, 3061415, 2860535, 2764066, 2631656, 2807001, 3017558, 2878832, 3015882, 2780755, 2284784, 2573248, 2819505, 2487672, 2186129, 1902244, 2121831, 2191907, 2099767]
7477B099767l33162M28707q1272m30734O3292o9389J08870l73702O9021K61604
7467A743002L04585N33425L2751k01768o03352N59181J99958k15890J19042r0705
7457B380229J17568Q2562k32844l68191N6978J55124J67042p925n17768j134m37620
7446A394021N8234M7233L01785k03077K20579m43365o0538L15360J06128k17627
7436A518733J59610q0594r4285N16258k16739J99472p87300J0078J87054L15955
7426A728242k49549P3817p4502k34774L50608k62009j43926L3502l89650J28263
7416I60022r9357m9814n0777R1749n93r4945k17765L03568k03816n9821M15302
7405I93753k37123J18902k35338L00676n7660r7803j3891l87633L04203j38695
$$ y = [2099767, 1766605, 2195312, 2114040, 1683306, 1746598, 1677209, 1786079, 1412377, 1481398, 1743002, 2047587, 2581012, 2613763, 2411995, 1808643, 2367824, 2567782, 2351892, 2470934, 2380229, 2497797, 2580359, 2347515, 1979324, 2036302, 2191426, 2358468, 2350543, 1832775, 1831641, 1394021, 1452255, 1499488, 1801273, 1598196, 1818775, 1375410, 1314872, 1630232, 1736360, 1518733, 1678343, 1597749, 1503464, 2019722, 1802983, 2002455, 1215155, 1225233, 1412287, 1728242, 1478693, 1552510, 1478008, 1243234, 1593842, 1331833, 1187907, 1221409, 831759, 960022, 860665, 810851, 760074, 851823, 851230, 756285, 538520, 842088, 638272, 578451, 993753, 756630, 875532, 640194, 940870, 883210, 785407, 771516, 383883, 688086, 549391]
7395E49391J91008j59403K06749m81231N15975k09081n61576L86297p1423l0618
7385C36088j9458L8498l81872L22032J70616L70l30524j2657J28198N5667J59011
7374D65969J07315k4251j70563R9691L18195o34999m5917J23346k25416J57935
7364A71305J03420j7041o05567M20738J61488N5791J17528k8229q3154J01709
7354C97988K7429j10625p4161K14208Q1034r1017n5732M51855r8559l21812j69686
7343B50922J02845L99432k84640J87723l98371K63510k98974K25135L18922j21854
7333F44650l66313j26605K86268N2421k24100k43126K55363J81324K29964J17947
7323H07793o2694J17604J31200r9575j08405k70558p4884l05725l88871M30179
$$ y = [549391, 740399, 580996, 787745, 306514, 822489, 613408, 51832, 438129, 366706, 336088, 316630, 355128, -26744, 295288, 465904, 466274, 135750, 123093, 251291, 306958, 465969, 573284, 549033, 378470, 478161, 796356, 161357, 115440, 238786, 13370, 171305, 274725, 257684, -347883, 72855, 234343, 290134, 407662, 379433, 296279, 397988, 425417, 314792, 240631, 454839, 535873, 444856, 389124, 840979, 742420, 420608, 250922, 353767, 753199, 468559, 656282, 257911, 521421, 222447, 447582, 766504, 644650, 278337, 151732, 438000, 490421, 266321, 23195, 278558, 459882, 689846, 807793, 745099, 862703, 993903, 894328, 785923, 515365, 440481, 134756, -254115, 176064]
7313A76064O7892j68853N73506j30524l64953o27878L51856J70158Q1710J54292
7303B83270l74769J35089K71990j57697l28870O0088N72391J6288k51001J66127
7293C92906m44513k46815l8741L15543J26190M04586p1095k25543r7514K62543
7283C77547K65096n51527n7270K83744J49826J42396k92923R7886k66849l68369
7273b20443p6550N06829P5065k86901K15788J86959N43433k06895J04335M02281
7263A243901j6646l65718O20229O45401k42769l44851Q0293O9297p31927j48581
7253H08629k08093j67776p7808K31072j74794K97060j16001m24201M7923M79720
7243F95731J29014P2209l55309l91505p1050j99607L25912n6624J4249l13017
$$ y = [176064, 243956, 75103, 648609, 518085, 153132, -474746, -122890, 47268, 128978, 283270, -91499, 43590, 315580, 157883, -170987, -110899, 461492, 477780, 226779, 392906, -51607, -298422, -337163, -21620, 104570, 509156, 438061, 212518, 115004, 377547, 642643, 91116, 33846, 317590, 467416, 609812, 316889, 414775, 147926, -220443, -296993, 209836, 284901, -2000, 213788, 400747, 944180, 737285, 841620, 1243901, 1227255, 861537, 1481766, 2127167, 1884398, 1539547, 1619840, 1689137, 957210, 808629, 600536, 432760, 354952, 586024, 411230, 708290, 592289, 168088, 216011, 695731, 824745, 896954, 541645, 150140, 79090, -120517, 205395, 148771, 163020, -149997]
7233a49997K3241N29608J1612l9280K73937o30928q4396K38173K5553k20197l63260
7222c85934L96007L94513k62395N0782k81067J98700q6223K75355J27305M1067
7212D68110l32417n37559Q1194K50639j71052M29844j48664O8748R0107Q8636
7202B87586M96291r65817l94730K04881N21604J15617J58851L2013q18127k46781
7192f08612O43422k69238J04915m9533K7440l8556j36816L97839m07142l39590
7182f75871J4287L31297l58993R3807P006K82234k74951k72210K95854j17219
7172f74759J82033k2593N5291l4113M23187q5517j03568j467j72250J90328R0418
7161a53010j87530K36228P2036k24206J39513j67593j33928L88610q5145J06604
$$ y = [-149997, -126756, 402852, 414464, 375184, 649121, 18193, -66203, 171970, 197523, -22674, -385934, 10073, 404586, 142191, 192973, -88094, 110606, 24383, 299738, 427043, 468110, 135693, -401866, -320672, -70033, -241085, 188759, 40095, 108843, 198950, 287586, 783877, -181940, -576670, -371789, 149815, 265432, 424283, 456296, -361831, -608612, 34810, -234428, -129513, -179046, -151606, -190162, -326978, 70861, -336281, -675871, -661584, -330287, -689280, -595473, -588467, -306233, -581184, -853394, -557540, -674759, -492726, -515319, -460028, -494141, -70954, -156471, -260039, -261506, -433756, -243428, -153010, -340540, -104312, -32276, -256482, -116969, -284562, -418490, -29880, -115025, -8421]
7151h421o4845p509r5527K3991K01090k270o25563r5674J67388K49320N94641
7140C36621J6053m24994M08313n0612m00072k18375K4195L27655r5642O3405m68779
7129d82232j33965K01189Q5817k2506j95979L9004m3833J1696m8405j17634P06516
7118c32J83602n06118N02165l06526l1565o5872p2472p5362j94465L62070r7691
7107c02566K4924L23981m01496J45501J06293j36476J40605l56622L4898j54990
7097e75948J43826j49108n468O8251k49280L3746l4558n0535j70748J95347N04370
7086b90105M2961L03N336j27160k21567J51489L37470J35087J82715p24003J08338
7075c99136K25231J5888l59974j3967j7801n8002O95389j01593k13239q6338M84448
$$ y = [-8421, -73266, -80775, -176302, -152311, 48779, 46509, -579054, -674728, -507340, -258020, 336621, 352674, -72320, 335993, 285381, -114691, -333066, -308871, 18784, -76858, -13453, -482232, -616197, -415008, -329191, -351697, -547676, -508672, -552505, -540809, -589214, -706848, -332, 183270, -322848, 179317, -127209, -158774, -224646, -297118, -372480, -566945, -204875, -302566, -277642, 46339, -355157, -209656, -103363, -239839, -99234, -455856, -420958, -575948, -432122, -581230, -586698, -518447, -767727, -733981, -768539, -819074, -989822, -794475, -290105, -247144, -246841, -241505, -368665, -590232, -438743, -101273, 33814, 216529, -507474, -399136, -173905, -158017, -517991, -531958, -549759, -607761, 87628, -13965, -227204, -313542, 170906]
7064A70906j37420l18787k46788M58411L23329j68521k72786M82261l78249m75662
7054e63306K92140J3060j89976q6167Q07330l97839l22385O77537o48562K55472
7044a62696m7366m14073N5970M15791J70724n63889J94890j92952m8453N56122
7034c5932k23334J76767l18177J3084j07887K04671K5345l09812M7236J07258
7024d20781N78536j9415k54995l5439j91975L93920p3318j82810k26668K35823
7014a97122R5262K30369k41293K13395K05342j15592l06006j9397j66355K18263
7004h3134n8092k8537M71931k91589L5995j60166O09229j09575m36161L5028J65917
6993A50846N0079L18829m28198j50694j9940O3915k96994K04863J69570L4559
$$ y = [170906, 33486, -285301, -532089, -73678, 249651, 81130, -191656, 290605, -87644, -563306, -271166, -258106, -448082, -534249, 273081, -124758, -447143, 230394, -418168, -162696, -210062, -624135, -568165, -152374, 18350, -545539, -350649, -543601, -592054, -35932, -259266, -82499, -400676, -387592, -495479, -290808, -265463, -575275, -528039, -420781, 157755, 138340, -116655, -152094, -344069, 49851, -23467, -206277, -432945, -197122, -101860, 128509, -112784, 100611, 305953, 190361, -115645, -135042, -301397, -83134, -141226, -169763, 302168, 10579, 46574, -113592, 495637, 386062, -50099, -15071, 150846, 200925, 519754, 91556, -59138, -79078, -15163, -312157, -107294, 62276, 96835]
6983I6835q7466j76885n09556M35072n4200M45292M40935l01971l98808K10883
6973A00131L7962m75434k988k5615l48572J34523K40056K63255K64172j01066
6963H6424k46801j52251q2831n7774o3392j9635N45675k74103M4614j4059m61732
6952f95865j209M98808J99948o90926J84027p6573M03520k45714J55424j57729
6942d26289l629J6953j34339Q9673j09053j85404k8549L21832K02134l59909k3466
6931f40046N61924K17271j26140k86600L6988m73665J06034q3383O20076K41430
6921A73889K4929j79726l4983k28762j12194K92614k10098O85580j69749l43057
6911a01557m24375K72750K49945P550p5996O6431L31073l36147l48875J61649
$$ y = [96835, 9369, -167516, -677072, -242000, -296200, 149092, 590027, 288056, -110752, 100131, 138093, -337341, -340329, -365944, -714516, -579993, -339937, -76682, 187490, 86424, -160377, -312628, -395459, -453233, -516625, -536260, 9415, -264688, -220074, -234133, -695865, -697074, -198266, 1682, -689244, -505217, -581790, -178270, -423984, -268560, -426289, -429918, -412965, -547304, -457631, -566684, -752088, -780637, -458805, -256671, -616580, -640046, -78122, 139149, 13009, -273591, -236603, -710268, -604234, -687617, -67541, 173889, 198818, 19092, -15891, -244653, -356847, -64233, -274331, 411249, 241500, -101557, -525932, -253182, -3237, 4313, -71683, -5252, 325821, -10326, -359201, -197552]
6901a97552k70781J33239M7160n4482K27994n61245K91484j61963l01289p510
6891h54945M41972k70867L77087j77046N5728K80047K40369J87617R3326k45079
6881A28209o30468q9975J78370K73868k6823P9111n6829k59730L37821j12678
6871a79124j25646k35229q581M1651O05320J84519k37713r1582L5675k1637m05263
6860d37610R0576M44803j85261j55375R2871K07647j85123J45956J71710k80151
6850h9957k83539J33332N96691l36166j76167N82465n46016l32644m10796L3835
6840h28962L35135j99864J33163K27968N26927r1131l90751k79940J76597L0275
6830c60583j0636q4158k63999l13256J17651J14142M67585j69200L34172k7388
$$ y = [-197552, -468333, -335094, -287934, -342416, -114422, -675667, -384183, -546146, -847435, -854945, -412973, -683840, -306753, -483799, -428071, -148024, 92345, 279962, 373288, 128209, -502259, -592234, -413864, -139996, -166819, -87708, -144537, -404267, -66446, -179124, -304770, -539999, -548580, -506929, 98391, 282910, 45197, -46385, -10710, -32347, -437610, -347034, 97769, -87492, -242867, -149996, 57651, -127472, 18484, 190194, -89957, -373496, -240164, 356527, 20361, -155806, 426659, -119357, -452001, -862797, -828962, -493827, -693691, -560528, -332560, 194367, 103236, -287515, -567455, -390858, -360583, -371219, -455377, -719376, -1032632, -914981, -800839, -333254, -502454, -168282, -195670]
6820a95670m34348M0902L21576N85460m58085m14524L4933j35727N4475K7373
6810e73635K66939L03816k9227J65926m12770m2395J72226l59329K2296J43956
6800c42197j63878K7700j26446K24439K4785L5459K23789j77290k39629l17921
6790h31189K23154J77623k08039L90816k68241k83642N52906j41020L58338J45075
6780A15781l85813k85404J69456m4854J8796J07197Q1012j16785l57655J70891
6770e27378K10196J69759J31569l37548n1000J40214L68685K8523Q8909n34617
6760c12688J87756P2002n0897K04605l93383l51247J34160K16768j9900m06872
6750g19696O92833L09886k56990J44748k71013k39080J81104j06818m10168M87214
$$ y = [-195670, -630018, -589116, -267540, 317920, -140165, -554689, -519756, -655483, -601008, -573635, -306696, -2880, -32107, 133819, -278951, -321346, -149120, -508449, -486153, -342197, -506075, -478375, -604821, -380382, -355597, -320138, -96349, -273639, -513268, -831189, -608035, -430412, -638451, -247635, -515876, -799518, -246612, -387632, -29294, 115781, -270032, -555436, -385980, -430834, -412038, -304841, -223829, -340614, -698269, -527378, -317182, -147423, -15854, -353402, -404402, -264188, 104497, 133020, 221929, -312688, -124932, -52930, -103827, 100778, -292605, -643852, -509692, -292924, -312824, -719696, -26863, 283023, 26033, 170781, -100232, -339312, -158208, -265026, -675194, -187980]
6740a87980L47690j61510k34151l5202k43189l7141K06231J48111L72847K30814
6730D06520k73198k8836q6305j25491K50982k3554m25792j36643M4132J81312
6720b16873J12597P920J76117p3089l51701l8627j97015k96647L02786K59413
6710c15119r6131J68851k0120l63729K38086Q0401j39397K41348O8390k027j61325
6699c00772Q799K7349L05365k37940K73276j05558J60067n8600L92538k63072
6689B01452l66370N60352m4897n76214K08643L82328k09670M05725m30207n51031
6679d19889L10091J46914m75602o5451j7225j35343n9168L13088j36662J84235
6669c55012R4248K8338J85391K41676n03745k06544K20827r542J33956R1009l12161
$$ y = [-187980, 159710, -1800, -235951, -271153, -514342, -551483, -345252, -197141, 175706, 406520, 133322, 104486, 18181, -107310, 143672, 120118, -305674, -442317, -398185, -216873, -104276, -96356, 79761, 6672, -345029, -383656, -580671, -877318, -574532, -315119, -411250, -242399, -262519, -626248, -388162, -307761, -447158, -205810, -137420, -139447, -300772, -291973, -264624, 40741, -197199, 76077, -29481, 130586, 71986, 464524, 201452, -164918, 395434, 350537, -225677, -17034, 365294, 155624, 561349, 131142, -419889, -109798, 37116, -438486, -503937, -521162, -656505, -715673, -402585, -539247, -355012, -260764, -232426, -47035, 194641, -309104, -515648, -294821, -304363, -170407, -79398, -391559]
6658c91559L37955K30356k13529l65387J0424M37559k85844L74146j61166J93131
6648A66086j80022m04125n7796Q0525N34006L22104l30794m52661K48277M0753
6638c3647l16685J7079L980L33483k64310l49599K95822j27709J53225O36139
6628C47778m26804k34443K82093l64738N19882k7778j76924j25204P4439m19746
6618e51445j31325M29384q3843J32781J50641J02290j52146M03097R4407r26551
6608e32710L21445J64463l38481K04409K39406P9203j26299m29372j02432L8972
6598d81396J49513K88390j1567K51213l65695K14838k27270j01670J2099K07065
6588f4480J19710J84277P8621P9531l75592M8525k86691M63300O7806l35729J60534
$$ y = [-391559, -53604, 176752, -36777, -402164, -391740, 45819, -240025, 134121, -27045, 166086, -13936, -418061, -475857, -395332, 138674, 460778, 129984, -322677, -74400, -33647, -350332, -333253, -329273, 4210, -260100, -609699, -313877, -441586, -288361, 347778, -79026, -313469, -31376, -396114, 123768, 95990, -80934, -206138, -131699, -551445, -682770, -253386, -337229, -204448, -53807, 48483, -103663, 299434, 393841, -532710, -211265, -46802, -385283, -180874, 58532, 137735, 11436, -417936, -520368, -481396, -331883, -43493, -55060, 196153, -169542, 45296, -181974, -283644, -271545, -64480, 55230, 239507, 318128, 397659, 22067, 70592, -216099, 247201, 315007, -20722, 139812]
6577A39812L568n513N750J15465j20260N9656L6451Q9101N3845q9339l38924m82867
6565e33255K91748j19892J044O1035J20861l0912J06747L97005k18220k42880
6555a66719M5720L40901k21700J82608k29031L63858n65266m1487J55353L70027
6545B34264P8885L4995j98530j85839j37745j81115K85325r8692k42583K54885
6535a56150N4588K30643p376n55501J5555q2860L06652J93817n03835j22180L34866
6524b91781l1504Q1403L7564j63882J56310j1268P4210m42347R9618J31997M62170
6513A02490O5467j1376k61203Q6743k9133j80902O0586l31635K75087J16306j95063
6502c02633K00307P0086l12349L2535p1589K52643J0887k47754R6995k007j61977
$$ y = [139812, 143380, 137867, 143617, 259082, 138822, 198478, 234929, 324030, 377875, 288536, -50388, -533255, -241507, -361399, -360355, -299320, -178459, -209371, -102624, 294381, 76161, -166719, -120999, 219902, -1798, 180810, -48221, 315637, -249629, -291116, -135763, 234264, 313149, 348144, 149614, -36225, -173970, -355085, -69760, -168452, -411035, -156150, -101562, 129081, 121705, -433796, -418241, -501101, -194449, -632, -504467, -626647, -291781, -323285, -241882, -204318, -368200, -211890, -223158, -148948, -591295, -491677, -359680, 102490, 167957, 156581, -104622, -17879, -47012, -227914, -167328, -498963, -223876, -107570, -302633, -102326, -32240, -344589, -312054, -383643, -131000, -120113, -367867, -270872, -272879, -434856]
6491d34856O67286q673m55616j17593j03414J59524K05459J85433K45580k59969
6481H3161l05941K7260L21180J41760l28980K27808K5524j23112p19830l79029
6471a030199M83163L65913J76261o5503j38671J01511p7775L1439j72071J08825
6461b17107j9763J99675j4659M6007K63940j63446K89659j52150l34722j7905
6451a20471J31368n63339m0792K46959J41094L519L0295l70435L39329J14535
6441h7938K19913l63720m8892r1165m48658N73514L51875l37706R216Q9781P5305
6430e8475o3096K80121m2994m71124L99244j18350n0973L70082l40203P4890l40925
6419c61803K2667L92048N73593J69932k55101J74944k01870n66541J47918j09768
$$ y = [-434856, 232430, 223757, -231859, -349452, -452866, -293342, -87883, 97550, 343130, 83161, -222780, -195520, 125660, 267420, -61560, 166248, 191772, 68660, -651170, -1030199, -547036, -181123, -4862, -70365, -209036, -107525, -185300, -153861, -325932, -217107, -236870, -37195, -51854, -5847, 258093, 94647, 384306, 232156, -102566, -120471, 10897, -552442, -593234, -346275, -205181, -201662, -171367, -541802, -202473, -87938, 131975, -231745, -280637, -371802, -820460, -246946, 104929, -232777, -223561, -133780, -58475, -121571, 158550, 115556, -355568, 43676, -74674, -125647, 244435, -95768, -20878, -361803, -339136, 52912, 626505, 796437, 541336, 716280, 514410, -52131, 95787, -13981]
6409a3981L8035K00721k78781m61272K26318J12901m99939L03240j0967j54581
6399e38306K70184p0651J25500J49113l6995L31327j89994J76203O1643k20132
6389E7892j26011J1954K48537l5574k91110k0325k37076L46071N99073k80329
6379B73102l72833j02208l70259J00090J005616M58052j054073p8892J27359Q9335
6369G5289j33946J09848j77013J23155k50040l12858M57073N79388n0424j71187
6359B49285j34622K68859m86449m05513N28311m0744j58520J64250l405o5344
6349h3892L32765J23983K07557n50699J48799n6883J54045j08815k88041L75369
6339B54188M13832J35383m6443o23140K02854J47859r0490k37126J90907J22744
$$ y = [-13981, 24054, 224775, -54006, -515278, -288960, -176059, -675998, -372758, -383725, -538306, -268122, -338773, -213273, -64160, -101155, 230172, 40178, 216381, 278024, 57892, -68119, -56165, 192372, 156798, -134312, -154637, -391713, -45642, 553431, 273102, -99731, -201939, -572198, -472108, 533508, 991560, -62513, -141405, -14046, 75289, -58657, 51191, -125822, -2667, -252707, -565565, -108492, 470896, 420472, 249285, 114663, 383522, -102927, -508440, 19871, -20873, -179393, -15143, -18548, -83892, 248873, 372856, 580413, 29714, 178513, 121630, 275675, 166860, -121181, 254188, 668020, 803403, 756960, 133820, 336674, 484533, 394043, 156917, 347824, 470568]
6329D70568n49176M8640J31362J19623J13891k29710L02792K83908n11060j63457
6319A7381J61886R8054J85431j95572l47485K61989K47666M48602j3407K45722
6309A110267J41022K774j61127l47709n3514m7785J78168K54328k61418O5106
6299H80112m33939J81070N63075l64043J74388k47908m78288N50561J61619M21827
6289A408474n1178l80648P3152L06094j00247j65403J17144J41036K0528J22539
6279A491491N30775j26301K22050l17508J83117k2080m74931J78934L8028M24312
6269B127887j92016k55227o5684K66233L95063M0745k21384R5748K90921r3923
6259B388363p4901J425j94249K62057O8333J07886K09383J87130j06648K60170
$$ y = [470568, -78608, -29968, 101394, 221017, 334908, 105198, 407990, 691898, 180838, 17381, 179267, 277321, 462752, 267180, -80305, 181684, 429350, 877952, 864545, 1110267, 1251289, 1254063, 1092936, 745227, 691713, 643928, 822096, 1076424, 815006, 880112, 446173, 627243, 1190318, 826275, 1000663, 752755, 274467, 825028, 986647, 1408474, 1357296, 976648, 1049800, 1355894, 1255647, 1090244, 1207388, 1348424, 1368952, 1491491, 2022266, 1895965, 2118015, 1800507, 1983624, 1961544, 1486613, 1665547, 1703575, 2127887, 1935871, 1680644, 1614960, 1881193, 2276256, 2317001, 2095617, 2191365, 2482286, 2388363, 2313462, 2314887, 2120638, 2382695, 2451028, 2558914, 2768297, 2955427, 2848779, 3108949]
6249C108949L67778k89183L09498O93040O26334j46054L51462R4575L4154J6551
6239E167104j54077L47404L50713K08604N04427M89885J81745O21968M64639K76866
6229H459278N40688P70513J319511J400735J497352J457117J473580K111671K469274
6220B1499719K737752L219021L672385M764556N940665P901319R464818J0628942
6212F9829177Q130485K928782l056535r241422j1590287j0629341q887606o268873
6204C1214380m440569l484305k438811k067058k262160j319798j195855j185368
6196A2820456r20157r34391q59195p38483j62819r36958j082654p4180J30487
6187G242106o85073l15282j41816l23709J04502j54542k76199l96705o41583j07734
$$ y = [3108949, 3476727, 3187544, 3497042, 4190082, 4816416, 4670362, 5021824, 5116399, 5150553, 5167104, 5013027, 5360431, 5711144, 5919748, 6424175, 6914060, 7095805, 7717773, 8182412, 8459278, 8999966, 9770479, 11089990, 12490725, 13988077, 15445194, 16918774, 19030445, 21499719, 24237471, 27456492, 31128877, 35893433, 41834098, 49735417, 59200235, 69829177, 77959662, 80888444, 77831909, 68590487, 57000200, 46370859, 37483253, 31214380, 26773811, 23289506, 20850695, 18783637, 16521477, 15201679, 14005824, 12820456, 11900299, 10965908, 10106713, 9368230, 9205411, 8268453, 7185799, 7111619, 7242106, 6557033, 6241751, 6099935, 5776226, 5880728, 5726186, 5449987, 5053282, 4411699, 4303965]
6177D303965l06096J48717K467k25422K21577K92773k12339P7064m42540m41084
6167C419082m2554l05586M82434m33497l83134j66126K45205n9214N9843K4529
6157B840982q2344k18185J55242J61964j00827n99149j15276L55547K02908j46173
6147B454689J28236N1197j70727l36760K28952M66615m05930R3392k6719N96611
6137C079556J79255k15987k89474j92006K17131M05975L21984N33703O17093R27190
6127E584420J69188j23602O95496Q74768j63064R905J21542k54708p62240n49858
6117E601847n0412j42940j289097l7056K43788Q1990J16196p32231m22564L8401
6107C407922j56841k21798L45602m09651J41119N41743j56377j66905j86896J53191
$$ y = [4303965, 3997869, 4146586, 4149053, 3923631, 4145208, 4437981, 4225642, 4302706, 3860166, 3419082, 3376528, 3070942, 3553376, 3119879, 2736745, 2570619, 2815824, 2756610, 2816453, 2840982, 2758638, 2540453, 2695695, 2857659, 2756832, 2157683, 2042407, 2397954, 2600862, 2454689, 2582925, 2634122, 2463395, 2126635, 2355587, 2822202, 2416272, 2509664, 2482945, 3079556, 3258811, 3042824, 2753350, 2561344, 2778475, 3184450, 3506434, 4040137, 4657230, 5584420, 5753608, 5630006, 6325502, 7200270, 7037206, 7047111, 7168653, 6913945, 6151705, 5601847, 5551435, 5408495, 4119398, 4082342, 4326130, 4408120, 4524316, 3792085, 3369521, 3407922, 3251081, 3029283, 3374885, 2965234, 3106353, 3648096, 3491719, 3324814, 3137918, 3291109]
6097C291109p1403k75357R9187J77067J78661n9475o82207K56764L7175o3709
6087B887812O0235o03879n311j20502j51959l18598Q7437o8329J00864l76899
6077A490871m15338K28998P3594L98582j94536J41741k30728o3498J60506m52798
6067A137394o758N35834n16569l02377J21557m02370J87333N55761k94362k58681
6057G56762k66341j77039O21933R8686k09090n95714J34432K01284J63963k01302
6047E27574K07270o1332l07603m01048k36722k34619P49237L72140j18609P0004
6037E66292R7417j69271k97659L00985l07506p80113M42349O05700K8425M02716
6027H89335p11268o7J84257p0272J2737j32060o3577K52076M32717p43075K17003
$$ y = [3291109, 3219706, 2944349, 3043536, 3220603, 3399264, 3339789, 2657582, 2914346, 2951521, 2887812, 2948047, 2344168, 2338857, 2218355, 2066396, 1747798, 1835235, 1766906, 1867770, 1490871, 1075533, 1304531, 1378125, 1776707, 1582171, 1723912, 1493184, 1429686, 1590192, 1137394, 1130636, 1666470, 1149901, 847524, 969081, 566711, 754044, 1309805, 1015443, 756762, 490421, 313382, 935315, 1034001, 824911, 229197, 363629, 564913, 728876, 527574, 734844, 673512, 365909, -35139, -271861, -506480, 242757, 614897, 496288, 566292, 663709, 494438, 196779, 497764, 190258, -589855, -147506, 458194, 486619, 889335, 178067, 178000, 362257, 291985, 304722, 172662, 109085, 361161, 793878, 50803, 267806]
6016B67806J72895k64281K71381k44838R6507n45903j17145O66833j52887L7769
6006A88137k79186M09539J73364k58856m67956J58204J55035J00077k03312p56501
5996g81455K81399M24424K14378r3793k82280q0047J33822j32930K20161L90658
5986B94337j88783k45415M1550N52776q0042p58013M79635L55619l88588p2787
5976i711j98262l2602n5375l48070N18595m22747L11929M13987j33206J56158
5966B00696k04024N8251Q0805j02442N51163j80159j41138K9125O656N5641Q1733
5955D36307L06440m79815J7045k68735r7068R0489m1156K39009N9735j38908j43918
5944b0575K70619m28793j50917l03348q3053K67799K32379J85473K73605m23526
$$ y = [267806, 440701, 176420, 447801, 202963, 299470, -246433, -363578, 303255, 150368, 188137, -91049, 318490, 491854, 232998, -234958, -76754, 78281, 178358, -24954, -781455, -500056, -75632, 138746, 44953, -237327, -317374, -183552, -316482, -96321, 294337, 105554, -139861, -98311, 454465, 374423, -383590, 96045, 451664, 63076, -9711, -207973, -240575, -295950, -644020, -125425, -548172, -236243, 177744, 44538, 200696, -3328, 54923, 135728, 33286, 584449, 404290, 263152, 292277, 298933, 354574, 436307, 742747, 262932, 279977, 11242, -85826, 4663, -36493, 202516, 262251, 123343, -20575, 250044, -178749, -329666, -633014, -716067, -448268, -215889, -30416, 243189, -180337]
5934a80337K24449J77242j41782j00284r8544N62175k44161K24244J1644m64595
5924b9949P8936L56406m13845j48196K95232j58489l33041j05219r964K27023
5914b41106L92091P8568k15048j0029r8163j21984j25493J49409J85958n7671
5904f3468O0221J10413p8319j31964k11183K12049l8338J45902K25629k44692
5894a3750j94390L5929l09387O97035L68691k48728J9895l81320M7859q3772k19656
5883b81594k5451K07643K50105j54911k30290J00352K56252n81968R5924O19095
5873B55157n11359P6137L10440Q7432j5474M6130k42491r2269K34873M05198k34446
5862C19328j47812k35375L49794q7873L8305q7520j31755L50352j62701M292j31673
$$ y = [-180337, 44112, 221354, 79572, -20712, -119256, 442919, 198758, 423002, 434646, -29949, 48987, 405393, -8452, -156648, 138584, -19905, -352946, -458165, -468129, -241106, 150985, 229553, 14505, 4476, -93687, -215671, -341164, -191755, -5797, -63468, -3247, 107166, 28847, -103117, -314300, -102251, -140589, 5313, 230942, -13750, -208140, -172211, -481598, 215437, 584128, 335400, 355295, -26025, 21834, -61938, -281594, -307045, -99402, 150703, -4208, -234498, -134146, 122106, -459862, -363938, 255157, -256202, -180065, 130375, 217807, 202333, 248463, 5972, -86297, 148576, 553774, 319328, 171516, -63859, 285935, 198062, 236367, 148847, 17092, 367444, 204743, 209035, 77362]
5851G7362L49395M23042k01692l39458J31729M69659m78069m19862N80279j68231
5841D24154K66109k66497k84567J91071Q0265k54263j3685K13378j63291o7903
5831A24771K32483j64241J31718j59469k88369L67308q5884j67848Q4952j9870
5821E5551l2122L28480J01886J00653k20932J78597J33695M8604j24498o40342
5811g0428o4661J63783M11073J13593K89384m74127j09612L58293m8870l534k95682
5800B69212K385L73486J88405K48n23287j1928L12826R7953k08253j66530r3415
5789B41102M79900J19299l19689M3572J69100L28081K19416k51825k43980K45676
5779A030652p7992j58309J67682j17067l82765M68756k75618J51325j49065O28953
$$ y = [77362, 426757, 849799, 648107, 308649, 440378, 910037, 431968, 12106, 592385, 424154, 690263, 423766, 139199, 330270, 410535, 156272, 142587, 355965, 192674, 124771, 357254, 193013, 324731, 165262, -123107, 244201, 158317, -9531, 75421, 55551, 23429, 351909, 453795, 554448, 333516, 512113, 645808, 694412, 569914, -70428, -135089, 28694, 439767, 553360, 842744, 368617, 259005, 617298, 568428, 564894, 269212, 271597, 645083, 833488, 833736, 310449, 298521, 611347, 709300, 501047, 334517, 241102, 721002, 840301, 520612, 564184, 733284, 1061365, 1280781, 1028956, 784976, 1030652, 952660, 794351, 962033, 844966, 462201, 930957, 655339, 806664, 657599, 1286552]
5769A286552k03042N9749k26492l29532N66949k67131J34299P05851l39198m13701
5759I74304L00953k22028r9003p7009n09454K28339q9140J68375M48582l28267
5749G95652q4990k38650P3064k17764L49915N8612J52782j91022n4854k68306
5739C74439L39368K64463m9014k70725j21031o8792O1285M27554o20592j30649
5729B06306N12302J93250m18981l0535m81644l64094m0471N89516J75271j61255
5719A79665k48200J50632k72272K4206m1810j88504L12022J33128J72813J9684
5709B41364o588J48401J3063J89636l04478J70709K39435l4526q7969k25106m55300
5698a11359o7713J80910o1693K17499J86324L43355m36032n02620m7460K19202
$$ y = [1286552, 1083510, 1143259, 916767, 587235, 1154184, 887053, 1021352, 1727203, 1388005, 974304, 1275257, 1053229, 954226, 877217, 367763, 596102, 506962, 675337, 1123919, 795652, 710662, 472012, 545076, 327312, 677227, 735839, 888621, 697599, 642745, 374439, 713807, 978270, 929256, 658531, 537500, 468708, 529993, 957547, 336955, 206306, 718608, 911858, 492877, 462342, -19302, -383396, -423867, 165649, 340920, 179665, -68535, 82097, -190175, -165969, -207779, -396283, -84261, 48867, 221680, 241364, 234776, 383177, 396240, 585876, 281398, 452107, 691542, 657016, 569047, 343941, -111359, -179072, 1838, -59855, 157644, 343968, 687323, 251291, -251329, -298789, -79587]
5688g9587j50109J22325M9871J69218o7604K33785k83538m08905R8500O31909
5678C15865O0594l33064m00661O63288n074N2607k52467n8687K62247j52870j39064
5667A2714K11672k30860k69974L68698K99132p3607J94637j1008k11807k22033
5657F7564k33950J91746J02029M35205j02649K48639l84700o0006j22420l14717
5647a73259J2493N1209l31781J09716K31459j09621M71540q5912K25041k29064
5637A71821J16690N40471j16124j33712k96940q1388j2510R4222j55788J34967
5627B61709l67548L77304o9878J27385J9094j31768q0306J59790K41445j81416
5617C55811r0859l6182N7635K66193j59262j44158l10459K46751K0721l92J3302
$$ y = [-79587, -229696, -107371, -57500, 111718, 44114, 277899, -5639, -414544, -316044, 315865, 376459, 43395, -357266, 306022, 300948, 353555, 101088, 42401, 304648, 151778, 12714, 224386, -6474, -276448, 92250, 391382, 317775, 512412, 501404, 289597, 67564, -166386, 25360, 127389, 562594, 459945, 708584, 323884, 263878, 141458, -173259, -160766, -109557, -441338, -331622, -100163, -209784, 261756, 175844, 400885, 171821, 288511, 828982, 712858, 579146, 282206, 200818, 188308, 282530, 126742, 261709, -105839, 271465, 201587, 328972, 348066, 216298, 135992, 295782, 537227, 355811, 264952, 228770, 286405, 552598, 393336, 249178, -61281, 185470, 206191, 205799, 219101]
5606B19101k89273j26049J42588R89297k56837n73141M15370p0790J12480j5371
5596E47375l79119J93703m18698J94174K03434p0002m39672j97787L26533K15850
5586A75791J7560K39927j98715n71061m824M12505J71434L00354j16738k84820
5576A41413l41841J79539L77498k34714j58689J84016p8645j89917L08450l56616
5566a69506K6842L02282m00215k00980k48255M31799K70836L7195m4494K94928
5556C00432o2525k449J94114K5307m8248j93776k27115J51284J27147k28562K34344
5545B69953k69540Q6025K08844J34709J69197p58231J18777K36509K7292J41158
5535C64693k77550n60193J98526J64729j07626J75405K51284j85021k92280J06628
$$ y = [219101, -70172, -196221, -53633, 935664, 678827, 105686, 521056, 450266, 562746, 547375, 168256, 361959, -56739, 137435, 340869, 270867, -168805, -366592, -40059, 175791, 193351, 433278, 234563, -336498, -341322, 71183, 242617, 542971, 426233, 141413, -200428, -20889, 356609, 121895, -36794, 147222, 68577, -121340, 187110, -169506, -142664, 159618, -240597, -441577, -689832, -258033, 12803, 49998, 5504, 300432, 237907, 235458, 429572, 454879, 406631, 212855, -14260, 137024, 264171, 35609, 269953, 413, 86438, 295282, 429991, 599188, -159043, -40266, 196243, 223535, 364693, 87143, -473050, -274524, -109795, -217421, -42016, 209268, 24247, -268033, -161405]
5525a61405M01763L68755j59799K57881l41096k23214K1730l23659p42J23143
5515c6643k56111K40443m9984K68030j56003k88899k55078N93900M17767k94355
5505A83067k38243K51393o17203O12294P1525m49034K69805Q6316R1038j50271
5495A10687o4900j94680l59365L03795L62747J1786Q9382L52331k47952j64710
5485A99121q5865L73909n58361k70348P37154k46313k2445l37125K02383J75505
5475A67615J61070m2501j61109l39753j45082L34523J37847j88867j62704O1029
5465a77932M54720J88267k97209l15832N2424j22590K5304P1355j80773m5779
5455c48045M48769m99989M3547J82851M06389k28234J20820L17032J2450o66038
$$ y = [-161405, 240358, 609113, 449314, 707195, 366099, 142885, 164615, -159044, -159786, -36643, -292754, -52311, -102295, 165735, 9732, -279167, -534245, 59655, 477422, 183067, -55176, 196217, -420986, 191308, 262833, -186201, 83604, 169920, 260958, 110687, 45787, -148893, -508258, -204463, 158284, 170070, 259452, 611783, 363831, 199121, 113256, 487165, -71196, -341544, 395610, 149297, 126852, -210273, -7890, 167615, 328685, 286184, 125075, -214678, -359760, -25237, 112610, -76257, -238961, -177932, 276788, 465055, 167846, -147986, -95562, -218152, -192848, -121493, -302266, -348045, 100724, -399265, -355718, -172867, 233522, 5288, 126108, 443140, 455590, -210448]
5445b10448j34914K88064J17082q1788M56896k28612o41836N13622l0358j69322
5435a21614J71361L47340J81286k79772o1178k51880N06633N331j66785k64486
5425F6236m68475L47007M25757N11649n91371j84412Q3012M50998k59891p28123
5415c47613O68557J61638m36100K39184Q2503O8028l09751m02214J73815K71781
5405A69828l25451K45860J58814j17867j49241j11576q9233J70317j26938L11568
5395A36081J82566m65513K74322n8906J95577J63857Q5262q7832Q6288K4603j93376
5384C42929k83116M42564K6990j71675L34425m09717J48386n22599L02438N58682
5374G69307O9240n43646m6870j99083j28073J36038J20721O120j26224q3662K00510
$$ y = [-210448, -345362, -57298, 59784, -22004, 434892, 206280, -435556, 78066, 47708, -121614, 49747, 397087, 578373, 298601, 237423, -14457, 492176, 497507, 330722, 66236, -402239, -55232, 370525, 882174, 290803, 106391, 189403, 640401, 380510, -347613, 320944, 482582, 46482, 285666, 368169, 436197, 126446, -275768, -101953, 169828, -155623, 90237, 249051, 131184, -18057, -129633, -218866, -48549, -175487, 136081, 318647, -146866, 127456, 68550, 264127, 427984, 513246, 425414, 511702, 536305, 342929, 59813, 502377, 529367, 357692, 692117, 282400, 430786, -91813, 210625, 769307, 838547, 294901, 248031, 48948, -79125, 56913, 177634, 183754, 57530, -26132, 174378]
5363A74378J57369l8932r2625P8765P05392j50216O28599o19321j74012k01631
5353D67766J30328K03180n131Q2313j92867Q8925K36919N4785m20159j5313p5075
5342E55671j62684j17500k7613Q6193L85883M6578j80726M570M552k79442J33128
5331D48610n6992J22362M92829L78917n61692k43961k19620K97123m33907K13074
5321D36743M0079K56254O6200l18972O7705L9648k91217J47380l75922j00555
5311c2657K25792r2421l8815l43159N46178K26555r142m07820N47616J75930j218
5300G96839J85132k79530l21998O38583p9693j97865l2815M85026l28924l41794
5290E22961j05428q4787L87698J07305m34326L87828R5618o01846M3763L80088
$$ y = [174378, 331747, 292815, 200190, 278955, 984347, 834131, 1462730, 843409, 669397, 467766, 598094, 801274, 796143, 878456, 685589, 774514, 1011433, 1066218, 646059, 630746, 555671, 392987, 275487, 247874, 334067, 719950, 766528, 585802, 590372, 594924, 315482, 448610, 391618, 513980, 1006809, 1385726, 824034, 580073, 360453, 657576, 223669, 436743, 476822, 733076, 799276, 480304, 548009, 587657, 296440, 443820, 67898, -32657, 193135, 100714, 61899, -281260, 264918, 491473, 482331, 74511, 622127, 798057, 796839, 981971, 702441, 380443, 1019026, 939333, 741468, 708653, 1193679, 864755, 522961, 417533, 332746, 720444, 827749, 393423, 781251, 876869, 275023, 318786, 698874]
5280F98874k30941j09124L32799K39580j54145n53463r9114K58996J55168Q0480
5270F19110k65211K40279J27826j80865J14176L62622J11895m59134P46564k33406
5260A183856Q3538k17168l15715K60475m05545k02552J24409k2997J36181L1601
5250F56083O4917K86170J92717M0907k03712J5956r3379K02587m28624L55277
5240A088899N89078K1365J50568k48074M2283q6119l4251J32172Q0862m82689
5230A254094j95394K13861M86570m61518J3321l0380m99904n7343Q37383J47677
5220A708367l40453L41338k8190r0058j5599m42769k42269j48906J80650K92714
5210A214825N29162k86218J92107k39685k03422N38724K12894L13519j25193k67579
$$ y = [698874, 467933, 358809, 691608, 931188, 777043, 223580, 124466, 383462, 538630, 619110, 353899, 594178, 722004, 541139, 655315, 1017937, 1129832, 670698, 1417262, 1183856, 1267394, 1050226, 734511, 994986, 589441, 386889, 511298, 488301, 624482, 656083, 721000, 1007170, 1199887, 1240794, 1037082, 1053038, 959659, 1162246, 733622, 1088899, 1677977, 1699342, 1849910, 1601836, 1644119, 1558000, 1523749, 1655921, 1736783, 1254094, 1058700, 1272561, 1759131, 1297613, 1310934, 1280554, 780650, 723307, 1560690, 1708367, 1367914, 1709252, 1681062, 1591004, 1575405, 1132636, 890367, 741461, 922111, 1214825, 1743987, 1457769, 1649876, 1410191, 1206769, 1745493, 1958387, 2271906, 2146713, 1879134]
5200A879134l81810K09920l28898O7690L93725R9155l21128J97067J23730K39915
5190B178500o95795K58089K27390r3134N5056j14179k25404L50657l5425P1376
5180A977131J86487l34011L14065o2091J51501L57015n397J40401K0987M9423
5170B795511j66905j19919L64507K37505m55060M46691J66110m40147r7388k64271
5160B466634J88065K40202M8317q2697K26013k8000M187Q4168K61632l6447K62753
5149C634827l13849K79499L38565Q1831K99790O5536N3601m29896K99649l70082
5139C939471J95959L96583J56776j10928l02383l5033L54540m0075N2304M00073
5129E007287M26753j07260k05587L73877M52846J18836k21301J58786O5230M75220
$$ y = [1879134, 1497324, 1707244, 1378346, 1446036, 1839761, 1938916, 1617788, 1814855, 1938585, 2178500, 1482705, 1740794, 1968184, 1875050, 1930106, 1815927, 1590523, 1941180, 1905755, 1977131, 2163618, 1829607, 2143672, 2081581, 2233082, 2590097, 2584700, 2725101, 2746088, 2795511, 2628606, 2508687, 2873194, 3110699, 2655639, 3102330, 3268440, 2828293, 2730905, 2466634, 2654699, 2894901, 2943218, 2860521, 3086534, 3058534, 3062721, 3146889, 3408521, 3372074, 3634827, 3320978, 3600477, 3939042, 4020873, 4320663, 4386199, 4439800, 4009904, 4309553, 3939471, 4135430, 4532013, 4688789, 4577861, 4275478, 4240445, 4594985, 4554910, 4607214, 5007287, 5434040, 5326780, 5121193, 5495070, 5947916, 6066752, 5845451, 6004237, 6069467, 6544687]
5119F544687J27075j58512N2520P65046K21227J72138J87396J39810M52410k1369
5109H482428J20757L91890M54171N41436L22524K42049L69461J230759L21467
5100A2476942N67254R11391J270574O31162R96860J870326J751614J774593K222959
5091B4473675K629809L229440L782161M021507M171440M584259L088318l78761
5083D9601848k016037l498291l182765k537908j271656m77832M18241J257568
5075C8293168K179017L134637M225820L257872J30801k49953n70939j0063J122188
5066E1512548J567528L003032L474285N420699O877443P325836Q570707N576434
5058I3328512p83105p341503j0053563r495886q005106n894695m790887l130756
$$ y = [6544687, 6671762, 6513250, 6565770, 7330816, 7552043, 7724181, 7911577, 8051387, 8503797, 8482428, 8603185, 8995075, 9449246, 9990682, 10313206, 10555255, 10924716, 12155475, 12476942, 13044196, 13955587, 15226161, 15857323, 16854183, 18724509, 20476123, 22250716, 24473675, 27103484, 30332924, 34115085, 38136592, 42308032, 46892291, 49980609, 49601848, 47585811, 44087520, 40904755, 38366847, 37095191, 36617359, 37035600, 38293168, 40472185, 43606822, 47832642, 51090514, 51221315, 50971362, 50400423, 50390360, 51512548, 53080076, 56083108, 59557393, 64978092, 71855535, 79181371, 87752078, 93328512, 92545407, 85203904, 75150341, 65654455, 57649349, 51754654, 46963767, 43833011]
5050D3833011j971532j925721j285714p86148l57071l51477M11596J032455J512237
5041D0111636J149989P83054M89806Q14406J382293J652458K301855L196409K397946
5032E4279852o17215l181292m885879n433186m987215m021697k672617j965681
5024B6515070j191694j227838j803371q68119m04215r78137k9645J60351l25984
5015A9846418j1650n13354q1464m75761j078320p84979n08870m57677r49053m17531
5005A4567759j78617m27084J869L8511K54775j50534L14654L56298L4506O40936
4995A5453073O36806j93867l97493K35606j67580j39433J19207M1757Q7017J71184
4985A5846277J96850m13684K0746k36997l29211k88884j90338j00685j85754p6240
$$ y = [43833011, 41861479, 39935758, 38650044, 37863896, 37506825, 37155348, 37566944, 38599399, 40111636, 41261625, 42044679, 42534485, 43348891, 44731184, 46383642, 48685497, 51881906, 54279852, 53662637, 50481345, 45595466, 40162280, 35175065, 31153368, 28480751, 26515070, 25323376, 24095538, 22292167, 21424048, 21019833, 20041696, 20012051, 20172402, 19846418, 19834768, 19321414, 19239950, 18764189, 17685869, 16900890, 16392020, 15934343, 14985290, 14567759, 14389142, 13962058, 13963927, 14002438, 14257213, 14106679, 14421333, 14777631, 14812137, 15453073, 16089879, 15896012, 15498519, 15734125, 15566545, 15427112, 15546319, 15588076, 15675093, 15846277, 16043127, 15629443, 15650189, 15413192, 15083981, 14795097, 14604759, 14504074, 14318320, 14242080]
4975A4242080K91096P27324R81569O52817R48296J031012O49055M59414K61279
4966B0243942m19058k3727j87488l35887L74645O00281Q42075L64108J79754n1452
4956B1587193r74794j231320j377334p07383k34743k87604n2781o5572l74368
4947A6281294J0550L13874L09247J92552K33406N48299L69840j6980j13774m38630
4937A7689678N5811L93403J23428L0869P02137K08929J26867K31092n14265k15737
4927A8832212l02965j59857k43915J71166J12554N29414O54584K18375P6190O75455
4917B0563213O90620N40105Q88929P15111Q70392J108523J721838R77909J995698
4908C0072338K462668K774272K264283L362035L827829M492219N580040N716741
$$ y = [14242080, 14533176, 15260500, 16242069, 16894886, 17843182, 18874194, 19523249, 19982663, 20243942, 19824884, 19801157, 19613669, 19277782, 19652427, 20252708, 21094783, 21458891, 21638645, 21587193, 20612399, 19381079, 18003745, 17296362, 17061619, 16774015, 16721234, 16655662, 16281294, 16291844, 16605718, 16914965, 17107517, 17340923, 17889222, 18259062, 18242082, 18128308, 17689678, 17745489, 18138892, 18262320, 18293189, 18995326, 19204255, 19331122, 19562214, 19047949, 18832212, 18529247, 18369390, 18125475, 18296641, 18409195, 18938609, 19593193, 19811568, 19887758, 20563213, 21253833, 21793938, 22682867, 23397978, 24268370, 25376893, 27098731, 28076640, 30072338, 32535006, 35309278, 37573561, 40935596, 44763425, 49255644, 54835684, 60552425]
4900F0552425O544126O032602M928539J996447j487419m387918n861506n101449
4892F3215847l560991l278038j975227r42200k33487J11329J165221J639204K681197
4883E8822855K648967L296019M829992N481386O676795Q322415Q954422J0942425
4875A09975276J2461580J3401128J0487810L674307o340203j2060165j4796468
4868A16803265j3922580j1737115r665316o717313n188318l467380l378372k183688
4860F0543183j226960p26515N45237J037087J627754J926134K817541L798768
4852G0342229M932832N671327P308843R456849R873961P420370O1101q669245
4844A06398267j2656573j2499559j0947436q483209o622303n381210l870463l624849
$$ y = [60552425, 67096551, 73129153, 78057692, 80054139, 78566720, 74178802, 68317296, 63215847, 59654856, 56376818, 54401591, 53459391, 53225904, 53337233, 54502454, 56141658, 58822855, 61471822, 64767841, 69597833, 75079219, 81756014, 90078429, 99032851, 109975276, 122436856, 135837984, 146325794, 150000101, 143659898, 131599733, 116803265, 102880685, 91143570, 81478254, 74760941, 69572623, 66105243, 62726871, 60543183, 59316223, 58589708, 59134945, 60172032, 61799786, 63725920, 66543461, 70342229, 75275061, 80946388, 88255231, 97712080, 107586041, 115006411, 115067512, 106398267, 93741694, 81242135, 70294699, 61811490, 55189187, 49807977, 45937514, 42312665]
4836D2312665k660852k073563k312056j890626j983212j113958j297211j111285
4828B7869902o70488o18129o50823o51097n98274k29335k75874m05833P8566N7308
4818B3905923j175605j274624o66142l08590j60845r61293n07796J56843j58522
4809A8849349k88214k08468J92593j30123J11227j71558k3643J76099K58834r5392
4799A8670704K94030L30912j59572Q8362m6558k91276l92391o0592l50176j35007
4789A7948436M98439P3276K39829l34302J58955j49329O32181p1383J08396P65716
4779A9870214M18889M22333Q56034L40192K09099J510017R96543R11002J139568
4770B6673891J035575J336560N57811k51856n60914k32225k18415j05870j36587
$$ y = [42312665, 39651813, 37578250, 35266194, 33375568, 31392356, 30278398, 28981187, 27869902, 27199414, 26581285, 25930462, 25279365, 24681091, 24451756, 24175882, 23770049, 23848615, 23905923, 22730318, 21455694, 20789552, 20480962, 20320117, 19358824, 18851028, 19007871, 18849349, 18561135, 18352667, 18545260, 18415137, 18526364, 18354806, 18331163, 18507262, 18766096, 18670704, 18964734, 19295646, 19136074, 19224436, 19177878, 18886602, 18494211, 18433619, 18083443, 17948436, 18446875, 18520151, 18759980, 18425678, 18584633, 18435304, 19067485, 18996102, 19104498, 19870214, 20289103, 20711436, 21567470, 21907662, 22116761, 23626778, 24623321, 25534323, 26673891, 27709466, 29046026, 29603837, 29351981, 28791067, 28558842, 28340427, 28234557, 28097970]
4761B8097970J15631J15693J052339J43288p8792O92662M01385R53682O80356
4752C2174214R32903J287539J184297Q58964J751415J916147J916186K143735
4744D4165400K532035L017079L140266K824044L156941L282255L170999K341385
$$ y = [28097970, 28213601, 28329294, 29381633, 29524921, 29446129, 30138791, 30540176, 31493858, 32174214, 33107117, 34394656, 35578953, 36437917, 38189332, 40105479, 42021665, 44165400, 46697435, 49714514, 52854780, 55678824, 58835765, 62118020, 65289019, 67630404]
$$ [...]
##END NTUPLES=NMR SPECTRUM
##END=
