##TITLE=1H_EC-3259(V-3)
 CDCl3, 8 sc, 
 2.9.2021
##JCAMPDX= 6.0         $$ Bruker NMR JCAMP-DX V2.0
##DATA TYPE= NMR SPECTRUM
##DATA CLASS= NTUPLES
##ORIGIN= UXNMR, Bruker Analytische Messtechnik GmbH
##OWNER= root
$$ XWIN-NMR		Version 3.5
$$ Thu Sep  2 09:37:40 2021 Russian Standard Time (UT+4h)  she@DPX200
##.OBSERVE FREQUENCY= 200.1312
##.OBSERVE NUCLEUS= ^1H
##.ACQUISITION MODE= SIMULTANEOUS
##.ACQUISITION SCHEME= undefined
##.AVERAGES= 8
##.DIGITISER RES= 18
##SPECTROMETER/DATA SYSTEM= spect
##.PULSE SEQUENCE= zg30
##.SOLVENT NAME= CD2Cl2
##.SHIFT REFERENCE= (INTERNAL, CD2Cl2, 0, 17.8906)
##AUDIT TRAIL= $$ (NUMBER, WHEN, WHO, WHERE, WHAT)
$$ ##TITLE= Audit trail, XWIN-NMR		Version 3.5
$$ ##JCAMPDX= 5.01
$$ ##ORIGIN= Bruker BioSpin GmbH
$$ ##OWNER= she
$$ F:/spectra/data/she/nmr/H-F/1/pdata/1/auditp.txt
$$ ##AUDIT TRAIL=  $$ (NUMBER, WHEN, WHO, WHERE, WHAT)
(   1,<2021-09-02 09:34:49.15 +0400>,<she>,<DPX200>,
      <created by zg, POWCHK disabled, PULCHK disabled
       configuration hash MD5:
       00 E9 B6 7A A2 85 ED C7 34 08 36 98 17 FE 4E 26
       data hash MD5: 16K
       1F B3 7E 63 07 2A FF 17 92 14 BC 60 E1 24 70 40>)
(   2,<2021-09-02 09:36:12.31 +0400>,<she>,<DPX200>,
      <Start of raw data processing
       efp BC_mod = 2 LB = 0.24 FT_mod = 6 PKNL = 1 PHC0 = -13360.46 PHC1 = 16.40097 SI = 16K 
       data hash MD5: 16K
       5A 4C BE 40 59 73 69 FA A0 88 2E 97 06 23 7C 0A>)
(   3,<2021-09-02 09:36:36.20 +0400>,<she>,<DPX200>,
      <pk PHC0 = 2.35162 PHC1 = -4.8 
       data hash MD5: 16K
       D1 54 BC 8B 45 6E 90 5B 5C A9 20 AF CA 9F 5E 47>)
(   4,<2021-09-02 09:36:39.95 +0400>,<she>,<DPX200>,
      <abs ABSG = 5 
       data hash MD5: 16K
       70 8B A8 73 1D 5A 28 0D 68 BF 2F 6B 70 8B 00 55>)
(   5,<2021-09-02 09:37:13.53 +0400>,<she>,<DPX200>,
      <abs ABSG = 5 
       data hash MD5: 16K
       FD D1 4E D8 1C 73 3E 51 6C 24 BD 5B 8E D1 B0 34>)
$$ ##END=
$$ 
$$ hash MD5
$$ D4 A1 51 87 8D 82 43 DF 72 90 4B CA A0 09 12 2E
##$RELAX= 
##$RELAX= 
##$RELAX= 
##$RELAX= 
##$RELAX= 
##$RELAX= 
$$ Bruker specific parameters
$$ --------------------------
##$DU= <F:/spectra>
##$EXPNO= 1
##$NAME= <H-F>
##$PROCNO= 1
##$TYPE= <nmr>
##$USER= <she>
##$AMP= (0..31)
100 100 100 100 100 100 100 100 100 100 100 100 100 100 100 100 100 100 
100 100 100 100 100 100 100 100 100 100 100 100 100 100 
##$AQSEQ= 0
##$AQ_mod= 1
##$AUNM= <au_zg>
##$AUTOPOS= <>
##$BF1= 200.13
##$BF2= 200.13
##$BF3= 200.13
##$BF4= 200.13
##$BF5= 200.13
##$BF6= 200.13
##$BF7= 200.13
##$BF8= 200.13
##$BYTORDA= 1
##$CFDGTYP= 0
##$CFRGTYP= 5
##$CHEMSTR= <none>
##$CNST= (0..31)
1 1 145 1 1 1 1 1 1 1 1 1 1 1 1 1 1 1 1 1 1 1 1 1 1 1 1 1 1 1 1 1 
##$CPDPRG= <>
##$CPDPRG1= <>
##$CPDPRG2= <>
##$CPDPRG3= <>
##$CPDPRG4= <mlev>
##$CPDPRG5= <mlev>
##$CPDPRG6= <mlev>
##$CPDPRG7= <mlev>
##$CPDPRG8= <mlev>
##$CPDPRGB= <>
##$CPDPRGT= <>
##$D= (0..31)
0 1.2 0 0 0 0 0 0 0 0.06 0 0.03 0 0 0 0 0.0002 0 0 0 0 0 0 0 0 0 0 0 0 
0 0 0 
##$DATE= 1630560888
##$DBL= (0..7)
$$ [...]
##$SUBNAM3= <"">
##$SUBNAM4= <"">
##$SUBNAM5= <"">
##$SUBNAM6= <"">
##$SUBNAM7= <"">
##$SUBNAM8= <"">
##$SUBNAM9= <"">
##$SW= 20.0189188712717
##$SWIBOX= (0..15)
0 0 2 0 0 0 0 0 0 0 0 0 0 0 0 0 
##$SW_h= 4006.41025641026
##$TD= 16384
##$TD0= 1
##$TE= 0
##$TE2= 300
##$TE3= 300
##$TEG= 300
##$TL= (0..7)
0 120 120 120 120 120 120 120 
##$TP= (0..7)
150 150 150 150 150 150 150 150 
##$TP07= 0
##$TPNAME0= <>
##$TPNAME1= <>
##$TPNAME2= <>
##$TPNAME3= <>
##$TPNAME4= <>
##$TPNAME5= <>
##$TPNAME6= <>
##$TPNAME7= <>
##$TPOAL= (0..7)
0.5 0.5 0.5 0.5 0.5 0.5 0.5 0.5 
##$TPOFFS= (0..7)
0 0 0 0 0 0 0 0 
##$TUNHIN= 0
##$TUNHOUT= 0
##$TUNXOUT= 0
##$USERA1= <user>
##$USERA2= <user>
##$USERA3= <user>
##$USERA4= <user>
##$USERA5= <user>
##$V9= 5
##$VALIST= <valist>
##$VCLIST= <CCCCCCCCCCCCCCC>
##$VD= 0
##$VDLIST= <DDDDDDDDDDDDDDD>
##$VPLIST= <PPPPPPPPPPPPPPP>
##$VTLIST= <TTTTTTTTTTTTTTT>
##$WBST= 1024
##$WBSW= 4
##$XGAIN= (0..3)
0 0 0 0 
##$XL= 0
##$YL= 0
##$YMAX_a= 207708
##$YMIN_a= -296433
##$ZGOPTNS= <>
##$ZL1= 120
##$ZL2= 120
##$ZL3= 120
##$ZL4= 120
##$ABSF1= 17.89058
##$ABSF2= -2.128498
##$ABSG= 5
##$ABSL= 3
##$ALPHA= 0
##$AQORDER= 0
##$ASSFAC= 0
##$ASSFACI= 0
##$ASSFACX= 0
##$ASSWID= 0
##$AUNMP= <proc_1d>
##$AZFE= 0.1
##$AZFW= 0.1
##$BCFW= 0
##$BC_mod= 2
##$BYTORDP= 0
##$COROFFS= 0
##$CY= -3
##$DATMOD= 1
##$DC= 0
##$DFILT= <>
##$DTYPP= 0
##$F1P= 0
##$F2P= 0
##$FCOR= 1
##$FTSIZE= 16384
##$FT_mod= 6
##$GAMMA= 0
##$GB= 0
##$INTBC= 1
##$INTSCL= 1.334414e-10
##$ISEN= 128
##$LB= 0.24
##$LEV0= 0
##$LPBIN= 0
##$MAXI= 10000
##$MC2= 0
##$MEAN= 0
##$ME_mod= 0
##$MI= 1.114404
##$NCOEF= 0
##$NC_proc= -6
##$NLEV= 6
##$NOISF1= 3.799351
##$NOISF2= 2.8
##$NSP= 0
##$NTH_PI= 0
##$NZP= 0
##$OFFSET= 17.89058
##$PC= 1
##$PHC0= -13358.11
##$PHC1= 11.60097
##$PH_mod= 1
##$PKNL= yes
##$PPARMOD= 0
##$PSCAL= 0
##$PSIGN= 0
##$REVERSE= no
##$SF= 200.129622768969
##$SI= 16384
##$SIGF1= 3
##$SIGF2= 2
##$SINO= 5.538805
##$SIOLD= 16384
##$SREGLST= <1H.CDCl3>
##$SSB= 0
##$STSI= 16384
##$STSR= 0
##$SW_p= 4006.41025641025
##$SYMM= 0
##$S_DEV= 0
##$TDeff= 16384
##$TDoff= 0
##$TI= <>
##$TILT= no
##$TM1= 0
##$TM2= 0
##$TOPLEV= 0
##$USERP1= <user>
##$USERP2= <user>
##$USERP3= <user>
##$USERP4= <user>
##$USERP5= <user>
##$WDW= 1
##$XDIM= 16384
##$YMAX_p= 283428493
##$YMIN_p= -305894
$$ End of Bruker specific parameters
$$ ---------------------------------
##NTUPLES= NMR SPECTRUM
##VAR_NAME=  FREQUENCY,     SPECTRUM/REAL,   SPECTRUM/IMAG
##SYMBOL=    X,             R,               I
##VAR_TYPE=  INDEPENDENT,   DEPENDENT,       DEPENDENT
##VAR_FORM=  AFFN,          ASDF,            ASDF
##VAR_DIM=   16384,         16384,           16384
##UNITS=     HZ,            ARBITRARY UNITS, ARBITRARY UNITS
##FACTOR=    0.24454680195387, 1,            1
##FIRST=     3580.43487114399, 0,            0
##LAST=      -425.975385266261, 0,           0
##MIN=       -425.975385266261, -305894,     0
##MAX=       3580.43487114399, 283428493,    0
$$ Real data points
##PAGE= N=1
##DATA TABLE= (X++(R..R)), XYDATA
$$ [...]
9004 113228 116888 22546 -34489 77404 99406 27039 -71043 -75128 31244 51054 -10311 -29460
8992 -29460 32277 -80337 59910 115965 -507 51792 70424 34743 68693 91885 156101
8981 156101 89185 83623 147585 171221 120261 131512 92565 36758 99830 106726 -22863 -65027
8969 -65027 -6364 55377 96186 90233 69911 32433 95266 16708 55309 40730 -4685 -42667
8957 -42667 2483 -63328 430 5138 10958 23729 -56729 16268 101343 70249 -2527 5118
8945 5118 -36344 -5713 -20199 -19466 -63110 99502 -30481 -47992 65365 70502 99770 149515
8933 149515 87476 23368 101421 20097 -24090 31014 -1451 -17998 -816 -52923 -57356 -54979
8921 -54979 34675 126231 39238 11740 -78246 -75622 88030 200715 32009 8399 -57114
8910 -57114 -7633 55981 8104 107628 68091 71999 95401 157859 86746 67585 17753 31791
8898 31791 10408 -24937 -98604 -49640 30204 149512 -2708 15280 51908 11387 25684
8887 25684 59809 -35240 -37791 -148782 -139825 -70323 -4390 54162 165959 70464 36475 122465
8875 122465 135986 156775 46832 -34264 46430 57937 -12019 25549 131344 119438 58630
8864 58630 120449 102511 205167 82570 70379 90454 78085 71145 117823 94457 72530 163430
8852 163430 172242 107998 165442 94276 18758 -2451 -38220 41866 85683 46979 100284 51802
8840 51802 138406 5083 29218 47842 -37386 49348 21959 -16016 -58554 -3261 23069 -34813
8828 -34813 -50003 48250 -24344 -12971 -26249 -17235 14820 92384 85448 24067 60119 -40980
8816 -40980 92816 -8337 -9 58082 67348 28980 52675 5788 -7310 -15238 -146614 -38460
8804 -38460 60652 -42384 41273 110116 86222 102799 226539 172426 135754 26348 143154
8793 143154 65926 112815 108206 25044 61828 92095 188259 -16517 33154 24826 -5967 54121
8781 54121 131601 116222 -15590 -46119 12717 54621 54857 61752 118054 25281 14355 1584
8769 1584 46666 26302 41679 3380 140640 97992 -29561 -102414 49007 -27669 31137
8758 31137 40148 60758 72398 45707 122098 29750 -54436 104173 272418 180726 127565 78102
8746 78102 26888 133107 -1935 127546 208061 121284 60846 -21852 101549 77711 85801
8735 85801 77957 52585 103395 78716 101320 111886 44804 94595 3023 69788 157173 118935
8723 118935 155971 169159 73031 142062 239915 169847 114711 55891 144624 119750 86224 65193
8711 65193 50609 79267 28496 85317 56814 63580 70072 16261 121333 126451 66809 117906
8699 117906 54103 61471 114894 92463 165484 67801 154749 166978 112630 123023 34103 -26231
8687 -26231 -81801 29003 62048 101359 25023 -4351 54658 128691 11798 129749 108679
8676 108679 50650 61014 13064 95153 116212 83827 87852 85495 169381 129196 153999 185277
8664 185277 233659 175936 158384 82121 -17656 23541 101730 24318 10053 39949 -35752 52922
8652 52922 113071 115161 179619 107327 68211 158202 134838 123195 116684 168674 142452 159472
8640 159472 229932 218886 249282 76603 17616 155982 124037 25952 7081 -37666 60551
8629 60551 203121 196496 151356 55302 -4668 12795 -32486 31962 77219 41402 157051 123932
8617 123932 234335 137433 47702 68540 118830 69644 95533 41719 49806 146823 66949 45088
8605 45088 41038 14159 10524 -20164 95070 76072 119653 182936 192069 128724 167401 216561
8593 216561 192425 119217 93507 100127 113265 176759 139070 91838 76439 9175 -29168 115533
8581 115533 136045 135794 201496 236163 82095 167034 203977 211701 189298 23757 156975 181250
8569 181250 240695 234768 160197 162296 21512 97096 159206 173489 118163 148144 178931 140552
8557 140552 151068 159158 59320 186496 190488 76401 137813 248038 136055 121011 182742
8546 182742 119163 133400 175763 323416 173886 111014 90149 162052 207636 290761 78144
8535 78144 76297 90277 118829 149453 100569 161577 184445 126256 198490 168995 136046 95251
8523 95251 101017 226731 171375 128819 135069 141956 206587 198779 124414 197220 123750 182419
8511 182419 175724 87566 89382 207681 127130 164549 142753 157147 264048 254420 153156 180027
8499 180027 222442 260487 190035 248516 166999 107114 156825 174912 232371 245495 274382 249770
8487 249770 173473 139399 146341 113361 76515 139671 185721 138904 97861 211632 327352
8476 327352 357564 407533 297862 213056 300797 253925 271834 225874 157927 288521 276405
8465 276405 179701 55977 74980 203762 169304 104730 199074 255294 234693 223747 162722
8454 162722 176406 140051 98514 149767 250827 285583 264239 217605 280506 243739 251176 269006
8442 269006 263511 314611 302636 267161 226509 227110 234228 313930 223675 272428 342714 297056
8430 297056 369246 254801 108328 358899 392769 287969 178018 309700 317896 333398 285488
8419 285488 277408 265012 318449 200004 182498 225989 169210 260702 221764 291798 358689 306670
8407 306670 273492 347959 347024 289858 224992 284828 409858 416341 310713 231179 348675 329396
8395 329396 289898 270571 337786 399079 300354 311497 300316 509831 606451 473661 453081
8384 453081 411646 438137 402840 437293 532972 572103 444826 540534 617258 707388 665958
8373 665958 677339 726931 681490 735441 686227 770639 661298 602964 683491 769297 682443
8362 682443 696305 727914 660890 594224 664096 698381 733153 666364 685896 748639 765880 696084
8350 696084 805417 817069 803436 851317 839903 863666 939452 823503 824650 1006046 948654
8339 948654 1035285 1054211 1001490 1088657 1048404 1058492 1135954 1211866 1219057 1155670 1124820 1239295
8327 1239295 1312089 1362617 1284426 1186595 1153839 1148214 1207386 1296938 1332552 1265381 1296557 1342657
8315 1342657 1332476 1281988 1482922 1521430 1505153 1549485 1558923 1665934 1722445 1690939 1654304
8304 1654304 1730809 1951814 1984066 2101583 2149491 2195089 2368412 2439126 2484177 2693719 2838656
8293 2838656 3015584 3275108 3466421 3778355 4023193 4443353 4844057 5260152 5724156 6172696
8283 6172696 6833420 7368192 7703665 7964476 8190729 8171280 8185600 8075822 7716679 7270389
8273 7270389 6898503 6298436 5694416 5246084 4876285 4554958 4190256 3856610 3558017 3367427
8263 3367427 3132861 3039272 2929725 2812072 2708331 2624758 2527352 2509595 2438119 2431543 2429319
8252 2429319 2345148 2436357 2581911 2650174 2762503 2825156 2793002 2919035 3103998 3164932 3336233
8241 3336233 3230725 3174447 3321124 3423960 3404769 3268955 3140493 2979827 2922288 2779589
8231 2779589 2671507 2582088 2483388 2516329 2542563 2553426 2512713 2511259 2597435 2552893 2673762
8220 2673762 2716277 2837507 3079456 3177563 3404127 3588688 3677265 3877287 4018227 4178183
8210 4178183 4274100 4421015 4600342 4667436 4565543 4521951 4467991 4308396 4107112 3861336
8200 3861336 3525465 3243891 3126792 2932215 2763321 2635462 2472243 2415965 3420141 3444201
8190 3444201 3049270 2945719 2811809 2872221 2739567 3008286 3119051 3164145 3071769 3133022
8180 3133022 3070852 3100008 3195022 3328069 3341713 3268416 3211340 3230356 3174800 3006210 2919283
8169 2919283 2812596 2775203 2630313 2639131 2499648 2489568 2575608 2592309 2510374 2311845 2407006
8158 2407006 2492627 2301708 2242341 2366638 2400721 2393468 2372471 2324451 2271598 2303642 2411503
8147 2411503 2504399 2483602 2418067 2400493 2414943 2434075 2374329 2479120 2415600 2362086 2594413
8136 2594413 2635944 2514211 2469649 2569366 2620839 2610925 2587273 2595202 2493824 2582632 2701696
8125 2701696 2538354 2639038 2705436 2728014 2854492 2945430 3052054 3108845 3173635 3296451
8115 3296451 3512732 3420749 3401093 3368460 3333807 3264615 3345682 3396366 3326171 3472809 3494604
8104 3494604 3581473 3575915 3713223 3759229 3852871 3832104 3863375 3958042 4012212 4125552 4142204
8093 4142204 4238694 4378639 4382712 4416899 4459165 4585182 4855397 5033484 5127680 5293425 5291391
8082 5291391 5411371 5722621 5790130 5833057 5956566 6197339 6285280 6395858 6557003 6705453
8072 6705453 6839952 7096740 7328530 7582824 7873817 8157491 8523683 8923060 9293552 9728468
8062 9728468 10059036 10432973 10920785 11262510 11773225 12439417 13083496 13913687 14864853 15701623
8052 15701623 16700079 17759017 19110408 20711782 22625452 24987835 27615551 30695573
8044 30695573 34019443 37322100 40581105 44733365 49416859 53515380 55469879 55675603
8036 55675603 56472889 58643031 61418589 62602154 60621243 56301068 50570926 45135956
8028 45135956 41229025 38471404 37045729 36213399 35045585 33569143 32285391 31351484
8020 31351484 30894364 30889910 31384114 32334552 33705635 35707631 38311530 41465216 45291982
8011 45291982 49374175 53472935 57471980 61265748 64097464 66462604 69620160 73779710
8003 73779710 77111940 77656207 76739341 75506723 72741703 67900632 60090801 51279175
7995 51279175 44025116 37899790 33509980 30417655 28169469 26398930 25116081 23583900
7987 23583900 21909467 20377251 18775762 17370027 16276309 15449207 14679095 14014898 13490944
7978 13490944 13092987 12757576 12456844 12014114 11897878 11613890 11352893 11173391 11030994
7969 11030994 10747307 10354533 10151029 9975035 9794657 9452110 9107851 8756293 8316709
7960 8316709 7921266 7712039 7684531 7284571 7028796 6817359 6598125 6507344 6366560 6229184
7950 6229184 6098027 5858931 5740871 5709558 5625697 5588951 5555711 5656082 5597911 5569619 5581861
7939 5581861 5621626 5678464 5622178 5641038 5658146 5514292 5500846 5369890 5134607 4992310 4927657
7928 4927657 4701035 4405032 4244308 4115695 3964952 3943980 3857814 3854447 3837856 3740024 3529409
7917 3529409 3528995 3411280 3411269 3355539 3344279 3357235 3339330 3419284 3345637 3186626 3131513 3272904
7905 3272904 3272004 3183455 3118650 3138135 3168714 3186051 3321933 3444430 3439692 3312417 3246740
7894 3246740 3289752 3400132 3363525 3466129 3536118 3413284 3580859 3662347 3736859 3687371 3819038
7883 3819038 3924901 3870770 4051249 4052081 4110624 4161487 4108408 4258543 4460705 4542564 4550699
7872 4550699 4639494 4761277 4875279 5032580 5142866 5226926 5404927 5563438 5786383 5690141
7862 5690141 5654761 5847319 6052550 6164637 6363038 6593357 6708943 6879018 7133446 7232445
7852 7232445 7259191 7604438 7877707 8053331 8425846 8752402 9111521 9470542 9874907 10179590
7842 10179590 10655597 11297265 11871523 12391910 13017702 13700122 14385147 15051521 15728517
7833 15728517 16692092 17655412 18726142 20027630 21505894 23189001 25167960 27384858
7825 27384858 29519898 31322618 33268999 35916047 38892105 41620599 43388373 44905498
7817 44905498 45859490 44880891 42042979 38730477 36185487 34551134 33731151 33693418 33979810
7808 33979810 33582277 32897034 32458379 32091250 32125318 32619978 33457849 34603336 36076445
7799 36076445 38225971 40702034 43256908 45956124 48754627 52215610 56356767 61018148
7791 61018148 66288329 71631200 76544620 80017490 81822111 80318816 76077858 70408813
7783 70408813 64767864 60718245 57750945 54711631 50308949 45903251 42405332 39355555
7775 39355555 36938400 35025623 33453414 32361819 31661993 31284513 31036275 31190906 31599849
7766 31599849 32230610 33247342 34771153 36948577 39455211 41833677 43498488 44477304
7758 44477304 45785028 47555189 49736816 51844992 52801676 51713917 48379461 43743701
7750 43743701 38471921 33965566 30512343 27937111 26124605 24771852 23620633 22310323
7742 22310323 21055038 19946677 18905971 18016992 17250242 16504274 16069719 15594292 14988767
7733 14988767 14556153 14190684 13671106 13383131 13152119 12994776 12765132 12641934 12515624
7724 12515624 12438984 12468687 12533812 12533082 12693794 12806751 12581992 12708039 12899332 12951585 13160732
7713 13160732 13153264 13296816 13551429 13913164 14067760 14446207 14938848 15397244 15864787 16472321
7703 16472321 17304816 18260779 19453868 20980852 22790422 24959653 27411066 30165468
7695 30165468 33457371 37513178 42603822 49222070 57816855 64493049 62668445 53438723
7687 53438723 46000989 39222155 34140432 31568956 30467856 30455237 31093385 32406917 33845468
7678 33845468 34735274 34803209 35324376 36450525 37747261 37837728 35948026 33468752 31765652
7669 31765652 30489983 29136505 26958929 24789924 23057941 21630530 20482714 19798645
7661 19798645 19361256 19169469 19167315 19480281 19841331 20395659 21331158 22675488 24286004
7652 24286004 26065798 27370731 28315209 29484512 31051194 33354341 36212308 38793313
7644 38793313 40466941 40486016 38584270 34955303 30831546 27235683 24490266 22585240
7636 22585240 21497096 20755948 19591804 18081975 16647879 15460194 14448405 13862555
7628 13862555 13494811 13185312 12949908 12865388 13022071 13346274 13721851 14295485 15108927 16054498
7618 16054498 16734190 16968227 17262377 17607439 17874108 17597067 16542202 15380680 14309188
7609 14309188 13357349 12452609 11351284 10238428 9188448 8334375 7554522 7026554 6533738
7600 6533738 6106506 5752005 5429575 5184092 4950892 4751978 4654688 4543551 4384031 4275666
7590 4275666 4214204 4137859 4024988 3864234 3756239 3622803 3691640 3520758 3283015 3230937
7580 3230937 3056673 2901873 2737060 2612153 2510836 2447261 2374962 2334172 2211559 2162408
7570 2162408 2173252 2098108 1883894 1797216 1728476 1678897 1648555 1759258 1648265 1484359 1500604
7559 1500604 1389541 1286131 1274883 1240566 1240638 1202972 1243654 1076752 1000447 1087060 1168964
7548 1168964 1176973 1066679 1018300 965172 882138 912800 855110 796204 809938 760282 815923
7537 815923 696365 625108 635195 777729 627829 660126 751269 632577 618476 729894 638132
7526 638132 644286 729877 632599 533770 551994 557317 530598 545146 578099 548487 518297 464327
7514 464327 391930 489125 518859 499051 491388 563247 440338 371721 411421 329940 390295 484425
7502 484425 538156 498133 430770 436606 332595 439058 516722 394911 369322 428345 292772
7491 292772 263294 347444 432993 406463 468762 356334 451890 409859 513034 420320 251181
7480 251181 301981 403218 404798 358987 437180 447919 439694 320999 238631 323475 429698
7469 429698 360839 385060 445206 432466 376410 450089 352017 454877 554991 482199 512223
7458 512223 575904 547914 569200 519419 470041 427067 443944 479842 431136 358389 321716 329137
7446 329137 284462 319451 343007 314086 163745 247284 258108 171174 212288 223582 154624
7435 154624 174807 324392 267953 234010 175459 94161 197257 257081 223692 228621 248832
7424 248832 206317 148184 109498 38172 126560 214972 241438 115151 59060 44657 162079
7413 162079 245896 29485 -80544 2690 19324 -103854 -3203 36778 118234 154010 15896
7402 15896 74108 -84575 3539 8922 -55453 -3273 62130 -65128 -68101 28260 129144 39115
7390 39115 -43142 58548 96313 -596 20555 31811 85254 91675 -412 15278 -78766 -14429
7378 -14429 30679 67941 65418 28985 -106110 -42761 -57566 -84045 88018 137537 111770 -5257
7366 -5257 -22218 -37583 -14693 -74661 -26139 93587 96888 123860 87698 8007 81897 55582
7354 55582 21818 102024 -23683 -50898 26069 -10966 -115225 48816 -49147 -121202 13138
7343 13138 133360 149624 185992 -5196 -5002 48307 85026 124660 7210 50963 74122 116357
7331 116357 86035 93143 84108 36607 33731 38627 134145 113015 47044 19818 71773 206552
7319 206552 184988 167822 293862 253159 211071 229187 73963 70002 173085 94069 49716
7308 49716 55593 114160 130883 82376 84821 2242 -32059 -118324 -90584 -15782 -59470 -111471
7296 -111471 -39262 -130806 -147679 39505 160832 25463 -9219 54315 29062 163180 200548
7285 200548 95167 57094 56215 -4393 73074 9837 -11173 21238 38143 103420 127488 16319
7273 16319 20558 101244 23716 46267 91813 54702 47245 73424 100663 -31264 87052 195226
7261 195226 262598 298207 176321 152554 83626 151137 59016 66201 168942 62992 -17730
7250 -17730 -66813 83202 124777 69987 89332 81809 110953 87607 11313 -40427 -75607 1552
7238 1552 79241 -13623 -61410 10354 56553 71816 92525 21963 52868 47220 11603 17744
7226 17744 -50271 -42246 -138749 -78271 -17001 -86099 53732 36591 8855 22529 -56399 -117806
7214 -117806 -10892 -16631 -54814 -10072 -7673 -70429 -27239 -46130 -31602 18410 1331 -99874
7202 -99874 -22670 -2812 -166371 -97790 -102444 -76177 -8963 -15071 5833 -66744 -55461 17326
7190 17326 -32088 -97838 -129805 -79631 -165205 13695 -66596 -31394 -10566 -62471 94296
7179 94296 36569 -54577 -109646 -35046 -130158 -154711 -151091 -75466 -179098 -183814 -49710 -47455
7167 -47455 -73959 -39484 79746 34328 -2712 -98006 -70130 -29330 -10844 -24889 -142869
7156 -142869 -84861 -57666 35319 -17917 -75770 -103766 -57515 -14992 -2734 -100809 -68535 -128200
7144 -128200 -61117 -11257 -18370 -40967 -119992 9090 -90418 -185690 -181882 -97860 -121831 -122742
7132 -122742 -204908 -154593 -262119 -282982 -162927 -77880 48789 138918 116873 28144 -94512
7121 -94512 -105103 -125323 -124249 -110616 -48003 -132131 -95426 -21745 -39768 -43172 -58490 21865
7109 21865 8151 -31099 -17015 7786 -8729 -70930 -81690 -90891 -96408 -88322 -213703 -121617
7097 -121617 -99747 -66734 -100575 -87250 962 523 -60569 22318 -62330 -129858 -32666 -58710
7085 -58710 -99535 -161562 -91726 -77064 -65664 -53128 -8810 -79689 -70098 -89870 -145606 -44061
7073 -44061 -57604 64312 30000 -47992 -93368 -81095 -126980 -12411 33416 -150130 -96364
7062 -96364 -87169 -125151 -169229 -217432 -196249 -129550 -147874 -193720 -46455 -84890 -63122 -123402
7050 -123402 -107034 -85206 -17898 70188 -36732 -139444 -168435 -178585 -147745 -45422 -43825
7039 -43825 -59371 -159953 -9112 -4199 -17910 73116 100041 -57454 -11931 -155933 -93715
7028 -93715 -100620 -90134 -113065 -181079 -77990 -164276 -109367 -148776 -50250 -29830 -82296 -29388
7016 -29388 -54434 -54215 51891 16817 -78137 40299 100541 36237 -102689 -74333 -55029 -71697
7004 -71697 -78719 -72101 -32128 6082 46063 -4338 48112 7023 -52076 -125499 -14732 -17713
6992 -17713 -59595 -54683 -117388 -70260 -163985 -134291 -135295 -35092 17122 7119 -30469 -34541
6980 -34541 10571 24467 -32663 14276 -51143 -30974 676 -88695 -149986 -201231 -65135 -60999
6968 -60999 -48581 24528 -11436 -218058 -305894 -179712 -152932 -123799 -139803 -227887 -178665
6957 -178665 -137367 -56991 -46648 -19702 -113973 -18455 23524 15924 21503 4631 73270 63113
6945 63113 -1309 -8524 12761 12516 -115523 -203228 -76382 -57681 -140909 -81168 -97217 -53024
6933 -53024 -87315 -8668 -171935 -254977 -259412 -150584 -37112 3425 -65798 -128043 1672
6922 1672 -83027 -77166 46517 108520 18753 -115520 -148799 -142692 -131376 -34271 31256 91674
6910 91674 67782 8453 42586 -31652 -86735 2079 -59827 -26949 -52209 -39911 5355 7385
6898 7385 39302 -91934 -91476 -56985 23031 2078 -31300 1294 -35988 -51952 -69873 -100811
6886 -100811 -135374 -105511 -116855 -91365 -112259 -37541 -37719 -134689 -218836 -140885 -84636 -3735
6874 -3735 -3071 34819 -142607 -153066 -1865 28055 29625 -73990 -30395 -50442 8146 -17970
6862 -17970 12777 90860 -13567 12948 -79146 -109697 -93491 -285821 -297207 -219877 -158692
6851 -158692 43877 70920 -70775 -46301 -57431 -9425 35037 -12516 -98254 -180370 -66747
6840 -66747 -78765 -104166 -78906 26193 -99633 -103284 -19684 -57353 -180380 -226826 -101043
6829 -101043 -14270 -63569 -77174 -84973 -168239 -205559 -75085 39878 23200 120290 -1247
6818 -1247 -29521 -92259 -21878 -3005 -106131 -106960 -78973 -7658 -147062 -161728 -44507 -209011
6806 -209011 -134530 -20670 45928 -142917 -119451 -29925 -57511 -92342 -124143 -57148 -58893
6795 -58893 11915 -50234 9847 157020 103417 -8549 46201 -59139 -36707 -68012 -82301
6784 -82301 -70413 -17304 -151733 -138470 -98657 -275673 -226831 -135571 -171690 -105233 8414
6773 8414 -141649 -78395 -76281 4674 15460 -33172 -25216 -113075 -127800 -57886 -14349 8352
6761 8352 31577 75550 87068 501 -150961 -249581 -183339 -93093 -69502 120594 87874 -122285
6749 -122285 -112186 -61658 -7478 -146275 -98452 22914 -36759 26438 -24378 -74372 -44674
6738 -44674 -140681 -11608 -6484 -77540 -73262 -91930 -35820 -72646 -60642 -45566 -61603 -37458
6726 -37458 -20789 18226 -2923 11620 -50414 -36412 -56417 -41795 59455 -4444 -155797
6715 -155797 -187617 -73339 -48213 11118 52412 151667 158297 -21737 -67059 -7871 -155683
6704 -155683 -139890 -61705 -144269 -136682 -52419 -109115 -37564 -31479 38662 34272 10192 73168
6692 73168 68436 33591 -35838 -32905 -83193 -107398 -96422 -82249 -109094 -77446 -82258 -94875
6680 -94875 -42186 -66213 -135628 -182338 -114989 -153294 -150500 -58913 -107449 -65446 -22679 27381
6668 27381 -22297 -43283 -73864 29533 -18194 -114023 -80111 119456 119118 -35268 -174736
6657 -174736 -174407 -224495 -181071 -152368 -185906 -136060 -120980 -12881 19783 68136 -68954 -60521
6645 -60521 -168551 12101 -93995 -80763 76674 -13381 -76153 -144944 -79538 -9971 4353
6634 4353 -79782 -95114 -86225 8520 9576 -21971 -5763 -70533 -97495 -2273 -38597 26394
6622 26394 66629 -55337 77467 104218 182056 165354 53915 100560 103536 -5226 16273
6611 16273 62033 -6337 24498 87469 39952 53435 191467 160100 184181 101776 36785 -4736
6599 -4736 2818 -90895 -62808 108619 98452 118304 320 123217 180070 96384 42496 -20635
6587 -20635 3569 -25091 106985 156336 147351 107492 103360 209310 260527 207913 321375 371629
6575 371629 406582 374910 273450 234621 416280 539460 573004 512119 316759 291627 317926
6564 317926 190224 134210 126483 179827 172312 76080 138394 237400 247500 197077 146313 154455
6552 154455 129323 32742 38273 115352 116775 61357 28461 42793 113970 99536 158156 103679
6540 103679 95464 110278 -21742 107075 137811 128088 238373 192944 84761 -29388 -36644
6529 -36644 -96996 -74414 12442 -2413 14945 67834 47245 49917 76209 141214 242307 164064
6517 164064 79515 152959 99013 99625 18736 35136 -4590 56267 105973 -13194 44227 105114
6505 105114 164660 124449 24538 -1940 4673 63853 31374 46000 32506 -87327 -53554 7415
6493 7415 24707 -65050 -926 2045 98170 99267 -31807 -15932 79736 121306 25520 -45481
6481 -45481 -7263 62220 29773 10472 74220 -697 -21686 -81297 21183 17599 -60301 -20146
6469 -20146 24160 71660 -23127 41843 81865 12149 -71411 -81507 58955 133904 96182 88334
6457 88334 -55229 -7939 37352 120655 137793 90717 133898 152955 119913 271476 205598
6446 205598 76231 9797 70089 92118 130194 163851 50284 45905 132911 126226 152328 127688
6434 127688 246580 296177 227823 119319 167775 217691 82860 66887 12966 -49734 54694
6423 54694 177118 188612 175947 172850 157734 102153 193266 198840 243598 241760 283098 276402
6411 276402 175073 141358 157693 75549 130427 132050 178691 193918 176857 151543 205328 238937
6399 238937 157293 206123 237384 148992 202770 226147 145030 243308 233025 98694 192826
6388 192826 192278 261248 204424 265149 298444 212667 254037 187445 204630 223191 194570 310619
6376 310619 292732 260889 277976 340772 475176 326646 360164 296704 331457 398345 399556
6365 399556 377992 392596 361556 411112 459522 393180 394807 409473 414014 421259 458346 440743
6353 440743 511375 531612 589768 562755 571091 537000 511803 501838 474785 483308 498614 508543
6341 508543 580234 648097 580837 466101 477050 624998 483066 514233 521909 494354 672345
6330 672345 668238 626987 604215 700948 654015 652636 698944 682226 663540 633683 610719 717824
6318 717824 721036 799505 809976 771062 733842 734406 648810 736659 768744 834569 833590 769595 740878
6305 740878 741199 744825 812922 948568 1014004 968514 859336 931127 1038583 1186202 1134216
6294 1134216 1102852 1098265 1291403 1505044 1425785 1406966 1617888 1644864 1611877 1661178 1668904
6283 1668904 1595537 1755332 1765533 1845982 1909385 1992757 2085953 2047560 2147083 2290801 2307446
6272 2307446 2365559 2423943 2639856 2609487 2617889 2808073 2922551 2867311 2800592 2906126 3076136
6261 3076136 3163476 3253846 3241494 3296980 3394313 3617225 3655171 3843333 3822992 3854897 4059129
6250 4059129 4117283 4320628 4575423 4821800 5039353 5233300 5420527 5732781 6079434 6300127
6240 6300127 6565576 6938731 7164579 7730386 8207955 8577576 9011641 9643364 10189768 10864152
6230 10864152 11568782 12336601 13283550 14365791 15754686 17134887 19085486 21537522 24240660
6221 24240660 27484359 31265761 35531278 40602546 46760606 53941180 62859122 73014022
6213 73014022 82938001 89308382 88953851 81908871 70360257 57757174 46609232 37780719
6205 37780719 31491674 27108878 23875994 21416031 19466789 17726402 16296956 14902632
6197 14902632 13593335 12478117 11456016 10624014 9805864 9159977 8685577 7951796 7433829
6188 7433829 7188642 6994187 6590879 6220791 6044425 5722304 5423986 5247385 5058160 4751826
6178 4751826 4579528 4445433 4345844 4124154 3938180 3788141 3506422 3366935 3292643 3116804
6168 3116804 2885847 2816481 2825763 2743385 2743993 2552771 2403222 2427495 2431308 2344737 2283520 2188454
6156 2188454 2167481 2047763 2183623 2148930 1915102 2012011 1978824 1983309 1870860 1854969 1831133
6145 1831133 1801444 1760653 1708012 1680005 1634255 1613432 1779457 1699251 1785636 1732358 1686354
6134 1686354 1668972 1557073 1657431 1823517 1797303 1850406 1985198 1974135 2151999 2311999
6124 2311999 2414597 2405976 2384969 2341029 2325908 2247243 2173378 1959418 1794227 1687041 1522122
6113 1522122 1300872 1172308 1209357 1224371 1170376 1118401 1047881 918717 909361 902687 857371
6102 857371 896811 890149 751874 784547 793657 683287 652530 651437 719404 581020 686179
6091 686179 752538 679256 705662 615308 534755 504362 566008 616239 651855 529366 514214
6080 514214 595642 563675 491946 482609 535454 508791 528637 493450 456163 554828 402803 460378
6068 460378 484084 513295 492674 301621 334436 512472 577830 764442 799636 631563 739962
6057 739962 669071 690165 802331 787402 760606 734700 735267 772160 608607 647651 757482
6046 757482 774668 652121 628447 600826 685350 586082 599018 580711 482364 522308 401841
6035 401841 334199 390140 403716 357676 406927 341949 501215 493913 494193 515091 319557 258317
6023 258317 238484 268940 282981 320392 255205 229067 76429 135293 80170 102633 149587
6012 149587 194628 265410 123545 133826 141817 232028 212543 129025 230980 230255 150796 292043
6000 292043 189218 112962 124403 118401 108176 72304 83224 -31940 70206 131932 -40175
5989 -40175 8087 56943 32383 82932 113049 186010 283138 239803 318968 129181 42045 160458
5977 160458 72620 109231 98481 187040 207954 171547 131266 185488 174076 66784 104690
5966 104690 47248 22070 -15895 -32920 36197 40933 125657 84089 -18574 65613 170322
5955 170322 153990 29108 -48176 -24321 149594 66910 90965 125114 41494 56355 35898
5944 35898 61316 40142 27758 -15714 87120 206865 148360 159406 41244 -51496 -20617
5933 -20617 139866 255106 285985 88955 5435 6751 80370 65509 56567 48860 42886 10158
5921 10158 42101 -13889 8312 999 21012 106190 596 122086 184683 4058 -99919
5910 -99919 -137945 -36887 111652 56124 103197 45590 -14401 -80756 -40388 41742 31452
5899 31452 8020 -25322 19443 86 110091 56963 150763 166198 3260 -47481 14506
5888 14506 62659 44391 222536 137079 57257 -58396 -106241 -13225 -7968 24216 227766
5877 227766 133269 118152 99279 20844 58803 141791 107541 38965 58637 -1954 132969
5866 132969 94064 97306 139456 295594 342040 249646 137072 119132 146040 169808 315700
5855 315700 275461 309848 366903 439347 398674 376848 386233 308536 343271 248825 309215 233606
5843 233606 221270 215741 218733 214392 127634 113897 72184 72028 133845 92988 119070 186674 327
5830 327 21509 -24786 87760 39278 121052 47077 34687 42886 40943 34079 -12810 -187493
5818 -187493 -14703 46436 51862 75924 20957 1087 77438 88723 14985 -61285 -8837 -84072
5806 -84072 -109062 -12574 -78656 3557 122128 21555 28937 32328 7985 107662 181140 96655
5794 96655 -12758 84017 25898 -106280 -73664 99297 158289 145246 -41960 47214 -13815
5783 -13815 -35182 -80763 -79361 -30059 44814 -76093 1232 -30720 -56407 40986 65978 -2690
5771 -2690 -96862 20503 -16097 3332 73042 65418 70393 163270 138863 157845 116583 -37119
5759 -37119 78328 95781 146896 69897 -62655 -48683 -14215 77947 56268 -3332 1769 100158
5747 100158 147789 101468 161236 155198 14307 49570 3964 -1420 -61655 -206352 -104110
5736 -104110 31699 45352 -40284 137867 -30244 -134551 40092 77993 98888 148586 38109
5725 38109 13961 32079 156879 32987 -44554 -58953 29247 11538 84578 189585 156604
5714 156604 101832 189755 195614 95773 187887 176937 82362 131091 94907 -139620 1991
5703 1991 -9136 178021 59972 -14871 -75178 15720 92181 -6409 -18657 -13391 537 -592
5691 -592 21276 -20589 -6113 18512 111650 119762 15691 -6938 -6385 -27642 -71701 31921
5679 31921 -2656 -112134 -109205 -73888 -21528 -56120 -69495 -51201 -47340 -50422 -10593 -42645
5667 -42645 -138426 -107633 -122571 -95951 -40316 -9408 -36880 -76184 -95442 -280806 -116916
5656 -116916 20727 7143 156373 149548 79982 -12994 18628 44710 49183 7354 -38930 -23106
5644 -23106 -88964 32089 34955 -3449 -19814 444 156162 108672 -36219 -44108 -50701 42380
5632 42380 78315 86296 126576 5289 -25950 -29723 121416 38073 4099 -59287 -101982 4377
5620 4377 32123 58245 102291 -12426 -105556 40899 16713 56464 116614 85526 140044 51856
5608 51856 61219 -24043 91398 142059 112396 126743 99282 127446 106166 81963 74623 74380
5596 74380 -9696 102601 111882 81870 120968 128692 -25595 -22307 -8107 35526 82385 113225
5584 113225 -72696 -64661 78394 24644 -5941 -9715 26283 6650 39578 -9184 -126473
5573 -126473 -25606 19643 -5448 88770 128346 106509 45994 99378 8090 17541 -868 -12962
5561 -12962 136411 20668 181333 252309 60001 116349 105711 134266 85366 32067 26343
5550 26343 42684 66391 97970 41254 19738 64993 8495 13524 10579 82548 136475 110008
5538 110008 53268 32491 -792 2255 44911 -15808 -76749 -47010 754 -33386 104877 72650
5526 72650 -78801 14820 73699 97601 2367 -58830 -10620 -10964 37481 95286 1076 126316
5514 126316 147408 51911 46292 100016 110630 3309 26406 -26058 -113706 -33148 107538
5503 107538 75630 15074 37297 112850 63734 1040 103283 72737 36447 134306 117856
5492 117856 -42048 63874 -8341 34876 110936 143047 51225 118366 154055 119685 116549
5481 116549 65202 143868 158940 168134 178653 113514 66735 -18465 -13529 87191 84606 86662
5469 86662 121429 261041 161336 144981 123218 132347 260750 273353 156325 118151 192302
5458 192302 168397 175068 145373 34047 87083 104617 66639 6813 204575 228460 182791
5447 182791 272307 179644 180983 122324 55696 195380 291245 243898 194852 111953 73220 115890
5435 115890 58496 71773 209116 146973 10353 40045 140900 104061 72198 98829 183404
5424 183404 155677 185809 173263 56245 147099 157812 97426 126896 115583 80867 177839
5413 177839 201115 160404 101228 162192 144411 112319 39864 106123 190295 227087 365713
5402 365713 315706 261507 319205 324049 256685 203769 395802 306734 278624 173204 212921
5391 212921 353252 374179 330883 347257 255185 371697 445491 399553 382847 324041 371663
5380 371663 297403 299083 330300 385732 385854 435755 432525 373629 308335 447601 452729 415584
5368 415584 419630 407581 396608 289238 286761 358092 273533 420039 532805 413929 330442
5357 330442 298548 333732 470567 504499 426725 495186 594697 539205 555031 603402 641093
5346 641093 587166 535003 412559 389315 357937 293240 354044 419670 407459 444125 453066 384445
5334 384445 391452 469945 525397 596973 546452 666671 543418 553617 577048 626032 600790
5323 600790 585979 561595 603475 543449 431028 469880 539651 451549 376215 250453 307069
5312 307069 397599 311136 312399 255666 377627 396937 376462 381970 361097 364194 378560 290078
5300 290078 406117 375741 358174 499334 537169 385336 406248 454938 499899 483086 517878
5289 517878 469462 537524 447382 361979 396875 495329 520915 596080 469236 453117 493670
5278 493670 492369 570267 551770 534321 590267 493157 485182 686244 637214 505361 561165 478811
5266 478811 520151 512547 505547 609002 527567 530808 492280 424791 487051 553970 543754 523870
5254 523870 419490 551652 556647 574679 654927 558626 600236 631999 665561 715713 580974
5243 580974 599370 625250 666985 735631 803378 797190 632631 694274 660848 572864 639357 689118
5231 689118 733179 740498 764548 778273 683466 741232 799971 785542 632214 665296 725230 771502
5219 771502 931030 1004160 1021164 940494 944738 965351 1060609 1011057 1023305 1084721 1056469 961231
5207 961231 962682 1033841 983929 987637 1021964 1011936 1060831 1108082 1116657 1049894 1135887 1229786
5195 1229786 1180500 1089786 1285056 1286111 1218013 1222916 1310155 1307064 1359133 1380831 1332150 1289137
5183 1289137 1319329 1320212 1298603 1350691 1419042 1385035 1390539 1472391 1555032 1534779 1581983 1583232
5171 1583232 1554853 1565707 1705993 1729651 1648581 1636523 1729438 1768335 1873151 1958702 1932022
5160 1932022 1918738 1890346 2039563 2088249 2190009 2202169 2345469 2361185 2392645 2524678 2522290
5149 2522290 2538083 2492294 2542690 2602744 2656709 2834710 2943841 3072149 3194839 3292986 3314190
5138 3314190 3380966 3375109 3466195 3622240 3758852 3835352 3954356 4033840 4176417 4298869 4391344
5127 4391344 4403238 4583240 4698460 4836608 4940382 5096231 5102543 5238292 5535133 5694580
5117 5694580 5834887 6090974 6339924 6588151 6941666 7184118 7315111 7463693 7734875 8208473
5107 8208473 8504670 8712377 8995792 9377045 10000034 10364960 10709534 11334478 11934228 12553603
5097 12553603 13268517 14166788 15203935 16233647 17575952 19292161 21228391 23307855
5089 23307855 25511725 27962180 30842753 34305525 38286175 42814160 47587684 51365709
5081 51365709 52282567 50044239 46108964 41975290 38301338 35465493 33584001 32670922
5073 32670922 32344252 32004310 31757587 31752580 32094595 32976881 34659067 36839869 39585493
5064 39585493 42778581 46314216 50541205 55417808 61312867 68360941 76602057 85788801
5056 85788801 93822139 96383054 91183941 81054546 69827347 59598123 51442455 45401581
5048 45401581 40838543 37658917 35261452 33375605 31838982 30780788 30024946 29748331
5040 29748331 29708018 30086557 30807815 32048996 33382661 35284164 37561202 40183538 43693043
5031 43693043 47586937 50999334 52666172 51025286 46335412 40512793 34860296 30104713
5023 30104713 26504389 23701702 21434961 19574037 18029392 16753670 15486824 14543079
5015 14543079 13649076 12762957 12003111 11393628 10884828 10419456 10018890 9490476 9192059
5006 9192059 9011479 8800215 8693988 8624796 8452397 8302419 8224688 7974592 7797588 7631574
4996 7631574 7460002 7261723 6929299 6605023 6404719 6180757 5828425 5588280 5453305 5388158
4986 5388158 5341154 5225862 5168469 5102139 5135847 4974375 4778782 4847446 4890396 4824065 4863246
4975 4863246 4805473 4864610 4950799 5056519 5127873 5089876 4810055 4651466 4431761 4249458
4965 4249458 4074320 3873233 3738403 3551503 3562556 3496881 3380328 3289489 3109507 3129827
4955 3129827 3032379 2822630 2696687 2779872 2709399 2621262 2689938 2602092 2669336 2695121 2768996
4944 2768996 2965566 2886033 2728021 2706084 2521303 2341713 2400580 2249030 2126049 2221930
4934 2221930 2170900 1957590 1869912 1812129 1774817 1717944 1692788 1748762 1626097 1626390 1702255
4923 1702255 1638765 1694854 1641100 1571900 1668483 1625834 1541518 1576432 1576922 1469445 1440582 1375229
4911 1375229 1428545 1464293 1578685 1620124 1656363 1655334 1743558 1775196 1736578 1700078 1750879
4900 1750879 1738061 1770923 1752553 1664638 1638578 1621867 1619948 1699086 1780583 1717778 1661676 1626446
4888 1626446 1578752 1544629 1649810 1805270 1886710 1808017 1848346 1855990 2078145 2234025 2320013
4877 2320013 2378074 2401349 2415660 2435530 2335848 2302534 2258738 2237575 2189969 2178116 2228997
4866 2228997 2262178 2260654 2284020 2286335 2375380 2472271 2567223 2605056 2727754 2933051 2982354
4855 2982354 3257117 3574696 3906395 4175470 4597247 5021521 5526275 6133557 6481469 6196503
4845 6196503 5403395 4539254 3831058 3499770 3309923 3032139 2924340 2772909 2710293 2595174
4835 2595174 2597178 2462910 2504074 2463629 2400517 2416814 2446248 2531147 2438798 2424501 2560792
4824 2560792 2605780 2647049 2769315 2650178 2558802 2538512 2513608 2400486 2482140 2419530 2446197
4813 2446197 2514308 2497425 2513719 2412488 2459358 2495849 2527159 2546227 2604250 2578076 2671297
4802 2671297 2757512 2878794 2919685 2933439 2932962 2947410 3002677 2969924 3034825 3042476 3157807 3228445
4790 3228445 3284402 3278457 3386732 3562619 3619124 3693606 3811382 3891344 4089915 4155688 4134770
4779 4134770 4266246 4458056 4588144 4646980 4867394 5009277 5247621 5291467 5486574 5597143
4769 5597143 5653947 5694600 5726089 5835585 5861042 5972164 6024147 6235689 6472728 6762550
4759 6762550 6972386 7115701 7293736 7405020 7624903 8001513 8137892 8464176 8759702 8982086
4749 8982086 9220453 9545407 9859512 10226343 10569930 10974009 11464013 11961007 12391508 12624908
4739 12624908 13012540 13614735 14299551 15094106 15987986 17071960 18158243 19463212 20859572
4730 20859572 22541413 24478245 26730320 29305713 31992392 35104979 38423667 41729516
4722 41729516 44468731 45998039 45938983 45008819 43541691 41848153 40315959 39224807 38331078
4713 38331078 37809438 37443584 37416996 37947523 38800030 40184001 42032978 44323091 47100368
4704 47100368 50454542 54330278 58559968 63238560 68442523 73982418 79238467 83003460
4696 83003460 83538131 80008090 73488295 65811201 58499796 52197430 47335315 43516786
4688 43516786 40755093 38489434 36669033 35332693 34290243 33488015 33043030 33063614 33558074
4679 33558074 34509404 35709649 37144842 38943036 41023800 43202371 45654343 47639298
4671 47639298 48408398 47476286 44522297 40256882 35702337 31435495 27851310 25044585
4663 25044585 22938916 21221757 19625730 18273730 17114399 16100867 15208712 14312057
4655 14312057 13388436 12622234 11991508 11495858 10916271 10306649 9971096 9646272 9381638
4646 9381638 9155285 8877073 8628918 8339131 8227814 8091803 7961270 7799814 7578615 7561201
4636 7561201 7522647 7476015 7377113 7359747 7217581 7024150 6702481 6559725 6229893 5995350
4626 5995350 5800416 5678335 5673474 5522781 5483926 5414736 5192311 5021245 4989242 4914651 5009723
4615 5009723 5022394 4949871 4811113 4917330 4849004 4902036 5054365 5094289 5193514 5089257 5142134
4604 5142134 5087661 5057271 4841122 4638678 4584316 4548817 4455507 4348711 4360902 4238884 4180039
4593 4180039 4156984 4096145 3982954 3997091 3956007 3751459 3778421 3705794 3581387 3642941 3625230
4582 3625230 3586450 3610333 3545706 3648596 3719223 3621494 3726955 3832134 3847242 3973150 3891882
4571 3891882 3930959 3971594 3859900 3888758 3885995 3955139 4011454 4104653 4307317 4340331 4412328
4560 4412328 4479818 4450948 4459367 4462781 4489338 4565022 4682060 4944180 5171427 5282608 5302579
4549 5302579 5291596 5425462 5438038 5438091 5425840 5265190 5335005 5287736 5157740 5061406 5146331
4538 5146331 5146814 5038872 5085299 5080298 5248136 5428496 5616144 5920726 6265917 6599133 6930766
4527 6930766 7264498 7654432 7982927 8190217 7942655 7602935 7159422 6656812 6362530 6172343
4517 6172343 6049783 5982063 5766079 5489094 5096561 4778651 4461359 4335547 4228932 4116709
4507 4116709 4136182 4238908 4202245 4306281 4358394 4461422 4628208 4861373 4938494 4947688 4795497
4496 4795497 4615542 4449818 4246463 4096662 3849878 3658639 3578639 3543486 3288956 3082534
4486 3082534 2837613 2596784 2421517 2315288 2161966 2121319 2015222 1935157 1860420 1788774
4476 1788774 1769332 1681021 1597192 1619403 1597150 1529556 1527055 1321108 1344816 1295145 1340203
4465 1340203 1337088 1223337 1170738 1130151 1277532 1288472 1140685 1197465 1229222 1113408 1147185
4454 1147185 1146372 1073025 1011648 935436 961389 1038715 946364 1025529 980104 1027777 992737 965683
4442 965683 972429 958385 1001407 1094810 1086310 1180309 1028771 1023819 1024443 929523 979557 989179 1006556
4429 1006556 1102064 985693 1013142 867362 954382 1107896 1035453 1014267 903033 927880 914957
4418 914957 853024 930609 946424 769504 819532 950222 965713 1025562 952550 904279 964393
4407 964393 889100 915639 1071892 1129758 1001815 840483 706510 724881 748531 661404 606076
4396 606076 754128 636399 576253 492699 623269 627924 557790 726135 749163 724216 705841
4385 705841 728354 656889 673517 719675 764728 755148 770954 794417 747154 699233 672816 581020
4373 581020 620792 538991 613080 657064 644349 635986 729446 680835 584514 625389 563588 526248
4361 526248 539226 568586 584728 580507 433271 388800 375978 370078 359589 460976 361822 350355
4349 350355 353180 528788 366509 295240 367724 361579 415889 397520 502001 482641 372987
4338 372987 404959 257071 265011 388838 328149 302001 325349 265900 409516 482100 478915
4327 478915 461454 456446 291003 262710 312988 181292 340323 333898 296467 470949 426448
4316 426448 351438 329681 294462 366606 321435 363885 456657 413258 383070 376950 395887 399876
4304 399876 488221 474995 469574 320134 282400 388088 403205 463401 427897 337148 378930
4293 378930 331203 306305 413463 301013 360566 459771 419451 421521 457102 439413 618688
4282 618688 502675 501122 507254 460250 481679 471775 456402 443126 426835 372384 414565 502248
4270 502248 463244 499083 524010 551209 517152 457917 526922 524954 571435 571350 518593 405126
4258 405126 440239 485198 563634 583884 539981 496643 506465 590064 562760 504101 498644 551696
4246 551696 617316 766404 790477 736390 636398 702544 539972 676039 633844 503837 556997
4235 556997 650926 726309 626590 561638 605053 741773 846184 830283 772230 779851 884846
4224 884846 875110 935442 987887 974626 972957 909234 1014033 1019528 968253 997980 1056982 1168744
4212 1168744 1164730 1171859 1203428 1247506 1336719 1304814 1288065 1328456 1398823 1308693 1310255 1344027
4200 1344027 1399418 1447987 1499592 1623205 1570618 1591520 1630341 1585538 1641344 1781412 1878671
4189 1878671 1903387 1863133 1866092 1924679 1990011 1982950 1964000 2003164 2093209 2185752 2227559 2298327
4177 2298327 2412694 2530630 2559911 2685228 2806976 2898463 3040350 3257522 3306249 3521250
4167 3521250 3657481 3796186 3990322 4301812 4405605 4667393 4918984 5173237 5560261 5996986
4157 5996986 6466025 6895762 7430650 8289497 9315816 10358119 11738039 13304495 14941165
4148 14941165 17073637 19295959 22238644 25731932 30194134 35378091 39418786 40196529
4140 40196529 37460463 32124063 26016786 21117903 17181276 14433568 12616662 11314559
4132 11314559 10259273 9443576 8887614 8172402 7571986 7156586 6617929 6332211 5997717
4123 5997717 5937017 5696982 5501283 5322770 5093272 5105612 5223120 5271037 5135163 5117178
4113 5117178 5185360 5264249 5419420 5413830 5618364 5762139 5871913 6035634 5983457 6135544
4103 6135544 6378348 6711204 7094540 7439900 7938979 8660461 9491385 10494129 11821388
4094 11821388 13297166 14976326 16928900 19382654 22256410 25798173 30330039 34758944
4086 34758944 37198274 37381275 35697127 31329711 25449488 20635962 16740491 13909021
4078 13909021 11964760 10514094 9371943 8563015 7772578 7236512 6614832 6111433 5671549
4069 5671549 5317615 5033042 4641458 4403347 4176487 3960606 3665772 3479254 3364965 3295871
4059 3295871 3075101 2900483 2808448 2705576 2607029 2527050 2508918 2431785 2193635 2213678 2231472
4048 2231472 2179464 1986339 1931562 1863674 1758946 1739886 1788212 1685912 1569103 1483752 1520659
4037 1520659 1492075 1567558 1416013 1293241 1347192 1279749 1373518 1274385 1129272 1132515 1116598
4026 1116598 1138639 1174998 1091759 992069 957869 1017010 983884 1074225 1125039 1030580 960795
4015 960795 921155 846780 883193 904872 878675 909813 774337 826131 762398 734162 826875
4004 826875 737462 864314 761670 727447 713459 739698 741776 702669 767781 671898 637244
3993 637244 626106 632056 615859 649914 736214 707139 673889 589036 522740 681594 673096 568709
3981 568709 518158 539072 571771 544361 409580 551221 585387 442950 328460 509590 623252
3970 623252 551588 564845 486823 477440 471969 470781 459220 494372 543496 547842 532044 550913
3958 550913 508386 428787 508569 582423 543000 419240 363065 408081 454603 458358 409579 437502
3946 437502 499034 505873 505031 447181 398473 409510 531174 492624 515815 542020 460373 524962
3934 524962 459311 420493 444933 445588 538607 473317 479977 497388 417062 410802 410420 510374 521724
3921 521724 461578 400508 419054 363465 574558 626379 427584 429404 533402 557331 569579
3910 569579 547135 629216 602261 509003 570711 525315 637483 731308 693761 673913 693570
3899 693570 624481 606738 729140 782488 715677 622940 692474 729180 720665 658802 641197 606856
3887 606856 750954 745719 684799 713034 630488 611479 677151 681380 626710 696283 771888 665408
3875 665408 684782 740830 715610 702306 709587 883633 946875 948034 999393 1039142 1108414 1100600
3863 1100600 983343 1165904 1361941 1475454 1641521 1728479 1731155 1868918 2011641 2144295
3853 2144295 2255947 2266475 2052151 1868185 1711281 1489579 1369494 1275877 1380408 1285996
3843 1285996 1163474 1078272 1034683 1098103 978277 883032 903616 945750 903323 885156 833017
3832 833017 830269 883693 925620 918208 859937 950596 953273 811970 687343 799627 926506
3821 926506 885259 935138 776355 746532 940889 968295 1017384 1007419 898169 1028865 1129991
3810 1129991 1064578 1084749 1087462 1154881 1141983 1223733 1250747 1258337 1114496 1154248 1288518
3799 1288518 1202311 1101950 1153119 1155926 1115398 1062581 1044134 1128516 1224826 1228395 1131259 1116626
3787 1116626 1070084 1065708 1041153 1136284 1169431 1174555 1192256 1208028 1173489 1182481 1266589 1232179
3775 1232179 1206887 1215916 1193928 1171058 1309616 1397369 1382033 1445015 1412266 1416595 1459621 1417456
3763 1417456 1351354 1435857 1535960 1689900 1625448 1599605 1590829 1580597 1602097 1658142 1721462
3752 1721462 1745244 1791634 1805698 1758790 1775695 1817202 1958935 1998058 1963270 1943237 1995148
3741 1995148 1943794 1918324 2029590 2055284 2083267 2174848 2305457 2377599 2380928 2237987 2175039
3730 2175039 2214584 2281863 2491428 2540339 2510688 2508129 2461759 2635389 2618215 2676633 2719018
3719 2719018 2683467 2765997 2846606 2835944 2810127 2875188 2911495 2905128 2993202 2980409 3063731 3157211
3707 3157211 3158126 3164646 3171510 3172367 3143513 3123923 3305609 3480518 3501318 3668777 3704019 3691156
3695 3691156 3757448 3856384 3874964 4086824 4267469 4274459 4329709 4525199 4617803 4726020 4876493
3684 4876493 5088131 5551731 5658785 6035210 6418610 6709489 7114458 7410631 7810316 8387728
3674 8387728 8960623 9649816 10197109 10579063 10510090 10002782 9682806 9158551 8959112 8796904
3664 8796904 8718847 8659446 8711250 8783866 8850591 9014020 9140241 9233333 9392509 9654903 9906962
3653 9906962 10037904 10162665 10472436 10612282 10694303 10802005 10906704 11052552 11218711 11377494
3643 11377494 11569906 11789376 12069709 12253038 12519018 12755411 13185880 13454936 13807181
3634 13807181 14247100 14732381 15183651 15666011 16260761 16769304 17288659 18180720 19133217
3625 19133217 19995970 20885853 21815856 22672187 23613077 24507089 25808696 27188653 28647803
3616 28647803 30368258 32193191 34022568 35984307 38303421 41010855 44065710 47694402
3608 47694402 51936448 56999732 63162499 70528293 79097112 89410058 101304300 114977414
3600 114977414 130726842 149418141 171927292 199762117 233219460 266108278 283428493
3593 283428493 273215315 240607323 199075174 161666357 131125799 108679858 92986236
3586 92986236 81542406 72815780 65864871 60109261 55052074 50854127 47042283 43594148
3578 43594148 40495600 37715482 35322056 33092457 31197105 29491318 27954994 26849292
3570 26849292 25876528 25005043 24347217 23708221 23212236 22719969 22262649 22151660 22176452 22259442
3560 22259442 22445425 22669442 22762391 22625298 22072546 21155342 20166567 19086051 17826139
3551 17826139 16771939 15740640 14936896 14303723 13674968 13243475 12652281 12215662 11867462
3542 11867462 11411616 11097636 10741068 10527316 10296089 10141356 9876382 9725096 9707400 9709339
3532 9709339 9717630 9699274 9628764 9426884 9234056 9197357 9061805 8874776 8665048 8554361
3522 8554361 8454733 8525550 8471451 8521148 8442047 8419255 8522417 8552048 8592327 8589524 8648468
3511 8648468 8862299 8758546 8884610 9040314 9089018 9022011 8792504 8554756 8345775 8233536
3501 8233536 8024123 7780333 7795216 7708425 7524390 7389071 7284235 7360376 7333292 7403481
3491 7403481 7355751 7367394 7552934 7724018 7753792 7835559 7778101 7813105 7876862 8046334 8344957
3480 8344957 8563184 8751924 9099512 9449867 9781360 10192730 10658234 11090643 11595175 12024211
3470 12024211 11871599 11102256 10426539 9717512 9225654 8863725 8690089 8552918 8392440
3461 8392440 8310517 8299858 8364019 8404026 8467556 8421901 8372199 8386299 8485158 8536532 8653856
3450 8653856 8802660 8922000 8932076 9044484 9188512 9446925 9708562 9807164 10120323 10181374
3440 10181374 10234274 10440120 10591383 10776514 10870332 11257232 11488259 11723917 12028168 12402962
3430 12402962 12793571 13281199 13916619 14244544 14253578 14169326 14031228 14034930 13996345 14086777 14373346
3419 14373346 14630539 14853578 15059963 15257605 15533292 15853054 16089364 16483747 16902707
3410 16902707 17563434 18247369 18711560 19371786 19991545 20190963 20251976 20138533 19936998 19660528
3400 19660528 19402272 19338562 19450443 19729253 20091402 20409028 20808468 21283387 21821470 22396072
3390 22396072 23092837 23771731 24502489 25411359 26367499 26912770 26520050 25804243 25146683
3381 25146683 24804315 24570992 24441703 24533127 24727519 24960067 24749842 24370419 23886451 23325901
3371 23325901 22865240 22449298 22051151 21678745 21433344 21222865 21031494 20844366 20571102
3362 20571102 20382810 20067453 19805694 19668082 19369674 19176373 18928373 18693718 18589956
3353 18589956 18298189 18025936 17771729 17581493 17404775 17146890 16744187 16415025 16264604
3344 16264604 16045424 15985619 15727404 15520350 15357315 15263640 15135484 14996920 14937379 14951994
3334 14951994 14898587 14899422 14832615 14640773 14411510 14000234 13633935 13325024 13105742 12908284
3324 12908284 12698701 12520745 12395652 12205971 12136620 11962207 11793806 11636242 11574271 11509904
3314 11509904 11455951 11413489 11381921 11347107 11355964 11341496 11243658 11432984 11349428 11342861 11367406
3303 11367406 11497119 11590079 11666799 11753574 11651261 11728356 11901685 12031607 12104550 12126900
3293 12126900 12285661 12454255 12802914 13036259 13347807 13873233 14283627 14690349 15220935
3284 15220935 16031547 16673845 17447632 18184489 18873203 19434779 19931907 20011319 19839481 19388670
3274 19388670 18926291 18629219 18489712 18374778 18356948 18521793 18836793 19232743 19579369 20310594
3264 20310594 21109833 22005022 23283321 24562103 26089949 27880027 29747987 31675676
3256 31675676 33841759 36204121 38468258 40433303 42131066 43427616 44162218 44122404 43376658
3247 43376658 42193901 40653406 38947318 37360060 36047819 34880753 33858995 33071208
3239 33071208 32837475 32701834 32908608 33500278 34269098 35150404 36356175 37812175 39473582
3230 39473582 41047487 42724881 44760822 46698372 48582659 50378092 52035070 53148934
3222 53148934 53577744 53523763 52734858 51482122 49704667 47759205 45516167 42984059 40458902
3213 40458902 38301296 36693484 35394845 34560203 33906578 33627107 33654888 33605348 33926216
3204 33926216 34426425 35026081 35799645 36703733 37906384 39216691 40397664 41320574 42263250
3195 42263250 42922745 42845852 42430032 41347159 39500475 37253894 34673612 31774926 29257341
3186 29257341 27016467 25157040 23704495 22431706 21554905 20773365 20089249 19598179 19307050
3177 19307050 18942294 18841379 18770529 18771427 18726018 18824930 18912035 19023412 19228191 19234760 19060797
3166 19060797 18701405 18107388 17227021 16194852 15139031 14137533 13139894 12460284 11826016
3157 11826016 11316254 10899067 10441535 10139976 9890908 9763601 9564447 9288269 9077243
3148 9077243 8874167 8893399 8782118 8679932 8586089 8443216 8325126 8219185 8188302 8154610
3138 8154610 8097935 7957243 8031690 7985938 7896776 7842919 7920294 7864984 7827223 8038626 8204316
3127 8204316 8164591 8149277 8298171 8339369 8334344 8433986 8573440 8686912 8721268 8864801 9016096
3116 9016096 9131584 9290568 9416099 9593706 9840552 10063662 10431090 10725602 10945073 11363420
3106 11363420 11785187 12200663 12850624 13359511 13573167 13679025 13678210 13901700 14229759 14488260
3096 14488260 14765082 15077079 15607902 15942097 16059185 16000562 16029737 16251388 16478011 16786292
3086 16786292 17218414 17828815 18435166 19284437 20234819 21249312 22235459 23221588 24206994
3077 24206994 25073029 25742881 26377102 27104503 27728171 28411151 29057780 29811912 30738096
3068 30738096 31623298 32452563 32790643 32919766 32891940 32551362 32092227 31946015 31963058 32227071
3058 32227071 32845663 33566222 34460789 35197146 35842824 36621745 37388151 38059838 38912127
3049 38912127 40035186 41061568 42315216 43719616 44985991 46456604 48225054 50073392
3041 50073392 51778338 53206821 54161085 54715315 54546934 53908850 53161222 52177224 51368659
3032 51368659 50791178 50362683 50108378 49975089 49956656 50138844 50570845 51085666 51718084 52528161
3022 52528161 53728749 55488922 57733986 60278673 63020961 65721459 68127980 69948272
3014 69948272 71132919 71640442 71985760 72510604 72810594 72752669 72117213 71100449 70190257
3005 70190257 69600396 68951985 68740058 68673834 68988625 68898117 68596972 68254001 67697716 67397558
2995 67397558 67207221 66878908 66258729 65499136 64802203 64209518 63493580 62719950 61593804
2986 61593804 60266172 59107367 58248459 57744204 57786243 57910913 58147093 58405600 58676823
2977 58676823 58635507 57808728 56357249 54440508 52190390 50104588 48452477 47239113 46275106
2968 46275106 45268193 44137810 42941942 42002920 41573291 41299719 41184159 41167190 41093661
2959 41093661 40938356 41080727 41446034 41968200 42597477 43472053 44211516 44356809 44177046
2950 44177046 43473308 42484850 41127444 39711198 38484056 37068164 35683733 34103041
2942 34103041 32726615 31584607 30773975 30198990 29657771 29433023 29325756 29470362 29646844
2933 29646844 29570594 29084166 28334274 27531089 26653116 26063501 25592597 25154929 24815347 24507112
2923 24507112 23934414 23309633 22729371 22352349 22074712 21909418 21885167 21939944 21914915 21559921
2913 21559921 21259019 20962148 20529470 19679148 18799801 17865725 16999424 16224553 15538587
2904 15538587 14889146 14421227 13988905 13729263 13511699 13459398 13344528 13135468 12907595 12665853
2894 12665853 12297728 11916698 11593724 11292793 11131935 10873894 10729711 10636945 10655557 10626052
2884 10626052 10560142 10336209 10155730 9934484 9615539 9299235 9153951 8861615 8651308 8460545
2874 8460545 8328289 8035477 7794127 7801927 7583630 7422177 7323690 7098952 6897998 6875331
2864 6875331 6658431 6557696 6534533 6485055 6428888 6431631 6424465 6232353 6103953 6106647 6194526
2853 6194526 6232114 6085831 6058865 6014817 5939803 5957509 6082502 6004727 5944497 5904280 5865710
2842 5865710 5739168 5661819 5643263 5722137 5658186 5455318 5595083 5598595 5466278 5462840 5391762
2831 5391762 5415469 5428072 5316122 5281045 5201766 5215303 5206414 5214243 5185812 5199201 5106586 5156183
2819 5156183 5244372 5119152 5125204 5254089 5183103 5179274 5180726 5158974 5216761 5319319 5409498
2808 5409498 5363351 5454478 5516288 5561715 5486229 5281701 5231020 5346493 5321353 5232488 5289729
2797 5289729 5449955 5452506 5378946 5312658 5304835 5359235 5428089 5569461 5657961 5714153 5661261
2786 5661261 5683459 5822824 6102330 6177508 6275868 6375307 6454745 6698589 6776286 7057979 7263422
2775 7263422 7581065 7775327 7942683 8125838 8223640 8523099 8791681 8942193 9090687 9232388
2765 9232388 9164247 9106839 8889246 8556956 8101407 7580271 7085082 6590493 6195367 5989114
2755 5989114 5728709 5518917 5341463 5215036 5107098 5055141 4873848 4801016 4801130 4674297
2745 4674297 4537676 4432901 4547192 4554115 4464669 4497820 4512419 4637380 4644238 4668653 4928175
2734 4928175 5033326 4955073 4702572 4499336 4412980 4188613 4023444 3965518 3983399 4018039
2724 4018039 3923790 4015902 3919515 3884104 3950083 3815375 3650929 3620563 3739675 3659607 3678021
2713 3678021 3710061 3572593 3556059 3633022 3733848 3864827 3876095 4030561 4088386 3967471
2703 3967471 3965143 3917821 3805155 3781367 3826844 3801964 3780670 3734860 3754551 3620820 3522167
2692 3522167 3571183 3467175 3391334 3427123 3377060 3247078 3135745 3109719 3032557 3082067 3029884
2681 3029884 3103902 3047855 2933479 2939435 2892335 2846995 2884664 2899276 2995779 2847214 2877678
2670 2877678 2946048 2975943 3046765 3048008 2879592 2737745 2763539 2667061 2728235 2666307 2555666
2659 2555666 2492763 2563335 2509248 2411060 2377307 2399042 2272275 2263666 2139532 2204297 2144454
2648 2144454 2050380 2027144 1918772 1899572 2007020 1890389 1946322 1971011 1927839 1888122 1819511
2637 1819511 1820074 1859108 1882310 1872563 1906663 1932016 1902203 1777933 1779540 1719163 1663720 1664796
2625 1664796 1603757 1500146 1475917 1439987 1475914 1508683 1405590 1366365 1383119 1356802 1457294
2614 1457294 1349064 1380508 1414922 1280787 1304799 1305601 1276438 1327192 1338975 1288892 1181680
2603 1181680 1255064 1269730 1344337 1222229 1073920 1153927 1188640 1100457 1145640 1072138 1028466
2592 1028466 988990 1057579 1026683 958616 1022864 888448 929643 1033307 930591 803554 707897
2581 707897 735263 836732 793417 783995 909181 918758 899720 826905 690299 756403 748262 742782
2569 742782 652860 718650 678762 773837 715843 536737 554254 661768 651004 614252 667313
2558 667313 611594 653470 629317 612031 639409 704359 639914 508564 425685 531647 554380
2547 554380 528702 514075 647231 534490 478427 549839 447077 461939 531903 465403 434426
2536 434426 437452 398692 359873 294067 457719 340751 390097 377694 478835 360401 382202
2525 382202 374687 337853 507065 518659 608956 535698 479726 501467 551818 525638 428941 235401
2513 235401 295873 285157 329367 425188 455385 501144 411011 419598 310600 338271 395017 458004
2501 458004 506463 526522 494182 534897 486526 388349 401466 396965 359703 384810 439897 597536
2489 597536 517660 631702 587429 529689 490376 534695 578966 445789 546733 465347 460388
2478 460388 545767 514929 555439 522534 474107 570421 646924 617206 583196 550176 504986 633170
2466 633170 565130 652317 677953 729967 706512 749628 688539 666040 590758 462424 415482
2455 415482 501292 462255 418797 525426 526378 554146 522824 417652 467020 377988 469996 399449
2443 399449 406134 395381 342659 394630 460152 481957 437631 469875 428128 363196 287652 266204
2431 266204 275357 302024 301508 290420 364061 394075 365281 382089 282755 177815 144827 166856
2419 166856 208705 192700 202828 246133 271141 191474 210918 294320 249471 167677 144241 172446
2407 172446 263285 189986 96305 92165 32823 105007 84279 74628 82806 166924 103871 133776
2395 133776 263854 184051 77855 76843 -7167 71552 21994 138617 44134 87291 11398
2384 11398 -1335 23 -23695 74994 26676 34075 61514 71008 11406 87255 61042 -32927
2372 -32927 -93438 -5421 55207 -3932 -1956 49399 -13890 -44604 68492 184603 36611
2361 36611 -22438 114257 88451 97286 126051 132876 100879 107585 131008 -41332 -996 33343
2349 33343 53821 3694 15117 37066 1994 113254 16264 -22170 -26563 -34179 45623 25222
2337 25222 6345 39554 92226 69706 -15412 8603 63056 -26550 -75450 -95725 -3950 -6548
2325 -6548 -54639 -13297 -100278 -159947 -55862 -22543 2406 -5895 -12335 -113365 -5017 63296
2313 63296 43193 82214 36663 35788 163642 179081 30889 -37268 -193689 -39417 -115061
2302 -115061 -36399 24568 -61163 -6954 -73984 -108608 -2282 -28634 -121477 4116 -18356
2291 -18356 -41736 -109021 -22524 -32132 39053 86420 19855 40436 26740 79477 6665 -53265
2279 -53265 26600 48169 -37058 -51041 25649 83685 -58187 -141355 -124365 -23638 25412
2268 25412 -27168 -32406 -80892 -76628 -63208 -33815 -22266 29540 -81036 -196841 3499 10375
2256 10375 5468 36010 -36323 -32167 38686 6155 24666 23752 -23427 -12875 80877 150107 30330
2243 30330 18680 63165 5794 22663 -71416 128416 83223 2272 51086 64487 163375 163415
2231 163415 -3895 33935 -12406 37549 22335 -31724 76363 18821 -28187 59903 88856
2220 88856 4176 -15949 38910 4088 41039 161132 11552 112471 80724 12824 -47207
2209 -47207 47363 77527 100978 81468 54576 -8176 75969 20072 84994 133201 100230 60525
2197 60525 42744 -49111 -156148 -146374 -45002 -59 -52685 -80880 -36529 -7088 -12318 -96159
2185 -96159 -162711 -80109 15876 33441 119715 27181 -77777 -7205 71189 -2428 -54588 38385
2173 38385 52745 -10867 -28669 -41916 -46736 -120181 -42088 -36787 -50121 27970 16774 -23213
2161 -23213 -45674 -13011 9494 -30415 -23191 -39186 4023 72116 9479 1182 19385 -5424
2149 -5424 -69391 -45072 -54655 17192 77362 43790 67699 56468 34137 126210 132605 200664
2137 200664 166965 160135 115946 15064 -83211 98952 78296 22664 -58491 36269 -50912
2126 -50912 -27145 25105 15263 53591 -26 80926 -11130 -117042 -119471 -128517 -7865 67836
2114 67836 68877 76293 97188 -36614 -32237 -53470 -65583 -23006 -21463 -9521 -60934 -12205
2102 -12205 39654 134379 56932 -49206 -23005 -123460 -167679 -93605 -69782 -49985 22388
2091 22388 23280 59052 32111 48449 5910 -70508 -79484 6953 107511 9429 -141781 -128400
2079 -128400 -120668 -8744 41602 14752 51582 30270 15168 1751 12226 -17727 -19122 -29365
2067 -29365 1527 11352 -58783 -45726 -63219 -31088 68560 128799 90644 -865 934 74111
2055 74111 94436 -2641 47962 -18599 106230 83160 -35298 -3727 20596 -72290 -104687
2044 -104687 -14999 -21002 -16623 -128410 -185256 -34430 -9929 -5523 49831 52039 114573 708
2032 708 40835 131957 84558 26159 -148158 -39937 3833 39562 -8946 117021 189192 70806
2020 70806 -6654 74592 -57943 33641 -5739 14048 66460 -9062 83429 252571 93369
2009 93369 25305 22468 -27474 62076 -10417 -56235 35003 118935 121112 115244 117402 93670 145653
1996 145653 167412 154711 107729 42390 42706 152842 199646 140523 177335 180118 229692 336944
1984 336944 443774 334272 314641 317243 359342 223140 110939 55009 133809 133854 135546 113645
1972 113645 92710 175419 127210 185361 281638 189264 67087 57533 64495 224343 21320
1961 21320 -56749 -40136 -431 66725 86546 79541 52259 144721 96594 206419 123728 228604
1949 228604 213029 215532 196723 175495 198856 144641 143186 132533 135399 139658 212435 195626
1937 195626 129500 -16089 24730 74856 74679 54723 -6244 -17105 73025 67437 141773 248481
1925 248481 33108 49536 107907 104844 58318 149244 121397 158745 219895 183130 266782 266050
1913 266050 163533 199957 187105 313329 235552 69408 149594 333053 274000 228465 219720
1902 219720 172367 121462 76593 213031 262832 232747 246923 298218 379829 416073 266567
1891 266567 173631 118745 312873 315519 257776 311626 274027 319007 292829 461154 364511
1880 364511 338810 405124 322630 467351 352852 332215 393798 353688 381907 322157 380251
1869 380251 384962 334391 359069 377272 480115 434398 426791 386950 436253 360581 285924 411059
1857 411059 400294 391701 317649 385054 359195 336006 417843 403219 287608 234733 341163
1846 341163 410199 447726 426679 504359 542901 463563 552414 547871 549218 475426 469311 548428
1834 548428 593381 530272 535979 628819 641814 672787 773797 729156 703732 724503 838963
1823 838963 805960 861505 1009252 956933 989485 1082603 1047226 1106877 1140933 1184870 1354602
1812 1354602 1277560 1317269 1317101 1315992 1267630 1410139 1476549 1540147 1572329 1625863 1704144 1843551
1800 1843551 1920329 1825381 1802170 1878372 1867443 1961666 1893953 1912139 2067594 2331913 2180471
1789 2180471 2233724 2303524 2343290 2389918 2488538 2556176 2620017 2706189 2847516 2899290 3080859
1778 3080859 3115444 3235641 3356008 3498281 3743494 4036608 4258301 4396070 4542116 4839455
1768 4839455 5030419 5250094 5523591 5943562 6189384 6629421 7118605 7654395 8083452 8682794
1758 8682794 9285050 10126507 11047232 12149528 13326060 14429896 15843820 17589994 19837680
1749 19837680 22484619 25469112 29145351 33652731 39142303 45619439 54216256 65401988
1741 65401988 73872248 70656366 57562649 46797463 36745530 28823905 23911222 20515610
1733 20515610 18046319 16219311 14791663 13717808 12817625 12095276 11369010 10512131 9539554
1724 9539554 8675625 7863864 7200037 6672672 6194042 5663167 5367246 5115198 4934243 4696321
1714 4696321 4437589 4311244 4062917 3877621 3843997 3738277 3566740 3488940 3263082 3111333
1704 3111333 2986581 2859460 2736309 2640464 2464266 2370409 2211617 2132970 2085607 2074391
1694 2074391 1978262 1830080 1789429 1815276 1847475 1657700 1532733 1463489 1456580 1467383 1438337
1683 1438337 1349089 1350958 1314234 1294293 1291985 1271789 1206182 1123293 1114847 1124214 1115555 1150361
1671 1150361 1181961 1079284 1124886 1010397 1002629 974365 937886 895177 901229 835801 833770 777213
1659 777213 736429 605771 674915 652169 611067 607816 739354 732009 700770 712228 713465 593669
1647 593669 574418 458078 453510 439150 559618 571434 624767 568256 521590 570576 484168
1636 484168 389325 357205 262819 346594 395487 258552 292822 288682 299692 373117 416940 396138
1624 396138 394862 383285 232438 202002 116356 53935 35399 174074 259442 190586 93487
1613 93487 35595 128716 236888 200307 206173 132319 67962 110312 153857 21686 -30075 69403
1601 69403 156673 114291 149369 231890 52359 53649 145706 152924 61826 50289 170980 186449
1589 186449 211393 258442 182441 197411 155755 152795 171406 272934 338689 232695 162032
1578 162032 54505 73539 139035 14157 68392 178454 179388 116486 164567 238068 312578
1567 312578 113980 154971 141234 151829 19792 -23114 74693 85042 103103 106802 29705
1556 29705 -29198 -38550 -5255 92556 81704 63317 40495 110143 105259 27047 34766 25725 61890
1543 61890 2592 28014 13504 137544 131519 60795 51129 61344 27743 64649 86908 59443
1531 59443 36128 104195 181669 85565 107028 117374 23477 54039 120335 95263 84403 98676
1519 98676 15406 42613 124993 74924 147061 142424 88345 148199 117328 178399 202216 98302
1507 98302 189409 143045 175431 218439 163306 217613 262764 369402 312706 442387 464999
1496 464999 383513 336182 238902 101771 -1018 20069 172091 238898 58045 26967 -19368
1485 -19368 59691 159248 118384 109239 95504 93188 16725 17498 -46997 21040 110330 -607
1473 -607 11340 -63290 -1930 59690 56505 81180 167217 82050 1883 -58695 -32485 -38351 -3136
1460 -3136 46775 32668 -55383 -85162 -76427 -56337 -45714 15876 78125 15516 70709 -21954
1448 -21954 -44275 -17397 -13724 -148157 -62741 43328 120120 22246 51444 139017 -11378
1437 -11378 -12448 -4810 25402 -80713 51753 39580 -80425 -134014 -164599 -128085 -49926 -37669
1425 -37669 71735 22909 -602 -449 -21660 -2384 -22029 -27134 25431 -88991 -32907 -6352
1413 -6352 -33730 -22507 43482 86218 39951 -24689 -36533 29722 6302 -58715 14965 -50607
1401 -50607 -71391 -33703 21770 -8384 -97154 -80909 -31073 -108432 -187977 -179685 -87759 -60396
1389 -60396 83580 66380 -14503 97833 175417 114059 11019 16047 -43972 128567 66551
1378 66551 92562 31699 5070 2276 -14945 21135 10727 -761 -39562 62543 131381 99946
1366 99946 -7410 44454 29168 103367 60053 65386 14489 -111247 57509 -50323 -110362
1355 -110362 -99972 -52511 -40343 952 -47381 17509 29552 82301 30145 -86977 -42095
1344 -42095 -65989 -67560 -31113 -151993 -86044 32495 -53362 -78730 -49407 -2693 50243 40717
1332 40717 -50305 -102917 -28230 -103740 54900 63295 -18736 14463 87156 112815 65113 -16618
1320 -16618 4528 -97069 -177346 8065 90883 5017 -122752 -149300 -125431 -208199 -143745
1309 -143745 -64196 -104504 -62212 -3574 35671 76361 -23554 -25520 97308 147148 72779 123440
1297 123440 54440 -28556 56869 81277 44019 2631 -57041 28156 -41002 -5085 115555
1286 115555 53303 89974 41135 80539 -23216 -27165 -25356 33220 -27402 -12991 12016 77968
1274 77968 -58840 4110 -5601 -75141 33571 694 20369 -91532 33500 -22356 -53808
1263 -53808 10413 -84640 -145441 -104282 -113237 -180116 -91652 17946 -45534 -72628 -90537 -82493
1251 -82493 -62329 -6382 -43480 -127248 -16556 -39867 -5557 -1390 50207 -19301 34661 41619
1239 41619 132030 35391 10506 90373 -15697 -26828 -152642 -107487 69395 -7888 -10494
1228 -10494 -72797 -155291 -237055 -101182 -51930 -67372 43396 195076 54209 -87835 51642
1217 51642 83381 -30167 -48492 -36343 5233 20686 45673 -18235 -113015 -140952 -165341 -8124
1205 -8124 12724 -49828 35608 29718 -3937 -32789 -42425 451 42316 13540 -92929 -65229
1193 -65229 9911 54842 53927 60613 -87492 -83712 20984 90950 -92892 -101771 -27351 -150634
1181 -150634 -163133 -12123 105876 99769 111449 136929 97040 50264 98970 125658 7360
1170 7360 54880 -4032 -70422 -24831 -42034 -144737 -65151 -11230 -103984 -73487 -157719 -159889
1158 -159889 -70443 -16868 1546 9969 650 -37 37694 60229 133288 14527 3554 36692
1146 36692 59176 20825 -76841 24606 -2437 30104 27285 -23637 149090 67437 12159 -71060
1134 -71060 -28598 -47775 -27595 83843 70072 -16513 -50234 -3718 95354 123991 71426 19144
1122 19144 28674 137207 100384 38560 38869 -10205 14029 -117159 -40138 -28729 -11577 64446
1110 64446 86197 165610 -14836 -13231 -5094 -14650 4555 -101178 -154299 -111265 -14456 75911
1098 75911 -68339 -104449 -12541 87506 -8174 -104387 -14299 6099 42171 -78219 -193277
1087 -193277 -76664 51926 81878 -15902 -23933 -25284 -84841 -97953 -45889 19670 -54970 -4053
1075 -4053 97374 158 -23928 -103010 -49318 -46108 -22569 20759 -38042 -163412 -172771 -120205
1063 -120205 -141557 -68594 65268 -37959 -64116 39864 67855 -55179 -73917 -28137 -20989
1052 -20989 54419 32033 52720 58764 82543 76286 -35822 47309 35291 -26905 -44845 -49326
1040 -49326 -103363 -429 36943 -29123 -102004 -139751 -124363 -131459 -147159 -188675 -162631 -87835
1028 -87835 66827 35092 -35461 -46533 24625 102484 -111244 -59686 -775 -2009 52865 -4496
1016 -4496 -35398 -74829 -39832 -92193 -8728 -76842 -110210 -155623 -190262 -185983 -94437 -48493
1004 -48493 -88339 18768 4964 -61413 -76136 -40460 -22522 -21690 17524 -18906 -10778 33593
992 33593 -28248 48371 75132 115715 42670 -9678 43467 -15203 -1 42721 24161 -31013
980 -31013 -27038 -80518 -62584 20779 111394 55167 88322 88564 55914 -41794 -44899 63088 45477
967 45477 35972 30257 -55139 -23055 -44859 -159217 -94598 -97718 -134776 -29699 15593 -7350
955 -7350 28708 24879 -3844 -121062 -105621 -3265 109011 48617 -113257 -148892 -102184 -33431
943 -33431 -5927 -11865 -18589 -121920 -45726 67074 -81919 45996 124864 48513 -8319 31128
931 31128 19337 -55335 -22139 -27105 5063 -18558 -136357 -73218 -51776 -112284 -10241 135920
919 135920 140047 26594 -35623 -85139 -180312 -168381 -75981 30948 -13988 -49624 -126769 -13290
907 -13290 -5502 -21342 -44077 10358 -26396 -16460 124716 88075 111107 95886 68935 11890
895 11890 -76211 -105941 4051 18298 -19133 -50322 -69241 -123046 83290 -4290 -73460 -41995
883 -41995 -66810 -88291 -99392 6625 17027 67434 52461 -83456 -46912 46755 -35020 -17943
871 -17943 -68551 -75666 -22331 -7516 30460 42886 9366 19425 -24160 -29245 -12999 -35389
859 -35389 125282 143922 -10450 -2239 -885 -1625 -43922 -2370 100537 -67557 -142810 -132886
847 -132886 -20921 19153 2958 -25714 -23446 -136859 -41712 -31231 30830 73324 64403 35897
835 35897 41141 -319 -91055 -44886 -40751 6781 68345 23989 -35004 31225 111217 160077
823 160077 79116 -18535 8663 -76908 -64882 65386 1020 -82319 -13808 -107601 -71455 22385
811 22385 -28050 -65058 -106149 74541 43120 -15843 -48536 -21588 -30296 -83634 -49648 -35351
799 -35351 -25539 66472 102074 67733 81267 71893 83504 -21743 -11170 120840 27690 -101989
787 -101989 -69608 37092 42502 -7973 47288 -55871 -10041 -43767 50533 144834 133519 8327
775 8327 -14300 63645 -19863 -1285 -67878 -98654 -62584 24011 -21263 -39108 -35861 1707
763 1707 19329 49173 -18265 -20728 -7669 -21240 -42644 21689 65740 103887 -28294 -2850
751 -2850 -60695 -40226 19754 29689 -9725 18980 33665 41280 -65894 -85134 -98548 -177702
739 -177702 13805 127700 18626 -23769 -63909 -49763 -86726 -145399 -111127 -41813 -82784
728 -82784 3349 -6538 -27166 -41086 -8695 14251 33437 38982 -295 -65156 -101465 -13576
716 -13576 -56527 -126582 -96880 -26859 -69683 36348 -38036 -90000 -216147 -84930 29185
705 29185 17926 53535 101271 28437 148186 -9816 -84757 12250 52634 104309 -18025
694 -18025 -31420 53629 -570 68142 9851 -38420 21306 -75186 -16036 -31129 -41753 -131846
682 -131846 -23190 114515 96132 11704 8139 43638 81743 23288 -15233 40718 -31085 -37045
670 -37045 -29683 -616 -42130 -50832 55183 126324 -42426 -160754 -141548 14174 -29639 32292
658 32292 145840 126980 67896 120576 82053 -14098 82704 117765 67565 38442 25814 62075
646 62075 -107856 -36249 28510 -43090 -160260 -86389 -126099 -188634 -109471 -57778 -28495 -76826
634 -76826 -13672 17389 73393 -19953 -30323 -70136 -15171 -12832 -57163 -102538 -159352 -5237
622 -5237 -2215 24158 63253 -92395 -59385 -49966 51319 81222 60161 166190 196808 20782
610 20782 -251 -19182 62312 7820 -553 -4142 87213 62170 35431 25642 -75672 -102444
598 -102444 -74956 11760 -21144 32141 -50189 -42735 -121181 -58821 4767 -97101 -1595 22996
586 22996 -43270 66908 154224 28569 6002 -438 38364 142877 66657 43537 90202 -71243
574 -71243 -151340 -84686 -62769 -59271 30076 110043 117012 38505 10989 70584 58617 49342 101258
561 101258 -17065 -73113 -88614 -13536 -39006 18604 -37075 -84220 -62962 -94276 -53054 2650
549 2650 459 -66569 -2117 71827 23740 -50619 -63248 -59590 76412 79129 137255 64167 76180
536 76180 113936 125246 84071 -69487 -29582 83415 -37517 4698 -32369 -93565 -84200 -53904
524 -53904 -15341 111767 158256 79203 32509 -11023 -19450 -14780 -5913 -5543 30785 2449 -75519
511 -75519 -95259 -14447 37637 31231 73180 156454 41652 -37187 32448 9787 21917 -47545
499 -47545 -102534 -93000 -83753 -78091 -85307 57599 18326 -43406 -164283 -38195 81330 -85057
487 -85057 -123808 66856 118980 13785 -26689 -56659 -19832 83530 57707 -1665 117988
476 117988 75529 9695 28489 91060 65811 37036 73044 28774 36342 28824 -2271 5496
464 5496 -51942 -57834 -71398 -43598 5304 -2098 -31079 -12017 28786 3688 62860 51002 69122
451 69122 -7814 -13253 61500 28033 30441 117691 -4635 111292 108105 110447 43081 -83845
439 -83845 -119265 -128151 36666 20391 86222 51087 10840 -15113 -100298 -102829 -34652 -4037
427 -4037 -12172 -59109 -21130 -108764 -46612 28199 -85777 -103032 -76883 163 152502 41918
415 41918 -49644 -88305 -64253 -120199 -85989 -5614 26258 72385 19757 31016 -71412 -81568
403 -81568 -22600 -19371 -23914 -1518 146004 58067 61451 133370 30443 6453 56162 20072
391 20072 -9028 -13803 54381 58717 112954 135971 94108 -25014 -21567 71638 105353 72211
379 72211 44497 77929 31660 163903 -9865 -203862 -219746 -104789 -19995 -37579 48255
368 48255 71940 -35988 -31413 -69020 -24216 44955 31610 109850 167191 86269 -8199 23281
356 23281 115218 14439 -1523 -52034 14820 69264 -38076 9244 18289 -73608 13235 83499
344 83499 -3999 -19643 -10197 -4333 -79939 -920 92727 127224 70550 14763 -9067 -39615
332 -39615 -132737 -95473 -73736 33236 -37262 -120742 13374 22864 101065 63178 -8957 30962
320 30962 40482 82855 -80823 -137923 110870 63532 75045 108722 81141 59115 69567 161800
308 161800 188908 83479 60795 53175 72369 -6916 -94505 100164 60809 12395 32707 42356
296 42356 89471 71288 97433 -21341 29150 91628 70039 34267 4694 -69066 -22383 65987
284 65987 75840 28857 14151 -7768 -37367 45251 112164 42303 50761 71186 -2039 -25952
272 -25952 -46141 28777 22143 -22718 -83971 -89664 -73666 -5223 35289 25710 53484 87276 30538
259 30538 64281 51751 112313 135675 -21663 103807 103516 105012 14565 92232 99831 70148
247 70148 59329 92800 -18655 -44448 27395 -115487 -37919 5939 134316 140251 164611 90073
235 90073 71111 7725 -71046 -136477 -168113 -52828 -86535 -122642 -7315 62706 138425 60729
223 60729 65506 8855 17754 23330 -73301 76906 102860 138271 64178 -52892 -21908 35030
211 35030 50649 64156 21201 13528 8533 -54668 19993 101384 56718 -50011 -2125 24130
199 24130 45116 -50891 45665 46093 99944 69439 -62002 -32517 -54420 -3118 -105908 -5536
187 -5536 202458 101288 10234 95604 51875 29279 -1273 -90583 -35585 75039 86432 -46675
175 -46675 4080 40449 26828 86888 47213 -37387 -79592 -48537 -15890 -73236 -38620 -5569
163 -5569 23584 92252 163056 130128 116375 103574 -2771 100500 16400 -91995 -44122 2702
151 2702 -25650 57016 75171 94460 50264 108180 143932 187116 131281 39927 7307 -20845
139 -20845 36217 9064 15956 -58601 8706 37509 50191 102594 93843 40615 73055 84160
127 84160 -2784 9097 111619 49205 -14358 43518 73926 82689 62522 128595 125849 29331
115 29331 31715 -5258 -29344 -27555 -27348 5330 92106 20322 -42993 -91096 -85555 20917 36732
102 36732 35479 16557 134698 66211 47886 34236 30883 -5977 76648 29720 43436 40430
90 40430 -63644 3596 -1030 27261 39173 64462 -27981 -40228 -78192 -23237 -24449 -16736 -47470
77 -47470 42821 66206 47548 66620 -37575 23749 49633 37949 25526 -5228 37161 62462
65 62462 16262 14764 59753 126576 144453 100719 53717 -47531 -33281 72617 101695 83563
53 83563 43197 16532 -24402 36361 95598 42417 3715 26452 -2701 24752 -35999 55114
41 55114 33674 79074 61189 26811 22063 88269 56089 46495 25714 74513 55689 70830 79433
28 79433 71382 14116 27390 77302 29929 14349 -1261 4132 16910 14759 9581 25089 -22171
15 -22171 33735 62833 66230 4151 3368 8654 49462 81040 25083 -49539 8869 46046 63065
2 63065 44625 19263
0 19263
$$ Imaginary data points
##PAGE= N=2
##DATA TABLE= (X++(I..I)), XYDATA
16383 -1075658 -1118100 -1097189 -1097659 -1183895 -1107202 -1105439 -1045309 -1048617 -1014556 -966783 -1011826 -988675
16371 -988675 -1010198 -1009188 -946871 -976923 -1011744 -966123 -921153 -922985 -860148 -858904 -837419 -768683
16359 -768683 -752930 -765856 -672114 -650959 -651542 -598471 -630930 -622146 -603028 -619319 -568920 -505330
16347 -505330 -391584 -455814 -592326 -617200 -517663 -447769 -447509 -470990 -457905 -410427 -353639
16336 -353639 -347435 -370536 -381979 -388574 -328891 -332436 -234774 -253564 -284922 -259743 -287601 -161459
16324 -161459 -187288 -202234 -132522 -207481 -155720 -170078 -217159 -209851 -150859 -44683 -28072
16313 -28072 -65723 -37008 12323 -63262 -55 -24613 -17806 -17654 21204 35704 31415 11807
16301 11807 61932 159533 274086 138898 111005 207068 292118 225011 246186 294525 214396
16290 214396 281765 197556 195145 364605 346048 305983 290123 354259 381091 388687 422052 434028
16278 434028 455708 507645 420181 436512 470526 516824 572697 537539 486858 452449 566124
16267 566124 641506 626628 632853 642502 631887 592725 604570 594436 597567 655826 696891 637524
16255 637524 668764 696796 657245 640897 680439 785088 841759 864320 775452 688882 677596
16244 677596 766476 829453 840284 920167 882121 846669 794410 906287 944101 940151 1077298
16233 1077298 1039085 929582 872363 923043 982802 1012167 965519 1009934 931077 971550 990927
16222 990927 1096775 1116919 1031082 982630 1086975 1161894 1115888 1108143 1096534 1053250 1036485
16211 1036485 1049524 1030269 1055658 1175237 1060725 1031561 1047255 1023104 1069653 1143358 1178485
16200 1178485 1216129 1120659 1233713 1214809 1170003 1112741 1196564 1141326 1175537 1198721 1136596
16189 1136596 1124519 1100146 1172165 1215876 1168669 1263971 1221893 1242963 1304884 1333609 1371970
16178 1371970 1338772 1350820 1360920 1285563 1203429 1212933 1103059 1040200 1120564 1294420 1327052
16167 1327052 1318992 1191586 1181869 1235023 1253989 1313881 1395000 1287737 1335431 1347099 1378413
16156 1378413 1319607 1294578 1230378 1258973 1243901 1319145 1350229 1398112 1382374 1375627 1314317
16145 1314317 1304810 1256453 1197427 1261791 1327844 1402826 1384782 1385788 1440703 1366983 1272300 1311401
16133 1311401 1369736 1443333 1504890 1429006 1392568 1469244 1389205 1408044 1515017 1475636 1378821
16122 1378821 1452092 1462660 1411850 1413168 1428721 1414281 1422465 1449262 1424361 1537614 1626858
16111 1626858 1489545 1476182 1397285 1398876 1458962 1480307 1456684 1446578 1397928 1368979 1351807
16100 1351807 1268269 1325208 1393724 1476128 1512054 1552159 1539159 1518386 1412143 1391319 1490704
16089 1490704 1545224 1501605 1438325 1500355 1501143 1516950 1506039 1509328 1447234 1453482 1410706 1500582
16077 1500582 1600271 1405252 1387020 1516590 1505298 1453370 1457940 1431395 1421809 1453578 1442335
16066 1442335 1428250 1420231 1464910 1448932 1369517 1447562 1309092 1414443 1566807 1553603 1579365
16055 1579365 1450744 1507796 1642062 1571689 1548603 1593588 1569300 1492928 1578064 1568086 1559564
16044 1559564 1523114 1591470 1562194 1432348 1369223 1438686 1405560 1435349 1494064 1416552 1447037
16033 1447037 1384959 1391250 1491128 1493579 1485202 1527729 1469230 1463561 1514610 1546697 1580636 1539345
16021 1539345 1560039 1606348 1632926 1558172 1523775 1569995 1534742 1575556 1523272 1572919 1542293
16010 1542293 1532809 1550850 1423222 1543735 1533991 1441699 1572971 1583880 1566782 1482919 1513582
15999 1513582 1543785 1491469 1537549 1511909 1485100 1498559 1625417 1606532 1485649 1500210 1475074
15988 1475074 1514378 1483663 1510363 1527157 1491868 1538044 1530098 1363507 1345083 1401692 1437778
15977 1437778 1348964 1407237 1556968 1462591 1577505 1739015 1654222 1525493 1455798 1395055
15967 1395055 1339770 1478111 1480273 1514480 1562483 1538318 1423451 1509114 1592223 1522920 1524700
15956 1524700 1559891 1505691 1412437 1467122 1455604 1387974 1422709 1471915 1422352 1454307 1563715
15945 1563715 1573135 1512022 1561440 1559712 1612397 1532344 1566195 1513139 1445795 1648257 1505412
15934 1505412 1486200 1477857 1513125 1530695 1598969 1591335 1569949 1543252 1516325 1617491 1546658
15923 1546658 1534991 1549977 1539191 1454773 1423675 1454872 1470866 1508857 1602924 1571345 1519627
15912 1519627 1549085 1549240 1547072 1599164 1681796 1593187 1443554 1498531 1539380 1536385 1587248 1506478
15900 1506478 1484038 1512221 1549164 1432632 1366950 1457952 1480552 1602728 1660796 1571323 1616952
15889 1616952 1419052 1474913 1503724 1547060 1607735 1535328 1634474 1523061 1527890 1468506 1498548
15878 1498548 1456573 1437965 1515748 1669515 1583103 1547903 1528360 1515944 1619621 1588404 1507527
15867 1507527 1515563 1547849 1603841 1548174 1556129 1569399 1476891 1413170 1432219 1478076 1457488 1448736
15855 1448736 1516915 1576319 1512205 1427565 1469687 1591648 1607920 1624889 1645952 1572179 1574065
15844 1574065 1465467 1465389 1422571 1474077 1454785 1450759 1520869 1565391 1549790 1671180 1577591 1536387
15832 1536387 1557207 1552785 1556762 1512283 1581376 1494424 1428114 1430905 1433706 1413096 1434253 1547469
15820 1547469 1483363 1421947 1534930 1473106 1486581 1557030 1473514 1506837 1538170 1577349 1560795
15809 1560795 1566193 1588313 1496321 1574991 1478504 1520498 1619374 1580186 1553936 1483711 1483794 1371256
15797 1371256 1361836 1492675 1495579 1534973 1579788 1502091 1512542 1605366 1452685 1401038 1459954
15786 1459954 1523333 1440712 1437448 1483212 1571547 1600065 1646533 1599726 1461538 1473353 1562264
15775 1562264 1565050 1524390 1534707 1640634 1597938 1642442 1558077 1488217 1455626 1570549 1647143
15764 1647143 1493386 1586363 1657010 1585401 1581202 1589121 1588412 1605231 1606069 1451780 1529631 1613731
15752 1613731 1573011 1573085 1530937 1506463 1576643 1580838 1502753 1483255 1505411 1513176 1566081 1605445
15740 1605445 1610975 1727548 1686276 1566411 1558723 1529605 1380562 1386866 1448268 1423888 1577510
15729 1577510 1479908 1511296 1455236 1482223 1458247 1372779 1491088 1425005 1529632 1610451 1577732
15718 1577732 1513716 1528490 1613044 1589246 1567857 1538501 1475786 1564221 1708304 1557580 1371477
15707 1371477 1405741 1403419 1448700 1486599 1489495 1443759 1564609 1500821 1437426 1501662 1551955
15696 1551955 1570374 1557940 1661912 1638592 1567396 1484101 1473313 1525754 1530276 1517315 1508221
15685 1508221 1573974 1627089 1665417 1567455 1577708 1625349 1505249 1479334 1567776 1541704 1537115
15674 1537115 1507472 1548083 1582181 1488609 1482431 1527668 1572805 1761783 1658590 1628441 1731372
15663 1731372 1684318 1627330 1623214 1560337 1484853 1546705 1605547 1562729 1581379 1529758 1536001 1536262
15651 1536262 1492836 1453524 1538484 1617363 1699915 1736027 1560901 1473306 1540244 1573899 1543354
15640 1543354 1529217 1645578 1689667 1653252 1735521 1731506 1688378 1637305 1610503 1668743 1591622
15629 1591622 1558384 1636808 1569488 1583127 1543389 1451186 1660060 1654545 1581987 1456905 1519740
15618 1519740 1541583 1462184 1552314 1652758 1596782 1527513 1541433 1536891 1598849 1614225 1644826
15607 1644826 1536661 1556889 1593693 1598547 1530082 1555572 1650719 1597681 1573989 1571945 1644292
15596 1644292 1658082 1660854 1758169 1676242 1579168 1601753 1612351 1574510 1489768 1488473 1543557 1573640
15584 1573640 1685260 1633790 1563795 1568800 1596542 1605451 1596266 1569057 1549850 1505623 1483678 1440908
15572 1440908 1478752 1673579 1522981 1435907 1553022 1433998 1396143 1485788 1617389 1628950
15562 1628950 1575579 1542721 1576382 1470930 1521111 1450188 1503471 1583737 1588517 1543260 1581919
15551 1581919 1697520 1595301 1547783 1566296 1550646 1608509 1614080 1658649 1695431 1511918 1547835
15540 1547835 1568170 1532953 1508558 1568195 1529093 1480478 1537571 1553051 1575016 1608818 1654873
15529 1654873 1560976 1592631 1516687 1562617 1434857 1581622 1614347 1595726 1699466 1591061
15519 1591061 1633951 1593406 1649184 1626324 1657727 1609807 1574213 1540893 1502657 1539694 1515158
15508 1515158 1525175 1573126 1611281 1560406 1466703 1443461 1515462 1587849 1602256 1535565 1545207
15497 1545207 1537731 1624453 1681018 1562030 1489888 1481386 1547915 1554935 1617806 1622718 1599184 1657647
15485 1657647 1672920 1573779 1674684 1702924 1730101 1744019 1579694 1591857 1566521 1586886 1606817
15474 1606817 1567871 1640500 1735455 1813118 1738141 1742375 1676701 1607652 1654536 1571214 1575176 1641405
15462 1641405 1696577 1696601 1594188 1591578 1602363 1591877 1543096 1568977 1531414 1562692 1568843 1539485
15450 1539485 1413770 1461595 1483298 1444170 1452109 1436315 1503684 1557473 1596342 1621677 1515222
15439 1515222 1536884 1520695 1560999 1507378 1575698 1544233 1594891 1589302 1577787 1579002 1467301
15428 1467301 1528325 1522108 1582683 1547505 1611565 1578050 1625205 1644331 1613740 1632541 1592761
15417 1592761 1553989 1573003 1603723 1529707 1504346 1524236 1562343 1606500 1516576 1485569 1477269
15406 1477269 1557575 1463658 1418486 1421124 1416577 1445189 1549528 1684980 1709803 1635544 1673370
15395 1673370 1665731 1588476 1619755 1629201 1452190 1451622 1586287 1650466 1621569 1556254 1540331 1674460
15383 1674460 1625069 1627453 1732803 1630065 1593186 1463365 1504683 1561931 1653826 1591944 1608566
15372 1608566 1668392 1611644 1599280 1662092 1661390 1639043 1612124 1604841 1659929 1632712 1548134 1512483
15360 1512483 1454606 1551494 1601611 1629772 1639852 1577663 1642702 1652368 1639906 1619703 1657847
15349 1657847 1523369 1562666 1673960 1620067 1651331 1620452 1726671 1643073 1644860 1656020 1670026
15338 1670026 1609235 1601879 1602403 1546741 1673544 1620421 1644632 1590710 1695954 1600573 1604098 1630071
15326 1630071 1712883 1705799 1649530 1604803 1502636 1622202 1626548 1577300 1583347 1525093 1634740
15315 1634740 1673433 1548443 1557862 1647153 1555351 1600769 1595214 1660450 1616099 1574429 1701993
15304 1701993 1705960 1728533 1735117 1654532 1652632 1609190 1732437 1780663 1802073 1678471 1594682
15293 1594682 1568936 1645550 1614217 1561854 1622548 1512398 1646053 1583107 1626121 1588604 1700498
15282 1700498 1661942 1620998 1572104 1614055 1555206 1547727 1513032 1578675 1642091 1625235 1711435
15271 1711435 1613006 1575099 1578158 1580572 1643305 1647561 1679386 1585564 1561644 1681823 1593372 1625451
15259 1625451 1620460 1551189 1615141 1629558 1663547 1659995 1532535 1545616 1558752 1579451 1628182
15248 1628182 1682158 1646750 1618226 1631635 1621762 1616679 1630467 1704547 1644651 1653149 1622361 1711152
15236 1711152 1714924 1609728 1628480 1611706 1728626 1685932 1767347 1719416 1718890 1717165 1667265 1604895
15224 1604895 1642544 1809060 1701702 1637737 1593655 1667759 1693108 1715042 1745834 1631129 1586841
15213 1586841 1625929 1671633 1647051 1603864 1580297 1647672 1681883 1653048 1724151 1745201 1752236
15202 1752236 1578745 1567020 1637054 1738943 1653071 1584105 1690257 1718813 1650983 1602953 1640829
15191 1640829 1599872 1620599 1626731 1610458 1663368 1677398 1753799 1774380 1721160 1710859 1621951
15180 1621951 1523444 1523213 1691817 1750775 1615800 1642167 1634165 1609967 1536618 1556567 1632055
15169 1632055 1663707 1742142 1676791 1655622 1741201 1690956 1635926 1650585 1713486 1709701 1617277
15158 1617277 1675406 1637064 1676563 1748853 1717622 1740305 1690750 1629771 1625597 1577084 1642555
15147 1642555 1832055 1821003 1730919 1719230 1583728 1635990 1640904 1612794 1596153 1652691 1745844
15136 1745844 1665536 1712120 1684557 1711444 1747394 1790554 1742980 1822452 1744168 1634742 1708443
15125 1708443 1561342 1629780 1704346 1719193 1639474 1590273 1622820 1591450 1700208 1715945 1544850
15114 1544850 1510907 1569048 1674847 1619630 1644476 1677560 1647767 1581329 1707396 1579366 1498919
15103 1498919 1608401 1652531 1620632 1537751 1556015 1548580 1496884 1555207 1662699 1715534 1602940
15092 1602940 1635039 1627019 1615229 1651899 1669511 1623341 1629150 1603194 1630537 1573512 1573283 1732932
15080 1732932 1688477 1614605 1612487 1611662 1621338 1694425 1627879 1674531 1668567 1624852 1696166 1698348
15068 1698348 1669947 1691743 1602805 1631078 1674358 1666235 1679178 1620557 1744288 1788088 1598957
15057 1598957 1706997 1589697 1642225 1658209 1625635 1648884 1671435 1717525 1696005 1690456 1654597
15046 1654597 1570306 1636060 1708982 1764079 1706418 1650400 1658371 1670840 1690297 1600054 1596220 1653959
15034 1653959 1641655 1506592 1505827 1702137 1674814 1749334 1740359 1747203 1650406 1612612 1580285 1720266
15022 1720266 1733965 1691929 1773573 1709108 1738310 1709040 1722684 1759687 1736086 1745971 1750544 1562906
15010 1562906 1593536 1713609 1803659 1630073 1590070 1601706 1596890 1581888 1638382 1550442 1582813
14999 1582813 1727392 1792405 1721142 1768974 1759889 1586214 1658776 1700345 1652696 1556815 1670572
14988 1670572 1733589 1658310 1776927 1719891 1709533 1865182 1857041 1809485 1671235 1632522 1636275
14977 1636275 1622095 1623635 1657959 1737130 1734097 1649567 1667400 1623956 1667477 1764262 1727748 1791194
14965 1791194 1754301 1694648 1654765 1611660 1551282 1589645 1690591 1776376 1725683 1578030 1645287
14954 1645287 1547957 1592747 1667941 1692609 1713317 1700087 1692077 1699177 1733109 1703849 1644746 1648403
14942 1648403 1791885 1628627 1668179 1678197 1757939 1664367 1551994 1636747 1658492 1632378 1704816
14931 1704816 1661166 1577019 1744714 1787838 1782301 1743330 1679488 1768694 1805229 1757282 1773187
14920 1773187 1776849 1732336 1708993 1736261 1711181 1708172 1711682 1669755 1564506 1546501 1608436 1672054
14908 1672054 1804190 1743794 1800351 1691497 1701175 1764203 1848433 1743230 1672648 1666588 1642713
14897 1642713 1674823 1685711 1752781 1621853 1665678 1660403 1761831 1691273 1734450 1712300 1770413
14886 1770413 1699729 1730706 1699055 1695392 1703496 1664651 1691822 1706467 1682460 1753267 1806587 1786640
14874 1786640 1770466 1842078 1742713 1667368 1649308 1747436 1732344 1634480 1638929 1562307 1656148
14863 1656148 1687784 1748562 1772375 1733950 1701869 1667554 1664494 1741962 1690324 1668642 1702056
14852 1702056 1685070 1633712 1672755 1741115 1676452 1682368 1531291 1482513 1482853 1633051 1733598
14841 1733598 1728111 1769780 1763364 1712619 1784434 1768481 1772705 1746612 1718509 1844818 1819653 1724705
14829 1724705 1713054 1652464 1603887 1698418 1793643 1717124 1681105 1770485 1754212 1779185 1762521
14818 1762521 1858733 1776838 1841112 1791159 1624697 1574494 1699609 1666714 1678355 1616950 1648451
14807 1648451 1616570 1698864 1707662 1738691 1654850 1642426 1627699 1680980 1723182 1708167 1709841 1703234
14795 1703234 1704707 1710943 1666836 1721820 1768332 1718891 1795238 1744124 1667216 1631570 1668574 1703485
14783 1703485 1711958 1724828 1672357 1600325 1665601 1793869 1778144 1713343 1768677 1797015 1735450
14772 1735450 1652743 1711929 1777344 1867712 1826949 1740308 1776793 1746602 1753264 1818700 1695391
14761 1695391 1784163 1757451 1781640 1843371 1755336 1555333 1565327 1651664 1677889 1827240 1809403
14750 1809403 1670585 1635500 1647177 1667195 1725131 1740545 1675351 1659620 1630207 1685730 1709532
14739 1709532 1696788 1735356 1827160 1719428 1631086 1715218 1734869 1803296 1777471 1696485 1750408
14728 1750408 1707980 1610400 1635563 1650218 1656315 1665962 1637501 1578377 1588206 1591898 1585568 1606494
14716 1606494 1554212 1530677 1630086 1688834 1684565 1715475 1819054 1845224 1698966 1757853 1836299
14705 1836299 1773152 1749217 1762291 1818194 1772531 1696578 1694339 1710788 1757285 1722694 1796595
14694 1796595 1883463 1845166 1770826 1788394 1766483 1705197 1761779 1763693 1686949 1728587 1784313
14683 1784313 1752498 1602717 1678179 1743102 1669305 1769062 1770809 1839619 1778712 1675737 1778862
14672 1778862 1670370 1725806 1749748 1621397 1618920 1781887 1848177 1826466 1751796 1735944 1689494
14661 1689494 1668329 1731696 1699699 1630630 1653008 1607833 1590625 1682344 1728160 1829182 1867371
14650 1867371 1912642 1738972 1773894 1779961 1759925 1661386 1660467 1839448 1743734 1743535 1720840 1692120
14638 1692120 1691054 1742759 1772096 1651612 1800684 1771985 1742859 1763172 1643582 1678303 1718815
14627 1718815 1836244 1799828 1829580 1831484 1729277 1757084 1703321 1684842 1651845 1829341 1806700
14616 1806700 1666626 1714897 1805043 1783074 1690592 1704308 1731331 1791397 1768094 1743838 1854170
14605 1854170 1707957 1725534 1710457 1715692 1798009 1794785 1741025 1749931 1789367 1734266 1784481 1708388
14593 1708388 1877053 1888614 1780422 1808453 1732632 1801066 1804212 1855256 1885257 1791205 1728624
14582 1728624 1882466 1812807 1775726 1620212 1658046 1669097 1750288 1790977 1744969 1777126 1781382
14571 1781382 1748926 1699126 1725477 1767818 1775634 1748240 1772214 1627899 1716054 1844894 1781763
14560 1781763 1814863 1773721 1825050 1802988 1801884 1752997 1712995 1707469 1731668 1783780 1736181 1759331
14548 1759331 1868509 1877887 1613286 1752870 1842029 1904267 1710160 1764682 1733871 1793459 1831615
14537 1831615 1905234 1774798 1725101 1599544 1690249 1766156 1812711 1847645 1812683 1759694 1798056
14526 1798056 1815540 1789164 1885150 1719556 1669250 1588192 1591686 1682470 1718173 1761361 1775923
14515 1775923 1726670 1780013 1768603 1806200 1700067 1784552 1857495 1776238 1733133 1823103 1855599
14504 1855599 1785735 1844939 1702738 1738255 1666328 1763062 1818134 1776399 1705100 1646793 1662955
14493 1662955 1738285 1831703 1794918 1761710 1623770 1675834 1791519 1776979 1739095 1810385 1815345
14482 1815345 1736176 1736875 1891562 1872935 1781982 1843520 1824567 1717209 1691995 1690470 1783164
14471 1783164 1833630 1935337 1803012 1825361 1703222 1765073 1729661 1759329 1797252 1857973 1795756
14460 1795756 1647851 1632826 1795382 1811701 1808535 1878520 1731265 1643514 1706278 1707538 1758121
14449 1758121 1821050 1873243 1804929 1690006 1722193 1775162 1855372 1810147 1849207 1822467 1833372
$$ [...]
##END NTUPLES=NMR SPECTRUM
##END=
