##TITLE=1H_EC-3259(V-2)
 CDCl3, 8 sc, 
 2.9.2021
##JCAMPDX= 6.0         $$ Bruker NMR JCAMP-DX V2.0
##DATA TYPE= NMR SPECTRUM
##DATA CLASS= NTUPLES
##ORIGIN= UXNMR, Bruker Analytische Messtechnik GmbH
##OWNER= root
$$ XWIN-NMR		Version 3.5
$$ Thu Sep  2 09:23:19 2021 Russian Standard Time (UT+4h)  she@DPX200
##.OBSERVE FREQUENCY= 200.1312
##.OBSERVE NUCLEUS= ^1H
##.ACQUISITION MODE= SIMULTANEOUS
##.ACQUISITION SCHEME= undefined
##.AVERAGES= 8
##.DIGITISER RES= 18
##SPECTROMETER/DATA SYSTEM= spect
##.PULSE SEQUENCE= zg30
##.SOLVENT NAME= CD2Cl2
##.SHIFT REFERENCE= (INTERNAL, CD2Cl2, 0, 17.893)
##AUDIT TRAIL= $$ (NUMBER, WHEN, WHO, WHERE, WHAT)
$$ ##TITLE= Audit trail, XWIN-NMR		Version 3.5
$$ ##JCAMPDX= 5.01
$$ ##ORIGIN= Bruker BioSpin GmbH
$$ ##OWNER= she
$$ F:/spectra/data/she/nmr/H-F/1/pdata/1/auditp.txt
$$ ##AUDIT TRAIL=  $$ (NUMBER, WHEN, WHO, WHERE, WHAT)
(   1,<2021-09-02 09:21:42.68 +0400>,<she>,<DPX200>,
      <created by zg, POWCHK disabled, PULCHK disabled
       configuration hash MD5:
       00 E9 B6 7A A2 85 ED C7 34 08 36 98 17 FE 4E 26
       data hash MD5: 16K
       B8 F3 F8 D9 76 49 09 70 B5 F8 15 F3 04 5B 82 C6>)
(   2,<2021-09-02 09:21:45.28 +0400>,<she>,<DPX200>,
      <Start of raw data processing
       efp BC_mod = 2 LB = 0.24 FT_mod = 6 PKNL = 1 PHC0 = -13365.5 PHC1 = 20.60097 SI = 16K 
       data hash MD5: 16K
       57 B0 1C A6 A2 8F FB 89 23 39 D2 00 B9 D6 C1 C7>)
(   3,<2021-09-02 09:22:03.42 +0400>,<she>,<DPX200>,
      <pk PHC0 = 9.096369 PHC1 = -12.6 
       data hash MD5: 16K
       EE D6 40 01 B9 C5 8B EF E3 FB 44 FE C4 2E DC BE>)
(   4,<2021-09-02 09:22:06.28 +0400>,<she>,<DPX200>,
      <abs ABSG = 5 
       data hash MD5: 16K
       88 DE FD AF A9 C5 6C A7 6E F3 7D 07 4B 30 D1 C2>)
$$ ##END=
$$ 
$$ hash MD5
$$ 08 FF 51 15 5A 6A 1E 1C B7 8F 97 1E 7F 1E 50 9B
##$RELAX= 
##$RELAX= 
##$RELAX= 
##$RELAX= 
##$RELAX= 
##$RELAX= 
$$ Bruker specific parameters
$$ --------------------------
##$DU= <F:/spectra>
##$EXPNO= 1
##$NAME= <H-F>
##$PROCNO= 1
##$TYPE= <nmr>
##$USER= <she>
##$AMP= (0..31)
100 100 100 100 100 100 100 100 100 100 100 100 100 100 100 100 100 100 
100 100 100 100 100 100 100 100 100 100 100 100 100 100 
##$AQSEQ= 0
##$AQ_mod= 1
##$AUNM= <au_zg>
##$AUTOPOS= <>
##$BF1= 200.13
##$BF2= 200.13
##$BF3= 200.13
##$BF4= 200.13
##$BF5= 200.13
##$BF6= 200.13
##$BF7= 200.13
##$BF8= 200.13
##$BYTORDA= 1
##$CFDGTYP= 0
##$CFRGTYP= 5
##$CHEMSTR= <none>
##$CNST= (0..31)
1 1 145 1 1 1 1 1 1 1 1 1 1 1 1 1 1 1 1 1 1 1 1 1 1 1 1 1 1 1 1 1 
##$CPDPRG= <>
##$CPDPRG1= <>
##$CPDPRG2= <>
##$CPDPRG3= <>
##$CPDPRG4= <mlev>
##$CPDPRG5= <mlev>
##$CPDPRG6= <mlev>
##$CPDPRG7= <mlev>
##$CPDPRG8= <mlev>
##$CPDPRGB= <>
##$CPDPRGT= <>
##$D= (0..31)
0 1.2 0 0 0 0 0 0 0 0.06 0 0.03 0 0 0 0 0.0002 0 0 0 0 0 0 0 0 0 0 0 0 
0 0 0 
##$DATE= 1630560102
##$DBL= (0..7)
120 120 120 120 120 120 120 120 
##$DBP= (0..7)
150 150 150 150 150 150 150 150 
##$DBP07= 0
##$DBPNAM0= <>
##$DBPNAM1= <>
##$DBPNAM2= <>
##$DBPNAM3= <>
##$DBPNAM4= <>
$$ [...]
##$SUBNAM3= <"">
##$SUBNAM4= <"">
##$SUBNAM5= <"">
##$SUBNAM6= <"">
##$SUBNAM7= <"">
##$SUBNAM8= <"">
##$SUBNAM9= <"">
##$SW= 20.0189188712717
##$SWIBOX= (0..15)
0 0 2 0 0 0 0 0 0 0 0 0 0 0 0 0 
##$SW_h= 4006.41025641026
##$TD= 16384
##$TD0= 1
##$TE= 0
##$TE2= 300
##$TE3= 300
##$TEG= 300
##$TL= (0..7)
0 120 120 120 120 120 120 120 
##$TP= (0..7)
150 150 150 150 150 150 150 150 
##$TP07= 0
##$TPNAME0= <>
##$TPNAME1= <>
##$TPNAME2= <>
##$TPNAME3= <>
##$TPNAME4= <>
##$TPNAME5= <>
##$TPNAME6= <>
##$TPNAME7= <>
##$TPOAL= (0..7)
0.5 0.5 0.5 0.5 0.5 0.5 0.5 0.5 
##$TPOFFS= (0..7)
0 0 0 0 0 0 0 0 
##$TUNHIN= 0
##$TUNHOUT= 0
##$TUNXOUT= 0
##$USERA1= <user>
##$USERA2= <user>
##$USERA3= <user>
##$USERA4= <user>
##$USERA5= <user>
##$V9= 5
##$VALIST= <valist>
##$VCLIST= <CCCCCCCCCCCCCCC>
##$VD= 0
##$VDLIST= <DDDDDDDDDDDDDDD>
##$VPLIST= <PPPPPPPPPPPPPPP>
##$VTLIST= <TTTTTTTTTTTTTTT>
##$WBST= 1024
##$WBSW= 4
##$XGAIN= (0..3)
0 0 0 0 
##$XL= 0
##$YL= 0
##$YMAX_a= 280993
##$YMIN_a= -397821
##$ZGOPTNS= <>
##$ZL1= 120
##$ZL2= 120
##$ZL3= 120
##$ZL4= 120
##$ABSF1= 17.9028
##$ABSF2= -2.116278
##$ABSG= 5
##$ABSL= 3
##$ALPHA= 0
##$AQORDER= 0
##$ASSFAC= 0
##$ASSFACI= 0
##$ASSFACX= 0
##$ASSWID= 0
##$AUNMP= <proc_1d>
##$AZFE= 0.1
##$AZFW= 0.1
##$BCFW= 0
##$BC_mod= 2
##$BYTORDP= 0
##$COROFFS= 0
##$CY= -3
##$DATMOD= 1
##$DC= 0
##$DFILT= <>
##$DTYPP= 0
##$F1P= 0
##$F2P= 0
##$FCOR= 1
##$FTSIZE= 16384
##$FT_mod= 6
##$GAMMA= 0
##$GB= 0
##$INTBC= 1
##$INTSCL= 1.334414e-10
##$ISEN= 128
##$LB= 0.24
##$LEV0= 0
##$LPBIN= 0
##$MAXI= 10000
##$MC2= 0
##$MEAN= 0
##$ME_mod= 0
##$MI= 1.114404
##$NCOEF= 0
##$NC_proc= -6
##$NLEV= 6
##$NOISF1= 3.799351
##$NOISF2= 2.8
##$NSP= 0
##$NTH_PI= 0
##$NZP= 0
##$OFFSET= 17.89303
##$PC= 1
##$PHC0= -13356.4
##$PHC1= 8.000969
##$PH_mod= 1
##$PKNL= yes
##$PPARMOD= 0
##$PSCAL= 0
##$PSIGN= 0
##$REVERSE= no
##$SF= 200.129622280465
##$SI= 16384
##$SIGF1= 3
##$SIGF2= 2
##$SINO= 5.538805
##$SIOLD= 16384
##$SREGLST= <1H.CDCl3>
##$SSB= 0
##$STSI= 16384
##$STSR= 0
##$SW_p= 4006.41025641025
##$SYMM= 0
##$S_DEV= 0
##$TDeff= 16384
##$TDoff= 0
##$TI= <>
##$TILT= no
##$TM1= 0
##$TM2= 0
##$TOPLEV= 0
##$USERP1= <user>
##$USERP2= <user>
##$USERP3= <user>
##$USERP4= <user>
##$USERP5= <user>
##$WDW= 1
##$XDIM= 16384
##$YMAX_p= 387333393
##$YMIN_p= -492919
$$ End of Bruker specific parameters
$$ ---------------------------------
##NTUPLES= NMR SPECTRUM
##VAR_NAME=  FREQUENCY,     SPECTRUM/REAL,   SPECTRUM/IMAG
##SYMBOL=    X,             R,               I
##VAR_TYPE=  INDEPENDENT,   DEPENDENT,       DEPENDENT
##VAR_FORM=  AFFN,          ASDF,            ASDF
##VAR_DIM=   16384,         16384,           16384
##UNITS=     HZ,            ARBITRARY UNITS, ARBITRARY UNITS
##FACTOR=    0.24454680195387, 1,            1
##FIRST=     3580.92536869982, 0,            0
##LAST=      -425.484887710428, 0,           0
##MIN=       -425.484887710428, -492919,     0
##MAX=       3580.92536869982, 387333393,    0
$$ Real data points
##PAGE= N=1
##DATA TABLE= (X++(R..R)), XYDATA
$$ [...]
6653a3020o41M0637q9090J52126l6276k65714k7605M0113O4148R1729o3963n7716
6641a65272M2685j9794O1382j8943N853j71491N0100R0818o5875L7661R2563J9872
6629d0441j04262r4916J24717n9081m2278o404m1164K09058p4763Q6316M9304
6618F086k1238N1814j81069j7805P7088M5196l9943M8340J43300j43608r6206
6607a28045J13987m5990k4669n40J19738l8816L0232L9401n5406N2514m3230N1781
6595G0957j05735m0675L6716k5850K02573o3067J1058M3690r0465n8395K4747
6584E554J83584R9419J3778j43515m4484p032Q2934M9265l9549m7132R7060Q9553
6572C39435M0948J15570j302p3480K0600j25607j40409m4548P2269P491J87327
$$ plain form
6653 -13020 -13661 26976 -62114 90012 53736 -211978 -239583 -199470 -135322 -43593 -107556 -165272
6641 -165272 -122587 -142381 -80999 -99942 -94089 -265580 -215480 -124662 -190537 -152876 -60313 -40441
6629 -40441 -144703 -239619 -114902 -173983 -216261 -222665 -263829 -54771 -129534 -43218 6086
6618 6086 -15152 36662 -144407 -162212 -85124 -39928 -79871 -31531 111769 -31839 -128045
6607 -128045 -14058 -60048 -84717 -85257 34481 -4335 25897 65298 9892 62406 19176 70957
6595 70957 -34778 -75453 -38737 -64587 137986 74919 85977 129667 39202 -19193 5554
6584 5554 189138 288557 302335 158820 114336 107304 190238 239503 199954 152822 249882 339435
6572 339435 380383 495953 494651 421171 441771 316164 175755 131207 203476 210967 398294
6561C98294j18832j41958J59364o5467M073l3439r8811Q1541j09628L7800m4752
6550F8185R7720j01667o1194p8577o1073J27031K1485P7767J03027j73N4816j14840
6538A32507p1813M2426n5646O8311J2921n8554k35382q1686j6174J29741n9108
6527a92457J6980L2082M3360K0810J59542n8348j56334K71333q1486J2863j34274
6516f5929J12439J50153r1566K5288k97774J4166K18933P6904p6969k00122K8707
6505a05770K42034J70627j48614k71855L9729J72484K6918j34737j25350P7677
6495e6857J42678M8497k47537j38799J27368J14271P8131p0560J6120k0893O4182
6484E6601J38163o9380j23137l5661M960O2395k60066L9727K20167L7785K21346
$$ plain form
6561 398294 279462 137504 296868 231401 235474 202035 103224 184765 75137 112937 68185
6550 68185 165905 64238 3044 -75533 -136606 -9575 11910 89677 192704 192531 247347 132507
6538 132507 60694 103120 47474 115785 128706 70152 -165230 -246916 -263090 -133349 -192457
6527 -192457 -175477 -143395 -100035 -79225 80317 21969 -134365 136968 55482 68345 -65929
6516 -65929 46510 196663 105097 130385 -167389 -153223 65710 142614 65645 -134477 -105770
6505 -105770 136264 306891 158277 -113578 -73849 98635 125553 -9184 -134534 -56857
6495 -56857 85821 134318 -113219 -252018 -124650 -10379 67752 -2808 13312 -7581 56601
6484 56601 194764 125384 2247 -33414 -28454 33941 -226125 -186398 33769 71554 292900
6473B92900j49765j13666j3945n577Q8041k56844O9790Q9237R2631P0667q5789
6462G7680L0188R7677q5734K1186j61802q9046J69718j4523N9502r9796O2928
6451F7978m802O6061o7988o5221J51570l6432j0756n8401M0382m7747M7883m7126
6439C5401j05143N9497J11387m5318J3044k0927k8010J2980J35704J20183j04387
6428A84411j52412j19407M1773M7097r2456k2546J10557J33911l7091m3557L9269
6417H9549m6604l1714M3236N1120L1070q0088Q6163O7865p2246J20416j48657
6406A10110j46963p021J0591P6709J08926o1617O7127P1923l8912l1951r6467
6395F2455l0176J9917k8251R1854r661J6707Q052P9244m0355M981j53969J07484
$$ plain form
6473 292900 143135 29469 15524 9947 97988 -158856 -89066 171 92802 163469 77680
6462 77680 107868 205545 119811 140997 -20805 -109851 59867 45344 104846 5050 67978
6451 67978 63176 129237 61249 -3972 147598 111166 100410 42009 82391 34644 82527 35401
6439 35401 -69742 -10245 101142 55824 68868 47941 19931 32911 168615 288798 184411
6428 184411 31999 -87408 -45635 1462 -90994 -113540 -2983 130928 93837 50280 89549
6417 89549 42945 11231 54467 105587 136657 56569 142732 210597 138351 258767 110110
6406 110110 -36853 -43874 -33283 43426 152352 90735 157862 229785 190873 158922 62455
6395 62455 32279 52196 23945 115799 106138 122845 130897 210141 169786 174767 20798 128282
6383A28282J00091r5452O3236L7190J8649J9060K930p4527l2927l3962Q6858J27971
6371C47399k28276l6276N5654R1772o0291j05059k4177q3447K20670J65705m2258
6360C01416p7589M8627J34986Q4596o0082q6114m8117J88162L3451N4389K2773
6349E96498m8144o4771M7124j00784j61598N3153K24990Q9115n741k3527K5425
6338F31740L8636j88863m8874o3212j72386K36030J28467k6048l9431k077J28301
6327F22283N6407j01932k11502J44241J50631r3532R7702L0538M5536m9563k0646
6316F70163J08639q0695L7282J4173L3721K0718k8054k3918R9758J0864R0968
6305I53619n9960L5488m1494P5841l0193p5885K48315k7693N510P7902p3873k7042
$$ plain form
6383 128282 228373 132921 196157 233347 251996 271056 273986 199459 166532 132570 219428 347399
6371 347399 119123 82847 138501 230273 169982 64923 40746 -42701 177969 343674 301416
6360 301416 223827 272454 407440 492036 431954 345840 297723 485885 519336 573725 596498
6349 596498 548354 483583 530707 429923 268325 321478 546468 635583 629842 606315 631740
6338 631740 670376 481513 432639 369427 197041 433071 561538 535490 496059 493982 622283
6327 622283 678690 576758 365256 509497 660128 566596 664298 694836 740372 690809 670163
6316 670163 778802 698107 735389 749562 783283 804001 775947 752029 851787 862651 953619
6305 953619 893659 929147 887653 963494 933301 857416 1105731 1078038 1083548 1161450 1087577 1060535
6293A060535R0489J09162J9608r5421o7465P2522K22553K099L6297O0423J22380
6282A633182J69189J47291j00352R2329J42230K6727L74L0979Q3201P7467k6069
6271B276548N0057K263K4050K4643J55226J45764R7337R4114P2928J46900l8879
6260C050951J15227L8180J95303J51308K68947N9238K45905L66328J68251K72472
6250D932110K05379J43556P7272J95433L69262K01269J94756Q9826K65633M75513
6240G150009K33301K63942M81369M03004M77310N30445L97847N31686M71889O09351
6230A1550153O49039Q19378J059864J010406J472681J718896K176985K481746
6222B2939148L086478L941280M493785N198784O063391P256853Q782116J1077657
$$ plain form
6293 1060535 1151024 1260186 1279794 1184373 1116908 1189430 1411983 1414082 1450379 1510802 1633182
6282 1633182 1802371 1949662 1849310 1941639 2083869 2110596 2110970 2141949 2225150 2302617 2276548
6271 2276548 2326605 2328868 2352918 2377561 2532787 2678551 2775888 2870002 2942930 3089830 3050951
6260 3050951 3166178 3204358 3399661 3550969 3819916 3879154 4125059 4491387 4659638 4932110
6250 4932110 5137489 5281045 5358317 5553750 5923012 6124281 6319037 6408863 6674496 7150009
6240 7150009 7383310 7647252 8128621 8531625 9008935 9539380 9937227 10468913 10940802 11550153
6230 11550153 12199192 13018570 14078434 15088840 16561521 18280417 20457402 22939148
6222 22939148 26025626 29966906 34460691 39659475 45722866 52979719 61761835 72839492
6214G2839492J3651473J5328284J3972765P282200j673957r979285j4881162j5216688
6206H1323122j3419201j0623662q142282o238664m826840l734405l206704k752054
6198B8379310k721586k069617k234082j831215j505220j582041j148599j072989
6190A4213961q07960p24515p11064o28580o57327m72857m96107p27934n12418
6181H475199l46465m28902l10602k96680j97496l45319k07361j82406k23049p3119
6171E863800l97164M9626j84326k76845k55249l14185j00512q5313k56006k55879
6161C787947r7533q228j18280k34325j20842k52260J29608j47813k07756p7513
6151B653005j59560R1225l6493j75971k0916l7874m7011o3521q3513P8997j35911
$$ plain form
6214 72839492 86490965 101819249 115792014 123074214 121400257 111420972 96539810 81323122
6206 81323122 67903921 57280259 49137977 42899313 38072473 34338068 31131364 28379310
6198 28379310 25657724 23588107 21354025 19522810 18017590 16435549 15286950 14213961
6190 14213961 13406001 12681486 11970422 11341842 10684515 10211658 9715551 8987617 8475199
6181 8475199 8128734 7699832 7389230 7092550 6895054 6549735 6342374 6159968 5936919 5863800
6171 5863800 5466636 5516262 5331936 5055091 4799842 4485657 4385145 4299832 4043826 3787947
6161 3787947 3690414 3682186 3563906 3329581 3208739 2956479 3086087 2938274 2730518 2653005
6151 2653005 2493445 2584670 2548177 2372206 2351290 2313416 2266405 2202884 2119371 2198368 2062457
6140B062457J0260J75290j49121j41050K4697K455J8190j37992m314j6614Q1716
6129A925974N2402l7583p3823k38008J24777O8222k61444j55432p5601L3489o7987
6118A294986p2964k02909k0417L9414P1315J32586L0239r2477j25333q83q188
6107A045369n8506k40446j09172k27041J69894L4548j97797J54037n5304L4573
6097E50155k3655k8808J26559l4088n056k3804O857J29955j04943j06977r7221
6086C88974j32859N4488o0795R0539J14069j49869J68844j4017Q2884m7777j12765
6075C81716N5061j65309J34191K2085n1284k078j30868R6003K4058m4380n7325
6064B61870O9202O8413P3006j17955o0072J08613m654k0245q5245j0505k9012
$$ plain form
6140 2062457 2072717 2248007 2098886 1957836 1982533 1984988 2003178 1865186 1860872 1844258 1925974
6129 1925974 1978376 1940793 1866970 1628962 1753739 1821961 1560517 1405085 1329484 1362973 1294986
6118 1294986 1222022 1019113 998696 1038110 1109425 1242011 1272250 1179773 1054440 1053557 1045369
6107 1045369 986863 746417 637245 410204 580098 614646 416849 570886 515582 550155
6097 550155 526500 497692 624251 590163 585107 561303 568160 698115 593172 486195 388974
6086 388974 256115 310603 249808 340347 454416 304547 473391 459374 542258 494481 381716
6075 381716 436777 271468 405659 427744 376460 374382 243514 339517 363575 319195 261870
6064 261870 331072 399485 472491 354536 294464 403077 398423 378178 292933 282428 253416
6053B53416J06264Q541j32195L7881M8203Q9567j49439L5074N8533p2412k9133
6042B54300j75891j65080M4137K34593K6439k9017o8008k9527J29297L7658j04654
6031A54247j03712J2709K4848J12016q0442k62522O9209J87308l4022r3072P6426
6020F2993J06858J45767r143m2178j3856M3814l8629L6466j44468j29434R2543
6009A10733q6863R223J33116j18990J54389R9100O2900j28750m6098K8495p7565
5998A39690r2274q2987Q7609Q3876R2977r2996l7420n1245j03131J14361Q2465
5987A40925k9499n7810J03043r9131o7216p6350R7448J11159j42116l926k1833
5976d5306R5078J27223j46744J53038p7302j03667N596Q8386j192j42137K8283
$$ plain form
6053 253416 359680 368221 236026 273907 322110 411677 262238 297312 355845 283433 254300
6042 254300 78409 -86671 -42534 192059 218498 189481 121473 91946 221243 258901 154247
6031 154247 50535 63244 88092 200108 119666 -142856 -73647 113661 79639 -13433 62993
6020 62993 169851 315618 306475 264297 250441 294255 255626 292092 147624 18190 110733
6009 110733 23870 33093 166209 47219 201608 300708 363608 234858 188760 217255 139690
5998 139690 47416 -35571 52038 135914 228891 135895 98475 47230 -55901 58460 140925
5987 140925 111426 53616 156659 57528 -9688 -86038 11410 122569 -19547 -23473 -45306
5976 -45306 49772 176995 30251 183289 105987 2320 7916 96302 95110 -47027 -18744
5965a8744l0859J16762n2618k6632n0532N2440K421l8393N3607O8471k0644L7162
5953I2441k753j44625O4000M4606o993K53Q6609j30947j73049L19152J1670R736
5941A70100m6253m0100K1318J7745N815j57452k63883K57927J30464j04456Q5696
5930G6921P2533J06298J2826l8401k04047K1047P9848j14693J20940j09191K6746
5919E0827j0980k0177P4994j29135j9867p718J74926N007m0777K3443N7212R944
5907A67699r7046m1359k18257K4082n6014Q0270Q0351j8648k1434L1424J05252
5896C6320l1319q2248P373J46745n2950k2143l0168j99144J86066j12223k4885
5885a78576l0463j5485K24340L3073J94000N7302r4009P4858j09219p1608j03980
$$ plain form
5965 -18744 -49603 67159 14541 -12091 -62623 -10183 -7762 -46155 7452 75923 55279 92441
5953 92441 89688 -54937 9063 53669 46676 46929 133538 2591 -170458 148694 160364 170100
5941 170100 123847 83747 105065 122810 128625 -28827 -292710 -34783 95681 -8775 76921
5930 76921 149454 255752 268578 230177 26130 47177 127025 12332 133272 24081 50827
5919 50827 39847 19670 94664 -34471 -54338 -62056 112870 117877 77100 100543 157755 167699
5907 167699 70653 29294 -188963 -164881 -220895 -140625 -60274 -78922 -100356 -68932 36320
5896 36320 5001 -77247 -69874 76871 23921 1778 -28390 -227534 -41468 -153691 -178576
5885 -178576 -209039 -224524 -184 32889 226889 284191 190182 265040 155821 84213 -19767
5874a9767j38032N9139J02040K21679j4387P2201j74524j46873N2353p8783K00196
5863A35242J02808j07338J83337L1810P6602j00089l4690p4738j11946L5269N0160
5852A86427L16951K06479j04750J34824j39299k53622j40713P3256J69075j12451
5842C36177m7307J28151j50973o4500K111L1900j11237j61759J01438p2380J57954
5831A49575P0292j9288P4360k68153P8859k51954l2061O7329m3987P2325j3511
5820a16214R7200n1052J12944k487j11055m1816Q2788R3687J42079p7189o0597
5809F8288O3274p8438J76360j95802j06574J9224l712K18645j34591J4996j54454
5798a12784o4271P2696M4929K7611j79680N0974J12892q5917R9019n6800J16824
$$ plain form
5874 -19767 -157799 -98660 3380 225059 210672 282873 108349 -38524 13829 -64954 135242
5863 135242 238050 130712 314049 345859 422461 322372 287682 212944 100998 136267 186427
5852 186427 503378 709857 605107 739931 600632 347010 206297 279553 448628 336177
5842 336177 288870 417021 266048 201548 203659 235559 124322 -37437 64001 -8379 149575
5831 149575 219867 200579 274939 6786 85645 -166309 -198370 -131041 -175028 -102703 -116214
5820 -116214 -19014 -70066 42878 40391 -70664 -112480 -29692 63995 206074 128885 68288
5809 68288 131562 53124 229484 33682 -72892 -53668 -57380 161265 26674 41670 -112784
5798 -112784 -177055 -104359 -59430 -31819 -211499 -160525 -47633 -133550 -34531 -91331 25493
5787B5493n7698K209L5541j75822L782J77003J04216P9856r879k656k5817m5644
5775A10584j8025j04198p5496o854K6941M8213n2010M7206k0490j33709J1514
5764a66324Q5653M1519p3076Q6139r165P6392k1471j19976L800N6243J3606N611
5752b1049L1365J15176j34287M9455L0627j8563l3436n927J48194m367k3390m8762
5740H5036P3086L3705n9042M4595o037n2319J0750p9080Q356k9105J53865j9269
5728A64541L9130r7632P9228p4819j6873Q2720j99230P448O8619O4047q3608j51165
5716a17594N2572o4089j09811Q4417J13499k5274J41559J03016j97190j54345
5706a73240m2425j13949R3878L032l8647L43868j06355R8768k3312j9774k0354
$$ plain form
5787 25493 -32205 -29996 5545 -170277 -166495 10508 114724 194580 184701 182045 156228 110584
5775 110584 92559 -11639 -87135 -93989 -67048 -18835 -70845 -23639 -44129 -177838 -166324
5764 -166324 -80671 -39152 -112228 -26089 -35254 41138 19667 -100309 -96509 -40266 -26660 -21049
5752 -21049 10316 125492 -8795 40660 71287 52724 19288 13361 161555 157188 133798 85036
5740 85036 158122 191827 132785 177380 171343 119024 129774 50694 59050 29945 183810 164541
5728 164541 203671 106039 185267 110448 93575 176295 -22935 -15487 53132 117179 33571 -117594
5716 -117594 -65022 -129111 -238922 -154505 -41006 -66280 75279 178295 -18895 -173240
5706 -173240 -215665 -329614 -235736 -232704 -271351 72517 -33838 64930 41618 21844 1490
5695A490j42501J66109p4998O6315R3688o6666O0025k11211k3850r1563k0859
5684b44021O2855r5063K80133J72381j6839J29860j832J29316k23047J784J05527
5673C01054n5946K0644m4120j01294j74629J241N1672n7720K1922p9984p5637
5662a92797K29674J32116p730j36817m7438J35599j98026K8333n4842n2086N4871
5651a09143O1057J27131j10238j77805Q2529j1603k0662K07525L7287J5798o7435
5640C4441J06448j33452j00455r3546L4426J7699n7619J9888j45517J83016q400
5629a43071J85911K9286j36206N333P5695R5047j37429J12358K0544J39257l7431
5618B09294j54867l108J30651p6316r7132R02m3654K46335M5064L102o9226p9050
$$ plain form
5695 1490 -141011 25098 -49900 16415 110103 43437 103462 -107749 -131599 -223162 -244021
5684 -244021 -181166 -276229 3904 176285 159446 289306 287474 416790 193743 195527 301054
5673 301054 245108 265752 221632 120338 -54291 -53050 -1378 -59098 -37176 -117160 -192797
5662 -192797 36877 168993 161263 24446 -22992 112607 -85419 -57086 -111928 -164014 -109143
5651 -109143 -48086 79045 -31193 -208998 -126469 -138072 -158734 48791 86078 101876 34441
5640 34441 140889 7437 -93018 -186564 -152138 -134439 -192058 -172170 -317687 -134671 -143071
5629 -143071 42840 72126 -64080 -58747 16948 111995 -25434 86924 107468 246725 209294
5618 209294 54427 51319 181970 105654 8522 9424 -34230 212105 257169 260271 191045 111995
5606A11995J6359k82047J67441j24384n7562J03878N131J18997k8519j28700L0209
5595f7202K8665K9496L1488J493N5195k549r5224N0818r366k5859m2580j4555
5583f0180j7124Q8079L6632O9521k360j75130n655l0449N1922N4324j48419J61006
5571B2167J76155K9534p4332p594O4041j43909p1679L4032P4107m7661P6857P1870
5559B03588L3049q7571n6189q3973K6907o042j36144K8544J41086k459P91j79311
5547a17724r9599q359K1155M6513K08196P5311l5966Q0097l4087J29167j39136
5536A25568j95169J03816P0527o8451L1353P2000j65568p6743j16635M2358n9630
5525b36574M4000J26581J24173n7745R1209L9594l1009R9637k25295P9288j4197
$$ plain form
5606 111995 128354 -153693 13748 -110636 -168198 -64320 -59189 59808 31289 -97411 -67202
5595 -67202 -38537 -9041 22447 23940 79135 76586 -18638 32180 22814 -3045 -45625 -60180
5583 -60180 -77304 10775 47407 116928 114568 -60562 -66217 -96666 -44744 9580 -138839 22167
5571 22167 198322 227856 153524 145930 209971 66062 -5617 28415 102522 54861 131718 203588
5559 203588 236637 149066 92877 8904 35811 29769 -106375 -77831 63255 60796 61587 -117724
5547 -117724 -217323 -225682 -204527 -158014 50182 125493 89527 169624 135537 264704 125568
5536 125568 -69601 34215 104742 36291 67644 139644 -25924 -102667 -219302 -176944 -236574
5525 -236574 -192574 -65993 58180 435 91644 131238 100229 199866 -25429 53859 39662
5514C9662Q2523R3467m5793J44813j72932k8403L6188k4425N0276m641P2890N609
5502B49234N8024J1705j1606j04528j33966M3345q3996n0210Q2574J4705O94J61050
5490B37025j29604j5536M2253n5619J8835r0577J80054j17233k4192P1260j03868
5479A2798J1454j34461J58738l304Q7498J68518O158K0297j64360j12767J4050
5468F4619r1053n2284O480M5336J87265K0109O4793l8186k0855R9647j13363J34561
5456C07069r400m1648J25809P345K6106l07958r5455L9893q3408J86216r2834
5445F1735J3751J75688N3014j1277k38107J63149j29186N8760K7851j69824O6198
5434G1752n9527K06542J14650r8302m796j42338K01222M273M6704O8029j97415
$$ plain form
5514 39662 122185 215652 169859 314672 141740 113337 149525 125100 175376 170735 243625 249234
5502 249234 307258 318963 307357 202829 68863 112208 28212 -21998 60576 75281 75975 237025
5490 237025 107421 91885 134138 78519 97354 6777 186831 69598 45406 116666 12798
5479 12798 24252 -110209 48529 45225 132723 301241 307399 327696 163336 50569 64619
5468 64619 -26434 -78718 -72238 -26902 160363 180472 245265 207079 186224 285871 172508 307069
5456 307069 297669 256021 381830 389175 415281 107323 11868 51761 -31647 154569 61735
5445 61735 75486 251174 304188 292911 54804 217953 88767 147527 175378 5554 71752
5434 71752 12225 218767 333417 235115 230319 87981 289203 293476 340180 408209 210794
5423B10794j88640Q9156K0495j06185p4449j7454K10628p369m5675P3721N3902
5412B18924R789n1210l2655M134K8757q5106J07971j4984n0417J01451n4193J24607
5400C07068p7578l9642J12022L4883M7423m6771k3957j6296m8853j79756J51561
5389B20104p320q1276O8117j46770K46536Q0800r7119K3938r7664J29991j8299
5378C21038O1749J43039N0220r4487J811J25849k11836p1830M0646Q3378J526
5367D51103J19239m7276J8297q3072N6143o6642j06264k2330j44448K11165J24387
5356E10302j13833K8980l3702K40823q3996j28339P9090M0082K09292J08593K30409
5345A087701l9407k23577m2750j13527J3355j58840j43419K53909O3911N389m0515
$$ plain form
5423 210794 22154 111310 131805 25620 -48829 -66283 144345 136976 91301 165022 218924
5412 218924 228713 177503 144848 148982 177739 92633 200604 185620 135203 236654 182461 307068
5400 307068 229490 189848 301870 336753 384176 337405 313448 297152 248299 68543 220104
5389 220104 212784 131508 199625 52855 299391 380191 283072 307010 209346 339337 321038
5378 321038 382787 525826 576046 481559 483370 609219 397383 325553 366199 449577 451103
5367 451103 570342 523066 541363 458291 514434 447792 341528 319198 174750 385915 510302
5356 510302 396469 425449 391747 632570 548574 420235 499325 539407 748699 857292 1087701
5345 1087701 1048294 824717 781967 668440 681795 522955 379536 633445 697356 702745 662230
5334F62230o2606m6219o9454l8816j54048J33727k7572m1171J23928n1273l8640
5323C90086P7910J9026O6103J9653j19839J09606J17557j79363l0811m093r4315
5312C71520l5361N4253Q1203J08238P8743k3453O3407p9862j06845j01976k6319
5301C83548r1976Q0131J51896O6723r9329P813N2438j22539P5250k1277n7497
5290D25181K00172j16082K23368j18277j47240j39038j38873J33061k21117J7413
5280A18568K05977J74535L4017j02443j7022J00722J8073l340q6131l2385Q3600
5269D94171J36379M3751k11987J18599j21618o4735R3479N9538O3901j25577K95356
5258G81257K2691j59228R031j65785P5118m262k07136J96430L9183Q8982P7172
$$ plain form
5334 662230 599624 553405 483951 445135 291087 424814 397242 356071 479999 428726 390086
5323 390086 467996 487022 553125 572778 452939 562545 680102 500739 469928 465835 371520
5312 371520 336159 390412 471615 579853 658596 635143 698550 618688 511843 409867 383548
5301 383548 291572 371703 523599 590322 490993 498806 551244 428705 503955 482678 425181
5290 425181 625353 509271 732639 614362 467122 328084 189211 322272 101155 118568
5280 118568 324545 499080 533097 430654 413632 514354 532427 529087 442956 410571 494171
5269 494171 630550 674301 462314 580913 459295 394560 488039 547577 611478 485901 781257
5258 781257 803948 644720 653751 487966 563084 558822 351686 548116 587299 676281 753453
5247G53453M4544j71605k4135J06080j51142L5555n3971j21810K42715M834r5546
5236E68972q3681j26287L05898R693J29414r3544J8551K63320j55071O9110j68751
5225G37624L281Q3641Q4411P7849p8025r6025o5550K9914R7513j60361K8192K29361
5213I71825K510P9060j1158j49931R219L8515J7867j13059J16468J21284L2623
5202A115223K10348q2389R4243q1360n7529n1204l4420K21498J0393Q9981m4189
5191A390595o0781J60783j69635J3208M3371K3355l4024J9062K2089J83090J29266
5180A720379J7839j11485j21368j3386Q6017K83802M3449P2679O6250l4580o935
5169B002661J29856j9356m0372Q3940J02144k5658K2860p6343j29155l505q5780
$$ plain form
5247 753453 797997 626392 602257 708337 557195 592750 538779 416969 659684 664518 568972
5236 568972 485291 359004 664902 674595 804009 710465 729016 992336 837265 906375 737624
5225 737624 740905 824546 908957 986806 908781 812756 747206 777120 874633 714272 742464 971825
5213 971825 974335 1053395 1042237 892306 901525 940040 957907 844848 961316 1082600 1115223
5202 1115223 1325571 1243182 1337425 1256065 1198536 1147332 1112912 1334410 1344803 1434784 1390595
5191 1390595 1329814 1490597 1320962 1334170 1377541 1400896 1366872 1385934 1408023 1591113 1720379
5180 1720379 1738218 1626733 1505365 1491979 1577996 1861798 1905247 1977926 2044176 2009596 2002661
5169 2002661 2132517 2113161 2072789 2156729 2258873 2233215 2256075 2179732 2050577 2047072 1961292
5158A961292o0871O1218K83130J89681J00387J1795P1049J14832K5336m7645j9980
5147B690224m7687K48963L93317l943N3480J55203J1120J61143O604O3750J085
5136C733259j19359J48856N1498P6099O7512r6284k8784N1053M7577J67644K46086
5125D345157K74009K26062K96935J73165J62901J60119J60465J40344K52014K58638
5115F449809K60829L17256J41052J20064K41157K88839K51988K66631L37766L50309
5105I025700M89880M89450M01456K05659M11678K96054M27413N86426O28608P49409
5095A3711733P36630Q84171J079524J072930J216495J335052J492156J889768
5087B3418459J960613K382430K766564L432107L881102M714745N567544O646381
$$ plain form
5158 1961292 1900421 1961639 2244769 2434450 2534837 2546632 2617681 2732513 2757849 2710204 2690224
5147 2690224 2642537 2891500 3284817 3280874 3334354 3489557 3500677 3661820 3668424 3732174 3733259
5136 3733259 3613900 3762756 3814254 3890353 3957865 3861581 3832797 3883850 3931427 4099071 4345157
5125 4345157 4619166 4845228 5142163 5315328 5478229 5638348 5798813 5939157 6191171 6449809
5115 6449809 6710638 7027894 7168946 7289010 7530167 7819006 8070994 8337625 8675391 9025700
5105 9025700 9515580 10005030 10406486 10612145 11023823 11319877 11747290 12333716 12962324 13711733
5095 13711733 14448363 15332534 16412058 17484988 18701483 20036535 21528691 23418459
5087 23418459 25379072 27761502 30528066 33960173 37841275 42556020 48123564 54769945
5079E4769945P531676O668112L458421r78429l955123n065372n106585l966930
5071E3355715k470634j793339j565133j453093j056033o82196k35585O08369J224665
5062D5932736J998526K726123L472113M320961N347443O523156P760293R671543
5054H7752894J1996088J4012411J3488307P444738k779304j0263874j3462299
5047A08188961j3868565j1998571r768044p308937n618388m339069l481306k707226
5039D9098855k164620j712179j209153q64132q0945L13010R01297J414397K323862
5030D8020392L077630L788593M853792N921472N949269L776983l99622m708639
5022G0279870o726273p330476o913236n485067m762184l722482l183864k683570
$$ plain form
5079 54769945 62301621 68969733 72428154 71449725 67494602 62429230 57322645 53355715
5071 53355715 50885081 49091742 47526609 46073516 45017483 44335287 44099702 44708071 45932736
5062 45932736 47931262 50657385 54129498 58450459 63797902 70321058 78081351 87752894
5054 87752894 99748982 113761393 127249700 134694438 131915134 121651260 108188961
5047 108188961 94320396 82321825 72553781 65244844 59626456 55287387 51806081 49098855
5039 49098855 46934235 45222056 44012903 43148771 43067826 43380836 44282133 45696530 48020392
5030 48020392 51098022 54886615 59740407 65661879 71611148 75388131 74988509 70279870
5022 70279870 63553597 56223121 49309885 43824818 39062634 35340152 32156288 29472718
5014B9472718k172572k078538j540760j559098j211612j142267r85574q56523
5006A7925774p54503p14939m20312l54362l02205j31751k31732j98324n42826
4997A4274820m20729n71933p31734o08363q01628m00677l62853n10851l54582
4988I511470l05776k98851m05283j02718j12436k86514j33030j12486j59679q5497
4978G509200j98952o3871Q6091j50108n3870k0345j26603j78215k29021l33839
4968F240467k15765j64022j90660k06841l28542q4148j77523j19014k03688m2301
4958D507963k11884n4906k3157j86742m5764j50411N9718q7530j55928K25j44626
4947C506958q7987j27397j5341j12520j29053m9592m8747P2538k7150L3838L1581
$$ plain form
5014 29472718 27300146 25221608 23680848 22121750 20910138 19767871 18782297 17925774
5006 17925774 17171271 16456332 16036020 15681658 15379453 15247702 15015970 14817646 14274820
4997 14274820 13854091 13282158 12550424 11942061 11140433 10739756 10376903 9866052 9511470
4988 9511470 9205694 8906843 8501560 8398842 8286406 7999892 7866862 7754376 7594697 7509200
4978 7509200 7310248 7246377 7332468 7182360 7128490 7108145 6981542 6803327 6574306 6240467
4968 6240467 6024702 5860680 5670020 5463179 5134637 5050489 4872966 4753952 4550264 4507963
4958 4507963 4296079 4241173 4218016 4031274 3985510 3835099 3894817 3807287 3651359 3651584 3506958
4947 3506958 3418971 3291574 3276233 3163713 3034660 2985068 2936321 3008859 2981709 3015547 3047128
4936C047128l9325r9668J9446j9060N5526o0922k24049j70490n5812R7594j22020
4925B428348p3523J89725j56851J25043o7905J972k3887m0352p1660P5091J9984
4914B405985M7944L3757J14252j02594k7974J41772j05707R0245J73144J98498
4904B969322K11925J13558K82438R7468J23339m9227j54147J04484j76363j8244
4894C504553j76808q3645j9486k42755P9318l099m7922O7450l48L35196r4975
4883C317479J23079K76063J06371K98086J36250L08276M04560J97409L44385J27792
4873E639750M4749j01162j60291l60941l33171k25055o5401k16142o6903j50804
4863D004629m0464l7784n2920J45804l9011J84363L6335O072M04803K60916K97988
$$ plain form
4936 3047128 3007803 2908135 2927581 2908521 2964047 2903125 2679076 2508586 2452774 2550368 2428348
4925 2428348 2354825 2544550 2387699 2512742 2444837 2446809 2422922 2382570 2310910 2386001 2405985
4914 2405985 2453929 2487686 2601938 2499344 2471370 2613142 2507435 2597680 2770824 2969322
4904 2969322 3181247 3294805 3577243 3674711 3798050 3748823 3594676 3699160 3522797 3504553
4894 3504553 3327745 3244100 3224614 2981859 3061177 3058078 3010156 3077606 3077258 3412454 3317479
4883 3317479 3440558 3716621 3822992 4121078 4257328 4565604 4970164 5167573 5511958 5639750
4873 5639750 5684499 5583337 5423046 5062105 4728934 4503879 4438478 4222336 4155433 4004629
4863 4004629 3964165 3926381 3873461 4019265 3980254 4164617 4200952 4207024 4611827 4872743 5170731
4852E170731M19448M87533N01632N80461P21400Q31102J178919J198192Q93840
4843A1983258j32065j012425j289613j258034j068735p91245o46286k96556l47606
4834E140693m92566j43028k02562k4810j3494k04881p1239Q4016n9894j39592
4824C872643Q9908q7159Q5838L42812K66454Q9030j24562j35359k55509j51257
4814C992839j69107l92355m0422P2085m1289M0155k41457n298j6547P8070R2360
4803C369034j64538Q7799N7527R828j21585k7038q9089K0108Q5115j0703J47231
4792C363689J8300j5418Q4991L6100P9499q4489n3286K43125J59064n6830J64547
4781C939292Q348L50685N7332R154n2199r9143K54487j5920J21010P3106J38912
$$ plain form
4852 5170731 5590179 6077712 6579344 7159805 7881205 8712307 9891226 11089418 11983258
4843 11983258 11851193 10838768 9549155 8291121 7222386 6431141 5784855 5488299 5140693
4834 5140693 4648127 4505099 4302537 4277727 4264233 4059352 3988113 4072129 4012235 3872643
4824 3872643 3962551 3875392 3961230 4304042 4570496 4659526 4534964 4399605 4144096 3992839
4814 3992839 3823732 3431377 3390955 3463040 3421751 3461906 3220449 3215151 3198604 3276674 3369034
4803 3369034 3204496 3292295 3349822 3359650 3238065 3211027 3121938 3142046 3227161 3216458 3363689
4792 3363689 3381989 3366571 3451562 3487662 3567161 3482672 3429386 3672511 3831575 3774745 3939292
4781 3939292 3947640 4298325 4355657 4364811 4312612 4213469 4467956 4452036 4573046 4646152 4785064
4770D785064J76061n7071K51922P7202m2993J78098J11291M26944J04222Q6827
4760F097567K13230J95477K04770M7532K33982K09848K25105L66060K17159J08712
4750H119442J29035n285M04860N4973J32272K82234J68649L30989L41605L73947
4740A0332721J85913L99581M41816N83681N02434O42717O47480O78637M22109
4731A4837089O84979P05066P89637R56153R97663J462791J255574J750911J987665
4722B5427528K025650K606966K797176L540065L886020M364241M792697N159038
4714E4599381N591473M849768L135127N36839j088054k117571k567462k312711
4706F0626790k004167j725007j280929p50136l10413O61988J339217K107439L077765
$$ plain form
4770 4785064 4961125 4904054 5155976 5233178 5190185 5368283 5479574 5906518 6010740 6097567
4760 6097567 6310797 6506274 6711044 6758576 6992558 7202406 7427511 7793571 8010730 8119442
4750 8119442 8248477 8243192 8648052 8703025 8835297 9117531 9286180 9617169 9958774 10332721
4740 10332721 10518634 10918215 11360031 11943712 12446146 13088863 13736343 14414980 14837089
4731 14837089 15522068 16227134 17016771 17972924 18970587 20433378 21688952 23439863 25427528
4722 25427528 27453178 30060144 32857320 36397385 40283405 44647646 49440343 54599381
4714 54599381 60190854 65040622 68175749 68712588 67624534 65506963 62939501 60626790
4706 60626790 58622623 56897616 55616687 54866551 54556138 55218126 56557343 58664782 61742547
4697F1742547L819973M470532N220362O281524O823727P982948Q371016Q524925
4689A13237554Q696383P153192K704635m382981r349141j1510668j1484420r974631
4681H5089923q133674o465216n100008m157171l427306k755078j973455j268294
4673E1809721n26099M6414P75399J477348J938371K565963L001434L185760L359604
4664F7633915L651721L250896K158182n93790m172362o232811o839021o539823
4656E2316907n670799m556543l630031k944767k396884k032878j684634j615627
4648B7784744j622633j656192j433007j321355j231020j114035j085928j034557
4640A7286017n78514n36858m22637n67499n45267n05670n32514k10812m63582
$$ plain form
4697 61742547 65562520 70033052 75253414 81534938 88358665 96341613 104712629 113237554
4689 113237554 121933937 129087129 131791764 127408783 118059642 106548974 95064554 85089923
4681 85089923 76956249 70491033 65391025 61233854 57806548 55051470 53078015 51809721
4673 51809721 51283622 51330036 52105435 53582783 55521154 58087117 61088551 64274311 67633915
4664 67633915 71285636 74536532 76694714 76100924 71928562 65695751 58856730 52316907
4656 52316907 46646108 42089565 38459534 35514767 33117883 31085005 29400371 27784744
4648 27784744 26162111 24505919 23072912 21751557 20520537 19406502 18320574 17286017
4640 17286017 16707503 16170645 15748008 15180509 14635242 14129572 13597058 13386246 12922664
4631A2922664j58812j33572k26747n4286k0160J2607Q787P476k88055m10050n09721
4620A1150131m83950n37167m08486l66851l07993k61306l92657j40439m03663
4611G847619j95230j45479j44857m4224k44066j97225j97872q8540J3775j713
4601F602188o5862K2589J41840q5815j06335j53833j50400j59834k87924k07428
4591E549186q1878j95279j52406p4703j52882n0598p1509j78225l1939q1791l5133
4580D442843m029J15488l6108j23604J6455n4645J09498O5294L1139P8954O7716
4569D709001J13066m523J09594K04612P3399K26697L52924M27847M50869M37365
4559G100851M76250L70682J50189J05457J69473L53948M75759Q37164Q89631J094938
$$ plain form
4631 12922664 12763852 12630280 12403533 12349247 12329087 12341694 12350481 12357957 12069902 11659852 11150131
4620 11150131 10666181 10129014 9720528 9353677 9045684 8784378 8391721 8251282 7847619
4611 7847619 7652389 7506910 7362053 7317829 7073763 6876538 6678666 6590126 6603901 6602188
4601 6602188 6536326 6558915 6700755 6614940 6508605 6354772 6204372 6044538 5756614 5549186
4591 5549186 5467308 5272029 5119623 5044920 4892038 4841440 4769931 4591706 4559767 4477976 4442843
4580 4442843 4438814 4554302 4518194 4394590 4411045 4356400 4465898 4531192 4562331 4641285 4709001
4569 4709001 4822067 4817544 4927138 5131750 5205149 5431846 5784770 6212617 6663486 7100851
4559 7100851 7577101 7947783 8097972 8203429 8372902 8726850 9202609 10039773 10929404 12024342
4549A2024342J449702R16021J05316p68800j095996j253442r85939p28638m06724
4540I255842k81207k97623n3699K3660Q140l6800J59405O9074N56682N81331O89432
4529A0674237Q11462Q70260R78610R07602J266312J309560K071912K448333K321706
4520B3659994R59699j212304k225862k576004k325569j870399j415770r86246
4512A2007539q21367p25726p11021o58630o01876j80834j16838j32227j01453
4503G957567L098K90996M04501M84559K10990L99591N84372R29242R48513J005814
4493A3219243P54738j07515r48075j306613j414305j349181j023815n92215n29093
4484F703169l93342m42905m52585m11865j99635k54390m08066j89482j89681m9283
$$ plain form
4549 12024342 13474044 14390065 14495381 13726581 12630585 11377143 10391204 9662566 9255842
4540 9255842 8974635 8677012 8623313 8646973 8655113 8618313 8777718 8846792 9403474 9984805 10674237
4529 10674237 11485699 12355959 13334569 14242171 15508483 16818043 18889955 21338288 23659994
4520 23659994 24619693 23407389 21181527 18605523 16279954 14409555 12993785 12007539
4512 12007539 11186172 10460446 9749425 9090795 8488919 8308085 8191247 8059020 7957567
4503 7957567 7960665 8251661 8656162 9140721 9351711 9751302 10335674 11264916 12213429 13219243
4493 13219243 13973981 13866466 12918391 11611778 10197473 8848292 7824477 7232262 6703169
4484 6703169 6309827 5866922 5414337 5002472 4802837 4548447 4140381 3950899 3761218 3711935
4474C711935k00264l35160j12709l8578j76746m8134j52518k44815L3354K8173
4464B464538O2641k25416k24852j37548L3017K1451k79043J03064l7020K9793
4454A810625P7287j10520j42851n4058L1190j03746j19799l0830n9392J43605
4444A441511J10630j75161j67223m012K3990o0223j11869n3906N9488K41434m4579
4433A260080m3619K2757j18409q7051P9593q9707M9854J62378J7662J14787j27565
4422A240760N8388M1299o1341j46072p2055n047K3989Q7467l3478j62970q5287
4411H85653j04133l9985J74342L3462p46J38477K4645N0357Q7389j28271j19396
4400A001794Q2198L3228N754O3771J3418P697o9606r7487r1730j4118o6676q6654
$$ plain form
4474 3711935 3511671 3176511 3063802 3025224 2848478 2800344 2647826 2403011 2436365 2464538
4464 2464538 2527179 2301763 2076911 1939363 1972380 1993831 1714788 1817852 1780832 1810625
4454 1810625 1887912 1777392 1634541 1580483 1611673 1507927 1388128 1357298 1297906 1441511
4444 1441511 1552141 1376980 1209757 1205745 1229735 1169512 1057643 1003737 1063225 1304659 1260080
4433 1260080 1216461 1239218 1120809 1033758 1113351 1023644 1073498 1235876 1253538 1368325 1240760
4422 1240760 1299148 1340447 1279106 1133034 1060979 1055932 1079921 1167388 1133910 970940 885653
4411 885653 781520 741535 915877 949339 948593 1087070 1111715 1162072 1249461 1121190 1001794
4400 1001794 1083992 1117220 1122974 1186745 1200163 1207860 1138254 1040767 949037 934919 868243 781589
4388G81589o4809j3109j0845P2808j12848j43719J28189j00800k7248J41686p2260
4377E78634R2033N2000J9635j22293j2050N0738l1898Q4042N8807r6545J10710
4366G83813m0754j75126q8188r4359J13098j75716J28455L7527R9295Q7548k46115
4355D29478O3389j19688o8880J06449q9836J40271j66565J35231K30647j16858
4345E43638J13728l08706o4503P3622j61708l6237k1161J09760J70798l4627p9946
4334C04658j75212J41334o1458j2546J32294n6020K18820k0192r3585n2163j39790
4323A86140J29334m7459R6077k5325j34375K33412p9943J09370j65898j11327
4313A90006P0801j57908O8809J3747K9962R1930J056k9466j41897Q3039L5348
$$ plain form
4388 781589 716780 703671 692826 765634 652786 509067 637256 536456 509208 650894 578634
4377 578634 670667 722667 742302 620009 607959 658697 626799 710841 769648 673103 783813
4366 783813 743059 567933 479745 385386 498484 322768 451223 488750 588045 675593 429478
4355 429478 492867 373179 304299 410748 320912 461183 294618 429849 660496 543638
4345 543638 657366 348660 284157 357779 196071 159834 138673 248433 419231 384604 304658
4334 304658 129446 270780 209322 196776 329070 273050 491870 471678 378093 325930 186140
4323 186140 315474 268015 364092 338767 204392 437804 357861 467231 301333 190006
4313 190006 260807 102899 171708 185455 215417 307347 308403 278937 137040 220079 255427
4302B55427r618j289j10400R3322J0001K8351J44276k75051j2818J32890n7957
4291A97134L7557k12704K17417P4680K0155J6352k21308o6679p3477J39652K2251
4280A51030n4764J67952n4141p965J18181j02249q1427m8005J05611m5909J0771
4269A59085l0205O3880N1816j09303L1765O8710J7820O185n4950J71119q865K6163
4257C93220j14322k9241J25024q9862r2489m9996Q718K9197q284Q1449j62282
4246I1132j00855K27149j21655K24319j27425P4145K23581q7176N895j12472k20219
4235G6419k1909j09253J06052J04166J8490K4132j56937J21475r2853R5171o3394
4224A01559Q1462J75630k65254K41893N717m3828N9914k55705P7730o0935O7203
$$ plain form
4302 255427 245809 244520 134120 227442 237443 265794 410070 135019 122201 255091 197134
4291 197134 234691 21987 239404 314084 334239 350591 129283 62604 -10873 128779 151030
4280 151030 96266 264218 210077 202112 320293 218044 136617 88612 194223 148314 159085
4269 159085 128880 192760 244576 135273 167038 235748 253568 259753 204803 375922 367057 393220
4257 393220 278898 249657 374681 284819 192330 142334 151052 180249 171965 253414 91132
4246 91132 -9723 217426 95771 320090 192665 266810 490391 403215 409110 296638 76419
4235 76419 54510 -54743 51309 155475 173965 198097 41160 162635 69782 164953 101559
4224 101559 183021 358651 93397 335290 341007 297179 357093 101388 179118 118183 185386
4213A85386l6222l2567K37659K2001k4275j10555q295J4079l2069O7607l3733
4202B49016p5716n5725N2269n8806K5699q9357J26094p654R713L4232K01773P4531
4190D86069j22726J6533j67409o1062K5157r4831R9547r2024R345K49130J7773
4179C65502m3469j59083M0319p735p5238j22231J02369l4736M9726p0430L6934
4168H1928k9193p2643n8247K43606N5856q0122j7108J6769J17152Q1384L2790
4157C72172q8078r2834q0531L4495J20263q3362P7963j60400J19027J00156n4805
4146B64066L4013k5256J9322m7596J06819Q1624o7979j31661L3370M6646P9818
4135C93186m0547k23155K7476O0595R6593j36358n2414P3347K4637J46809q5367
$$ plain form
4213 185386 149164 116597 354256 376257 351982 241427 233132 247211 215142 282749 249016
4202 249016 173300 117575 169844 111038 136737 47380 173474 165820 175533 209765 411538 486069
4190 486069 363343 379876 212467 151405 176562 81731 181278 89254 98599 347729 365502
4179 365502 322033 162950 203269 195534 120296 -1935 100434 65698 115424 44994 81928
4168 81928 52735 -19908 -78155 165451 221307 141185 124077 140846 257998 339382 372172
4157 372172 284094 191260 110729 145224 265487 182125 260088 99688 218715 318871 264066
4146 264066 298079 272823 292145 244549 351368 432992 365013 233352 266722 313368 393186
4135 393186 352639 129484 156960 217555 314148 177790 125376 198723 223360 370169 284802
4124B84802m8294k8929N1151N5521m6155p2246j27577K02323R5535l4662j84839
4113A46630k21479K05424j35344N9647j8421j00877J83308N775J9410j72303M0831
4102A2601N3196R4128J22530k54222J64860N2540j4645P0564j4209N6248K2332
4091C65923j42658J67783n0084J45657k0011p7393J22895j52238K8534l6902k42545
4080A08961J44014j11045J66741J22965k1158k546j35131l0710l9629O6241k7214
4069B41489j34202L6294R8672j18921j1203N8826N4416j06237M6517o3594J05643
4058B07700K69058k32909K4506k9730r0070K12235k03544J9227J50652K4670K537
4047C54332N9101R7941j27075o1089p5206P5957P4658j14540k31531J70740K9469
$$ plain form
4124 284802 236508 207579 258730 314251 268096 195850 68273 270596 366131 331469 146630
4113 146630 -74849 130575 -4769 54878 36457 -64420 118888 124663 144073 -28230 12601
4102 12601 65797 159925 282455 28233 193093 245633 230988 301552 287343 343591 365923
4091 365923 223265 391048 340964 486621 466610 389217 512112 359874 388408 351506 108961
4080 108961 252975 141930 308671 431636 410478 407932 272801 242091 202462 268703 241489
4069 241489 107287 143581 242253 123332 112129 170955 225371 119134 165651 102057 207700
4058 207700 476758 243849 268355 238625 148555 360790 157246 176473 327125 351795 354332
4047 354332 413433 511374 384299 323210 248004 323961 398619 284079 52548 223288 252757
4036B52757j42583J05637o8930k7687J45943O5012o8320j5997R2800k0782Q6580
4025D04430p0505P0494j01014Q2001J18625k46281J18953M4814J04898l1587j71963
4014C22865K6909l5408q5292J63454P1655p7294M2750j34389k42598J34411K9007
4003B16070j03060j0624K28284N7899N9223j16898j07061O3409j31593J32473
3993B88122L2330r5360m538j2702J66420Q8463r4382j76346o4198L5151J82278
3982C45238m3994J18422j12423p5550J73778j17428k48570L4047K25894Q78O7710
3971C68002R4537m0863O5262R0000p5488m7403O0997j77312M6296O6160j16233
3960C33955k4035J18058m5904K8844N8892l5491P7427J060j02172J2752j44630
$$ plain form
4036 252757 110174 215811 146881 119194 265137 330149 261829 245832 338632 317850 404430
4025 404430 333925 404419 303405 385406 504031 257750 376703 421517 526415 494828 322865
4014 322865 349774 314366 229074 392528 464183 386889 429639 295250 52652 187063 216070
4003 216070 113010 102386 330670 388569 447792 330894 223833 287242 155649 288122
3993 288122 320452 225092 220554 207852 374272 462735 368353 192007 127809 162960 345238
3982 345238 301244 419666 307243 231693 405471 288043 39473 73520 299414 300292 368002
3971 368002 462539 421676 486938 576938 501450 454047 515044 337732 384028 450188 333955
3960 333955 309920 427978 382074 410918 469810 434319 511746 512806 410634 423386 278756
3949B78756P0101J02999Q0110m9715p7450J61420n1220l3913J38666j57922J10441
3938E72273m2555j69870J14310n8316o8281j3445k9728k1692N6907R1828j177
3927D30254Q8335p8843k62537J24538J97563n0327j23640J67280j28266o9632
3917B94725q31M07J44983J30099j14686J11488P2482o3219k44066J02257m5512
3906C88127J09122m861n0364O6616j12199o9089m7419J28847J35658J06085l1909
3895F18614l5405K14502n0329j70747J35043K27364k18784Q1188K39593j79707
3885H61332r0776L7819J6902n476o3305q7348J53394J43996J1761k5134r9541
3874H53624j1420q5103k3201K1180p1484Q8797O7780O7096k6609o0206J2498R1057
$$ plain form
3949 278756 348857 451856 531966 482251 404801 566221 515001 481088 619754 461832 572273
3938 572273 529718 359848 474158 415842 347561 334116 304388 282696 339603 431431 430254
3927 430254 518589 439746 177209 301747 499310 448983 325343 492623 364357 294725
3917 294725 293894 294301 439284 569383 454697 566185 638667 575448 331382 433639 388127
3906 388127 497249 492388 442024 508640 396441 327352 279933 408780 544438 650523 618614
3895 618614 583209 797711 747382 576635 711678 939042 720258 801446 1041039 861332
3885 861332 770556 808375 825277 819801 756496 669148 822542 966538 978299 953165 853624
3874 853624 842204 757101 733900 755080 683596 772393 840173 907269 880660 820454 832952 924009
3862I24009O3537K30487J86869R4647J83238K55708L70104J90125K36879p8498
3852B657105k11483k61391j87100k36941j87227o4596n6863O792k82942r7385
3842A077969r4271q8992K61349Q1411r1547j28744J17117j35832r0477Q5906j42523
3831H51366J88291M2837K0673l5422l9653j53369J81030J20769j09328J6242J64994
3820A248430m7766J50440J86379j39942j34381n5791j13976M4759Q0132j22017
3810A096267m6423J73580o3441r3115O2251j34741j9909N8544l0654l125J40418
3799A139652j76563Q9190K48407k09348j86410j6091k0575J25705K41471m3283
3789A192155r6681P1223j576N1969M6220k17382K1551o5054J8555M6276o2084
$$ plain form
3862 924009 987546 1218033 1404902 1499549 1682787 1938495 2308599 2498724 2735603 2657105
3852 2657105 2445622 2184231 1997131 1760190 1572963 1508367 1451504 1458296 1175354 1077969
3842 1077969 983698 894706 1156055 1237466 1145919 1017175 1134292 998460 907983 993889 851366
3831 851366 1039657 1082494 1103167 1067745 1028092 874723 1055753 1176522 1067194 1083436 1248430
3820 1248430 1200664 1351104 1537483 1397541 1263160 1207369 1093393 1138152 1218284 1096267
3810 1096267 1049844 1223424 1159983 1066868 1129119 994378 974469 1033013 1002359 999234 1139652
3799 1139652 963089 1052279 1300686 1091338 904928 888837 868262 993967 1235438 1192155
3789 1192155 1095474 1166697 1165121 1217090 1263310 1045928 1067479 1002425 1020980 1067256 1005172
3778A005172O7286O9348K65334n9541k54959J24122R2659J40889J25426j03593
3768A472143L6121M3461m0450l9342P0458l5734j27049J31127K11319L3637K73721
3757B029412L9534j01999J39907m1275J2314j9645K7454r1940J03378J6476j7753
3746B095863Q5170j79026J56124J53547j076N4553k2021J12818n5535J40825o3892
3735B477350J2075P3549Q1565O3496P2400r1966j08842J57960K19296n109J43201
3724C094975K39887p5180J43668N4836J56478K07167J3523J54304K32397K12113
3714D434168P6767O2970N3585j54544K29454k06135L6803P6834j20832J8452j98246
3703D309276O701J26110J56091J44971N5838K63531K85513K55176K90635J41940
$$ plain form
3778 1005172 1072458 1141806 1407140 1347599 1092640 1216762 1309421 1450310 1575736 1472143
3768 1472143 1508264 1551725 1511275 1471933 1542391 1506657 1379608 1510735 1722054 1755691 2029412
3757 2029412 2068946 1966947 2106854 2065579 2077893 2058248 2085702 1993762 2097140 2113616 2095863
3746 2095863 2181033 2002007 2158131 2311678 2310602 2365155 2343134 2455952 2400417 2541242 2477350
3735 2477350 2489425 2562974 2644539 2708035 2780435 2688469 2579627 2737587 2956883 2951774 3094975
3724 3094975 3334862 3259682 3403350 3458186 3614664 3821831 3835354 3989658 4222055 4434168
3714 4434168 4510935 4573905 4627490 4472946 4702400 4496265 4533068 4609902 4489070 4507522 4309276
3703 4309276 4315977 4442087 4598178 4743149 4798987 5062518 5348031 5603207 5893842 6035782
3693F035782K07821J56468P3235K35203K15969K18985J38927M00332K50988j64032
3683G769678j0105n8409k5009J11440j21117m1281M3146J37819j12986o3453L0586
3672G660309l13977N5912J49515J57973L30306q6389K77290K37443K89124L48306
3662I105812J43860K49963K37136L18224N28171N8108L94212K25328K63001L44395
3652A1868210k284Q3278j496K47922J34826L2389J68852J87061M03160K77400
3642A3399318K94701O30388M35241O87220P91350N98958M84151N63834P05301
3633A8590462O12367N66449O97816N76278Q09754P16682N39489J111415Q97340
3624B5118052J224269J319261J268256J479990J404670J657229J441225J502335
$$ plain form
3693 6035782 6243603 6400071 6473306 6708509 6924478 7143463 7282390 7682722 7933710 7769678
3683 7769678 7759573 7701164 7676155 7787595 7666478 7625197 7668343 7806162 7693176 7629723 7660309
3672 7660309 7346332 7402244 7551759 7709732 8040038 7953649 8230939 8468382 8757506 9105812
3662 9105812 9249672 9499635 9736771 10054995 10583166 10641274 11035486 11260814 11523815 11868210
3652 11868210 11865926 11949204 11947708 12195630 12330456 12362845 12531697 12718758 13121918 13399318
3642 13399318 13694019 14324407 14759648 15446868 16238218 16837176 17321327 17885161 18590462
3633 18590462 19202829 19769278 20467094 21043372 21853126 22569808 23109297 24220712 25118052
3624 25118052 26342321 27661582 28929838 30409828 31814498 33471727 34912952 36415287
3616C6415287J493114J704408K089648K419399K722190L379390M087552M776208
3608E9087196N873992P323914Q769253J0839050J2779381J5098260J7670739K0828077
3600A58269862K4349134L0660691L8981911M8870254N2426189L3775352p30948
3593C86602445l2939845m7824430m7700441m2565081l3368180k4858471j8770021
3586A38575976j4823562j1872381r913572q555794p528175o678371o272943n571611
3578F7359567m717679m219146l622903l195437k811760k320730j860285j529858
3570D3081769j372720j273531j081249p28686o88243o56116k19186L04017O96901
3561C8062956P28253N07068K7149l65726r22587j457626j640249j716169j487516
$$ plain form
3616 36415287 37908401 39612809 41702457 44121856 46844046 50223436 54310988 59087196
3608 59087196 64961188 72285102 81054355 91893405 104672786 119771046 137441785 158269862
3600 158269862 182618996 213279687 252261598 301131852 353558041 387333393 386602445
3593 386602445 353662600 305838170 258137729 215572648 182204468 157345997 138575976
3586 138575976 123752414 111880033 101966461 93410667 85882492 79204121 72931178 67359567
3578 67359567 62641888 58422742 54799839 51604402 48792642 46471912 44611627 43081769
3570 43081769 41709049 40435518 39354269 38625583 37937340 37281224 37062038 37366055 38062956
3561 38062956 38791209 39298277 39325426 38959700 38037113 36579487 34939238 33223069 31735553
3552C1735553j139112j045104q86872q54669n73765n88430n11968k72224m90477
3543B5372932l35512k30420n6429k140k55164k31753j81005K18336K14578R0284
3533B4603707K49270M06622N67610O47252M92956P14289Q45096Q95484Q13021
3524C0235307R63768R93690J262238J406039J458590J298025J547096J770406
3516D0935159J692194J804283J919179J994007K122695K241018K215867K095346
3508E7019748J915245J668408J706376J278978J037444O82210K88703j33740k95299
3499F5168073o75463j052706j154877j655593j617845j852688k103793k176042
3491E2879066k121692k121387k084112k015526k177454k015938j903085j909941
$$ plain form
3552 31735553 30596441 29551337 28664465 27809796 27236031 26647601 26135633 25863409 25372932
3543 25372932 25037420 24807000 24750571 24748431 24493267 24261514 24080509 24298845 24513423 24603707
3533 24603707 24852977 25259599 25827209 26474461 26967417 27681706 28526802 29422286 30235307
3524 30235307 31199075 32192765 33455003 34861042 36319632 37617657 39164753 40935159
3516 40935159 42627353 44431636 46350815 48344822 50467517 52708535 54924402 57019748
3508 57019748 58934993 60603401 62309777 63588755 64626199 65308409 65597112 65463372 65168073
3499 65168073 64492610 63439904 62285027 60629434 59011589 57158901 55055108 52879066
3491 52879066 50757374 48635987 46551875 44536349 42358895 40342957 38439872 36529931
3483C6529931j660689j599513j409590j348228j235342j201681j137545j163829
3475B5773514j034835p19497r57635q44576r12571q76380o38009p25979n20366
3466A8543666o13561o12252m64659l93964n82124n74768k74632m42157l49335
3457A4236214k87834l22142j38932k05494k54393p9871j36799j66411j29519j55214
3447A2359605k90457j33920k06454k27031j13608m8694j38547M3302j14382o4761
3437A1065053O2424l3638K31420J78752L88145N39635L80826M46508N54345Q34636
3427A4648106J058668R17202P36123k57368n02524m68305o07359k13153K14526
3418A5525916M26717O74553j5170p73940p49833n83880m55832l53724j52653J73972
$$ plain form
3483 36529931 34869242 33269729 31860139 30511911 29276569 28074888 26937343 25773514
3475 25773514 24738679 24019182 23061547 22216971 21304400 20428020 19790011 19064032 18543666
3466 18543666 17930105 17317853 16853194 16459230 15877106 15302338 15027706 14585549 14236214
3457 14236214 13948380 13626238 13487306 13281812 13027419 12947548 12810749 12644338 12514819 12359605
3447 12359605 12069148 11935228 11728774 11501743 11388135 11339441 11200894 11244196 11129814 11065053
3437 11065053 11127477 11093839 11325259 11504011 11892156 12431791 12812617 13259125 13813470 14648106
3427 14648106 15706774 16623976 17360099 17102731 16600207 16131902 15524543 15311390 15525916
3418 15525916 15952633 16627186 16612016 15838076 15088243 14504363 14048531 13694807 13542154 13716126
3408A3716126N64436R60084R37325Q24521K0028o22110o86404p66470q42037j206750
3398A2898749j078182q98928o10272m62583n84945k70929l73472k07787p0076
3389H341575j94241k0761J19326J40154K42445J53255K45059L19087M23314K52397
3379A0021610K82702M60151P56707R70989J165073N32562p51050j118797j225484
3370A1094463j139138r72183p33280o42667k66743k40154k27019j44799k84665
3361F443815j5149j57487j10639k21542j81041j17491j88856J53868N505n0893
3351E560090r9984j3316M7671m9685k784m7687J5902P3271K4109K9627J40896
3340E678110J38846J36322J79520J50336J15210M36664M28461K84606P8728k03436
$$ plain form
3408 13716126 14280562 15240646 16177971 17002492 17022520 16400410 15714006 14947536 14105499 12898749
3398 12898749 11820567 10921639 10311367 9848784 9263839 8992910 8619438 8411651 8341575
3389 8341575 8147334 8126573 8245899 8386053 8628498 8781753 9026812 9345899 9769213 10021610
3379 10021610 10304312 10764463 11521170 12492159 13657232 14189794 13438744 12319947 11094463
3370 11094463 9955325 8983142 8249862 7607195 7340452 7100298 6873279 6728480 6443815
3361 6443815 6428666 6271179 6160540 5938998 5757957 5640466 5451610 5605478 5610983 5560090
3351 5560090 5460106 5446790 5494461 5444776 5441992 5394305 5410207 5483478 5507587 5537214 5678110
3340 5678110 5816956 5953278 6132798 6283134 6398344 6835008 7263469 7548075 7626803 7423367
3330G423367r4189j76895J8029n8364K1497K42857J08738K58100o6560o3473L3965
3319G647072o8167Q6992p29N5939O8709N0449K40616O4718j15837J16825K25329
3308H371916M69518M7234K13585L10035L05308N01070K99768L74664M64964N26007
3298A1884069O42646M21818O02978K64301L33809L34888r9171L9374J9375j07134
3288A4336953J87656M5673K61329L51406L22540N13051M06745P49259P93113Q05930
3278A8773655J152966J012672J505573J579339J221709J119128Q90402P99034
3270B8054478J54574K03467O8125j52890j2716j73639j88564o2364k03498q3435
3260B7603538R8172L27568M47662Q49300J501458J412408J690743J960183K159096
$$ plain form
3330 7423367 7329178 7152283 7170312 7111948 7133445 7376302 7485040 7743140 7676580 7613107 7647072
3319 7647072 7578905 7665897 7665168 7721107 7789816 7840265 8080881 8145599 8029762 8146587 8371916
3308 8371916 8841434 8888668 9102253 9412288 9717596 10218666 10518434 10893098 11358062 11884069
3298 11884069 12526715 12948533 13551511 13815812 14149621 14484509 14385338 14424712 14444087 14336953
3288 14336953 14524609 14570282 14831611 15183017 15505557 16018608 16425353 17174612 17967725 18773655
3278 18773655 19926621 20939293 22444866 24024205 25245914 26365042 27255444 28054478
3270 28054478 28209052 28412519 28480644 28327754 28315038 28141399 27952835 27890471 27686973 27603538
3260 27603538 27701710 28029278 28476940 29326240 30827698 32240106 33930849 35891032 38050128
3251C8050128K558213K607331K850288K701246K592828K134582J596605P91544
3243E5882765k94393n96597q92156j037652j312062j039820j033932j241734j108313
3234D7326106j190954q61374m89663K7010L28365Q51528J039884J428547J842209
3225E0301658J951411K220103K439896K813234K798060K871159K659971K487828
3217G0543320K076184J052520J48756o46717j344699k151362k403105k868438
3209F4406459l354039l082906l001136k289228j925418j715665j156563o83789
3201D7197715k47805l57241k1531L35295Q11225J107830J239067J412357J701100
3192E3178012J718551J847945J532784R16775L13278l71625j141068k377469l233488
$$ plain form
3251 38050128 40608341 43215672 46065960 48767206 51360034 53494616 55091221 55882765
3243 55882765 55588372 54991775 54099619 53061967 51749905 50710085 49676153 48434419 47326106
3234 47326106 46135152 45273778 44784115 44811125 45139490 45991018 47030902 48459449 50301658
3225 50301658 52253069 54473172 56913068 59726302 62524362 65395521 68055492 70543320
3217 70543320 72619504 73672024 73820780 73174063 71829364 69678002 67274897 64406459
3209 64406459 61052420 57969514 54968378 52679150 50753732 49038067 47881504 47197715
3201 47197715 46949910 46592669 46571138 46906433 47717658 48825488 50064555 51476912 53178012
3192 53178012 54896563 56744508 58277292 59194067 59507345 59135720 57994652 55617183 52383695
3183E2383695l533909l773787l158765k963274k617031k147580j697913j186384
3175C1305052j343229j017628r93535n97853l49264m81080l19116k57353o2464
3166B5883530K42600J73686N6112J99645n7240l7932m60940q25919j201046j360527
3156B2611969j450576j464577j005174j034352q36351n82783n97005n69887m11401
3147A4659863k18456k25246k98644q7794k43001l59097l40349j82787k03646k06776
3137A2294067k79928j8531j99372k27400j09700r4675n4012j02261n9547Q855
3127A1157496J62944J00248N0874K18883J38447l5496K27083L1373K78964O2380
3117A2393196P3632K77349Q4239J92614M0162R2357R3321J24716K06258K17807
$$ plain form
3183 52383695 48849786 45075999 41917234 38953960 36336929 34189349 32491436 31305052
3175 31305052 29961823 28944195 27950660 27352807 27003543 26522463 26203347 25945994 25883530
3166 25883530 26126130 26299816 26355928 26555573 26498333 26460401 25999461 25173542 23972496 22611969
3156 22611969 21161393 19696816 18691642 17657290 16820939 16238156 15641151 15071264 14659863
3147 14659863 14441407 14216161 13917517 13829723 13586722 13227625 12887276 12704489 12500843 12294067
3137 12294067 12014139 11995608 11796236 11568836 11459136 11364461 11310449 11208188 11148641 11157496
3127 11157496 11320440 11420688 11471562 11690445 11828892 11793396 12020479 12051852 12330816 12393196
3117 12393196 12466828 12744177 12828416 13021030 13061192 13153549 13246870 13371586 13577844 13795651
3107A3795651K51137J51246J43173L02858K72433L22103M74430L88007O06648
3098A6707686N58432P61562R70915L29808L96397J18254J38388N76348N15167
3089B1072957O70742O46082O83972M30250M8998K43320J9061J50220J43532L22704
3079B4431838P71266O67113P54774Q95063J098118J195057J277495J421310J283888
3070C3795922J293819J189548J118894J037170R28067Q52563J025667J171875
3062D2413525J436206J551684J375766R20318L97902P5020k12143m25287l75756
3053D7157235k74043L48331P75360R22372J266180R87994P69573Q56888J146844
3044E3956734J109811J365409J585436J721181J793841J869080J865298K041390
$$ plain form
3107 13795651 14046788 14198034 14341207 14644065 14916498 15238601 15713031 16101038 16707686
3098 16707686 17266118 18027680 18998595 19328403 19724800 19843054 19981442 20557790 21072957
3089 21072957 21743699 22389781 23073753 23504003 23553001 23796321 23815382 23965602 24109134 24431838
3079 24431838 25203104 25870217 26624991 27520054 28618172 29813229 31090724 32512034 33795922
3070 33795922 35089741 36279289 37398183 38435353 39363420 40215983 41241650 42413525
3062 42413525 43849731 45401415 46777181 47697499 48095401 48170421 47958278 47532991 47157235
3053 47157235 46883192 47231523 48006883 48929255 50195435 51183429 51953002 52809890 53956734
3044 53956734 55066545 56431954 58017390 59738571 61532412 63401492 65266790 67308180
3036F7308180K134963K410877K626295K360925J696163J151727M71970l78518
3028G9782582q46230q92880q85069q55420n24677j83180J53719K67773L38795
3019G6355413P35140P86491Q84562J194474J781032K418943K822545L550547L756035
3010I4285182L883067L837192K777583K004993J596512J268247J372704J225197
3002A12250677O88551J11556l81474p48500p10663n13389j32232J17959N82156
2993A11264641K37038K13135J8650l48837j71333n38255p90661r91150q57042
2984A08036186p83959j148966j294637j955659k104661k130759k138563j288744
2976I5190238m75906k6091M94209L88999L82030K74340m94185j263250k543882
$$ plain form
3036 67308180 69443143 71854020 74480315 76841240 78537403 79689130 80161100 79782582
3028 79782582 78936352 78043472 77158403 76302983 75778306 75595126 75748845 76016618 76355413
3019 76355413 77090553 77877044 78761606 79956080 81737112 84156055 86978600 90529147 94285182
3010 94285182 98168249 102005441 104783024 106788017 108384529 109652776 111025480 112250677
3002 112250677 112939228 113050784 112669310 111920810 111210147 110696758 110564526 110682485 111264641
2993 111264641 111501679 111714814 111733464 111384627 111213294 110675039 109884378 108893228 108036186
2984 108036186 107252227 106103261 104808624 102852965 100748304 98617545 96478982 95190238
2976 95190238 94714332 94688241 95182450 95571449 95953479 96227819 95733634 94470384 91926502
2967I1926502k900222l269900l028667k408185k215837j998009k273549k026414
2959G1805719j830801j597190j075453q79242m34141m41511l84251o8266K06612
2950F5301476O55613Q98887Q47305J149836O87324L75781n00161j276753j659327
2941F6479981k047711j820169k067369k306328k301320k180174j744659j579257
2933E0432994j364603p75847n45376k42614m5119j9503o143m60434o03800j224609
2923D5144946j301249j050120j081735p59828q43193q02450q17553q25662q37374
2914C6825782j086202p71543n16528l00065p7638l7852j30215l34484m60769n72985
2904C2537501n78087j046792r72285j351813j486268j261606j213142r34529q27651
$$ plain form
2967 91926502 89026280 85756380 82727713 80319528 78103691 76105682 73832133 71805719
2959 71805719 69974918 68377728 67302275 66423033 65988892 65547381 65163130 65094864 65301476
2950 65301476 65957089 66855976 67703281 68853117 69540441 69916222 69416061 68139308 66479981
2941 66479981 64432270 62612101 60544732 58238404 55937084 53756910 52012251 50432994
2933 50432994 49068391 48292544 47747168 47504554 47459435 47439932 47433789 46973355 46369555 45144946
2923 45144946 43843697 42793577 41711842 40952014 40108821 39306371 38488818 37663156 36825782
2914 36825782 35739580 34968037 34451509 34151444 34073806 34035954 33905739 33571255 33110486 32537501
2904 32537501 31959414 30912622 29940337 28588524 27102256 25840650 24627508 23692979 22865328
2895B2865328o76805o70763l12494l57783k79504m57353l45423m81982o67454
2886A8615767n98045o70750n90197n04323k60809j49245k68114k33935J44768
2877A5485117P8314l43724m05782m97579m93041k56543n58472n51762m66345k54304
2867A1735879k88597k76452l37518l15843l55784J0428k52888k31815j62176q7056
2857I438178J6292k36201j70482l19078m1829j24008k32555j08999l95981p0987
2847G754350k18055P8996k7606r3862N1144o498q5944q2211n9648k8609J39027
2836G421084j31192l3871j11005L4237o0397k29632K4591J7336J61185N5964J31283
2825G279583l9475k5556j0715j91562j21125k72343J48735o2941K1368p6899l1960
$$ plain form
2895 22865328 22188523 21517760 21205266 20847483 20567979 20110626 19765203 19283221 18615767
2886 18615767 18017722 17346972 16756775 16252452 15991643 15842398 15574284 15340349 15485117
2877 15485117 15563431 15219707 14813925 14316346 13823305 13566762 13008290 12456528 11990183 11735879
2867 11735879 11447282 11170830 10833312 10517469 10161685 10172113 9919225 9687410 9525234 9438178
2857 9438178 9454470 9218269 9047787 8728709 8686880 8562872 8330317 8221318 7825337 7754350
2847 7754350 7536295 7615291 7587685 7493823 7544967 7538469 7452525 7370314 7310666 7282057 7421084
2836 7421084 7289892 7256021 7145016 7179253 7118856 6889224 6913815 6931151 7092336 7148300 7279583
2825 7279583 7240108 7214552 7203837 7012275 6891150 6618807 6767542 6704601 6725969 6649070 6617110
2814F617110J52970j3115Q8531k98026P8528R9716J54856J96980j05711R4292
2804G066131J6714J33391L292r9275k4469J09812J40854K79628J33042Q6799J18786
2793G964705L4390N2203j622M8078J25159J79047J68134q2565L70292J6300O4589
2782H938710K80668K49235L79269K32342O47377N23423L55410O53258N94289P71721
2772A3625702P75003P28588R56148Q45037Q02496N26402M12724J46753m22134
2763A8396719n57236q16316j052253r61163j323081q97973r48706r86144p94170
2754A0059677q54905m91378q09075o65971k94007l06628k85479l39717k73774
2745E738743j72207k46450j93083k13630j08848m7041j23440N8940k37035m8256
$$ plain form
2814 6617110 6770080 6756965 6845496 6547470 6625998 6725714 6880570 7077550 6971839 7066131
2804 7066131 7082845 7216236 7219528 7120253 7095784 7205596 7346450 7626078 7759120 7845919 7964705
2793 7964705 7999095 8051298 8049676 8097754 8222913 8401960 8570094 8487529 8857821 8874121 8938710
2782 8938710 9219378 9468613 9847882 10080224 10727601 11251024 11606434 12259692 12853981 13625702
2772 13625702 14400705 15129293 16085441 16930478 17732974 18259376 18672100 18818853 18396719
2763 18396719 17839483 17023167 15970914 15009751 13686670 12788697 11839991 10853847 10059677
2754 10059677 9204772 8713394 7904319 7238348 6944341 6637713 6352234 6012517 5738743
2745 5738743 5566536 5320086 5127003 4913373 4804525 4757484 4634044 4692984 4455949 4407693
2735D407693j71455j47144m0740k79626J9723o963K55569j21732p9365j79644
2725C656316j15440K594j50542k77971L9152j40069j98218J44892j95788k9219
2715B735707j7212m0767r3344m266j95695m2879k3622j11894R5173m1831O6189
2704B325559K7298J38936L8128j0377J83441l2639j00442l8639k26590j76576
2694B128099J8927J6750k6516m3634j24134L2312o815n1313J5237L209n4232O9076
2682A976966R1838K0449K0383k20056M195p9138j8861k2233K8552O6846j2315
2671A856626L8991j6385k2338r4806r6590l4664Q7079P6124m9173J09796R392
2660A864052p9605p9188o9654n2140K2511O5658J29066k9381J7598L7946r2702
$$ plain form
2735 4407693 4236238 4089094 4048354 3768728 3788451 3781488 4037057 3915325 3835960 3656316
2725 3656316 3540876 3543470 3392928 3114957 3154109 3014040 2815822 2960714 2764926 2735707
2715 2735707 2718495 2677728 2584384 2580118 2384423 2341544 2317922 2206028 2301201 2259370 2325559
2704 2325559 2352857 2491793 2529921 2519544 2702985 2670346 2569904 2531265 2304675 2128099
2694 2128099 2147026 2163776 2137260 2093626 1969492 2001804 1994989 1943676 1958913 1962122 1907890 1976966
2682 1976966 2068804 2089253 2109636 1889580 1893775 1814637 1795776 1773543 1802095 1868941 1856626
2671 1856626 1895617 1879232 1856894 1762088 1665498 1630834 1717913 1794037 1744864 1854660 1864052
2660 1864052 1784447 1705259 1635605 1583465 1605976 1671634 1800700 1771319 1788917 1826863 1734161
2649A734161m7555k67167P3034L05558j86636P0970J00221l8336Q2950o3895J56495
2638A919800n7939L8240k8042p95J08436j57526k29K7311m0560k31819R5025O2332
2626A734234J38984K30613j13681J5587N4572l5241k09629J8025m6391j2415K57788
2615B032446j54550R0125j2356k6359j06878j42122J00219j50290J51694Q4523
2605A866452j8228L4191k7051K7578j21745j10583k30842K07062P2274j08846
2595A590262O2622j51717J2233O2294L0180J3772j23773P1890R9891k6602q944
2584A632108L5009p6530k3435k16224J1745r0113j09415K33726j00102J23066
2574A419835n7322O9446j03881J72300j74143k36893K46757q0019K8211j5944
$$ plain form
2649 1734161 1686606 1419439 1492473 1798031 1611395 1682365 1782586 1744250 1827200 1763305 1919800
2638 1919800 1861861 1900101 1872059 1871264 1979700 1822174 1821945 1849256 1808696 1576877 1671902 1734234
2626 1734234 1873218 2103831 1990150 2005737 2060309 2025068 1815439 1833464 1787073 1774658 2032446
2615 2032446 1877896 1968021 1955665 1929306 1822428 1680306 1780525 1630235 1781929 1866452
2605 1866452 1848224 1882415 1855364 1882942 1761197 1650614 1419772 1626834 1699108 1590262
2595 1590262 1652884 1501167 1513400 1575694 1605874 1619646 1495873 1567763 1667654 1641052 1632108
2584 1632108 1667117 1590587 1567152 1350928 1362673 1272560 1163145 1396871 1296769 1419835
2574 1419835 1362513 1431959 1328078 1500378 1326235 1089342 1336099 1256080 1284291 1268347
2564A268347j1249m7341N1652M2494k03015k2309k9132K2160J03419M3133k28314
2553I89845L4892M2867k23377K0899j49489J21459N9575J05709j22267J5086Q0853
2542I76052m2514j60225j66593J65458r2755o3643M6730P4298j3831j51590j6928
2531E54459P8411j59241R8554J33647r9473N5297o0817M96N5108q6021j5634k4300
2519E30486J36453k03882j2394N1213M9122r8463O4967J31045q6880J53529m6010
2508F69186R2700r7698j87335O8847Q7744Q8406p545J46820j43948J03368p7324
2497G43221o5751Q2771k3377P762K0468K3287L8830J58448j25368j09197J41262
2486H92356m5740n7746K6299J95884j02562P0760J23912j59692m9531l4828j84457
$$ plain form
2564 1268347 1257098 1209757 1261409 1303903 1100888 1078579 1049447 1071607 1175026 1218159 989845
2553 989845 1024737 1067604 844227 865126 715637 837096 896671 1002380 880113 895199 976052
2542 976052 933538 773313 606720 772178 679423 615780 662510 736808 722977 571387 554459
2531 554459 632870 473629 572183 705830 606357 661654 600837 601333 656441 570420 554786 530486
2519 530486 666939 463057 450663 501876 550998 452535 517502 648547 561667 715196 669186
2508 669186 761886 664188 476853 545700 633444 721850 714305 861125 717177 820545 743221
2497 743221 677470 760241 736864 744626 765094 788381 827211 985659 860291 751094 892356
2486 892356 846616 788870 815169 1011053 908491 979251 1103163 943471 893940 859112 674655
2475F74655o0109K83182j7499P8776l7694m781K76269j47704j60318O9853O4422
2464A019052K23173Q3018J82858k9239N3953P5480j79212j79924j11049k66418
2454H71692O0267p208j84692m2184J16440j14149j67601j6362p5430l0915l1985
2443C77873j59517K21126J01446p1671K36N5129o284k13319J03718J86901L3205
2432F28843J37524l1159k6912p1615k50887L3867j06858k4457M113o14M844J29086
2420D25775K7357j20685p1972m4260J7684n6339j16234J5305k6457J58681l2463
2409A76392j08771p1854m0434l6757o2080Q0185J0009K23006j67163l8125J23661
2398H8069l6351j8036k7326j24042k5041j02278J47132j1754p0904N7077k7742
$$ plain form
2475 674655 614546 897728 880229 959005 921311 916530 1192799 1045095 884777 954630 1019052
2464 1019052 1242225 1325243 1508101 1478862 1532815 1608295 1429083 1249159 1138110 871692
2454 871692 931959 924751 740059 697875 814315 700166 532565 516203 440773 409858 377873
2443 377873 218356 439482 540928 469257 469493 524622 518338 305019 408737 595638 628843
2432 628843 766367 735208 708296 636681 385794 419661 312803 288346 292459 291845 296689 425775
2420 425775 453132 332447 260475 216215 233899 177560 61326 76631 50174 208855 176392
2409 176392 67621 -4233 -44667 -81424 -143504 -63319 -53310 169696 2533 -35592 88069
2398 88069 51718 33682 6356 -117686 -142727 -245005 -97873 -109627 -180531 -123454 -151196
2387a51196O9186r5998J6457K47886r5070j45378r2701o846Q7178l6725m7147
2376b50354j38873J27140P6220j49240J82402j32545J34928J66047j00936J02113
2366A6902j09111N3403o2264Q4748j8880l01804K59617P8157q3728K3299j45653
2355b05314N7456m96j23732o864J37877N4021J1424R9617P55k23545O8996j36515
2343b66320j0922R7427p6860R4984k8067J27987k48698J85867K24179k48833N3635
2332i5621j22445Q9338Q3848j52473m2299J9739L4145j69355j28065J95754n7065
2321c44499J05614n9781J06710P1775j4602o2488J18853M6437j26937p9891K9496
2310b09313k61n0357K0567k1578J27368q662r4970K2807n2976J92841m2594q788
$$ plain form
2387 -151196 -82010 -178008 -161551 86335 -8735 -154113 -246814 -253660 -166482 -203207 -250354
2376 -250354 -389227 -262087 -185867 -335107 -152705 -285250 -150322 15725 -85211 16902
2366 16902 -92209 -38806 -101070 -16322 -35202 -337006 -77389 768 -82960 -59661 -205314
2355 -205314 -147858 -148354 -272086 -278950 -141073 -87052 -75628 23989 24744 -198801 -129805 -266320
2343 -266320 -277242 -179815 -256675 -161691 -189758 -61771 -310469 -124602 99577 -149256 -95621
2332 -95621 -218066 -128728 -44880 -197353 -239652 -219913 -185768 -355123 -483188 -287434 -344499
2321 -344499 -238885 -298666 -191956 -120181 -134783 -197271 -78418 -31981 -158918 -238809 -209313
2310 -209313 -209574 -259931 -239364 -260942 -133574 -142236 -237206 -214399 -267375 -74534 -117128 -125916
2298a25916j16419n1641J15945O5446N5429l1051p3122k9721k139o2696L7433
2287b18452J04744M8895Q6165Q572k29629N3691P6553p8582o2384j25948J56761
2276a79614O2849m8749j9060m8447K10150j32032p3473n2422L4784m2368J62416
2265a25966j4236p2919N2431M3705N9197k00262j13615J2138L01355J00748n4955
2254a2379K1122R257O3291j58652j91534j71711K37530N894m7885J19098j81457
2243c07426L1258J2775M3038P423q9410J4472J70001L13952j37698j96045o4450
2232b02110R7378k9058j39215q6828O2520J24345J89861j32503m4804k5028j9450
2221b04892J04981l4593k4356p46Q8812j4860n4307l3251j67686j52021L4428
$$ plain form
2298 -125916 -242335 -293976 -178031 -112585 -57156 -88207 -161329 -191050 -193189 -255885 -218452
2287 -218452 -113708 -64813 21352 29924 -199705 -146014 -69461 -148043 -210427 -336375 -179614
2276 -179614 -116765 -165514 -184574 -233021 -22871 -154903 -228376 -280798 -246014 -288382 -125966
2265 -125966 -140202 -213121 -160690 -116985 -57788 -258050 -371665 -359527 -58172 42576 -12379
2254 -12379 8743 18000 81291 -77361 -268895 -440606 -203076 -197182 -245067 -125969 -307426
2243 -307426 -276168 -263393 -220355 -212932 -302342 -287870 -117869 196083 58385 -137660 -202110
2232 -202110 -104732 -133790 -273005 -359833 -297313 -172968 16893 -115610 -160414 -185442 -204892
2221 -204892 -99911 -134504 -158860 -159606 -70794 -85654 -139961 -173212 -340898 -492919 -458491
2210d58491J35233j1146N8397J06991J41957k0774j1407k8948j676n857k7193
2199a22914J41457j23611M3215j00473m2815R5782k3124J0681k3755o1070R9600
2188a07027n1012L7978m0534q5065l0634k4201J20929Q877j9330P2867P8269p8188
2176a17071j93803n8019P6782J75581l3061j56751J12393J32442o7647Q1879j62176
2165b09451j26772L7529O9691J29206m2426K531j44958L9316j6074n9595Q2181
2154b38822j05175N0713j7990J19098J75726j1042j28918o8161J45893q4340o1923
2143b24941R0608l4207k5947J6588j41358L2087R2916n1674O6276l987O603k4879
2131b01915j9493J30406N9828j09314O5489j01017j00650J03190o998j0730P1085
$$ plain form
2210 -458491 -323258 -334404 -276007 -169016 -27059 -47833 -59240 -88188 -89864 -95721 -122914
2199 -122914 18543 -105068 -61853 -162326 -205141 -109359 -132483 -121802 -145557 -206627 -107027
2188 -107027 -158039 -120061 -160595 -245660 -276294 -300495 -179566 -170689 -190019 -117152 -38883 -117071
2176 -117071 -310874 -368893 -292111 -116530 -149591 -306342 -193949 -61507 -129154 -47275 -209451
2165 -209451 -336223 -298694 -229003 -99797 -142223 -139692 -284650 -245334 -261408 -321003 -238822
2154 -238822 -343997 -293284 -311274 -192176 -16450 -27492 -156410 -224571 -78678 -163018 -224941
2143 -224941 -134333 -168540 -194487 -177899 -319257 -287170 -194254 -245928 -179652 -183639 -177036 -201915
2131 -201915 -221408 -91002 -31174 -140488 -74999 -176016 -276666 -173476 -180474 -191204 -120119
2120a20119J6074k23314O8740K1294J05987p1463o2379P1347L9974R1196j23011
2109a85674o0090p4396L3839k5566r066Q1261j06923P9867r3138J50181o6566
2098b76271M4985q566j5769R4495k9816J69760k5800r423j50785j37715J47017
2087a97888O6305j63248Q8418M796J30183N3193m9297l5760l3030j5138m6284
2076a97750N3811k1345m9395j9996n8410L4521k13716L6537J76415M7790k64j4794
2064b26596M9191J05528j93687p6416J5083K9315j3904J08400L6449m6208Q9682
2053a23163k9815O5026P0757k70154q871J08285l8756M5855P0448J7770m0872
2042a33490P358j29345r5592P0663K48103M4353l5839r0747o2037J24346P9852
$$ plain form
2120 -120119 -104045 -327359 -258619 -237325 -131338 -202801 -265180 -193833 -153859 -62663 -185674
2109 -185674 -245764 -320160 -286321 -311887 -320953 -239692 -346615 -266748 -359886 -209705 -276271
2098 -276271 -231286 -239852 -255621 -161126 -190942 -21182 -46982 -56405 -207190 -344905 -197888
2087 -197888 -131583 -294831 -206413 -201617 -71434 -18241 -67538 -103298 -136328 -151466 -197750
2076 -197750 -143939 -165284 -214679 -234675 -293085 -258564 -472280 -435743 -259328 -211538 -211802 -226596
2064 -226596 -177405 -71877 -265564 -341980 -326897 -297582 -311486 -203086 -166637 -212845 -123163
2053 -123163 -152978 -87952 -17195 -287349 -296220 -187935 -226691 -180836 -110388 -92618 -133490
2042 -133490 -126132 -255477 -351069 -280406 -32303 12050 -23789 -114536 -176573 -52227 27625
2031B7625n7853r0699j4638O0815N0308J9707o3594k2684R2208J9376k9909j61545
2019a70883J9688K64985p0774j57300r3794O3375L6922n401j24323P3189L6459
2008a27857j68308J02384J14585j6604K4898J3730N6096l3544j21662O5502J82539
1997I1759J46849j32501o7979J68896j24466j55364j2275o9033P9222R0256l5466
1986b0102Q2953M3418J4000Q026L16544j70370j89428R6124K6866Q6056k15009
1975G9078n596m2948J22164J31601k22523K4388J04149R7697q2555j60131q3559
1964c8235L7299k5750J26802m9128q6888M6719j61337J35086n7482m1821l6511
1953a51246P6650J45603k10850J44017q5005j572m3815J9986J65614j67964P3777
$$ plain form
2031 27625 -30228 -120927 -135565 -74750 -24442 -4735 -68329 -91013 1195 20571 -9338 -170883
2019 -170883 -151195 113790 43016 -114284 -208078 -144703 -107781 -113182 -237505 -164316 -127857
2008 -127857 -296165 -193781 -79196 -95800 -70902 -57172 -1076 -34620 -156282 -90780 91759
1997 91759 238608 106107 38128 207024 82558 -72806 -85081 -154114 -74892 15364 -20102
1986 -20102 62851 106269 120269 128295 444839 274469 85041 181165 208031 294087 79078
1975 79078 73482 30534 152698 284299 61776 86164 190313 288010 205455 45324 -38235
1964 -38235 -936 -26686 100116 50988 -35900 10819 -150518 -15432 -72914 -114735 -151246
1953 -151246 -74596 71007 -139843 4174 -80831 -82403 -126218 -106232 59382 -108582 -34805
1942c4805J08271M1866l5241k40964q2780M7596N4123J547k0642P3962K3003l7479
1930a01543n7458q2800M7400O4861K3290l036N6278J45609n0464J42100j85410
1919a173m3857J8638q6912J58329j53581l9129J08126l9594J6502l3934P3731
1908b2854L7035J3105J08857P7491n8871n050J20697j27659j20256J23231j13033
1897C2693J93270j54526m8231J79767j55277J78609l6300m3190p6089j09841J54340
1886A15225L4541L0350n9434Q7604Q8310l09628n2545j6637p5094J69848J00949
1875A13489J10590j3893p8080j13864n3802J34456n1365r0415N4138M1209J54065
1864B06528j59907K41762N5099k22835J78077j13814N3073r9014L190J97783j54256
$$ plain form
1942 -34805 73466 115332 80091 -160873 -243653 -196057 -141934 -140387 -161029 -87067 -64064 -101543
1930 -101543 -159001 -241801 -194401 -129540 -106250 -109286 -53008 92601 42137 184237 -1173
1919 -1173 -45030 -26392 -113304 45025 -108556 -147685 -39559 -79153 -62651 -96585 -22854
1908 -22854 14181 27286 136143 213634 154763 149713 270410 142751 22495 145726 32693
1897 32693 225963 71437 23206 202973 47696 226305 190005 146815 70726 -39115 115225
1886 115225 149766 180116 120682 208286 296596 -13032 -65577 -82214 -157308 12540 113489
1875 113489 224079 210186 132106 18242 -35560 98896 47531 -42884 11254 52463 206528
1864 206528 46621 288383 343482 120647 298724 184910 237983 138969 142159 339942 185686
1853A85686K8958o4354N671L7697m2572K7983p5118J02103K6702Q7569J73703
1842D94028j40807p2094j2863j2399R1937j66340K65883q5182J7332K08494k13993
1831C73996L945R7562m0561J49142n8527p7885K9807p3514J19678l6514N6597
1820E43726o4853J49030p7469j19558J18359k663J42730N8268O221l847q175K78972
1808A020741j6724l6212L0373L8234O7153j01924K402Q9623O8989j2128J76839
1797A327366M7192J88608J37904j01549r1371j45161K17533k5199k6893K17440
1787A745870L5082L18926J98454k8436l8225m0952J10367M48018j02782j51915
1777B494407L25020K40181Q4277J11472K2344O4761K70731K94274K10402J93865
$$ plain form
1853 185686 214644 150290 155961 193658 151086 179069 103951 206054 232756 320325 494028
1842 494028 353221 281127 268264 255865 347802 181462 447345 362163 379495 587989 373996
1831 373996 377941 475503 434942 584084 525557 447672 477479 403965 523643 487129 543726
1820 543726 478873 627903 550434 430876 549235 546572 689302 747570 753791 749944 741769 1020741
1808 1020741 1004017 967805 998178 1036412 1103565 1001641 1004043 1093666 1162655 1150527 1327366
1797 1327366 1374558 1563166 1701070 1599521 1508150 1362989 1580522 1555323 1528430 1745870
1787 1745870 1780952 2099878 2298332 2269896 2231671 2190719 2301086 2749104 2646322 2494407
1777 2494407 2819427 3059608 3143885 3255357 3277701 3342462 3613193 3907467 4117869 4311734
1767D311734J90675L71510L05821L26843J7141K40615L33966M16455N51091N28021
1757G593872Q01246R00361J156372R83879Q72593J282028J624117K122890K280761
1748A9618119K901205L717097M315826N078565P089931R190737J2182890J0062082
1740G4156452l878410j0043301q948772r807164p896142n289035l786335l085014
1732B1422279k261307j626563j467453j115270q57141j220549j102386j041330
1724A0730280j071718q98925o31608n83197m95619k90138l70878k89851m47708
1715E650638l34356l09733l61962l79117k75930n8172k43204p6946p0554j67214
1705C373450k07797j60318J9754j43812R0608j97399K9516J04149k36068j26129
$$ plain form
1767 4311734 4502409 4873919 5179740 5506583 5523724 5764339 6098305 6514760 7065851 7593872
1757 7593872 8395118 9295479 10451851 11435730 12308323 13590351 15214468 17337358 19618119
1748 19618119 22519324 26236421 30552247 35630812 42720743 51911480 64094370 74156452
1740 74156452 70278042 60234741 51285969 41478805 33582663 28293628 24507293 21422279
1732 21422279 19160972 17534409 16066956 14951686 14094545 12873996 11771610 10730280
1724 10730280 9658562 8759637 8128029 7544832 7049213 6759075 6388197 6098346 5650638
1715 5650638 5316282 5006549 4644587 4265470 3989540 3931368 3688164 3611218 3540664 3373450
1705 3373450 3165653 3005335 3025089 2881277 2971885 2774486 2804002 2908151 2672083 2545954
1695B545954j81853k22056j20134j11821K5487j21966j5045q4750k8221O9515
1685A755110j65969r6629j26771n0395p0061J29825j22316j56969j05382L253
1675I93696J2251n5044k5927j18231J32259p7796L8795J77094j05809r7504j32611
1664G41173Q031j95473J37722J30810j26106J56068M030J18309k515r5297j60942
1653G15810q7792J20012j50966K0175k8782J03738M8626j97318p7529m861o7031
1642C94082j6204J09580l125J37909O4752j35631r9151p4065j12312l6497J07061
1631C36399j08925n6281P7974N4470l7855j37071L2121q9162J49397r2143o9662
1620E9262K14827n5199K0175n7374k3160O6013j07831j28633Q503J8405J41079
$$ plain form
1695 2545954 2364101 2142045 2021911 1910090 1935577 1813611 1798566 1713816 1685595 1755110
1685 1755110 1589141 1492512 1365741 1315346 1245285 1375110 1252794 1095825 990443 993696
1675 993696 1005947 950903 924976 806745 939004 861208 900003 1077097 971288 873784 741173
1664 741173 749204 553731 691453 822263 696157 852225 856255 974564 972049 876752 715810
1653 715810 628018 748030 597064 617239 588457 692195 740821 543503 465974 461113 394082
1642 394082 377878 487458 484333 622242 686994 551363 452212 378147 265835 229338 336399
1631 336399 227474 171193 249167 303637 265782 128711 160832 71670 221067 128924 59262
1620 59262 274089 218890 239065 181691 158531 224544 116713 -11920 -3417 14988 156067
1609A56067K9666Q5049j81833j65923M2347j17847J50554j03505P2621R1222J49895
1598B08313q104k44808R5819n2107K4183K1392J9084R7708O2093j08910p5898
1587C8765N6066o1718J68312j00957j20874j62287K59203J80594K8468P0300k50730
1576A05142J69304l8808j10711r6773L0356N295K1342J61707o8580K6094o5011
1565A39357j44720J24662k1009j01743m2483J97642J0630j10914L9475j3982n7518
1554A9397r326K8935j8993j80k7773o3556l5378l6850k2422Q2117P0793n2400
1542f5636k307J03990K6980r2945p0817M9732n8299Q597j10309j5840J07964j88033
1530c06923Q7995J06276P6615n509R1818J12755M8249j6791n3073l822j35279
$$ plain form
1609 156067 185733 270782 88949 -76974 -34627 -152474 -1920 -105425 -32804 58418 208313
1598 208313 200209 -44599 51220 -887 23296 44688 63772 161480 223573 114663 38765
1587 38765 94831 33113 201425 100468 -20406 -182693 76510 257104 285572 355872 105142
1576 105142 274446 235638 124927 28154 58510 63805 85147 246854 178274 204368 139357
1565 139357 -5363 119299 98290 -3453 -45936 151706 162336 51422 90897 76915 19397
1554 19397 10071 39006 20013 19833 -7940 -71496 -106874 -143724 -166146 -84029 -13236 -65636
1542 -65636 -67943 36047 63027 -29918 -100735 -51003 -109302 -100705 -211014 -226854 -118890 -306923
1530 -306923 -218928 -112652 -36037 -41546 50272 163027 211276 194485 141412 137590 2311
1519B311l6566J04532l4122J45304O3540j8533J38998o2825k52353j77204Q2551
1508d4367J2712o0537k640M5881k4256Q2610J00759j3197Q977J70218O8083K5809
1496C70052O4057j82923m7429J86496k59698o4211j89844j62529J78550N4137
1486e3342k0281o0124R3210J0572P3438J01347j70886o4377j206J1942p6741p0572
1474b27020k177J25149P8000K0491o4733P9999q3473r9198J46031n4973R5906
1463A4002Q1308Q4261j71511p2445L370K8352M5476l9541j59344O8951n8720o4915
1451b40756J08444P5463P1930J9279J02585l8747o5698O9731l6594O8116k7162
1440A06591j27266j2691j12798m7560q408L6628J33896M9320m4007K7723K6385
$$ plain form
1519 2311 -34255 70277 36155 181459 244999 226466 365464 302639 50286 -126918 -44367
1508 -44367 -31655 -92192 -94832 -48951 -73207 9403 110162 96965 105942 276160 344243 370052
1496 370052 434109 251186 203757 390253 130555 66344 -123500 -286029 -107479 -53342
1486 -53342 -73623 -133747 -40537 -29965 43473 144820 -26066 -90443 -91649 -79707 -156448 -227020
1474 -227020 -229197 -104048 -26048 -5557 -70290 9709 -73764 -172962 -26931 -81904 14002
1463 14002 95310 179571 8060 -64385 -61015 -32663 12813 -26728 -186072 -117121 -175841 -240756
1451 -240756 -132312 -56849 15081 34360 136945 98198 32500 102231 65637 133753 106591
1440 106591 -20675 -33366 -146164 -193724 -202132 -165504 -31608 17712 -26295 1428 27813
1429B7813m1140j36944K8517l842o8648J01474N3486j50520j33440R9738K12637
1418a0869K7751p3567l0217K22134P3217j52394j34789J26410j29585N1784M875
1407b5250m998j16822q770Q1453j74905J51371n8175n5532L3388L5384L4819Q8866
1395a9171J8125k1951l111N2791j5524m5178l8416J32963J953o1932o1057J01564
1383D1056k7253p6129O6921q1201o8823R3299N8078l1732M0337j10308n0917N6797
1371h9875p7355O574l1268o0411J06660J78123o1972n3105q4199n852J97771n6191
1359c1100j36590r5618J42377L5111L5968J85821j52614O6731P686m5080j64722
1348a52030j13905J58099p6407J55215k1529p7785R0469o2360L7774o8898r4568
$$ plain form
1429 27813 -13327 -150271 -121754 -125596 -194244 -92770 -39284 -189804 -323244 -223506 -10869
1418 -10869 16882 -56685 -86902 135232 208449 56055 -78734 47676 -81909 -30125 -25250
1407 -25250 -30248 -147070 -155840 -74387 -249292 -97921 -156096 -211628 -178240 -142856 -108037 -19171
1395 -19171 -1046 -22997 -26108 26683 11159 -34019 -72435 60528 62481 549 -60508 41056
1383 41056 13803 -62326 4595 -76606 -145429 -52130 5948 -25784 14553 -95755 -146672 -89875
1371 -89875 -167230 -160656 -191924 -252335 -145675 32448 -29524 -82629 -166828 -172680 25091 -31100
1359 -31100 -167690 -263308 -120931 -85820 -49852 135969 -16645 50086 57772 12692 -152030
1348 -152030 -265935 -107836 -184243 -29028 -50557 -128342 -37873 -100233 -62459 -131357 -225925
1337b25925J55221O6821J511K885R3939k903k05797p864J7566j01858J19752k8142
1325a14794j10626N9465k4035L4420l0485R6721N9054n6107o3504l6590K7050
1314a59431J7280M0395P933N9749o4309R5428N869O2512p7980m6405j0474J95487
1302A26054j52958j76562J57849j6430N2169o9593k9093P9337J7587r5897l293
1291a10830Q689L1020j6962j24933J16785o6244M1008J1084Q4534K00773j98761
1280b3837j22847N267J33323J3538L728n8217o3312J8998J9225P6848K8958j51477
1268a19805j15456J7394J42739j45969M5908J32279M3135N0727K681j47699N5169
1257c8897J08728j4141R3245r4691j49633P4847L9896m221j36317j13466J6976
$$ plain form
1337 -225925 -70704 -3883 -2372 513 94452 91549 -114248 -122112 -104546 -206404 -86652 -114794
1325 -114794 -225420 -165955 -189990 -155570 -186055 -89334 -30280 -86387 -149891 -186481 -159431
1314 -159431 -142151 -101756 -93823 -34074 -98383 -2955 2914 65426 -12554 -58959 -69433 126054
1302 126054 -26904 -203466 -45617 -62047 -9878 -79471 -108564 -29227 -11640 -107537 -110830
1291 -110830 -102141 -71121 -88083 -213016 -96231 -162475 -121467 -110383 -25849 174924 -23837
1280 -23837 -146684 -141417 -8094 5444 9172 -49045 -112357 -93359 -74134 2714 31672 -119805
1268 -119805 -235261 -217867 -75128 -221097 -175189 -42910 225 50952 53633 -94066 -38897
1257 -38897 69831 55690 148935 54244 -95389 -20542 19354 15133 -121184 -234650 -217674
1246b17674L9927J96423j36497p15P7956l4441l3873j0165R8528j64885J10094
1235g5322m5877j12676O0541r0607r5217O9060j9162K10196Q0972j49244J91902
1224B4566J7507Q116r8773p4953R2968l570R5501j71876j8995J31001j21455Q7775
1212c2188m4030N9770j5741l7864N7731J04868R505j22685K2924r132j31016R9137
1200c8721m6742o1004R3339k546m8125j8676N1124K1272N4148m3752k8908l9273
1188a07864J51473Q668r7352J64948k09729P499k31076P5940J02568M412J16731
1177a3782j0813J61312k56844n3164L2951r8681J01540k1602k0858K92901j14952
1166a992n515K173M1439N6877k07877K26227j65390k1597K99030k49288o9583
$$ plain form
1246 -217674 -177747 18676 -117821 -118536 -40580 -75021 -108894 -119059 -20531 -185416 -75322
1235 -75322 -121199 -233875 -173334 -263941 -359158 -290098 -309260 -99064 -18092 -167336 24566
1224 24566 42073 50189 -48584 -123537 -30569 -34139 61362 -110514 -129509 1492 -119963 -32188
1212 -32188 -76218 -16448 -32189 -70053 -12322 92546 102051 -20634 2290 -6842 -137858 -38721
1200 -38721 -85463 -146467 -53128 -55674 -103799 -122475 -71351 -50079 4069 -39683 -68591 -107864
1188 -107864 43609 52277 -45075 119873 -89856 -82357 -313433 -237493 -134925 -130513 -13782
1177 -13782 -24595 136717 -120127 -173291 -140340 -239021 -137481 -159083 -179941 112960 -1992
1166 -1992 -7507 -5334 36105 92982 -114895 111332 -54058 -75655 223375 -25913 -95496
1155i5496n7767r730J01874L6509L3760o3746P9321p484l6267l6912o0028N6137
1143e9829J86704r2224q3369n3138R0633J2428k4073q477j91347K48938k6460
1132b14m6768J03881j90390J45931R7550n609o1573r9625N9967j22137k7466P2521
1120g3932j20956Q1305J44163j45157J78991m7196k2964L2081p8772K9922q6167
1109a08682q6863m6217R3032J67429o8338K3979L2258J22089j65143J9794J15359
1098I8697m7196K21832k10500j03179M98j8617J17442o1414j12895m0704L5614
1087a20422n1341Q8304J5806J46624l1796r350j01359j5131J41113j97670L7097
1076i8125M1544P552p4946L8240Q6780r4579M466L2840l292L2610j0399Q6482
$$ plain form
1155 -95496 -153263 -162993 -61119 -24610 9150 -54596 24725 17241 -19026 -55938 -115966 -59829
1143 -59829 126875 34651 -48718 -101856 -11223 1205 -22868 -31345 -222692 26246 -214
1132 -214 -46982 56899 -133491 12440 109990 104381 42808 -56817 3150 -118987 -146453 -73932
1120 -73932 -194888 -113583 30580 -114577 64414 17218 -5746 26335 -52437 -22515 -108682
1109 -108682 -195545 -241762 -148730 18699 -49639 -25660 6598 128687 -36456 -16662 98697
1098 98697 51501 273333 62833 -40346 -39848 -58465 58977 -2437 -115332 -156036 -120422
1087 -120422 -171763 -83459 -67653 78971 47175 37825 -63534 -78665 62448 -135222 -98125
1076 -98125 -56581 -49029 -123975 -85735 1045 -93534 -89068 -56228 -59520 -26910 -37309 49173
1064D9173L1436l4787q7748L8615k17356O0081L2038J13984R1059m2578J8190
1053E2107o5926J00385q7745j24225R4927J07836k1089M3966L2443n0333o6458
1042A5888o0477O2764J07481n4307j83945j0457J12556O5480J248r7775O2454
1031B0910k8266n5815J10986r0046m3882n9369N8169N7308j50824K16308j71905
1020a36426r2712K16650K6766m827L0401N2916K1097L5571J3242r6087j19561
1009e2970J05019j12962q5719n1061J68923J01618j4835p7887l7138R2671n6654
998b0995J18523M4603n5911l7879j51558O5481O2717q4043j0782J24373j03431
987d8902M9905j43583Q5054J80702N3198n4355j29688K9833q0838K64110j48134
$$ plain form
1064 49173 80609 45822 -41926 -3311 -220667 -160586 -128548 -14564 76495 33917 52107
1053 52107 -13819 86566 -1179 -125404 -30477 77359 56270 100236 132679 82346 15888
1042 15888 -44589 18175 125656 71349 -112596 -123053 -10497 54983 56231 -41544 20910
1031 20910 -7356 -63171 47815 -42231 -86113 -145482 -87313 -30005 -180829 35479 -136426
1020 -136426 -229138 -12488 14278 9451 39852 92768 113865 149436 162678 66591 -52970
1009 -52970 52049 -60913 -146632 -197693 -28770 72848 58013 -19874 -57012 35659 -20995
998 -20995 97528 142131 86220 48341 -103217 -37736 24981 -59062 -69844 54529 -48902
987 -48902 1003 -142580 -57526 123176 176374 122019 -7669 22164 -58674 205436 57302
976E7302j54432L0397J60890M8713j76996O1602K7195m8210m8170q2067P0977
965e2799l7940R3401q5858P5754N0213K8093o9975q704q6773J1651L407l2942
953a12472R1474N0516n8169J13361j5400j78576O7689L6215j692L9340m2702j52005
941a62421J11866N4705J86406q6073q6780R1789q3616M9842j68663k0568Q1361
930c2152J40729j29392j8758R3222k2838k6740J2427M6058j44771L7437J57001
919A12223N4679j86088l5372k2133R1153J8201j25055q8659m896K38186M9265
908A01504j2821m2988j53812J21855J7020K2052l0964L3604r4740J38488p21j57414
896e8937l2532Q3466l2812J4221l7718O5811K52617l0125o7758J4033p7501l9968
$$ plain form
976 57302 -97130 -66733 94157 142870 -34126 27476 54671 6461 -41709 -123776 -52799
965 -52799 -90739 2662 -83196 -7442 42771 70864 889 -7815 -94588 -82937 -79530 -112472
953 -112472 -20998 29518 -28651 84710 69310 -109266 -41577 -5362 -7054 32286 -10416 -162421
941 -162421 -50555 4150 190556 104483 17703 109492 25876 75718 -92945 -113513 -32152
930 -32152 108577 -20815 -39573 53649 30811 4071 16498 62556 -82215 -44778 112223
919 112223 166902 -19186 -54558 -76691 14462 32663 -92392 -181051 -185947 52239 101504
908 101504 88683 45695 -108117 13738 30758 52810 21846 55450 -39290 99198 98477 -58937
896 -58937 -91469 -8003 -40815 -26594 -64312 1499 254116 223991 156233 170266 92765 52797
884E2797j08455K7260j77984J20272J42024r4602R4742j5175M1125K7009Q215
873A17228r8826n6780k9879O5350N1897j46644O5049J49134j08870J6636r3304
862f9009N822P2487J40069o5725R898M171N4981K5595j29721p0625k00577P4836
850a47798O2619M7224j9103P7732Q7290r3316J11719k4527p438o0036J26493K2217
838A83076j10473p8916q1581J00670L7196j46909j40062K02966l9902j1082J00762
827A5745Q1556J88538o2350j18096O4229j12593J919r9342k7422K2776j04992
816a50032R1692m2802j4404L2803L7383K74373n4937j07483J37185j06062O5480
805A63196j46352P9227p6763k05677J8003o8474K60390o8006q230J65811J2500
$$ plain form
884 52797 -55658 -28398 -206382 -86110 55914 -38688 56054 40879 82004 109013 117228
873 117228 18402 -38378 -68257 -2907 48990 -97654 -32605 116529 7659 24295 -69009
862 -69009 -63187 9300 149369 83644 93542 97713 152694 178289 48568 -22057 -222634 -147798
850 -147798 -85179 -37955 -57058 20674 107964 14648 126367 101840 94402 34366 160859 183076
838 183076 72603 -6313 -87894 12776 49972 -96937 -236999 -34033 -73935 -85017 15745
827 15745 97301 285839 223489 105393 169622 57029 58948 -40394 -67816 -45040 -150032
816 -150032 -58340 -101142 -115546 -82743 -45360 229013 174076 66593 203778 97716 163196
805 163196 16844 96071 19308 -186369 -168366 -236840 23550 -44456 -52686 113125 125625
794A25625n1492Q394o644j1123J9239l3690k9555o7114L7586p3832J27168l3685
782A0877j09510J43358M3164J846j72607r369Q9732J03910K16486j05768Q369
771B20488K938q7514l2473j50925j00710M893J13021J28503p8540Q2244M8865
760A50790q3284M4879j16798o1841N8578J19946J09815k12838J28330p9098P6712
749A35191R2004k21116K2709j38188J4980J15573j45262J6878k753R56J36446
738B7418L6971L0499l7603P5430O131P6327J59524j43776j02508j3740n2183l8871
726B3619j43339m6691P7289P3269J03778m7577n1504k5488l391O3230j56966M6188
714h7583L1387J28672N4201P6811j84804o5088j11734o1615o797M4305J81208
$$ plain form
794 125625 74133 82527 75883 64760 83999 50309 20754 -46360 -8774 -82606 44562 10877
782 10877 -98633 44725 87889 89735 -82872 -92241 -2509 101401 317887 212119 220488
771 220488 223426 135912 103439 -47486 -148196 -143303 -30282 98221 19681 101925 150790
760 150790 67506 112385 -4413 -66254 -7676 112270 222085 9247 137577 58479 135191
749 135191 227195 6079 28788 -109400 -94420 21153 -124109 -107231 -109984 -109028 27418
738 27418 64389 94888 57285 132715 138846 215173 374697 230921 128413 114673 62490 23619
726 23619 -119720 -166411 -89122 -15853 87925 40348 -11156 -36644 -40035 23195 -133771 -87583
714 -87583 -56196 72476 126677 203488 18684 -46404 -158138 -219753 -226550 -182245 -1037
703a037J33416L4582J9558o15j48300L135R4596P4388r749P3324j52551L5720
691A56467j40077j15512J8792k0226K2904R455p8789J37135j0647J55492Q3046
680B18040Q840k2257J1428J2818n0004Q2589L1579k2009r0653j48397n9738J23650
668I5886j86459J67581l7272o77L5622J4881J15411n4925k876j09604q8810J15880
656F4638j17015l7546Q3342J2726J6126j380q8968L9671M374l3328L0986J35452
644A09078q5010n0820J7259j15743Q0247L3183r6767j29726M3816J61959R1776
633E9252N4576K7378L9210P0125p6373j11521m3846j03917M9838J91134J7191
622A73047Q4541j82977p5895J14582R6884r8519n2209J14816M7521k4858o4080
$$ plain form
703 -1037 132379 166961 186519 185904 37604 40739 135335 209723 199974 273298 120747 156467
691 156467 16390 -99122 -80330 -100556 -77652 -68197 -146986 -9851 -20498 134994 218040
680 218040 226880 204623 216051 228869 178865 261454 293033 271024 180371 31974 -27764 95886
668 95886 -90573 77008 39736 39059 74681 89562 204973 150048 147172 37568 -51242 64638
656 64638 -52377 -89923 -6581 6145 22271 20891 -68077 -28406 -24032 -57360 -26374 109078
644 109078 24068 -26752 -9493 -125236 -44989 -11806 -108573 -238299 -194483 -32524 59252
633 59252 113828 141206 180416 250541 174168 62647 18801 -85116 -35278 155856 173047
622 173047 257588 74611 -1284 113298 210182 111663 59454 174270 221791 196933 132853
611A32853Q3173k72488Q8020j06748k6556J27122p5955J925K05475K8566n1062
600A34325R297j8607j54261J7905o1833j01923J36052j12938L5412l6875J60632
589G186j7536o1035J20702M7330m6060Q8341m0647K06625p9449j28616n2417N944
577E0368Q2715J8880j0928p6517j03577Q3624N4197J46320j1420m8102Q896j34853
565E9603Q3674J1564q838n5666k7432J02434j52616M4867M6117k21171J33932
554A6468M4802J47042l2457j49987J38250M1034L59j85714l5660N0574J09569
543A44280O5447j01321M4876p5947M2969m5952N423L9765k55276Q806P5333p2594
$$ plain form
611 132853 216026 -56462 31558 -75190 -101746 25376 -50579 -48654 156821 185387 134325
600 134325 143622 125015 -29246 -11341 -73174 -175097 -39045 -151983 -116571 -153446 7186
589 7186 -10350 -71385 49317 96647 50587 138928 98281 304906 225457 96841 44424 50368
577 50368 133083 151963 141035 64518 -39059 44565 98762 245082 233662 185560 194456 59603
565 59603 143277 154841 146003 90337 62905 165339 12723 57590 103707 -117464 16468
554 16468 61270 208312 175855 25868 164118 205152 205511 19797 -15863 34711 144280
543 144280 209727 108406 153282 77335 120304 74352 79775 119540 -135736 -126930 -51597 -124191
$$ [...]
##END NTUPLES=NMR SPECTRUM
##END=
