##TITLE=1H_EC-3259(V-1)
 CDCl3, 8 sc, 
 2.9.2021
##JCAMPDX= 6.0         $$ Bruker NMR JCAMP-DX V2.0
##DATA TYPE= NMR SPECTRUM
##DATA CLASS= NTUPLES
##ORIGIN= UXNMR, Bruker Analytische Messtechnik GmbH
##OWNER= root
$$ XWIN-NMR		Version 3.5
$$ Thu Sep  2 08:39:51 2021 Russian Standard Time (UT+4h)  she@DPX200
##.OBSERVE FREQUENCY= 200.1312
##.OBSERVE NUCLEUS= ^1H
##.ACQUISITION MODE= SIMULTANEOUS
##.ACQUISITION SCHEME= undefined
##.AVERAGES= 8
##.DIGITISER RES= 18
##SPECTROMETER/DATA SYSTEM= spect
##.PULSE SEQUENCE= zg30
##.SOLVENT NAME= CD2Cl2
##.SHIFT REFERENCE= (INTERNAL, CD2Cl2, 0, 17.9028)
##AUDIT TRAIL= $$ (NUMBER, WHEN, WHO, WHERE, WHAT)
$$ ##TITLE= Audit trail, XWIN-NMR		Version 3.5
$$ ##JCAMPDX= 5.01
$$ ##ORIGIN= Bruker BioSpin GmbH
$$ ##OWNER= she
$$ F:/spectra/data/she/nmr/H-F/1/pdata/1/auditp.txt
$$ ##AUDIT TRAIL=  $$ (NUMBER, WHEN, WHO, WHERE, WHAT)
(   1,<2021-09-02 08:38:45.31 +0400>,<she>,<DPX200>,
      <created by zg, POWCHK disabled, PULCHK disabled
       configuration hash MD5:
       00 E9 B6 7A A2 85 ED C7 34 08 36 98 17 FE 4E 26
       data hash MD5: 16K
       D4 B9 AD 17 04 23 A2 55 09 D8 A6 9D EC 2E 94 12>)
(   2,<2021-09-02 08:38:47.81 +0400>,<she>,<DPX200>,
      <Start of raw data processing
       efp BC_mod = 2 LB = 0.24 FT_mod = 6 PKNL = 1 PHC0 = -13359.48 PHC1 = 10.20097 SI = 16K 
       data hash MD5: 16K
       B7 AB A8 81 F5 65 83 CA 1D 50 ED 1E A3 F0 CD AF>)
(   3,<2021-09-02 08:39:04.15 +0400>,<she>,<DPX200>,
      <pk PHC0 = 0.17056 PHC1 = 0.7999998 
       data hash MD5: 16K
       90 EA 00 92 7B DB 72 69 8A 17 92 A7 13 CA 88 8E>)
(   4,<2021-09-02 08:39:07.54 +0400>,<she>,<DPX200>,
      <abs ABSG = 5 
       data hash MD5: 16K
       FD 6D 00 BC 2F 95 C2 4E 4D 9B DC 99 01 18 3B 83>)
$$ ##END=
$$ 
$$ hash MD5
$$ 7D 20 88 A7 2D 6E 48 30 78 56 A3 39 B9 33 72 2B
##$RELAX= 
##$RELAX= 
##$RELAX= 
##$RELAX= 
##$RELAX= 
##$RELAX= 
$$ Bruker specific parameters
$$ --------------------------
##$DU= <F:/spectra>
##$EXPNO= 1
##$NAME= <H-F>
##$PROCNO= 1
##$TYPE= <nmr>
##$USER= <she>
##$AMP= (0..31)
100 100 100 100 100 100 100 100 100 100 100 100 100 100 100 100 100 100 
100 100 100 100 100 100 100 100 100 100 100 100 100 100 
##$AQSEQ= 0
##$AQ_mod= 1
##$AUNM= <au_zg>
##$AUTOPOS= <>
##$BF1= 200.13
##$BF2= 200.13
##$BF3= 200.13
##$BF4= 200.13
##$BF5= 200.13
##$BF6= 200.13
##$BF7= 200.13
##$BF8= 200.13
##$BYTORDA= 1
##$CFDGTYP= 0
##$CFRGTYP= 5
##$CHEMSTR= <none>
##$CNST= (0..31)
1 1 145 1 1 1 1 1 1 1 1 1 1 1 1 1 1 1 1 1 1 1 1 1 1 1 1 1 1 1 1 1 
##$CPDPRG= <>
##$CPDPRG1= <>
##$CPDPRG2= <>
##$CPDPRG3= <>
##$CPDPRG4= <mlev>
##$CPDPRG5= <mlev>
##$CPDPRG6= <mlev>
##$CPDPRG7= <mlev>
##$CPDPRG8= <mlev>
##$CPDPRGB= <>
##$CPDPRGT= <>
##$D= (0..31)
0 1.2 0 0 0 0 0 0 0 0.06 0 0.03 0 0 0 0 0.0002 0 0 0 0 0 0 0 0 0 0 0 0 
0 0 0 
##$DATE= 1630557524
##$DBL= (0..7)
120 120 120 120 120 120 120 120 
##$DBP= (0..7)
150 150 150 150 150 150 150 150 
##$DBP07= 0
##$DBPNAM0= <>
##$DBPNAM1= <>
##$DBPNAM2= <>
##$DBPNAM3= <>
##$DBPNAM4= <>
$$ [...]
##$SUBNAM3= <"">
##$SUBNAM4= <"">
##$SUBNAM5= <"">
##$SUBNAM6= <"">
##$SUBNAM7= <"">
##$SUBNAM8= <"">
##$SUBNAM9= <"">
##$SW= 20.0189188712717
##$SWIBOX= (0..15)
0 0 2 0 0 0 0 0 0 0 0 0 0 0 0 0 
##$SW_h= 4006.41025641026
##$TD= 16384
##$TD0= 1
##$TE= 0
##$TE2= 300
##$TE3= 300
##$TEG= 300
##$TL= (0..7)
0 120 120 120 120 120 120 120 
##$TP= (0..7)
150 150 150 150 150 150 150 150 
##$TP07= 0
##$TPNAME0= <>
##$TPNAME1= <>
##$TPNAME2= <>
##$TPNAME3= <>
##$TPNAME4= <>
##$TPNAME5= <>
##$TPNAME6= <>
##$TPNAME7= <>
##$TPOAL= (0..7)
0.5 0.5 0.5 0.5 0.5 0.5 0.5 0.5 
##$TPOFFS= (0..7)
0 0 0 0 0 0 0 0 
##$TUNHIN= 0
##$TUNHOUT= 0
##$TUNXOUT= 0
##$USERA1= <user>
##$USERA2= <user>
##$USERA3= <user>
##$USERA4= <user>
##$USERA5= <user>
##$V9= 5
##$VALIST= <valist>
##$VCLIST= <CCCCCCCCCCCCCCC>
##$VD= 0
##$VDLIST= <DDDDDDDDDDDDDDD>
##$VPLIST= <PPPPPPPPPPPPPPP>
##$VTLIST= <TTTTTTTTTTTTTTT>
##$WBST= 1024
##$WBSW= 4
##$XGAIN= (0..3)
0 0 0 0 
##$XL= 0
##$YL= 0
##$YMAX_a= 497364
##$YMIN_a= -658946
##$ZGOPTNS= <>
##$ZL1= 120
##$ZL2= 120
##$ZL3= 120
##$ZL4= 120
##$ABSF1= 17.88936
##$ABSF2= -2.129717
##$ABSG= 5
##$ABSL= 3
##$ALPHA= 0
##$AQORDER= 0
##$ASSFAC= 0
##$ASSFACI= 0
##$ASSFACX= 0
##$ASSWID= 0
##$AUNMP= <proc_1d>
##$AZFE= 0.1
##$AZFW= 0.1
##$BCFW= 0
##$BC_mod= 2
##$BYTORDP= 0
##$COROFFS= 0
##$CY= -3
##$DATMOD= 1
##$DC= 0
##$DFILT= <>
##$DTYPP= 0
##$F1P= 0
##$F2P= 0
##$FCOR= 1
##$FTSIZE= 16384
##$FT_mod= 6
##$GAMMA= 0
##$GB= 0
##$INTBC= 1
##$INTSCL= 1.334414e-10
##$ISEN= 128
##$LB= 0.24
##$LEV0= 0
##$LPBIN= 0
##$MAXI= 10000
##$MC2= 0
##$MEAN= 0
##$ME_mod= 0
##$MI= 1.114404
##$NCOEF= 0
##$NC_proc= -6
##$NLEV= 6
##$NOISF1= 3.799351
##$NOISF2= 2.8
##$NSP= 0
##$NTH_PI= 0
##$NZP= 0
##$OFFSET= 17.9028
##$PC= 1
##$PHC0= -13359.31
##$PHC1= 11.00097
##$PH_mod= 1
##$PKNL= yes
##$PPARMOD= 0
##$PSCAL= 0
##$PSIGN= 0
##$REVERSE= no
##$SF= 200.129620324769
##$SI= 16384
##$SIGF1= 3
##$SIGF2= 2
##$SINO= 5.538805
##$SIOLD= 16384
##$SREGLST= <1H.CDCl3>
##$SSB= 0
##$STSI= 16384
##$STSR= 0
##$SW_p= 4006.41025641025
##$SYMM= 0
##$S_DEV= 0
##$TDeff= 16384
##$TDoff= 0
##$TI= <>
##$TILT= no
##$TM1= 0
##$TM2= 0
##$TOPLEV= 0
##$USERP1= <user>
##$USERP2= <user>
##$USERP3= <user>
##$USERP4= <user>
##$USERP5= <user>
##$WDW= 1
##$XDIM= 16384
##$YMAX_p= 470696847
##$YMIN_p= -380067
$$ End of Bruker specific parameters
$$ ---------------------------------
##NTUPLES= NMR SPECTRUM
##VAR_NAME=  FREQUENCY,     SPECTRUM/REAL,   SPECTRUM/IMAG
##SYMBOL=    X,             R,               I
##VAR_TYPE=  INDEPENDENT,   DEPENDENT,       DEPENDENT
##VAR_FORM=  AFFN,          ASDF,            ASDF
##VAR_DIM=   16384,         16384,           16384
##UNITS=     HZ,            ARBITRARY UNITS, ARBITRARY UNITS
##FACTOR=    0.24454680195387, 1,            1
##FIRST=     3582.88048796389, 0,            0
##LAST=      -423.529768446355, 0,           0
##MIN=       -423.529768446355, -380067,     0
##MAX=       3582.88048796389, 470696847,    0
$$ Real data points
##PAGE= N=1
##DATA TABLE= (X++(R..R)), XYDATA
$$ [...]
6625a36008l5534q849R2318J53558p4058r9472o1849p7839N0238K4767P4182r8813
6613a97359N3100K3811M8626p5097J9837K8999P0079j10164M1042P5872k4986
6602d6240j08200J2944O0288n5430N8369M8067k3729p5504J10073o5970j6408
6591a01740K07594j59715j5540R7013K472m3846L0601k6270n9823L537O4239J4819
6579A3341l6687R8458l6009l531Q9342N5994l9297j7385J63201K0891O4620J27580
6567E00518K2436J9917k9183k8833N5879r7351O976j52707l3294p2780N0107j5786
6555B25899l1935k444m4298p0827L9877J20582k23800j2933m7900J9170N1582
6544B2973K8158k2883K8406j4049J164o3273K7069o9649O9710K4197N0863j49918
$$ plain form
6625 -136008 -171542 -180391 -88073 65485 -8573 -108045 -169894 -247733 -197495 -172728 -98546 -197359
6613 -197359 -144259 -120448 -71822 -146919 -127082 -98083 -28004 -138168 -97126 -21254 -46240
6602 -46240 -154440 -141496 -81208 -136638 -78269 -30202 -53931 -129435 -19362 -85332 -101740
6591 -101740 105854 -53861 -69401 27612 30084 -13762 16839 -9431 -69254 -65717 -1478 13341
6579 13341 -23346 75112 39103 35572 124914 180908 141611 124226 287427 308318 372938 500518
6567 500518 522954 542871 513688 484855 540734 443383 450359 297652 264358 191578 241685 225899
6555 225899 193964 191520 147222 76395 116272 236854 13054 121 -47779 -28609 22973
6544 22973 51131 28248 56654 42605 43769 -19504 7565 -62084 7626 31823 82686 -67232
6532f7232J4595J631P3263J6678n1151J43476q5756n339J1306p3228m748o7032
6520i3537m4601M7681l2994L5949J1708P8970J01048n9666j74303K5392J0488
6509i3865O7768N0741k035o0720n6024M3032L5574j17596L9383P83J41442m641
6497D3842n7105N3303L8554R868j49595Q8895j07956m7694J92178l0876j04958
6486g1544r782J00325J05694K2220j29764j920L0863j5910M1062j3208m2623p772
6474G641J04819n1706n9388L4542l3230m8149L4230o696j61993M7860J63096L7108
6462F8134L2053j4755k2478k3071m745M4015o2533l0034N1960R4530L3423k0881
6450A45618p2184m3594R3782K4869n9022l3660Q1403N6513o8147Q602m7301j5157
$$ plain form
6532 -67232 -52637 -51006 22257 38935 -12216 131260 45504 40165 51471 -21757 -26505 -93537
6520 -93537 -138138 -90457 -123451 -87502 -75794 3176 104224 44558 -129745 -104353 -93865
6509 -93865 -26097 24644 22609 -38111 -94135 -51103 -15529 -133125 -93742 -92959 48483 43842
6497 43842 -13263 40040 78594 88462 -61133 27762 -80194 -127888 64290 33414 -71544
6486 -71544 -81326 18999 124693 146913 17149 15229 46092 30182 71244 58036 15413 7641
6474 7641 112460 60754 1366 35908 2678 -45471 -11241 -17937 -179930 -132070 31026 68134
6462 68134 100187 85432 62954 39883 35138 79153 16620 -13414 38546 133076 166499 145618
6450 145618 73434 29840 123622 148491 89469 55809 137212 193725 125578 134180 86879 71722
6438G1722J6251l7422L6684l3361l0821R701N3580J5739j499P9565O0715j24713
6426A16141q9238q4602N1963O1075K1890m9081P245l029l6642M8665N2541J8697
6414A15625M8973J7878q7906j9426P197R5196L4492j3384q5862L4532N5551K6750
6402B29616r3880M9653P1396j00313K4074m2964J35258r6164O0919J7041j2576
6391B42060P990R1432j2371n8841P4520l6551j07470j36316O238L1266J33749
6380B35706q6249j8822J31718j5042q8742O8425l6515L1019Q2569J06545K2175
6369D32787r4559p8500J3105J17547K7578Q0312p6081L2109m9910R4141L6616
6358E35145j02542L1702K0819J24804n6948j08444J46725l309L2724j88814m911
$$ plain form
6438 71722 87973 50551 87235 53874 23053 32754 86334 102073 100574 180139 240854 116141
6426 116141 26903 -57699 -5736 55339 77229 28148 35393 32364 -4278 44387 96928 115625
6414 115625 164598 182476 94570 75144 82341 177537 212029 198645 112783 147315 202866 229616
6402 229616 135736 185389 256785 156472 180546 137582 272840 176676 237595 254636 242060
6391 242060 250050 341482 329111 270270 344790 308239 200769 64453 70691 101957 235706
6380 235706 149457 130635 262353 247311 158569 226994 190479 221498 304067 410612 432787
6369 432787 338228 259728 272833 390380 417958 498270 422189 454298 404388 498529 535145
6358 535145 432603 464305 485124 609928 552980 444536 591261 587952 620676 431862 426951
6347D26951J07148K6428N1901r3328N3742J16387K8722j08043j4972K9558P9376
6336G03870p4206r803R8163o563n1752M6288N9393k5842j2898J17512j13275q3885
6324F47002M8277J00375L6345M8756O3729k2287j13804J2035K808J61682M317
6313I89235j038p0502R9076K07933O82J3603P145J2105j5417L6667o8175R7725
6301A309039L0235J994P5688m7303O9949P9222J01080o9799j26416J29408J04243
6290A657340n383J0375J05021l7086J32180J34541J21759J30429O0918J19088
6280B429182J05139M6246P7488P1979J61788J32498J13886m9080P9504J52829
6270C321459L2624O5456J14945J73519J44463R8065Q9668M7177K461Q5785K28776
$$ plain form
6347 426951 534099 560527 612428 519100 572842 689229 717951 609908 594936 624494 703870
6336 703870 629664 619861 718024 711461 659709 705997 765390 739548 726650 844162 730887 647002
6324 647002 695279 795654 831999 880755 944484 922197 808393 820428 823236 984918 989235
6313 989235 988197 917695 1016771 1224704 1225386 1238989 1246134 1258239 1242822 1279489 1211314 1309039
6301 1309039 1339274 1341268 1416956 1369653 1439602 1518824 1619904 1550105 1423689 1553097 1657340
6290 1657340 1651957 1662332 1767353 1730267 1862447 1996988 2118747 2249176 2310094 2429182
6280 2429182 2534321 2580567 2658055 2730034 2891822 3024320 3138206 3089126 3168630 3321459
6270 3321459 3354083 3419539 3534484 3708003 3852466 3950531 4040199 4087376 4089837 4175622 4404398
6259D404398J09636o6041R9639J50511J02658J10724J17827J12197K35881J30450
6249E507880J12034K35602K37109K68981K69622K40217L12245J60946K37516M12216
6239G994368M07119L72829M29530L69427L51666N88274P73991M72281O98955O35741
6229A3094181R25546Q07526Q91904J028495J197874J451586J445005J888838K223950
6220B4954905K423454K999629L410880M260719M663931N653343O957779Q475128
6212F3799768J0129287J1853829J2306963J1399729P912553J943296l762810p873399
6204A07709216p967275o292867m753210n648877p367080r275673r529344q390729
6196D8484161o641954n229950m095440l511733k826375k509290j901485j797061
$$ plain form
6259 4404398 4514034 4447993 4547632 4698143 4800801 4911525 5029352 5141549 5377430 5507880
6249 5507880 5619914 5855516 6092625 6361606 6631228 6871445 7183690 7344636 7582152 7994368
6239 7994368 8401487 8774316 9203846 9573273 9924939 10513213 11287204 11759485 12458440 13094181
6229 13094181 14019727 14827253 15719157 16747652 17945526 19397112 20842117 22730955 24954905
6220 24954905 27378359 30377988 33788868 38049587 42713518 48366861 55324640 63799768
6212 63799768 73929055 85782884 98089847 109489576 117402129 119345425 115582615 107709216
6204 107709216 99741941 93449074 88695864 83046987 75679907 66404234 56874890 48484161
6196 48484161 41842207 36612257 32516817 29005084 26178709 23669419 21767934 19970873
6188A9970873j670962j307028j200506j091997p54819p99253p17675n79048m90235
6179A1359350o16725n78529n18295l92158m54145k27269l88184l92442k92096
6170G499507l35749k17375l37389l15069k91653k68409k19101j46129j90795p2385
6160E105453j39867k44386j08771j99831k01199M4435j45010j14295k50609p1616
6150C674304n9941k0962j37145n7525q0571j20039m0729P7152k5213o3279j67251
6139B978801j02495j01680r6528m7191k6863j70326o7336o3308O6625Q7968j60994
6128B296673p3342j45153J07665k7925l9558o4917j50911O5044j14641m4794M3045
6117A851186j95058p3750m9590j00741o411j25970k0393l1884k0087j1832r5381
$$ plain form
6188 19970873 18299911 16992883 15792377 14700380 13945561 13146308 12428633 11849585 11359350
6179 11359350 10742625 10164096 9645801 9253643 8799498 8572229 8184045 7791603 7499507
6170 7499507 7163758 6946383 6608994 6293925 6002272 5733863 5514762 5368633 5177838 5105453
6160 5105453 4965586 4721200 4612429 4412598 4211399 4255834 4110824 3996529 3745920 3674304
6150 3674304 3614363 3593401 3456256 3398731 3318160 3198121 3157392 3234544 3209331 3146052 2978801
6139 2978801 2876306 2774626 2678098 2630907 2604044 2433718 2366382 2303074 2369699 2457667 2296673
6128 2296673 2223331 2078178 2185843 2157918 2118360 2053443 1902532 1967576 1852935 1808141 1851186
6117 1851186 1656128 1582378 1532788 1432047 1425636 1299666 1279273 1247389 1227302 1215470 1120089
6106A120089j52075J9120k2060L7011J4324O6147j20255j66378Q7146o163l2891
6095H44015R1850l1759j00620m5441k7323O977P6069o9471l0253l0910N8930p3462
6083F68602N9653n4953p249l0727m0593R507R862R918j70724o186P8668m9547
6071D76231R7999l0521j00812N7136m6391m4589p5886K3967Q5408K2751l8653
6060D26640k4297L3583o1150k1811q2318m5842J30605m6326j1659J06417l4001
6049C69841j0125j2358P2275p7233J03536k9324k50812R0527M8751J2021K9033
6038C46132k2477m9949J8124k4695M5298j4941k6921j45110R4590L0887K6150
6027B77088J7861J4713M995P9079l7438m5396j97229J36844L3651k2393M9956
$$ plain form
6106 1120089 968014 987134 965074 1002085 1016409 1082556 962301 795923 883069 876906 844015
6095 844015 935865 904106 803486 758045 730722 737699 813768 744297 714044 683134 742064 668602
6083 668602 728255 673302 666053 635326 594733 604240 614102 624020 453296 447110 525778 476231
6071 476231 574230 543709 442897 500033 453642 409053 333167 357134 442542 465293 426640
6060 426640 402343 435926 374776 352965 270647 224805 355410 309084 297425 403842 369841
6049 369841 359716 347358 419633 342400 445936 416612 165800 256327 305078 317099 346132
6038 346132 323655 273706 291830 267135 312433 297492 270571 125461 220051 250938 277088
6027 277088 294949 309662 314657 393736 356298 310902 113673 250517 284168 261775 311731
6016C11731m0910j46131P9266J31626o5759j4568n0596K7020Q1347j66641L602
6005A49987P6861j70057J14031Q1651m9113J4177n6253k6194j1372l7352J6272
5994A02638J8516K0898j8489R7721L0253l4012k6322j36227M263Q4207K4910j6293
5982A52063Q6042q414m3160j26834m9966J01908O1290P3702o5052n9782K5083
5971A46880J05205Q3021m6684j14931n3784q6509r9Q6897P2499n2480m3133P9284
5959A76166K7670J8086o5515N8065j36360j07849J84824N5831l1344j12648n1622
5948A5304O0285L0574j14J10874p5602N4159j5980n7003J3230o8577L184O2949
5936A33283M5889P802k3331j7249M7636r8049m6308l3654Q69j1164K862r327l1436
$$ plain form
6016 311731 270821 124690 203956 335582 269823 255255 204659 231679 313026 146385 149987
6005 149987 226848 56791 170822 252473 203360 217537 161284 135090 123718 86366 102638
5994 102638 121154 142052 123563 221284 251537 217525 191203 54976 59239 143446 168356 152063
5982 152063 238105 229691 186531 59697 9731 111639 172929 246631 181579 121797 146880
5971 146880 252085 335106 288422 173491 119707 33198 33099 119996 192495 140015 96882 176166
5959 176166 203836 221922 156407 214472 78112 -29737 155087 210918 179574 66926 15304
5948 15304 75589 106163 106049 216923 141321 195480 179500 122497 135727 67150 70334 133283
5936 133283 179172 186974 163643 146394 194030 95981 49673 16019 16888 5724 8586 -741 -32177
5923c2177k7820P5903k7802k5765l6126m0296K04073m3591L5042m5388M3371P0988
5911A50412l3552n2048M9584J17885m286l0753r0572K4979j4895Q854j0609j54532
5899c9533R1587k3582m737l6436J1605M8075J5785n0879J00093j2403o8255J51676
5887A82996L7122K205Q452m176J01942m6066j13959K7622o7012o0354o9763O5292
5875F4301K2137r7842P0524j3965l4028P7063m7585J5150J81970n3840q8549O567
5863A01903n1327J0804Q1829K5307q352M2462J2215p199q2210k4756J70376K5438
5851B96490n0261J73730R0147k7726N9691n6617j2633j3855M6426R435M6444r006
5839E52265K228k914j26641j72068j25823P6487j4845L7828n5839q6849M061N7891
$$ plain form
5923 -32177 -59997 15906 -11896 -37661 -73787 -114083 89990 46399 81441 36053 79424 150412
5911 150412 116860 64812 114396 232281 227995 197242 106670 131649 116754 125608 114999 -39533
5899 -39533 52054 28472 23735 -12701 -1096 46979 62764 11885 111978 99575 31320 182996
5887 182996 220118 222323 230775 226599 328541 282475 168516 196138 129126 68772 -991 64301
5875 64301 86438 -11404 59120 45155 11127 88190 40605 55755 237725 183885 95336 101903
5863 101903 50576 61380 143209 168516 160164 202626 214841 207642 125432 100676 271052 296490
5851 296490 246229 419959 510106 482380 542071 485454 472821 458966 505392 514827 561271 552265
5839 552265 554493 551579 424938 252870 127047 203534 188689 226517 170678 83829 87890 145781
5827A45781j6211o2331Q6085j508o1809M4873j07713n2670o4587K3297J31538
5816F4745Q1498m1660R889l6715j1178R4499o8199o2024L3387J3508N6780j2174
5804A22356n1026K1973l1532j9533M702J1976Q2382m517k178q5526j31651n8965
5792a41539J14997Q8584o8054L9218o6489r464N6552J0693l6145L4707Q415l2044
5780e69N0714L5893p911m6418L4506j07709J06672P7340j8735j02051L6277j00275
5768d2266K1060O3892R7437m8301k3313J83324p6358j25791r5230Q4654j04992
5757f5884P5260O4900m1712j74130m3676M4730O0095M5243n1394Q5900k4606n0776
5745g6050J8619M4440j39951Q3399J4746m8926O1861m3446N9373O473L5220R3530
$$ plain form
5827 145781 129570 67239 153324 151816 90007 134880 27167 -25503 -90090 -66793 64745
5816 64745 146243 104583 114472 77757 66579 161078 92879 30855 64242 77750 134530 122356
5804 122356 71330 93303 61771 42238 46940 58916 141298 136781 134603 49077 -82574 -141539
5792 -141539 -26542 62042 -6012 33206 -33283 -42747 13805 24498 -11647 23060 31475 -569
5780 -569 50145 86038 78127 31709 66215 -41494 65178 142518 123783 21732 58009 -42266
5768 -42266 -21206 42686 140123 91822 68509 251833 175475 49684 -45546 39108 -65884
5757 -65884 9376 74276 32564 -141566 -185242 -140512 -80417 -35174 -86568 -668 -25274 -76050
5745 -76050 -57431 -12991 -152942 -69543 -54797 -103723 -41862 -85308 -25935 -19462 15758 109288
5733A09288K342p5517O11n8297K9857M0345q7592l1837J00871O7473l6322R46
5721F2168O617j49467k4096N0353L6602N4376p7361J1574N1515R3918j66852J1055
5709c9598P730j56604N9579O2073J1088o581k1178o0855N4064N4395O2297N8832
5697H5242j05580r6910M7876n7364J1129p2975R1135o1672r939N2320q9078K01827
5685c989Q3666m9481o0495l435J52788o9089m5541o0635l0785J6838m174o601
5673h0933R2579M2142j73202Q6938m7956k9887J59083o9921j24048J9821N490
5662a19894L3862Q0957l8129P0122l8836k8342M5439L4236l1625m6258N9105J6815
5650C7452j05122L6874J50967o2023m2165K152n6432N9420m0531o3995K4965m8914
$$ plain form
5733 109288 111630 36113 36724 -21573 8284 48629 -38963 -70800 30071 97544 61222 62168
5721 62168 68785 -80682 -104778 -54425 -17823 36553 -40808 -29234 22281 116199 -50653 -39598
5709 -39598 -31868 -188472 -128893 -66820 -55732 -62313 -83491 -144346 -90282 -35887 26410 85242
5697 85242 -20338 -117248 -69372 -126736 -115607 -188582 -97447 -159119 -169058 -116738 -205816 -3989
5685 -3989 79677 30196 -30299 -33734 119054 49965 4424 -56211 -86996 -70158 -74332 -80933
5673 -80933 11646 53788 -119414 -32476 -80432 -110319 48764 -21157 -145205 -125384 -119894
5662 -119894 -86032 -5075 -43204 26918 -11918 -40260 5179 39415 7790 -38468 20637 37452
5650 37452 -67670 -30796 120171 58148 15983 18135 -38297 21123 -19408 -83403 -58438 -107352
5638a07352o1383j0513J52557J9825Q4081k4775l7107K6229r3541M4522k0584
5627b8041r3188j4049J15003k9265O7875P0674r7000l1129o8659L283J06124K8511
5615C0139j3772M4887l0414j44831O7464J44212R3087r8756o1329J05818l1138
5604A05367n9973O987O9839r4146j4876L482L0233L2288m971m0346n9619J36216
5592A10481n4107l3137L5160j6546R6153J0112j01118j77343J10326Q0129N1930
5581A12040k5658O9580O7098j42182m967L3431O4899J2189M6260P204q1594L0861
5569A89161j1470m6570J29374j111k3833R8829l0557K2504O3711j6716M438p4231
5557C03529J15936o8744j37238Q9691l5419N7721j09963Q6569j4341j40590j47968
$$ plain form
5638 -107352 -168735 -179248 -26691 -6866 77215 52440 15333 41562 -51979 -7457 -28041
5627 -28041 -121229 -135278 -20275 -49540 18335 89009 -7991 -39120 -107779 -104496 1628 30139
5615 30139 16367 61254 30840 -113991 -46527 97685 190772 92016 30687 136505 105367
5604 105367 45394 52381 122220 28074 13198 16680 46913 79201 74230 33884 -25735 110481
5592 110481 56374 23237 58397 41851 138004 148116 46998 -130345 -20019 60110 112040
5581 112040 86382 155962 223060 80878 75911 109342 174241 186430 232690 239894 158300 189161
5569 189161 177691 131121 260495 259384 235551 334380 303823 326327 390038 373322 377760 303529
5557 303529 419465 350721 213483 303174 267755 325476 215513 302082 287741 147151 -817
5546h17J37592O5808j6660K2480l143l4420R111o7701j7061R2156k0827o472O2415
5533B22461l5220n342O5588p7725M2400m8774P2471j04443p9916R2728J35041
5522B79269m3496Q8383l7768j33951R165l723R2383m1420K4565K3724K1984n6841
5510B22274q4605q8128J34207J32425r473o648q9408k5659l3235K0187J2616l3088
5498A51465o3032J43870N9839n1564M8087Q8338N6648N3439Q3428n0746L1657
5487E51429Q1568J9110n9672K292J45247M9106K3556o8251K9888M3959K34596
5476A052828m3401o0113O576N7076Q8524P7215P9619m6892q144p561M4400r002
5464A231125j1059k7582j04967L1210m7916K4521j374j58628K0983m9941J891
$$ plain form
5546 -817 136775 202583 185923 208403 205260 170840 179951 112250 95189 187345 166518 160046 222461
5533 222461 187241 181899 247487 169762 212162 163388 235859 131416 51500 144228 279269
5522 279269 235773 324156 286388 152437 161602 157879 250262 208842 233407 257131 279115 222274
5510 222274 137669 49541 183748 316173 306700 300052 210644 184985 151750 171937 184553 151465
5498 151465 88433 232303 292142 240578 288665 377003 433651 487090 570518 519772 551429
5487 551429 632997 652107 592435 594727 739974 789080 812636 744385 774273 818232 1052828
5476 1052828 1009427 949314 955890 1012966 1101490 1178705 1258324 1211432 1203288 1195727 1240127 1231125
5464 1231125 1220066 1192484 1087517 1118727 1070811 1095332 1093958 935330 956313 906372 908263
5453I08263O2454j57929k17437J49764Q096R5657q6094l8622j09213o1376Q8024
5442F41587l8302j4410j31300O2207n773Q0350L3923j25879q5953l031j8716M0699
5430D35402q235R2754k4992j28201q4093J09188J390q2329p944k3744J11674m9047
5418C41823q181l8526J8631O5086O6964o8737p273p6836P9737O0881m2358j327
5406C89884J21100l019j18256O4309k5006L932K2435J6143P9493L101j30886q6945
5394C36285M4091J28827l0281Q7503N1950M3119L1026p7966J74826J06073l581
5383H91872k7084l6099J04490P5385k27L8426M1560l8127j22620J21207o7306
5372I81477k1139k439l8021K8326j4096m1474k5443Q1485R5472Q3623o2479Q8481
$$ plain form
5453 908263 970717 812788 595351 745115 753211 848868 762774 724152 614939 553563 641587
5442 641587 603285 588875 457575 519782 514009 594359 628282 502403 416450 413419 394703 435402
5430 435402 427167 519921 494929 366728 282635 391823 393213 310884 302940 279196 390870 341823
5418 341823 333642 295116 313747 378833 445797 377060 369787 292951 372688 433569 391211 389884
5406 389884 510984 507965 389709 454018 429012 432944 455379 471522 551015 554116 423230 336285
5394 336285 380376 509203 478922 566425 618375 661494 692520 614554 789380 895453 891872
5383 891872 864788 828689 933179 1008564 1008337 1046763 1088323 1050196 927576 1048783 981477
5372 981477 960338 957899 919878 948204 934108 892634 867191 948676 1044148 1127771 1065292 1153773
5360A153773o6062o3999J57536J62137O5898K0258N3193J60145J18463k0323j00840
5349A640179o4034l8820q0554k23378K6914r3149p0644p2349j4834P5462p0957
5338A013836J77183j7833l0285N2656n1474N0983O0450j01523j7057J44259P2937
5327A354132Q3904P7937J7039o5560r1004j55074p7666N561R0771r6545o8064
5316A075431k31Q265k5883K0770M7845l1093p60M7752N6846r515J08024j03853
5304A193598j08467l6800r270J4745M0778K2074m0743o490p326j8837N639j02741
5292I46160M5287l572R4019J7209P2846j2776k8867R3516l9488O2252l0001m9333
5280A167252l3880M8260M6617K3304q2426k2967N0290l0580O5950j06877k0614
$$ plain form
5360 1153773 1087711 1023712 1181248 1343385 1409283 1429541 1482734 1642879 1761342 1741019 1640179
5349 1640179 1576145 1537325 1456771 1233393 1260307 1167158 1096514 1024165 1009331 1084793 1013836
5338 1013836 1191019 1173186 1142901 1195557 1144083 1195066 1255516 1153993 1136936 1281195 1354132
5327 1354132 1438036 1515973 1533012 1467452 1376448 1221374 1143708 1149269 1240040 1143495 1075431
5316 1075431 1075200 1083465 1057582 1078352 1126197 1095104 1094344 1142096 1198942 1189427 1297451 1193598
5304 1193598 1085131 1048331 1039061 1053806 1094584 1116658 1075915 1069425 1062099 1043262 1048901 946160
5292 946160 991447 987875 1081894 1099103 1171949 1159173 1130306 1223822 1184334 1246586 1216585 1167252
5280 1167252 1133372 1181632 1228249 1251553 1169127 1146160 1196450 1165870 1231820 1124943 1104329
5269A104329J6285N8765k7848k3179P5334j5413O1739J6617J7599J16482r99n4045
5257A345666L6957L8981L5124J26963j05179K8460M4926Q316j05159N2548J37570
5246A645173k1710l9390K7979J0465n8297p6068k7419J86486J02744J06031K3442
5235A879436n0142l231L8913r944l4712J5984P7223L3828P6047q310N1981R590
5223B076663M0289J30307j1212O9180R2602j06634J10474m2188J62259k2070j6295
5212B483375O4415M7271J49028K3867j4796J02433K7056L5538Q903O2209J64406
5201C153705P6685L8241k0240Q1450J49473R5165m5139J93757K02070J417m973
5190C921611R4720p5977j9995J77067l3715J34557Q215J43699J24770N1254N612
$$ plain form
5269 1104329 1120614 1179379 1151531 1128352 1203686 1188273 1250012 1266629 1284228 1400710 1399711 1345666
5257 1345666 1382623 1421604 1456728 1583691 1478512 1506972 1551898 1560214 1455055 1507603 1645173
5246 1645173 1623463 1584073 1612052 1622517 1564220 1488152 1460733 1647219 1749963 1855994 1879436
5235 1879436 1829294 1826063 1864976 1855032 1820320 1836304 1913527 1947355 2023402 2015092 2067073 2076663
5223 2076663 2116952 2247259 2236047 2305227 2397829 2291195 2401669 2359481 2521740 2499670 2483375
5212 2483375 2547790 2595061 2744089 2767956 2753160 2855593 2882649 2918187 2927090 2989299 3153705
5201 3153705 3230390 3268631 3248391 3329841 3479314 3574479 3529340 3723097 3925167 3926584 3921611
5190 3921611 4016331 3940354 3920359 4097426 4063711 4198268 4206483 4350182 4474952 4526206 4531818
5179D531818P6749J77825J13378J67827M4483P9422J27919K12981J53801K10398
5169E896601N9236K67960K53373J75820k5603k6372k0729J17577J25396J24407
5159F947666K04442J94505J26805J38245J51744m4008P0674N0741Q2782J10316
5149H033912K15977K15273K53769J95404J13484K93515K63419K50980K96511K31974
5139A0364218L04049K48005K92420K26207L24454L08231K26153K76692L22249
5130A2892678M41618J94088J41573O6497j6211J61874L21545L59518L32131K18303
5120A5113614M39781M79545M62749N49510M81524M49676N42198N66092O36737
5111A9721426P02133P04120P38493Q31123Q68894J094029J074823J041573J129650
$$ plain form
5179 4531818 4608567 4786392 4899770 5067597 5112080 5191502 5319421 5532402 5686203 5896601
5169 5896601 5955837 6223797 6477170 6652990 6627387 6601015 6580286 6697863 6823259 6947666
5159 6947666 7152108 7346613 7473418 7611663 7763407 7719399 7790073 7840814 7923596 8033912
5149 8033912 8249889 8465162 8718931 8914335 9027819 9321334 9584753 9835733 10132244 10364218
5139 10364218 10668267 10916272 11208692 11434899 11759353 12067584 12293737 12570429 12892678
5130 12892678 13334296 13528384 13669957 13736454 13720243 13882117 14203662 14563180 14895311 15113614
5120 15113614 15553395 16032940 16495689 17045199 17526723 17976399 18518597 19084689 19721426
5111 19721426 20423559 21127679 21866172 22697295 23566189 24660218 25735041 26776614 27906264
5102B7906264J271625J220667J302795J639189J921639K036362K377389K725980
5094D2401910K915194L196535L444946L930721M367384N113974O045689P121695
5086G8538048Q101053R065969R381491Q803052O677458L129691j192749m739122
5078A17764891o483088o494314m967968l104330j452361K703J299507K517571
5070I9082611L624554M502639M994224M952065M144665L784859M484774O353769
5062A35924160Q889874J1712830J4286646J6160001J6710685J4784685R708882
5055B28177763Q27159r017986j6820221k0248001j9271490j5700200j1469034
5048A36477990p921901m864458k561187p30317R12538J804992K358890J688895
$$ plain form
5102 27906264 29177889 30398556 31701351 33340540 35262179 37298541 39675930 42401910
5094 42401910 45317104 48513639 51958585 55889306 60256690 65370664 71416353 78538048
5086 78538048 86639101 95705070 105086561 113889613 120567071 123696762 122504013 117764891
5078 117764891 111281803 104787489 99819521 96715191 95262830 95265533 96565040 99082611
5070 99082611 102707165 107209804 112204028 117156093 121300758 125085617 129570391 135924160
5062 135924160 144814034 156526864 170813510 186973511 203684196 218468881 228177763
5055 228177763 229004922 219986936 203166715 182918714 163647224 147947024 136477990
5048 136477990 128556089 123691631 121130444 120400127 121312665 123117657 125476547 127165442
5040A27165442r36070l655322m481988l444270j135449J250835L390226M972145
5032A23125549N857976N329037L135238n46024n045373q460911j0599572j1189970
5024A01605950j0063922q276828o242335m339124k905724j986387j154641o07651
5016F6029338m99956q03922k185219l589977m472174m563910m206529l560316
5008D2147335l003993k442810k282470j823345j555384j451393j366252r79429
5000B7242259r58449r34369n98097n73598n44282l38524k51872j65925p1340j02011
4990B2703792j61989m93159o25082p23664o86456p11247p87328o22109n61551
4981A7331207p58456n97210o62637o51825l77071m51624l39059k32665l21075
$$ plain form
5040 127165442 126229372 122574050 118092062 114647792 113512343 114763178 118153404 123125549
5032 123125549 128983525 134312562 137447800 136901776 131856403 123395492 112795920 101605950
5024 101605950 91542028 83265200 77022865 72683741 69778017 67791630 66636989 66029338
5016 66029338 65529382 64725460 62540241 58950264 54478090 49914180 45707651 42147335
5008 42147335 39143342 36700532 34418062 32594717 31039333 29587940 28221688 27242259
5000 27242259 26283810 25349441 24751344 24177746 23633464 23294940 23043068 22877143 22805803 22703792
4990 22703792 22541803 22048644 21423562 20699898 20013442 19302195 18514867 17892758 17331207
4981 17331207 16572751 15975541 15312904 14661079 14284008 13832384 13493325 13260660 12939585
4972A2939585k40513k80219j30420j65944j05641k2995Q5940j1908o2534j70671
4962A1834680j38853m93721l74061m32480l47926k98205k68336j90221l06987
4953H983890k65603l10372k54392j86041j34755k11469j92628j72953k6673j85675
4943G043329j7453j96093j54821n1869o5381j38921o4805j9224K1671j25060K0914
4932F252287k3671N395m1655j06809O7699j50170o2187j60644j44323r8690O843
4921E544075J7609p5550o1700M956k1052L5029P3929n5972m1050l1615J36403
4910E525062Q9042J01301O8424J105J43362P2734J31218M9027J62591K11414K05914
4899F761194L15654K50034J89380L19506L91026L70115K49055K34273O0951j3685
$$ plain form
4972 12939585 12699072 12418853 12288433 12122489 12016848 11993853 12079793 12067885 12005351 11834680
4962 11834680 11695827 11202106 10828045 10395565 10047639 9749434 9481098 9290877 8983890
4953 8983890 8718287 8407915 8153523 7967482 7832727 7621258 7428630 7255677 7229004 7043329
4943 7043329 7025876 6829783 6674962 6623093 6557712 6418791 6353986 6334762 6356433 6231373 6252287
4932 6252287 6228616 6234011 6192356 6085547 6153246 6003076 5940889 5780245 5635922 5537232 5544075
4921 5544075 5561684 5486134 5424434 5429390 5408338 5443367 5517296 5461324 5420274 5388659 5525062
4910 5525062 5614104 5715405 5783829 5784934 5928296 6001030 6132248 6181275 6343866 6555280 6761194
4899 6761194 7076848 7326882 7516262 7835768 8226794 8596909 8845964 9080237 9141188 9127503
4889I127503m7673k36837k61575k10574k77853j83432m5943j27800O3727N2469
4879G852012J44493K3809J04096J13895K76837M64162O82479M46246M74950O61017
4869A1243996N29705M41611K87900R3815j20911k3137k98521n68648q51730q43444
4859I890636o94056n15148m15109l86808l06915j47780o5329n0918j6355q1031
4849G211187L4310J62423J35549J73707J61164R4461J90223J42118R2972m4013
4839H354101J5747j4591l42015k49344m20072m08601m58604l50126k61921l18177
4829E546397k08689k43882m0637j21174j19630j31504q0705L1652n9713p5876
4819D496239o9903j46437m5339L9620M5970L9788j26147M6051j14927K3808L6806
$$ plain form
4889 9127503 9079830 8842993 8581418 8370844 8092991 7909559 7863616 7735816 7799543 7852012
4879 7852012 7996505 8020314 8124410 8238305 8515142 8979304 9661783 10108029 10582979 11243996
4869 11243996 11773701 12215312 12503212 12597027 12476116 12452979 12154458 11585810 10734080 9890636
4859 9890636 9196580 8681432 8266323 7879515 7572600 7424820 7359491 7308573 7292218 7211187
4849 7211187 7245497 7407920 7543469 7717176 7878340 7972801 8163024 8305142 8398114 8354101
4839 8354101 8369848 8355257 8013242 7763898 7343826 6935225 6476621 6126495 5864574 5546397
4829 5546397 5337708 5093826 5053189 4932015 4812385 4680881 4600176 4631828 4572115 4496239
4819 4496239 4426336 4279899 4234560 4274180 4320150 4359938 4233791 4279842 4164915 4188723 4225529
4808D225529r4984m1968m883j0561r4083m8622L5801m4143o390P6604N0713M1057
4796D084070R4687L837j01526j13810P9115K0223K0783J03041J2144L0624R3888
4785D327076R4766J02380R4586J19624R6107j33196r044n3695j10260j0639p1979
4774D445726J0316Q2853J6530l3246n5263J03968J3583J65182J30052N1173N9433
4763D990307J36812K6603L6264R8759K50174J47709J79832K28246P008K2177M5259
4752F169150J46320M9705j46109j0918R1520O1264J91265K1407N7117K38943J60151
4741G029815J01644J03768Q4685J35666J03560N7576J45639K33474J59898K07012
4731H362737K61645K07826L26378K14227K87763L34211L46865L36888K57944N13176
$$ plain form
4808 4225529 4130545 4088577 4083694 4073133 3979050 3930428 3966229 3922086 3915696 3992300 4043013 4084070
4796 4084070 4178757 4182594 4081068 3967258 4046373 4066596 4087379 4190420 4202564 4233188 4327076
4785 4327076 4421842 4524222 4618808 4738432 4834539 4701343 4692299 4638604 4528344 4517705 4445726
4774 4445726 4456042 4538895 4555425 4522179 4466916 4570884 4584467 4749649 4879701 4930874 4990307
4763 4990307 5127119 5153722 5189986 5288745 5538919 5686628 5866460 6094706 6101714 6123891 6169150
4752 6169150 6315470 6365175 6219066 6208148 6299668 6360932 6552197 6573604 6630721 6869664 7029815
4741 7029815 7131459 7235227 7319912 7455578 7559138 7616714 7762353 7995827 8155725 8362737
4731 8362737 8624382 8832208 9158586 9372813 9660576 9994787 10341652 10678540 10936484 11449660
4721A1449660L35252L75733O31921L46203M02413N87722M13675N55198N58677
4712A5656454N73459N96870P88168J160975J110967J262531J402570J589191J962747
4703B6103932K236218K508215L078423L324855L618132L455292K737483J573245
4695D8635795J96900o79058j105980j397007j467882j158044q86330m97731k41759
4686D1398904L08538O90468J083691J619714K006318K478854K882948L284436
4678E5753871L815125M258647M802815N366284N244397M552746L018575o878l820815
4669H2984767o614523p304603o905618n612782m401842l741034k868691k277771
4661D3257903j946067j215504r82612n78718k7563K74209N61892J129476J473878
$$ plain form
4721 11449660 11784912 12160645 12792566 13138769 13541182 14128904 14542579 15097777 15656454
4712 15656454 16229913 16826783 17614951 18775926 19886893 21149424 22551994 24141185 26103932
4703 26103932 28340150 30848365 33926788 37251643 40869775 44325067 47062550 48635795
4695 48635795 48832695 48153637 47047657 45650650 44182768 43024724 42138394 41640663 41398904
4686 41398904 41707442 42397910 43481601 45101315 47107633 49586487 52469435 55753871
4678 55753871 59568996 63827643 68630458 73996742 79241139 83793885 86812460 86805582 82984767
4669 82984767 76370244 69065641 62160023 56547241 52145399 48404365 45535674 43257903
4661 43257903 41311836 40096332 39113720 38535002 38507439 38781648 39343540 40473016 41946894
4652D1946894J667824K007873K275264K379611J957169J269836J47047j566426
4644E2085092l259788m333355m203019l631763l027497k228979j656186j143909
4636B8600596q65321r20180r46079j062159j215440j224959j135448r82595q14392
4627A9434023n98568o68570m58597l55632l38719l32961r9358j88487j95476j82973
4617A6014682k68593j76675j21491r537J94673L18371K35547R2742M180j59502
4607A6124397l06990p16530p02682o55402n81954m67313m51873k90942k61026
4598A1689685j72103o2096n7797L47j71744j64657j10404k32784j48976m9300
4588A0520171l8260P0799q5508O0677J36950K324L3628j12970j80498n1975j48962
$$ plain form
4652 41946894 43614718 45622591 47897855 50277466 52234635 53504471 53651518 52085092
4644 52085092 48825304 44491949 40288930 36657167 33629670 31400691 29744505 28600596
4636 28600596 27735275 26815095 25869016 24806857 23591417 22366458 21231010 20248415 19434023
4627 19434023 18835455 18166885 17708288 17352656 17013937 16680976 16581618 16393131 16197655 16014682
4617 16014682 15746089 15569414 15447923 15438386 15633059 15951430 16186977 16279719 16283899 16124397
4607 16124397 15817407 15100877 14398195 13742793 13160839 12693526 12241653 11950711 11689685
4598 11689685 11517582 11455486 11397689 11398036 11226292 11061635 10951231 10718447 10569471 10520171
4588 10520171 10481911 10552710 10467202 10527879 10664829 10667153 10700781 10587811 10407313 10355338 10206376
4577A0206376k58062j25863q1490j17856j2872J05196K15703J29303J48245J07337
4567A0316017K9081K54131J38645L90485K32573J69386J66993L05225L98339M94473
4557A2895348L82297P04800O76127P88481Q66848R39641J097278J358310J691384
4548B1400514J928737K121391K114568K013635J326705O4737p45880p91101k41956
4539B9191350M97839J032935J829845K173046K456807K415344J757655k63282
4531D1091539k455778k904168k269311j031457l42140K08319Q32049J226944J555953
4522C5911950K159491K899771L681446M017264L672084K960890J08843k357159
4514E3054580k845257k313835p29117M62145J855470K999023L964521M058489
$$ plain form
4577 10206376 9948314 9822451 9740961 9623105 9610233 9715429 9931132 10060435 10208680 10316017
4567 10316017 10345098 10599229 10737874 11128359 11360932 11530318 11697311 12002536 12400875 12895348
4557 12895348 13277645 13982445 14658572 15447053 16313901 17253542 18350820 19709130 21400514
4548 21400514 23329251 25450642 27565210 29578845 30905550 30970287 30224407 29433306 29191350
4539 29191350 29689189 30722124 32551969 34725015 37181822 39597166 41354821 41091539
4531 41091539 38635761 35731593 33462282 32430825 32088685 32297004 33129053 34355997 35911950
4522 35911950 38071441 40971212 44652658 48669922 52342006 55302896 55411739 53054580
4514 53054580 50209323 47895488 47166371 47628516 49483986 52483009 56447530 60506019
4506F0506019L244736J457762l564972p349049p689498n890867l907287k533831
4498C4273013j694825j095113n09180n1776M22028J015940J299149J357659J051545
4489C6068440L3705j405608k090396j952118j298110o26899O4078Q42904J334111
4480C0970107J643813J639362J113717l92584k596335m188575m086399l246169
4472B0856937k385615j769107j213153j260827j066705o52227n99984p00476o38430
4463A0570413n24394l93073l27659l51160l14367m64418l66169k72531k73318
4454G283324k77127k66422j00542j62621k28322j11953k07464j76696j74968j44059
4444E433150q1973k06543r1748j69146j61332j40093j50452r3079j22010j6260
$$ plain form
4506 60506019 63750755 65208517 61643545 54294496 46604998 40714131 36806844 34273013
4498 34273013 32578188 31483075 30973895 30922119 31344147 32360087 33659236 35016895 36068440
4489 36068440 36102145 34696537 32606141 30654023 29355913 28729014 28793092 29635996 30970107
4480 30970107 32613920 34253282 35366999 34974415 32378080 28189505 24103106 20856937
4472 20856937 18471322 16702215 15489062 14228235 13161530 12509303 11909319 11208843 10570413
4463 10570413 10046019 9652946 9325287 8974127 8659760 8195342 7829173 7556642 7283324
4454 7283324 7006197 6739775 6639233 6476612 6248290 6136337 5928873 5752177 5577209 5433150
4444 5433150 5351177 5144634 5052886 4883740 4722408 4582315 4431863 4338784 4216774 4200514
4434D200514j19544o4222n9325k10707l6862o4562p5568m7307j36529r0811j1196
4423C283881j58459m8269N4565m4618m4051q4999M7148p3755j45079j74396P1944
4412B683912J23441n6047m7732k085j13367n8227l9837p9282l4237j71563j36394
4401B068582N9521j57999l4735J23028l5580j39854P279r0290L7582Q0258j5547
4390A902245j6164Q5437j30674N0679J04516q0371l3329j21556o0820k0982J01596
4379A780577p9436r3157o4426j03939j80732O1604K5655j49184L2838J15283o1743
4368A283340q4957n0383J024J10O4929P8251R1177k9341o6685o8457m1265O4946
4356A242689m3408p912K3823j02120j2721j33779L9569R9076o4568j35131j7560
$$ plain form
4434 4200514 4080970 4016748 3957423 3746716 3709854 3645292 3569724 3522417 3385888 3295077 3283881
4423 3283881 3125422 3077153 3131718 3087100 3043049 2958050 3005198 2931443 2786364 2611968 2683912
4412 2683912 2807353 2751306 2703574 2701489 2588122 2529895 2490058 2410776 2376539 2204976 2068582
4401 2068582 2128103 1970104 1935369 2058397 2022817 1882963 1890242 1799952 1837534 1917792 1902245
4390 1902245 1886081 1971518 1840844 1891523 1996039 1915668 1882339 1760783 1699963 1678981 1780577
4379 1780577 1701141 1607984 1543558 1439619 1258887 1320491 1346146 1196962 1229800 1345083 1283340
4368 1283340 1198383 1148000 1149024 1149134 1214063 1292314 1383491 1354150 1287465 1219008 1177743 1242689
4356 1242689 1199281 1191369 1215192 1113072 1100351 966572 1006141 1105217 1040649 905518 887958
4345H87958j08904K7677m0412O1044Q2508p8092m3871J3514J06230M9792r7039
4334H60405p5310O2928M6075j67379R7006j12263Q1685K1319o0196n1551k6229
4323F76490P654j24971Q9358L8802P6747q1103n8812n6797J0782J3510j03636
4312D88024K1280R0166j31809K7625J39046o700J4761M5765p4913J6361J9112
4301F48718l1125k4035Q7868j14440j1460n6897p7531n103J30069o1989p4703
4290D09372M6073O5677l4071N7788J03441n2478j80970j00406M4778J32794m457
4279D87541j41176N091q4170J44435O2343l0485p4140M2676N3183O1427j13295
4268D13430R935J93323r4069q8594k7913n7000L1572J33747l9903j04808o0742
$$ plain form
4345 887958 779054 806731 766319 827363 909871 831779 787908 801422 907652 957444 860405
4334 860405 785095 848023 894098 726719 823725 711462 793147 814466 754270 702719 676490
4323 676490 684144 559173 648531 687333 764080 682977 624165 567368 578150 591660 488024
4312 488024 509304 599470 467661 495286 634332 627632 642393 688158 613245 629606 648718
4301 648718 617593 593558 681426 566986 555526 498629 421098 415995 546064 484075 409372
4290 409372 455445 521122 487051 544839 648280 595802 414832 314426 359204 491998 487541
4279 487541 346365 351456 267286 411721 474064 443579 369439 412115 465298 526725 413430
4268 413430 423365 616688 522619 434025 406112 349112 380684 514431 474528 369720 308978
4257C08978P2446l1516K137J02086M2208o0129m7987N1342Q2980q9799j8352J1870
4245D26264J33677j08240O9811L5409k05873Q3715R4146l8527l1719Q0928J01705
4234F41296j05206o3789m4395Q2679q1637k152O0049O2796M3767n849p234p257
4222E73068N896l3578o0071M6701K5374L2547N9905o4605M2019p4017M9137m5877
4210E56499Q3471J0091o2554K9110Q1863p5406l7428J2967o6495O8626R0076l4003
4198F56817L1671k0426J4803O201J92772j21467j8390n0811J0399n9662q1516
4187E60391o9927J21821j3647j39028N9164M1496O080q0528J4704Q1934N9263
4176F41723k6595j12266Q5520K2960L9942k8682j16500k2266p5840P1289R4210
$$ plain form
4257 308978 381424 349908 352045 454131 496339 436210 388223 439565 522545 432746 414394 426264
4245 426264 559941 451701 521512 556921 351048 434763 528909 490382 458663 539591 641296
4234 641296 536090 472301 427906 510585 428948 426796 486845 549641 593408 587559 580325 573068
4222 573068 578964 545386 485315 532016 557390 589937 649842 585237 627256 553239 602376 556499
4210 556499 639970 650061 587507 616617 698480 623074 585646 598613 532118 600744 690820 656817
4198 656817 688488 668062 682865 689066 881838 760371 741981 691170 701569 641907 560391
4187 560391 490464 612285 598638 459610 518774 560270 566350 485822 500526 582460 641723
4176 641723 615128 502862 588382 611342 651284 622602 506102 483836 407996 479285 573495
4165E73495n3811p2178n498j41082J11147M9224p2704n0141J90097j3437k9910
4154D85202O8122P5806p5836j13380Q2445O2849L9314m749j37642n6978j17107
4143C08046J05937O0339N9018m0016j05936J4081J09745N1247N1458K9293m0420
4132F02792m3085j03364m3238L8905J1607p5830L6644K5870J27024r4168k6957
4121D56200N4304j181j12945J4351o0572j6780P2289J2936N3346l9498J8128p3919
4109C76659J6342J40771j6755J848P0867k08426Q8212J27691Q864p1650j5788
4098E18635N3400o3911N3130J6217j64867r0422R1080m4410J51306P4361j28809
4087D65710L1851k2720r2779K3463j05778k0557k1915J11611Q5431j2499j7558
$$ plain form
4165 573495 519684 447506 442008 300926 412073 461297 388593 338452 528549 515112 485202
4154 485202 553324 629130 553294 439914 522359 585208 624522 619773 482131 425153 308046
4143 308046 413983 474322 533340 493324 387388 401469 511214 562461 613919 643212 602792
4132 602792 559707 456343 413105 452010 463617 387787 424431 450301 577325 483157 456200
4121 456200 510504 509323 396378 410729 350157 333377 405666 418602 471948 432450 450578 376659
4109 376659 393001 533772 517017 518865 589732 381306 469518 597209 606073 534423 518635
4098 518635 572035 508124 561254 577471 412604 322182 413262 368852 520158 594519 465710
4087 465710 497561 474841 382062 405525 299747 279190 257275 368886 454317 441818 424260
4076D24260l948l8306J39297p6655L616R5633p7106r7019P2786J50535n6094m0811
4064D96188q9298m505O2726l9502o780N4520q3905l7169k5335J10376L2448o1652
4052D08112k8693n1606J8188J04165j00433J5853J13307O1944r5589r8884M4955
4041C91319q217n9177M0061l9128k3012J07678M3885p5876k4224Q178k1847J84706
4029E24346P6223k05141q5253o0386P6062J17899m6274j5417P3007Q8205r2510
4018D50761l397L2926k8276n0656L0266m6557L3115K5881j60278M9821P4267R7907
4006E05780q2144L8880J7158j3686P9974r7672O5987l7302k7754L8888o397M5932
3994E27644k9003o4648N7008M9788q2799j6152k5919R8869K6176j41662k5324
$$ plain form
4076 424260 420312 382006 521303 444648 448264 543897 466791 369772 442558 593093 536999 496188
4064 496188 406890 402385 465111 425609 418829 473349 389444 352275 326940 437316 469764 408112
4052 408112 379419 327813 346001 450166 349733 365586 478893 540837 445248 346364 391319
4041 391319 383102 323925 363986 324858 301846 409524 453409 377533 353309 361487 339640 524346
4029 524346 600569 395428 310175 249789 325851 443750 397476 382059 455066 543271 450761
4018 450761 447364 480290 452014 401358 431624 385067 418182 444063 283785 333606 407873 505780
4006 505780 423636 462516 479674 465988 545962 448290 514277 476975 449221 488109 481712 527644
3994 527644 498641 433993 491001 540789 457990 441838 415919 514788 540964 399302 373978
3983C73978J53453M756l2N0948N4379k149N9929p1684l2758N0521M7678o9299
3971F19720n5068N9727M3358L3142M5596l2339L3278L4362j00698o3540L9065
3960F56603J08049k3776L74n455M2801q5565j5707Q4483J04509j75078q014J13950
3948G97174k6668j973l4874m5877k6844J903O583P4263Q9038n7290N5897O1413
3936H92745R859m6707p8422R0505k2763j8183O0843K6194q857o6283J39965k6861
3924I52035M0416k1013l1605M6777M8582J2132r839M3585J4197O3438n6219K9771
3912A132257L0833p743j06484j6300M4993K771L4143l533J84613p6725j17160
3901A101665l5487Q7307P1769O1173q6815o7107O5520Q6065r3812j10673J78146
$$ plain form
3983 373978 527431 532187 532155 583103 637482 635333 695262 623578 590820 641341 689019 619720
3971 619720 564652 624379 667737 700879 746475 714136 747414 781776 681078 617538 656603
3960 656603 764652 740876 741250 735795 778596 693031 677324 761807 866316 691238 683224 797174
3948 797174 770506 768533 733659 687782 660938 662841 669424 743687 832725 775435 831332 892745
3936 892745 902604 855897 777475 867980 845217 827034 887877 914071 905214 838931 978896 952035
3924 952035 992451 971438 939833 986610 1035192 1047324 1037485 1081070 1095267 1158705 1102486 1132257
3912 1132257 1163090 1155347 1048863 1032563 1077556 1080327 1114470 1110937 1295550 1218825 1101665
3901 1101665 1066178 1153485 1225254 1286427 1199612 1132505 1198025 1284090 1190278 1079605 1257751
3890A257751O9625J29499k4989K5424j769k6693J15157J480N1473m3998o916J89348
3878A735392R295l0790n8896J4159N2474j7216l3963K006R084Q5143J8321q4962
3866A700047J48921O6644N6516o971J986J45513R1385l8311Q1275P7333L6209
3855B360547k9978J69766J43236J7681K60240K42222J69397J18933J98845K90131
3845C941020K39333J07187q5491k25219l85778k76076j91056j96143q7871j62534
3835B677372l8936r2414K0318J2651r9185p9509R0614q9647M8636n244J3801o9526
3823B388931j04382j8820k4644J2935O1077O9815R4482m2771r0671J15035M9196
3812B510183l6435J22266j29682j96874J18889J11553k7913R6167N8147n3276
$$ plain form
3890 1257751 1327376 1456875 1431886 1457310 1455541 1428848 1544005 1545485 1596958 1552960 1546044 1735392
3878 1735392 1744687 1713897 1655001 1669160 1721634 1704418 1670455 1672461 1681545 1766688 1785009 1700047
3866 1700047 1848968 1915612 1972128 1965157 1967143 2112656 2204041 2165730 2247005 2324338 2360547
3855 2360547 2330569 2500335 2643571 2661252 2921492 3163714 3333111 3452044 3650889 3941020
3845 3941020 4180353 4287540 4202049 3976830 3591052 3314976 3123920 2927777 2839906 2677372
3835 2677372 2638436 2546022 2566340 2578991 2479806 2400297 2490911 2401264 2449900 2444656 2458457 2388931
3823 2388931 2284549 2265729 2241085 2254020 2315097 2384912 2479394 2436623 2345952 2460987 2510183
3812 2510183 2473748 2596014 2466332 2269458 2388347 2499900 2471987 2568154 2626301 2573025
3802B573025L7847N4649k5465n4444K7045N9960l9242J24417Q2633O213l2647
3791B813991J4438L8791O7044K5388j967J72487L0683q635P8617j28745J61678
3780C263770M3780M761Q6630j52768J33645j43448j01491M3422J7130O05R9087
3769C295123Q9773Q1395M5402M1974Q6519m3795J2310R7022q586m018R8530Q8446
3757C880095K3650Q2519J32722K16360N1024K7059J04990q644K25749J79871l6190
3746D879205J48687M6191P7679o8181J75784K27288p2740j3565J69038l5402L2170
3735E566154J97054K00319J28467L2892J61462J06349J76121R8629J22095J27921
3725F917463J42459J72702J01594K03660K33291K19102K62904J48379L71678K57673
$$ plain form
3802 2573025 2610872 2665521 2640056 2585612 2612657 2672617 2633375 2757792 2840425 2846638 2813991
3791 2813991 2828429 2867220 2934264 2959652 2957685 3130172 3160855 3152220 3230837 3102092 3263770
3780 3263770 3307550 3312311 3398941 3246173 3379818 3236370 3134879 3178301 3195431 3196036 3295123
3769 3295123 3384896 3466291 3511693 3553667 3640186 3596391 3608701 3705723 3697137 3693119 3791649 3880095
3757 3880095 3903745 3986264 4118986 4335346 4386370 4413429 4518419 4509775 4735524 4915395 4879205
3746 4879205 5027892 5074083 5151762 5083581 5259365 5486653 5413913 5400348 5569386 5533984 5566154
3735 5566154 5763208 5963527 6091994 6124886 6286348 6392697 6568818 6667447 6789542 6917463
3725 6917463 7059922 7232624 7334218 7537878 7771169 7990271 8253175 8401554 8773232 9030905
3715I030905J15325K99164L79392K93827M03028M34328K72668L55751K14461J62686
3705A1961535J41775J13878K5004K5550L0008J26479P2238J44774K41229L94271
3695A3276741K20268K74283K69440M04720M14705N65136M56758N91785P07094
3686A7180930P30778O80866O74164P77468O60699M68673L94550K56754K46366
3677B2071248K30666K04115L82688K64090K57671M76136N74199N26572P17112
3668B5704497P76777N83389K2603o06718o37483l15411r3817O4635K28868M47154
3658B6174494L37811N73109O55356O62508Q17728R60131J010247P64540M60754
3649C2416678P01895O52116N42178N62446N85365N81121M16747L47628M13150
$$ plain form
3715 9030905 9146230 9445394 9824786 10118613 10521641 10955969 11228637 11584388 11798849 11961535
3705 11961535 12103310 12217188 12242192 12267742 12297750 12424229 12496467 12641241 12882470 13276741
3695 13276741 13497009 13771292 14040732 14445452 14860157 15425293 15882051 16473836 17180930
3686 17180930 17911708 18592574 19266738 20044206 20704905 21173578 21568128 21824882 22071248
3677 22071248 22301914 22506029 22888717 23152807 23410478 23886614 24460813 24987385 25704497
3668 25704497 26481274 27064663 27087266 26480548 25843065 25527654 25433837 25498472 25727340 26174494
3658 26174494 26512305 27085414 27740770 28403278 29221006 30181137 31191384 31955924 32416678
3649 32416678 33118573 33770689 34312867 34875313 35460678 36041799 36458546 36806174 37219324
3640C7219324L97969N29367M77547P25119P76448O73771Q16220Q73484Q63256
3631D3352505J057400J080122J012015J094860J159045J116349J104826J124061
3623E2101183J250805J260257J286651J181468J269380J204242J245768J319050
3615F2118804J437571J674638J738861J839733K000748K113052K379093K271395
3607G7573895K471022K570431K728695K860653L333254L936726M759430N750535
3599A05984641P006522Q355135J0022265J1778039J3939127J6515810J9594929
3592A93196468K3215538K8929832L5900294M3466676M7842557M7776030L8187099
3585D58514494J2182353k3988413n5063849o4520800n6819339m2958062l1916675
$$ plain form
3640 37219324 37617293 38146660 38624207 39349326 40125774 40799545 41615765 42489249 43352505
3631 43352505 44409905 45490027 46502042 47596902 48755947 49872296 50977122 52101183
3623 52101183 53351988 54612245 55898896 57080364 58349744 59553986 60799754 62118804
3615 62118804 63556375 65231013 66969874 68809607 70810355 72923407 75302500 77573895
3607 77573895 80044917 82615348 85344043 88204696 91537950 95474676 100234106 105984641
3599 105984641 112991163 121346298 131368563 143146602 157085729 173601539 193196468
3592 193196468 216412006 245341838 281242132 324708808 372551365 420327395 458514494
3585 458514494 470696847 446708434 391644585 327123785 270304446 227346384 195429709
3578A95429709k4459001j9511786j5734394j2652104j0473461q652379p323070
3571I6623514o418648n512506n082289m626874m084102l521024k884954k352460
3563F2140657j911294j388789r45765n21002q7460K36127P71269J198396J462957
3554F0955096J697454J709946J103517n0416k279226l885794m312804m484328
3546E0453445m122683l517858k966829k360210j879830j757716j326533j187816
3538C1333970j122340j074488q52714p71259r74150n88055o38907n81824p07834
3529B4022399p02355m59360n32363l98699l40980m02811l67789k30749j65292
3520B0422001l42592l33392k48989k18538j17357p6295l0665j39493j20221j78389
$$ plain form
3578 195429709 170970708 151458922 135724528 123072424 112598963 103946584 96623514
3571 96623514 90204866 84692360 79610071 74983197 70899095 67378071 64493117 62140657
3563 62140657 60229363 58840574 57894809 57373807 57286347 57522474 58293743 59492139 60955096
3554 60955096 62652550 64362496 65466013 65415597 63136371 59250577 54937773 50453445
3546 50453445 46330762 42812904 39846075 37485865 35606035 33848319 32521786 31333970
3538 31333970 30211630 29137142 28284428 27513169 26539019 25950964 25312057 24730233 24022399
3529 24022399 23320044 22860684 22328321 21929622 21588642 21185831 20818042 20587293 20422001
3520 20422001 20079409 19746017 19497028 19278490 19161133 19084838 19054173 18914680 18794459 18616070
3510A8616070j48826k85747j79600m95318k48679k69933l09878k61731o4029L7351
3500A6389680N9650L2850q6835k8632n7092m6059N5365J56706J42281K65975J09507
3489A6993396j10576k34207l70204o29670m75880k28693k19215K0525J6342m1423
3479A4720395Q8476J1122j8475O9734Q6269j55526J47189M26681K18814K29571
3469A5824250K06343J59500K72253K51682J09702J5294J86786K39237M69977K19252
3459A7954276K88373M76555K72033m1252q8107o9317K3416J17444K12065K17344
3449A9362830J71806K55342J45265K54723M32746K70006L98333L32843M49099
3440B2072993N62374M37446O04636O64783N71487P53259J012430Q80160J034112
$$ plain form
3510 18616070 18467244 18181497 18001897 17506579 17257900 16987967 16678089 16416358 16352329 16389680
3500 16389680 16449330 16482180 16395345 16366713 16309621 16263562 16318927 16475633 16617914 16883889 16993396
3489 16993396 16882820 16648613 16278409 15648739 15172859 14944166 14724951 14745476 14761818 14720395
3479 14720395 14808871 14819993 14801518 14871252 14957521 14801995 14949184 15375865 15594679 15824250
3469 15824250 16030593 16190093 16462346 16714028 16823730 16839024 17025810 17265047 17735024 17954276
3459 17954276 18242649 18719204 18991237 18949985 18861878 18792561 18815977 18933421 19145486 19362830
3449 19362830 19534636 19789978 19935243 20189966 20622712 20892718 21291051 21623894 22072993
3440 22072993 22635367 23072813 23677449 24342232 24913719 25666978 26679408 27559568 28593680
3431B8593680J142766J298027J382433J493408J724928J825644J851312J958085
3423D1270283J760670J535836J908510K429785L166304L666393M033113M536387
3415F4307281N059182M814297M759338N231452O718855R118451J2130036J4297127
3407A26436019J5318146J4095592J1995484l87278j2671344j3926969r868916
3400A30990734l385745J764315N097434Q199977J0894644J4692302J9292212K4669498
3392B12215371K8371237L0896792K7473961K3541296K64497m0078847n2683884
3385B30000423m7105782l4096640k2454574j5818393j2156963r544354p420066
3378H1403651n919278n111062m004485l348310k702674k545662k542770k336396
$$ plain form
3431 28593680 29736446 31034473 32416906 33910314 35635242 37460886 39312198 41270283
3423 41270283 43030953 44566789 46475299 48905084 52071388 55737781 59770894 64307281
3415 64307281 69366463 74180760 78940098 84171550 90890405 100008856 112138892 126436019
3407 126436019 141754165 155849757 167845241 167457963 154786619 140859650 130990734
3400 130990734 127604989 129369304 134466738 142666715 153561359 168253661 187545873 212215371
3392 212215371 240586608 271483400 298957361 322498657 322763154 282684307 230000423
3385 230000423 182894641 148798001 126343427 110525034 98368071 88823717 81403651
3378 81403651 75484373 70373311 66368826 63020516 60317842 57772180 55229410 52893014
3370E2893014k160973j500192q50287l14861L28512O50750P34904M64138j007369
3361D9237636k992031l489630l152424k505594j906633j748214j392685j272570
3353C0777855j387792j413646j066406r22734p20908n67860n66000n57374m88048
3344B3087087l90388j55516j38968k30317k12083k10082k136P6258K6399N0384
3334B1900638Q3243J20022K14325K72863J60986K81127L22744K11743J18245o6186
3324B3619750j26071j84623k66501k45804k89692j90910O5544K06834K06750L55940
3314B3151217L41575M52772N83245Q29439Q42853Q75450P96907P65423O27155
3305B9266036O52836N47615P33398P31427N40566L50020J28892l1648j27710j59057
$$ plain form
3370 52893014 50732041 49231849 48381562 48066701 48395213 49045963 49780867 50245005 49237636
3361 49237636 46245605 42755975 39603551 37097957 35191324 33443110 32050425 30777855
3353 30777855 29390063 27976417 26910011 25987277 25266369 24698509 24132509 23575135 23087087
3344 23087087 22696699 22541183 22402215 22171898 21959815 21749733 21747597 21823855 21850254 21900638
3334 21900638 21983881 22103903 22318228 22591091 22752077 23033204 23355948 23567691 23685936 23619750
3324 23619750 23493679 23309056 23042555 22796751 22507059 22316149 22381693 22588527 22795277 23151217
3314 23151217 23492792 23945564 24528809 25358248 26201101 27076551 27873458 28638881 29266036
3305 29266036 29918872 30466487 31199885 31931312 32471878 32821898 32950790 32919142 32791432 32632375
3295C2632375j74696M8634M19433M90387O40393Q11396R84757J216231J575013
3286C8643923J708349J975420K380925K507089K130518J785870J327561P50753
3278E3210408L79665N1745p5083l3464J86968L46671M21686M79647N48807M62563
3268E5979613L98149N68202Q07500J160790J349056J441848J756163K008352K201813
3259F7671486K484020K582204K516108K396652K098507J938724J293401P20301
3251H3701403K50611n45682j107840j207969j231877q76274n82547j95408L03260
3242G8507677M37191P42443Q21843Q64149Q27807R56054J171163J453726J375217
3233H7157270J267062J160558J360205J397861J527966J354341J233758Q12817
$$ plain form
3295 32632375 32457679 32506313 32925746 33416133 34056526 34867922 35852679 37068910 38643923
3286 38643923 40352272 42327692 44708617 47215706 49346224 51132094 52459655 53210408
3278 53210408 53590073 53641818 53566735 53533271 53720239 54066910 54488596 54968243 55517050 55979613
3268 55979613 56377762 56945964 57753464 58914254 60263310 61705158 63461321 65469673 67671486
3259 67671486 70155506 72737710 75253818 77650470 79748977 81687701 82981102 83701403
3251 83701403 83952014 83406332 82298492 81090523 79858646 78982372 78399825 78204417 78507677
3242 78507677 78944868 79687311 80509154 81373303 82201110 83157164 84328327 85782053 87157270
3233 87157270 88424332 89584890 90945095 92342956 93870922 95225263 96459021 97271838
3225I7271838J52657j54868o61352j029903j400900j816191k110307k097139k104094
3216H6049741j818586j636647j143736o95998n49369k87158k9858J15027K88415
3207H0291831M21121L55239M42991M26172J67389M1043P8507o3857k63363l14668
3197H1582405k53862n27789q08717j324807k054267k612607l280964l390164k917842
3188F4411386k400869j999591j519846j028327o64505k32411k73251n8758J41686
3179E6375514N5127P4429k76643m29673n85944o81993q02272p76852n91161o77886
3169E1682646o53267n52305o32346r99430j085522j032119j137708j058202r60189
3160D3571558p36623n36043m25092o99172n08432m46367j75040j81209L0786J30335
$$ plain form
3225 97271838 97424495 97269627 96608275 95578372 94177472 92361281 90250974 88153835 86049741
3216 86049741 84231155 82594508 81450772 80754774 80205405 79918247 79888389 80003416 80291831
3207 80291831 80712952 81068191 81511182 81937354 82104743 82145786 82224293 82160436 81897073 81582405
3197 81582405 81328543 80800754 79992037 78667230 76612963 74000356 70719392 67329228 64411386
3188 64411386 62010517 60010926 58491080 57462753 56798248 56565837 56292586 56233828 56375514
3179 56375514 56430641 56505070 56228427 55798754 55212810 54530817 53728545 52951693 52360532 51682646
3169 51682646 51029379 50477074 49844728 48845298 47759776 46727657 45589949 44531747 43571558
3160 43571558 42834935 42298892 41873800 41174628 40666196 40219829 40044789 39863580 39894366 40024701
3150D0024701J97565L86806L71164K70482N00571N88928P67829J123870J618641
3141D5850557J803467J883975J809727J426782P23801L22182K39446N07281N22362
3132E5089580L83353J7432m81288r05804j054932q79701n47002r3199L52855P28976
3122E2610270Q83000Q43917Q30896Q55098J058608J326852J646532K094716K152402
3113F4302291K346801J985871J752060J288669J117995P42616J039552J177746
3105G5753601J195797J124055Q06188Q0550p59886j127780j174971j077784r85536
3096G3834234q97531o32057m36978k85198j53925k40698l1287Q0241M23324Q85361
3086G2545486J256658J390251J577519J427423J297332J292857J445562J765562
$$ plain form
3150 40024701 40222266 40609072 40980236 41250718 41751289 42340217 43108046 44231916 45850557
3141 45850557 47654024 49537999 51347726 52774508 53498309 53820491 54059937 54567218 55089580
3132 55089580 55472933 55490365 55009077 54103273 53048341 52168640 51621638 51528439 51881294 52610270
3122 52610270 53493270 54337187 55168083 56023181 57081789 58408641 60055173 62149889 64302291
3113 64302291 66649092 68634963 70387023 71675692 72793687 73536303 74575855 75753601
3105 75753601 76949398 78073453 78879641 78960191 78200305 77072525 75897554 74819770 73834234
3096 73834234 72936703 72304646 71867668 71582470 71428545 71187847 71156560 71236801 71660125 72545486
3086 72545486 73802144 75192395 76769914 78197337 79494669 80787526 82233088 83998650
3078H3998650K063428J995125J586508P33761o16762j776378k485501k579044
3070H2919787k413153k253928j862410j265416r42847n89682l75350j02319O1897
3061G3176579L21937N81469P06666Q27976Q16714P27555R12805R51180J131994
3052H0154875R40572J030837N44211M0608m62231p60559r92826j064408j117506
3043G8313573r47862j001481p39818o16157k08522J06494L57744N82408Q73685
3034G6720064J063202R76939J222081J350947J443295J169328J522267J747970
3026H7216093J897830K049996K336078K238341K175704J560450J048475N46748
3018A01069715J38830J91051J39184K45127K68882J28888r7009m67850m95140
$$ plain form
3078 83998650 86062078 88057203 89643711 90377472 89760710 87984332 85498831 82919787
3070 82919787 80506634 78252706 76390296 75124880 74182033 73592351 73217001 73114682 73176579
3061 73176579 73498516 74079985 74786651 75614627 76431341 77158896 78071701 79022881 80154875
3052 80154875 81095447 82126284 82670495 82711103 82248872 81488313 80495487 79431079 78313573
3043 78313573 77365711 76364230 75624412 75008255 74799733 74906227 75263971 75846379 76720064
3034 76720064 77783266 78760205 79982286 81333233 82776528 83945856 85468123 87216093
3026 87216093 89113923 91163919 93499997 95738338 97914042 99474492 100522967 101069715
3018 101069715 101208545 101399596 101538780 101783907 102052789 102181677 102084668 101616818 101121678
3009A01121678k77186L01429O36243J301449J915087K551473K938810L195904
3001A13684887L511281L569545L330151K741222J990997J507148J243588J251468
2993A32830287J381067J460490J731451J979118K110975K168956K081094K255676
2985A47999114K278719K161006J486779L35046p08469j648455j973828j828603
2977A48101309j403957j052014r18823o06519o20207r57585j208506j489244j404479
2968A38439975j036846j717452k074500j678983p37039L86145J325929J660328
2960A34567557J897620J922631J476316M67476q75106k141208l124780l488432
2952A30702074l599346l768352l616102l743824l788480l724034l173351k549185
$$ plain form
3009 101121678 100844492 101145921 101782164 103083613 104998700 107550173 110488983 113684887
3001 113684887 117196168 120765713 124095864 126837086 128828083 130335231 131578819 132830287
2993 132830287 134211354 135671844 137403295 139382413 141493388 143662344 145743438 147999114
2985 147999114 150277833 152438839 153925618 154260664 153552195 151903740 149929912 148101309
2977 148101309 146697352 145645338 144726515 144119996 143499789 142542204 141333698 139844454 138439975
2968 138439975 137403129 135685677 133611177 131932194 131195155 131581300 132907229 134567557
2960 134567557 136465177 138387808 139864124 140331600 139456494 137315286 134190506 130702074
2952 130702074 127102728 123334376 119718274 115974450 112185970 108461936 105288585 102739400
2944A02739400k296776j964371j654887j111891q52925n88264l30189k02711l11305
2935I3426081n87646r33942r71228j217799j140974j264724j210894j686644j965853
2926H2446377j806979j534857j383618r42516l65263p3491n2281l77587q50626
2917G5059159j494988j890992k255347k530506k465251k290213j884527j594380
2909E8652955j107547q91219r97236j057393q94958q60583o67017m08238l00892
2900E1467872j71637j08329j98274n55115r01230r67940q15317q60818q57460
2891D6031752q64022r49772j168759j255193j373859j148491j113056r46603p21125
2882C6490872p00354n90075p67001o44849r07110q41468p32151p32143p11303
$$ plain form
2944 102739400 100442624 98478253 96823366 95711475 94858550 94270286 93940097 93737386 93426081
2935 93426081 92838435 91904493 90933265 89715466 88574492 87309768 86098874 84412230 82446377
2926 82446377 80639398 79104541 77720923 76778407 76413144 76339653 76287372 75909785 75059159
2917 75059159 73564171 71673179 69417832 66887326 64422075 62131862 60247335 58652955
2909 58652955 57545408 56654189 55656953 54599560 53704602 52844019 52177002 51768764 51467872
2900 51467872 51296235 51187906 50989632 50434517 49533287 48565347 47750030 46889212 46031752
2891 46031752 45167730 44217958 43049199 41794006 40420147 39271656 38158600 37211997 36490872
2882 36490872 35790518 35200443 34433442 33788593 32881483 32040015 31307864 30575721 29864418
2873B9864418n42294l55170m52193l38695k60190l9492k63128l04124l19749l50793
2863B6638590l81885m72087o28920m67840l49743k65189k13494l12254l06423
2854B3240755k43743l49957m06012k96594l31307k65679k92088l75852k99737
2845B0379786k74745k32008j34929k62285q8396j10379j55936j21287j14372j23937
2835A8761512j11154j20237j15567j62902o3408j04049j1594k17034l04282j05094
2825A7446191l5926j9493K0914K4278m7668l8375k8368L8182q1787m8797n7906
2814A7171245l1279M191J7654k55178j37544L9431j08221L2520O2920n043p3282
2803A6717414m2319J54187m4411l5559J26778M6319K8330L6892K28048J64956
$$ plain form
2873 29864418 29322124 28966954 28514761 28176066 27915876 27876384 27613256 27309132 26989383 26638590
2863 26638590 26256705 25784618 25155698 24687858 24338115 24072926 23859432 23547178 23240755
2854 23240755 22997012 22647055 22241043 21944449 21613142 21347463 21055375 20679523 20379786
2845 20379786 20105041 19873033 19738104 19475819 19387423 19277044 19121108 18999821 18885449 18761512
2835 18761512 18650358 18530121 18414554 18251652 18188244 18084195 18072601 17855567 17551285 17446191
2825 17446191 17410265 17390772 17411686 17435964 17388296 17349921 17321553 17359735 17277948 17229151 17171245
2814 17171245 17139966 17144157 17161811 16906633 16769089 16808520 16700299 16732819 16795739 16790696 16717414
2803 16717414 16675095 16829282 16784871 16749312 16876090 16922409 16950739 16987631 17215679 17380635
2793A7380635J42121J10439J14189J26510J74871K75082L01400K26890J58434
2784A9010571K40723J29427K98340J82602K88397J91864L83448L16698K77233
2775B1319303M28587N33570O20037N36340O65574P71808Q21930R36464J175716
2766B7809329J176446J275572J349377J356725J331770J235099Q99784M23692
2758C6857794N2785n64799j054489j616067j919156k004205k005327j770290j720956
2749B4255290j487525j352334j162471j053111r61523p81977p24720o85776n67417
2740A5478436n83059m67607l39783l99646m16270k72948j99106j86274l04154
2731A2309589j70826j67058k43446j44623k12797j91363k34437j98997k55669
$$ plain form
2793 17380635 17522756 17633195 17747384 17873894 18048765 18323847 18625247 18852137 19010571
2784 19010571 19251294 19380721 19679061 19861663 20150060 20341924 20725372 21042070 21319303
2775 21319303 21747890 22281460 22901497 23437837 24103411 24875219 25697149 26633613 27809329
2766 27809329 28985775 30261347 31610724 32967449 34299219 35534318 36434102 36857794
2758 36857794 36910579 36345780 35291291 33675224 31756068 29751863 27746536 25976246 24255290
2749 24255290 22767765 21415431 20252960 19199849 18238326 17456349 16731629 16045853 15478436
2740 15478436 14895377 14427770 14087987 13688341 13272071 12999123 12800017 12613743 12309589
2731 12309589 12138763 11971705 11728259 11583636 11370839 11179476 10945039 10746042 10490373
2722A0490373o9462j34188k02538j20485j53510m1459q1812j70888j90356j87573
2712I138102j28690k7568j14292j24423l8212k084q8487j15653j06319J9747n6968
2701H355153j69201M7805J6825q6764j60423n4215j55522j14212j07549L1933
2691G603830J15915r2271m9243m7212K7112j2915q4881r8756o0216k4855K0578
2680G297086j05369N3789k6995m1332j1033m6324O3279p4663j68608j6286k962
2669F920582r4291O3641l889o6073n9418l8659J39804M2166k9006j04465k2747
2658F747645o8623k066q8062n0403m9225j1339j03272j9Q9872r2249j69417J1647
2646F214489O0602q6423J5004m149j4322L6860k7024k18997N0492J90734P3336
$$ plain form
2722 10490373 10420911 10286723 10084185 9963700 9810190 9768731 9686919 9516031 9325675 9138102
2712 9138102 9009412 8981844 8867552 8743129 8704917 8702833 8614346 8498693 8392374 8412121 8355153
2701 8355153 8185952 8233757 8250582 8163818 8003395 7949180 7793658 7679446 7571897 7603830
2691 7603830 7719745 7627474 7578231 7531019 7558131 7545216 7460335 7361579 7301363 7276508 7297086
2680 7297086 7191717 7245506 7218511 7177179 7166146 7119822 7183101 7108438 6939830 6923544 6920582
2669 6920582 6826291 6889932 6886043 6819970 6760552 6721893 6861697 6903863 6874857 6770392 6747645
2658 6747645 6679022 6676956 6588894 6538491 6489266 6477927 6374655 6374636 6464508 6372259 6202842 6214489
2646 6214489 6275091 6188668 6203672 6199523 6185201 6222061 6195037 5976040 6026532 6217266 6290602
2635F290602n5891P3617J5487l860J3431K9241j40859n3239m6217j83294N2322
2624E991340P8339j15259p9534m8804K971J3119j1630J907M6357N5672J60910
2613F095388j31634N5452J01663n0360N7492j0820j01020j09679J30271L3391
2603F070144k8592M3602q3569j5675l882l2749n7702j39669j6012J05622j01647
2592E739871l8938O8057M7105j12884n7378K0260j5737M6560M2069J05728j34800
2581E709913N4423m051L6165K7931L6318J6982m8479P1958l7007j23165P7053
2570E818041J26089k2317p14N2967j14993k8959l3055k5301n1270j6572M7968
2559E751884R1471J99367Q0929J17190J84453J16347J43695J03765J78626J65680
$$ plain form
2635 6290602 6234711 6308328 6323815 6319955 6333386 6362627 6221768 6168529 6122312 5939018 5991340
2624 5991340 6069679 5954420 5874886 5826082 5829053 5842172 5830542 5832449 5878806 5934478 6095388
2613 6095388 5963754 6019206 6120869 6070509 6128001 6117181 6016161 5906482 6036753 6070144
2603 6070144 6041552 6085154 6001585 5985910 5982028 5949279 5891577 5751908 5735896 5841518 5739871
2592 5739871 5700933 5768990 5816095 5703211 5645833 5666093 5650356 5696916 5738985 5844713 5709913
2581 5709913 5764336 5760285 5796450 5824381 5860699 5877681 5829202 5901160 5864153 5740988 5818041
2570 5818041 5944130 5921813 5921099 5974066 5859073 5830114 5797059 5771758 5720488 5703916 5751884
2559 5751884 5843355 6042722 6123651 6240841 6425294 6541641 6685336 6789101 6967727 7133407
2549G133407K38466R737J46788J35061j0911k8186j34629q2453j0269j42150j30962
2538G123899j1398j8711M9414j66004j18788q7110k2257m2572p9610J36272J67348
2527F930483J60125N9620K15897K22370J84541L23845J92444L42087M33166N09721
2517I574299N04193M90344K62347J50175j06336j83836j83393l82272m28557j38174
2507I558790j46512j98594k47977j07413j43385k20192k31299l60099l42255k02499
2497G358565j11417M9282P4168P4549J46496J54643J316N6079K93553L34381K64396
2486H696011K99066K61367L06319L06048O6833R700j58399p9386j19809k65828
2476I321922j55091o9296n8950j18379k28583j91510j97807k39718r7024k57494
$$ plain form
2549 7133407 7371873 7381610 7528398 7663459 7652548 7624362 7489733 7407280 7397011 7254861 7123899
2538 7123899 7112501 7093790 7143204 6977200 6858412 6771302 6749045 6706473 6626863 6763135 6930483
2527 6930483 7090608 7150228 7366125 7588495 7773036 8096881 8289325 8631412 9064578 9574299
2517 9574299 10078492 10568836 10831183 10981358 10875022 10691186 10507793 10125521 9696964 9558790
2507 9558790 9412278 9213684 8965707 8858294 8714909 8494717 8263418 7903319 7561064 7358565
2497 7358565 7247148 7296430 7370598 7445147 7591643 7746286 7747602 7803681 8097234 8431615 8696011
2486 8696011 8995077 9256444 9562763 9868811 9935644 9945344 9786945 9707559 9587750 9321922
2476 9321922 9166831 9097535 9038585 8920206 8691623 8500113 8302306 8062588 7965564 7708070
2466G708070k16480n8593n2958l7470L6291J19738Q2369P289J22563O6464J78863
2455G956146J26746K831O7679J54021R9578J4024j89168l59357k42204k33963
2445G396333k02449j34754k39041j35816k09276k17317J5952j00797L7652M145
2435F214632o32j19506N5573j4035j529N4752k9328p7672l3855j6118j3882k38459
2423E779941m3033j76983j50675j58368j36390j71813j04933j80290j19421Q9330
2413D627365k21324q5584J918m5152q6370r6292p4147j31227j96998j46289k1293
2402C524607J0609j91173j32517p6770j55357n0665j27010j2823n2276j31677
2392B604948n4935p6782l8994K8426m8888j54248j9068K3134J6844K1664j31996
$$ plain form
2466 7708070 7491590 7432997 7380039 7342569 7378860 7498598 7580967 7588256 7710819 7777283 7956146
2455 7956146 8082892 8085723 8153402 8307423 8407001 8421025 8231857 7872500 7630296 7396333
2445 7396333 7193884 7059130 6820089 6684273 6474997 6257680 6273632 6172835 6210487 6214632
2435 6214632 6214000 6094494 6150067 6136032 6134503 6189255 6159927 6082255 6048400 6032282 6018400 5779941
2423 5779941 5736908 5559925 5409250 5250882 5114492 4942679 4837746 4657456 4538035 4627365
2413 4627365 4406041 4320457 4322375 4277223 4190853 4094561 4020414 3889187 3692189 3545900 3524607
2402 3524607 3535216 3344043 3211526 3134756 2979399 2928734 2801724 2788901 2736625 2604948
2392 2604948 2550013 2473231 2434237 2462663 2413775 2259527 2240459 2263593 2280437 2302101 2170105
2381B170105n6013J4828j56339P0716m1491k7443O7831k48310p452j06812n7858
2370A621762J29452j13072p4400j0472N9029k5698m0295r413l8074K392J0510
2359A511721o7030n6726O092l3748N251j24195k0744P6676q3632j4032l821m188
2347A191624q4739L5428r0296K9279N6322m7773j35228O3764m2704N4392L6408
2336A066477j09625o3400k0711r3870J41725J27200r9548r9262p9890O5764O6100
2325I00960j1166M945j05567l8801J48829j81211j6881q525Q2477m2929k6299
2314G05832j5058O0551m1296q9549L7934l2744k1220l3471N0370J6735j9882l8262
2302E79940R0251r8637J19782j62362j04710J4135N7967M0308O843l1589j0718
$$ plain form
2381 2170105 2114092 2128920 1972581 2043297 2001806 1974363 2042194 1793884 1786432 1679620 1621762
2370 1621762 1751214 1638142 1563742 1553270 1612299 1586601 1546306 1536893 1498819 1501211 1511721
2359 1511721 1444691 1387965 1394057 1360309 1365560 1241365 1220621 1297297 1213665 1199633 1195812 1191624
2347 1191624 1106885 1142313 1052017 1081296 1137618 1089845 954617 1018381 975677 1030069 1066477
2336 1066477 956852 893452 872741 778871 920596 1047796 948248 848986 769096 834860 900960
2325 900960 889794 894739 789172 750371 899200 717989 701108 692583 775060 732131 705832
2314 705832 690774 751325 710029 620480 658414 625670 604450 570979 621349 638084 618202 579940
2302 579940 670191 571554 691336 528974 424264 438399 496366 536674 543517 511928 501210
2291E01210L2799l7302K015p2834J12689n1236K841O7424J4864j53890m3424L2826
2279D07982Q3378Q4749j48559J55513N959q7529J8503n5579o0180k2329J1749
2268C93657P5253J03430r5912L8691R3958J8584n7679j29376l2121k6733R6232
2257D77984L6076n8067R8072L9734J04564L1192l625j4482N6052o0945o1368J26179
2245G71366L760n2246P6231O3986K0385o2458L9396P1419P0932q6210M8685O0473
2233A025719j5592N539J3638K58152J2755r2559O782K3560O9911L2696J20541
2222A461142l7475K8479k5417o0010N8356K16560n4800L68J52954R040q7185J52413
2210A814425k9171J10949J02542J33239M1697o8484N5731O1717J8812j9260k864
$$ plain form
2291 501210 534009 496707 498722 425888 538577 487341 490182 557606 572470 418580 375156 407982
2279 407982 491360 576109 427550 583063 589022 501493 519996 464417 404237 381908 393657
2268 393657 468910 572340 476428 515119 609077 627661 569982 440606 408485 381752 477984
2257 477984 514060 455993 554065 593799 698363 729555 725930 711448 767500 706555 645187 771366
2245 771366 775126 722880 799111 863097 883482 821024 860420 931839 1002771 916561 965246 1025719
2233 1025719 1010127 1015666 1029304 1287456 1300211 1207652 1214434 1237994 1307905 1340601 1461142
2222 1461142 1423667 1452146 1426729 1366719 1425075 1641635 1586835 1587203 1740157 1749197 1662012 1814425
2210 1814425 1785254 1896203 1998745 2131984 2173681 2105197 2160928 2222645 2241457 2222197 2219333
2199B219333n817N8459j8078M3943J20613R8963L183n725j07274m1330k887N8703
2187B422086j9982J87903N748q907o3424J10293M3872P1189J59194R2901L6197
2176C037070K13601R4504p5628m4256r5626j53327J8002j21809j72927j6690l8560
2165B644354r4535R945q7706k8532P6204l1061n8078K5105N621k6835q1908l1797
2153B320777n6864k7517j35902O0792K12606K1328M6469m6006O1504O1921J0562
2142B529670K0780l0409j03637q7490j19296r9890j80782n9488j38336k30563
2132A500559j33321k5198Q7374k9292j59852n6428l074J18341n5617J5509J0190
2121A269191j14826j39112q7130Q9905M4955J9537j59135m6439o304m9431Q7742
$$ plain form
2199 2219333 2213516 2271975 2253897 2297840 2418453 2517416 2520599 2514874 2407600 2366270 2363383 2422086
2187 2422086 2402104 2590007 2595755 2586848 2523424 2633717 2677589 2748778 2907972 3000873 3037070
2176 3037070 3250671 3345175 3269547 3225291 3129665 2976338 2994340 2872531 2699604 2682914 2644354
2165 2644354 2549819 2559764 2472058 2443526 2519730 2488669 2430591 2455696 2461317 2434482 2352574 2320777
2153 2320777 2263913 2236396 2100494 2161286 2373892 2395220 2441689 2395683 2457187 2519108 2529670
2142 2529670 2550450 2520041 2416404 2328914 2209618 2109728 1928946 1869458 1731122 1500559
2132 1500559 1367238 1342040 1429414 1400122 1240270 1183842 1180768 1299109 1243492 1259001 1269191
2121 1269191 1154365 1015253 928123 1018028 1062983 1082520 923385 876946 870642 821211 908953
2110I08953K1875m3224k2866p8794L9031j31654o4120J8554K5479l5001p3091
2099E65142o6484j4622m6320j42708L4894M3672L4394o0746O5463n1218M0005
2088D01472r7041o7728o5178L374P1430o2804N4952q925j64507K8307J04251l6731
2076A60872L1768O94j11828K0204L6128m8785j5065N436L117P648o9061j2978
2064H150l1698P5114m1154O8133M2717j08989m9107q0974J20677K14389n1679
2053A65579n9034J9527j12096L1695n4233L5170K3798M8573J3756k2550o1640
2042B8545J1493N8429L258M4637m2995o2509Q4692j1521n6524R121p2707J4690
2030H609L6377o419m6052J2063J4718j9750k9513j7446P346P8716r8670q8572
$$ plain form
2110 908953 930828 887604 864738 785944 824975 693321 629201 647755 673234 638233 565142
2099 565142 498658 484036 437716 295008 329902 373574 407968 347222 412685 361467 401472
2088 401472 304431 236703 171525 174899 246329 183525 238477 229552 65045 93352 197603 160872
2076 160872 192640 193334 81506 101710 137838 89053 73988 79424 82541 90189 21128 8150
2064 8150 -23548 51566 10412 78545 121262 12273 -36834 -117808 2869 217258 165579
2053 165579 106545 126072 13976 45671 -8562 26608 50406 98979 112735 90185 28545
2042 28545 40038 98467 101725 146362 103367 40858 125550 114029 57505 66626 -6081 8609
2030 8609 44986 38567 -7485 4578 19296 -454 -29967 -47413 -40067 38649 -60021 -148593
2018a48593R3485n3644R1773J01830j15892K5236k6370J18756k6641n1770n9916
2007e1746N5949k7094j48049K7968P3044l0531O7020N8126r8267P9377N385n0677
1995c9495m7431L4852r714M3470p8149K7785J5287l0633N3303P181K0259K5783
1983B2498M386P3929j33173M1960L5265P7491J04092K2636m3338L5886J07846
1972C49478O2882j43799j4556L1255j11278p5175o9998L548M2682J03873o1516
1961A17396j7398K800J752J4441n3110n5441L5750R2716j45438L1161j4440q8517
1949g8328Q2380k6462Q6483j3989j04604N4394l0702O9555j26669N7651l1987
1938f2278J33690L3400q8460m3622O1576M16j03668l350J689J45894p6055p2939
$$ plain form
2018 -148593 -55108 -108752 -16979 84851 -31041 -5805 -32175 86581 59940 8170 -51746
2007 -51746 4203 -22891 -170940 -142972 -69928 -100459 -33439 24687 -73580 5797 11182 -39495
1995 -39495 -86926 -52074 -61788 -18318 -96467 -68682 -53395 -84028 -30725 -23544 -3285 22498
1983 22498 26884 100813 -32360 9600 44865 122356 226448 249084 205746 241632 349478
1972 349478 412360 268561 254005 285260 173982 98807 28809 32357 75039 178912 117396
1961 117396 99998 102798 104550 118991 65881 10440 46190 138906 -6532 24629 10189 -78328
1949 -78328 4052 -22410 64073 50084 -54520 -126 -30828 38727 -87942 -30291 -62278
1938 -62278 71412 104812 16352 -27270 34306 34722 -68946 -72296 -70607 75287 -768 -73707
1926g3707j1672O6123J04786P0494j55691P3894k1656j29469o0220K16191K7465
1915A06538j09832J3759k0760k2282r8704M7857J58962n4499o573Q1051n6140
1904C9377R0256O7424j39413j43930l0993J79290K4272l8218p916K6271J4710
1893H1130M3649L4082O7964j41565k3494q1629J56727k5257J9011k6628k082O0910
1881A62818r0341J20303N4202m3257j02702M7348m8184j25602J30008r9524Q8223
1870I3292j7809K6399O4372j82181N9442J42069k6068j9252j21436R3148J30489
1859B42465m6583k2209j04472M8372P4240m6209m377N4065J05008J07518q4664
1848C23154j25602o6118N4023q9541J02895o3895Q1557O8789K3898k9678n20Q0411
$$ plain form
1926 -73707 -85379 -19256 85530 156024 333 74227 52571 -76898 -137118 79073 106538
1915 106538 -3294 10465 -10295 -32577 -131281 -83424 75538 21039 14466 95517 39377
1904 39377 129633 197057 57644 -86286 -117279 62011 86283 48065 40149 66420 81130
1893 81130 124779 158861 226825 85260 61766 -19863 136864 111607 130618 103990 101908 162818
1881 162818 72477 192780 246982 203725 101023 148371 100187 -25415 104593 5069 93292
1870 93292 75483 101882 166254 -15927 43515 185584 159516 140264 18828 111976 242465
1859 242465 195882 173673 69201 117573 191813 145604 141227 195292 300300 407818 323154
1848 323154 197552 131434 185457 95916 198811 134916 216473 285262 309160 279482 278962 359373
1836C59373j9033j10431Q8798N0780l8182R8996l4874j07332Q1349K2327K1278
1825D13049l5076L1539R2967P2599l3656l140n2101n386N0188L3261K4468J5803
1813F04515J19459j8524k0944k8984M6649J12051J47283j12321L500J49041m3105
1802I58620n9274R9825J52780P7068n0433J8215J32269K8451k2154P5483J91721
1791A602571n750r0448p7941n312Q8780M7669q0247R6261J43997R3557k7495J49863
1779A935505Q1788K701N8995J39526L1902J18722K5601M6786R1877J82404P8902
1768B794709J90917Q796J24195O6438J54536J09619K41603J61489J99407J80760
1758D232469L07436L04165L52333K34480M10706L86638L70937N05713N63205N68235
$$ plain form
1836 359373 340340 229909 318707 369487 331305 430301 395427 288095 369444 391771 413049
1825 413049 377973 409512 502479 575078 541422 538282 486181 480795 530983 564244 588712 604515
1813 604515 723974 705450 684506 655522 702171 814222 961505 849184 852684 1001725 958620
1802 958620 899346 999171 1151951 1229019 1178586 1196801 1329070 1357521 1335367 1410850 1602571
1791 1602571 1596821 1506373 1428432 1423120 1511900 1559569 1479322 1575583 1719580 1813137 1785642 1935505
1779 1935505 2017293 2019994 2078989 2218515 2250417 2369139 2394740 2441526 2533403 2715807 2794709
1768 2794709 2985626 2994422 3118617 3185055 3339591 3449210 3690813 3852302 4051709 4232469
1758 4232469 4539905 4844070 5196403 5430883 5841589 6228227 6599164 7104877 7668082 8236317
1748H236317P00612Q12064R58849J109065J263081J088381J455793J624671K169323
1739A9418156K669095L085704L909158N267338O524433P986744P922327O347331
1731F3130286O481499o724742j2797589j1220838q922964n152821l654221k683811
1723A8454799k293425j551692j304301j055392q94336o95028p00676q82574q02513
1714H274862p09102p37673n58231m82054l38527k36143j80894k74215k78217k26607
1704D253199p6445k61861n4490j01788j85888k96509r7022j83468p0205j25580
1694B799943j16029j23712j42539l6136j16267j11884j9649K1130l6546r4139
1684B024172p4133k30677L1687m2544q659m7968P7716J0370p3535j90356l5335
$$ plain form
1748 8236317 8936929 9748993 10707842 11816907 13079988 14168369 15624162 17248833 19418156
1739 19418156 22087251 25172955 29082113 34349451 40873884 48860628 56782955 63130286
1731 63130286 69611785 62887043 50089454 38868616 29945652 24792831 21138610 18454799
1723 18454799 16161374 14609682 13305381 12249989 11355653 10660625 9959949 9077375 8274862
1714 8274862 7565760 6828087 6269856 5787802 5449275 5213132 5032238 4758023 4479806 4253199
1704 4253199 4176754 3914893 3860403 3758615 3572727 3276218 3179196 2995728 2925523 2799943
1694 2799943 2683914 2560202 2417663 2381527 2265260 2153376 2133727 2154857 2118311 2024172
1684 2024172 1950039 1719362 1751049 1708505 1699846 1651878 1729594 1739964 1666429 1476073 1440738
1673A440738P9010j31520j52117r727j0064K9931m1577j01012j3187O04n24q8254
1661A002301L3161M4505j77178l0853k2761R9407j39669j59536N686k5166O7087
1650F96984N7290J0121J8220j28655q8352m0171J9674j65121P0213J04864O157
1639E61224j25572m95R7590K2087m4346p2111R300j06295Q862K9213P4764r3633
1627C60588q931k690l3006M8788K3380k1793q2962n58P3032M7029m021L0469n8234
1614C71091o633q9808M9235J66o6956m4217o664O3094j1809k2839j20796o305
1602A07559n48M9174k8775J8859K1109r859j06545P87R9563m0059J8458M8365
1590A78088o5384J8260l4890O7392J5429n4833J41308j32301j59537M447J79658
$$ plain form
1673 1440738 1519748 1388228 1236111 1226384 1216320 1246251 1204674 1103662 1090475 1091079 1090555 1002301
1661 1002301 1035462 1079967 902789 871936 849175 948582 808913 649377 655063 629897 696984
1650 696984 754274 764395 782615 653960 565608 525437 545111 379990 450203 555067 561224
1639 561224 435652 435157 532747 554834 510488 438377 447677 341382 350244 379457 454221 360588
1627 360588 351657 348967 315961 364749 388129 366336 283374 282816 355848 402877 398856 429325 371091
1614 371091 364458 274650 323885 324051 257095 212878 206214 269308 257499 234660 113864 107559
1602 107559 107011 156185 127410 146269 167378 157519 50974 51761 151324 111265 129723 178088
1590 178088 112704 130964 96074 163466 178895 124062 265370 133069 -26468 -22021 157637
1579A57637k8638q4099k4009k107N8207O6487J929K0487q9638o4034P2898m7786
1567C7334K9571n8j20620K0631J11860Q3262l4698p5715o4871m6712R5836r394
1555B6426J56006J5669L17j36656o9182L8605M9497j0228J8215J6170M7104j26838
1543B5105o4884m1996J37373L1777j37168l8850M7224N6918k2763m9811k8010
1532h5085P0559j3499q6864J7878O1273p5365L4545L2494K0013m0577N3994J32738
1520A22104m6014j5039j4934o6801K5845j19447q5822J17797J24486l6804J1454
1509A6825P2511j28417R269N1685L0373q2519N3281M1048k8680M655k0948M3236
1497F2319j3953o051R5173L8618M3297p692L4572L1520o1414Q534j7938J72842
$$ plain form
1579 157637 128999 44900 20891 18784 76991 143478 145407 165894 76256 12222 85120 37334
1567 37334 66905 66847 -53773 -33142 78718 161980 127282 51567 -13304 -60016 35820 26426
1555 26426 182432 198101 198418 61762 -7420 31185 80682 70454 88669 104839 151943 25105
1543 25105 -39779 -81775 55598 87375 -49793 -88643 -41419 15499 -7264 -57075 -85085
1532 -85085 -14526 -28025 -114889 -97011 -35738 -111103 -76558 -44064 -24051 -64628 -10634 122104
1520 122104 76090 61051 46117 -20684 5161 -114286 -200108 -82311 42175 5371 16825
1509 16825 89336 -39081 -29812 21873 52246 -30273 23008 64056 35376 40031 19083 62319
1497 62319 48366 42315 137488 176106 219403 211711 246283 277803 216389 224923 206985 379827
1485C79827r9056j53635P375p4222k7399J7572j12399J31055P1552j06497M098
1474C8271m7841n3233O6391m9901n6644N0393J03003k8142j09099M4871Q1346
1463C9415J7000j969K8212k14706R581J08345L6570q1630j04988O6347J11403
1452A3580p08J31861r5011j52004m7419j0135J17641K5425k7765j2510O1816m3660
1440c8889J16479N7383j81243J7396O8350o9030l0771N1892L4993q706N8469r6377
1428b0054L6350p7473k4110j5937J54349K035N55r6587j20385P4158N3746q7375
1416a20728n0682M5279j2054l4703M0259o1725P0572N3478J86L8929k013l3923
1404f7125o8140J08883O0010m7870j8890P0541k3643l475N5630j07664o2018m2648
$$ plain form
1485 379827 280771 127136 134511 60289 32890 50462 -61937 69118 140670 34173 38271
1474 38271 -9570 -62803 3588 -46313 -102957 -52564 50439 22297 -86802 -41931 39415
1463 39415 56415 54446 82658 -132048 -122467 -14122 22448 -59182 -164170 -97823 13580
1452 13580 12872 144733 49722 -102282 -149701 -159836 -42195 -16770 -44535 -57045 4771 -38889
1440 -38889 77590 134973 -46270 -28874 39476 -29554 -60325 -8433 26560 17854 76323 -20054
1428 -20054 16296 -61177 -85287 -101224 53125 55160 55715 -40872 -161257 -87099 -33353 -120728
1416 -120728 -171410 -126131 -138185 -172888 -132629 -194354 -123782 -70304 -70118 -31189 -33202 -67125
1404 -67125 -135265 -26382 33628 -14242 -33132 37409 13766 10291 65921 -41743 -103761 -146409
1392a46409J2570J13045q653r5100j2347J03137j127j1130N0397n8682o3066k905
1380a20270P1711Q3762o9059K3181M6696n2315j20296J41081K1755q3465P5097
1369A7878m5773J0262r0299M4937J24551l5487R3057o3524j04438j00157O3662
1358h5331m5358L279Q3720j18134k1606P5964N9323K3111j10812q3615N2971J35226
1346c1262r6396r364J0525l321P0469N1171L2540p968o4442q2040m4794j8219
1334a93101L3840Q2166K3264Q613n3790r0387O7474J15259l6497l0228L5551j7175
1322e5011J10469l8234l7532q111l4625j0151k8790N793n8260J7028J1511J3553
1310a12360p1636K3343P0545m7065M8837J0554p8291O6570L7030J40008O4890
$$ plain form
1392 -146409 -133839 -20794 -29447 -124547 -136894 -33757 -34884 -46014 4383 -54299 -117365 -120270
1380 -120270 -48559 35203 -33856 -10675 36021 -16294 -136590 4491 26246 -57219 17878
1369 17878 -27895 -17633 -107932 -62995 61556 26069 119126 55602 -48836 -148993 -85331
1358 -85331 -130689 -127410 -43690 -161824 -183430 -107466 -48143 -25032 -135844 -219459 -166488 -31262
1346 -31262 -127658 -137022 -126497 -129818 -59349 -8178 24362 16394 -48048 -130088 -174882 -193101
1334 -193101 -159261 -77095 -53831 -45218 -99008 -189395 -121921 -6662 -43159 -73387 -37836 -55011
1322 -55011 55458 17224 -20308 -28419 -63044 -73195 -101985 -96192 -154452 -137424 -125913 -112360
1310 -112360 -183996 -160653 -90108 -137173 -88336 -77782 -156073 -89503 -52473 87535 152425
1299A52425j66884q8322j18851N8386J36670k8724Q9847L4831j79696l6258P9011
1288f7565K5387M8627M8402l2879l5121n897k8726k5394k4495M6744M614k0249
1276f6552r1048q3154J37788K4799Q2248l8312j00608j1027P2915k1286l9622
1265a33859K1646M038P7956m8295j56934M1071J09928m3200k2472N5039M7798
1254d7284q2461M0523J54113p6281N4018k9281j50282Q4446J05402j52654r343
1243a09084L3371j0821M104m9500M2759J0737K3063M0166p564j19201r727Q0429
1231g1268Q6285n7235K8123j20625j5867J74685j1465j23351K6064m8722M8656
1220h4720K0059q0274J34388j1449L3887o4265j2174p1141m0216R1251N2212L7044
$$ plain form
1299 152425 -14459 -102781 -221632 -163246 -26576 -55300 34547 69378 -110318 -146576 -67565
1288 -67565 -42178 6449 54851 21972 -13149 -19046 -47772 -73166 -97661 -50917 -46303 -66552
1276 -66552 -157600 -240754 -102966 -78167 4081 -34231 -134839 -145866 -72951 -94237 -133859
1265 -133859 -112213 -108175 -30219 -78514 -235448 -194377 -84449 -127649 -150121 -95082 -47284
1254 -47284 -129745 -89222 64891 -11390 42628 13347 -136935 -52489 52913 -99741 -109084
1243 -109084 -75713 -86534 -82430 -131930 -89171 -78434 -55371 -15205 -22769 -141970 -151697 -71268
1231 -71268 15017 -42218 -14095 -134720 -150587 24098 12633 -110718 -84654 -133376 -84720
1220 -84720 -64661 -144935 -10547 -21996 11891 -52374 -64548 -135689 -175905 -84654 -32442 4602
1208D602M385K8131p3600m2949m2876J32746m3140o3003J08618K906j3337q7597
1196h5114J2792k0344K9345K6443R9428m0412m4975J1278l8301n2116J24878m8806
1184b5904j15446O3686k2610O8672O3361q4756R1413l3867j41578R5063O354M9224
1172A3612k8195l3443n1267L3051m4873K7143J7827n5089j1491L9846m994O7470
1160c0403P4541q2396l1639K6830L0151r4338k2600J29536K8123j16640L0960
1149e7875m928l8587j392J965l2636O1274L6238O8320j8271M5129j14583O8076
1137A2730o4269n2188j9152J5102J29622l3217K0065m2717L7334j00099q6730
1126a83519O0502o260K9477l800J58460j12705n0076j1208K0799N3158q4565R002
$$ plain form
1208 4602 8987 37118 -36482 -79431 -122307 10439 -32701 -95704 12914 15820 2483 -85114
1196 -85114 -72322 -92666 -63321 -36878 62550 22138 -22837 -11559 -49860 -101976 22902 -25904
1184 -25904 -141350 -77664 -100274 -31602 31759 -52997 38416 4549 -137029 -41966 -35612 13612
1172 13612 -14583 -48026 -99293 -66242 -111115 -83972 -66145 -121234 -132725 -92879 -97873 -30403
1160 -30403 44138 -38258 -69897 -43067 -12916 -107254 -129854 -318 27805 -88835 -57875
1149 -57875 -62803 -101390 -102782 -100817 -133453 -72179 -35941 32379 14108 59237 -55346 12730
1137 12730 -51539 -103727 -122879 -107777 21845 -11372 8693 -34024 3310 -96789 -183519
1126 -183519 -123017 -129277 -99800 -103600 54860 -57845 -107921 -119129 -98330 -45172 -129737 -120735
1114a20735l1797J46070j6340K9013p292Q994K802m8791K3363k9835J2944l5208
1102f6812j29072J01239K2228K4620m8445j31425O0922j8161P8676K9394m4525
1091a21361O9594N280n88J441J04188q8476J8190j7727N5262j076l8949r7894
1079a12116k8147L4302Q2696J0463o400p1355O1758n2366o586l696M1384J9979
1067c0084q0930n9755N9350P7167K1380k9027j9693m215J39079l2113o8205l7290
1055f4336j21126P0010Q7614j02843K599N4376Q2091Q6324j87593j1106R6756
1044g234l6350n0218Q4936j04111k9030Q5512J05929n2029n1464P4025o0383K2822
1032a7595K5028n6827j6704j07121K6251P3042M5212K3732N0305n9234j016k1141
$$ plain form
1114 -120735 -152532 -6462 -22802 6211 -1081 7913 10715 -38076 -14713 -44548 -31604 -66812
1102 -66812 -195884 -94645 -72417 -47797 -96242 -227667 -166745 -184906 -106230 -76836 -121361
1091 -121361 -51767 -46487 -47075 -45634 58554 -29922 -11732 -29459 25803 24727 -14222 -112116
1079 -112116 -140263 -105961 -23265 -12802 -19202 -90557 -28799 -81165 -87751 -91447 -50063 -30084
1067 -30084 -111014 -170769 -111419 -34252 -12872 -41899 -61592 -65807 73272 41159 -27046 -64336
1055 -64336 -185462 -115452 -27838 -130681 -128082 -73706 8385 94709 -92884 -103990 -7234
1044 -7234 -43584 -93802 -8866 -112977 -142007 -56495 49434 -2595 -54059 19966 -40417 -17595
1032 -17595 7433 -49394 -66098 -173219 -146968 -73926 -28714 -4982 45323 -13911 -14927 -36068
1020c6068k0547l3929M4309O5990o7074m4997J19937j04354K2160m2972L9580
1009e7965O4830N0601j41046K8682j29870q5588M9651M873M7205J30454r7205
998a35378n447L8887N6785L5291l0396K9167j72238J11788N8432J2607j06647
987a07149o8955R7975q5273o5590J20781Q8662j318k3315J3873K531Q6200n2414
975F008R9934l0570m8762l6440Q294L3678l2593p2996L3987P9808N5812k0255
963G5905l1000K1504m1023N6421l6746l4629n8787o6084L1046N8221J8031p0583
951g7724M0520j11895m1701J68881j14965m7406M3492K3421J4598q7621l5826
940b26226J07728O1304L1021L3989Q397K9106m0643N6367o811k5603j09112J02074
$$ plain form
1020 -36068 -56615 -90544 -46235 19755 -47319 -92316 27621 -76733 -54573 -97545 -57965
1009 -57965 6865 57466 -83580 -54898 -184768 -270356 -220705 -215832 -168627 -38173 -135378
998 -135378 -140825 -101938 -45153 -9862 -40258 -11091 -183329 -71541 -13109 -502 -107149
987 -107149 -176104 -78129 -163402 -228992 -108211 -19549 -20867 -44182 -30309 -27778 58422 6008
975 6008 105942 75372 26610 -9830 -1536 32142 -451 -73447 -39460 40348 96160 75905
963 75905 44905 66409 25386 81807 45061 10432 -48355 -114439 -83393 -25172 -7141 -77724
951 -77724 -37204 -149099 -190800 -21919 -136884 -184290 -140798 -117377 -102779 -190400 -226226
940 -226226 -118498 -57194 -26173 7816 16213 45319 4676 61043 54232 28629 -80483 21591
928B1591N0293j26712L9936l3441J305M3400k819l9184m6679r9113N4784k6303
916a62942O010J7064Q1665M8895k1406K6106P2120L7330j40206j2465J4995M4398
904A1564p2883L509N4822O1120O8406o7068q4864j67562O0298J07837J4569J04197
892I3945N702j22232m2561k9592j0043O9710M2484L1208J2671j984l1658o2691
880d5041m8285Q3838p3957O3399L5071L6737J07796o6113j43313L3215k500J4719
868d434n3571m117k2656K8203m1229M7337O7332N0190J0127j17618P4918l289
856C1193K4068M1334q4565O9150l4249n2317k0958l778J5127n4189J1857N3574
844c753L4688n7995K6231L6715n3241p4534P5089k0697M1763k4054n8225R0277
$$ plain form
928 21591 71884 -54828 -14892 -48333 -47028 -3628 -6447 -45631 -92310 -191423 -136639 -162942
916 -162942 -156932 -139868 -58203 -9308 -30714 -4608 67512 104842 -35364 -47829 -32834 11564
904 11564 -61319 -57810 -2988 58132 126538 59470 -25394 -192956 -132658 -24821 -10252 93945
892 93945 99647 -22585 -65146 -94738 -104781 -35071 7413 38621 51292 49308 17650 -45041
880 -45041 -93326 -9488 -83445 -20046 15025 51762 159558 93445 -49868 -16653 -19153 -4434
868 -4434 -58005 -62122 -84778 -56575 -97804 -50467 16865 67055 77182 -40436 34482 31193
856 31193 55261 96595 12030 81180 46931 -5386 -26344 -30122 -14995 -69184 -57327 -3753
844 -3753 30935 -27060 -829 35886 -17355 -91889 -16800 -37497 4266 -19788 -78013 12264
832A2264k2363n2655O0482k701n7087n8422J34435p1164M5451m4419m5422J19042
820A7441M2249N8046k5729j23240Q3658O3569l7561o8356q7567j8728j5614p6263
808a88095J00279L5695k8622O5897j6551J00723l9650P9114m6016q8986R920j6076
796c2368n6423n8531J55239N3485M4214O4728j67382L303L8401L1994r266O918
784G4312J0584j5830l8462j06360k6853Q6889k1068M7457R3461r8029j44008O7383
772g0524J6970p392o0018J02657M7557P5668q3848j51127J42257n7709j0980l4353
760i0842N8788l2511R5565j05426N729L0128l8006L7019Q5688J7781l8797j04886
748g9770m5183j4588J2374Q477K6111J38470k2062j94025M3335J5773R9227M830
$$ plain form
832 12264 -10099 -62754 -2272 -4973 -62060 -120482 13953 -57211 -11760 -56179 -101601 17441
820 17441 59690 117736 92007 -31233 52425 115994 78433 10077 -77490 -96218 -111832 -188095
808 -188095 -87816 -52121 -80743 -14846 -31397 69326 29676 108790 62774 -26212 -16292 -32368
796 -32368 -88791 -147322 7917 61402 105616 170344 2962 6265 44666 76660 67394 74312
784 74312 84896 69066 30604 -75756 -102609 -15720 -36788 10669 104130 6101 -137907 -70524
772 -70524 -53554 -60946 -120964 -18307 29250 104918 21070 -130057 12200 -45509 -56489 -90842
760 -90842 -32054 -64565 31000 -74426 -68697 -38569 -76575 -39556 46132 63913 25116 -79770
748 -79770 -124953 -139541 -127167 -118690 -92579 45891 23829 -170196 -126861 -111088 -11861 -7031
736g031o0076K7863l4709q3010J70470Q73m5995Q3573n6695M8978n2759Q544o5518
723f5492L4468J7106j43677L6778K0592m7352J26937M2281n5859j35269J32850
712c6637L0066q1910q309R9493n458L1354k3484k3589k7685L1070J154q4441k3101
699a21477L7356R1599l5954n1866j7836J210p323j034J11629J5448l8056L0322
687A4018p121o624j55502M2519J41624Q3098k5239p6226k1996L1497K7987J5798
675F3833j17436k8189J44712p8687J6517l8967Q035J50072o3024p62n914j08425
663e8235J72282M6739p4079k069q1337R6739j06844q1532L0484m0568M2330N9080
651B990R882j02468j5870N7068O3671J8833o0078N4477Q3177j6579k3482l2239
$$ plain form
736 -7031 -67107 -39244 -73953 -156963 13507 14380 -31615 51958 -4737 44241 -8518 26 -65492
723 -65492 -31024 -13918 -157595 -120817 -100225 -147577 -20640 21641 -34218 -169487 -36637
712 -36637 -6571 -88481 -96790 2703 -2755 28599 5115 -18474 -46159 -15089 -13935 -98376 -121477
699 -121477 -84121 7478 -28476 -80342 -98178 -96968 -104291 -105325 6304 21752 -16304 14018
687 14018 6897 273 -155229 -112710 28914 112012 86773 10547 -11449 20048 48035 63833
675 63833 -53603 -81792 62920 -15767 750 -38217 -30182 119890 56866 56104 50190 -58235
663 -58235 114047 160786 86707 84638 3301 100040 -6804 -88336 -57852 -98420 -56090 2990
651 2990 12872 -89596 -105466 -48398 15273 34106 -25972 28505 111682 95103 71621 39382
639C9382M4885j7431P3580O5943p3235q6235m7668r0794L8839J6234k2377q6422
627a45299K27273m7750k236l8136l141L5532Q2881q6570q0348J06943l9613P3253
615H2789n3329M2393p27l7532L7172n3191l413N1976o2429L5948j44658N3002
603e1999Q9311J1054J2429m2925k3840J23151L1152O949j00384J9855Q2733m1228
591A16258q3502j10613J11802R5067n8765j14739L3351n781P893P5335m7621L549
579B2234n409K4689J982j7769k4895m6801j1653P3222n9510M9063P5508j8590
567F2071j5218J22463j17560J9608M0503p4364K8226l8982L9762l9523o2379k0995
555e6388J1749J8847N589J41907n1603l0800m9282J3573J08844j20834K2037Q1052
$$ plain form
639 39382 84267 66836 140416 206359 133124 46889 -779 -91573 -52734 -36500 -58877 -145299
627 -145299 81974 34224 31988 -6148 -9289 26243 109124 22554 -57794 49149 9536 82789
615 82789 29460 71853 71126 33594 70766 17575 14162 66138 3709 39657 -105001 -51999
603 -51999 37312 48366 60795 17870 -5970 117181 148333 155282 54898 74753 157486 116258
591 116258 32756 -77857 33945 129012 70247 -44492 -11141 -16922 -9029 66306 18685 22234
579 22234 16825 41514 43496 25727 832 -45969 -57622 15600 -43910 5153 80661 62071
567 62071 46853 169316 51756 71364 111867 37503 65729 26747 66509 26986 -35393 -56388
555 -56388 -44639 -25792 -20203 121704 70101 39301 -9981 3592 112436 -8398 13639 94691
$$ [...]
##END NTUPLES=NMR SPECTRUM
##END=
