##TITLE=1H_EC-3259(IV-3)
 CDCl3, 8 sc, 
 31.8.2021
##JCAMPDX= 6.0         $$ Bruker NMR JCAMP-DX V2.0
##DATA TYPE= NMR SPECTRUM
##DATA CLASS= NTUPLES
##ORIGIN= UXNMR, Bruker Analytische Messtechnik GmbH
##OWNER= root
$$ XWIN-NMR		Version 3.5
$$ Tue Aug 31 12:34:58 2021 Russian Standard Time (UT+4h)  she@DPX200
##.OBSERVE FREQUENCY= 200.131506
##.OBSERVE NUCLEUS= ^1H
##.ACQUISITION MODE= SIMULTANEOUS
##.ACQUISITION SCHEME= undefined
##.AVERAGES= 8
##.DIGITISER RES= 18
##SPECTROMETER/DATA SYSTEM= spect
##.PULSE SEQUENCE= zg30
##.SOLVENT NAME= CDCl3
##.SHIFT REFERENCE= (INTERNAL, CDCl3, 0, 17.5093)
##AUDIT TRAIL= $$ (NUMBER, WHEN, WHO, WHERE, WHAT)
$$ ##TITLE= Audit trail, XWIN-NMR		Version 3.5
$$ ##JCAMPDX= 5.01
$$ ##ORIGIN= Bruker BioSpin GmbH
$$ ##OWNER= she
$$ F:/spectra/data/she/nmr/H-F/1/pdata/1/auditp.txt
$$ ##AUDIT TRAIL=  $$ (NUMBER, WHEN, WHO, WHERE, WHAT)
(   1,<2021-08-31 12:32:31.45 +0400>,<she>,<DPX200>,
      <created by zg, POWCHK disabled, PULCHK disabled
       configuration hash MD5:
       00 E9 B6 7A A2 85 ED C7 34 08 36 98 17 FE 4E 26
       data hash MD5: 16K
       22 0B FF 01 9D 2F 5D 43 32 14 C9 70 BA A2 1A E9>)
(   2,<2021-08-31 12:33:15.48 +0400>,<she>,<DPX200>,
      <Start of raw data processing
       efp BC_mod = 2 LB = 0.24 FT_mod = 6 PKNL = 1 PHC0 = -13357.22 PHC1 = 7.80098 SI = 16K 
       data hash MD5: 16K
       98 5E F0 79 F7 59 DD 89 FA BF B5 83 0C 80 C1 4B>)
(   3,<2021-08-31 12:33:31.62 +0400>,<she>,<DPX200>,
      <pk PHC0 = 0.07120889 PHC1 = 0.7999995 
       data hash MD5: 16K
       A5 A2 4B CF A0 13 F1 73 5D E4 9C 06 9B 00 55 B0>)
(   4,<2021-08-31 12:33:34.75 +0400>,<she>,<DPX200>,
      <abs ABSG = 5 
       data hash MD5: 16K
       4D 23 B6 35 75 24 B4 EE F9 F7 A9 72 5A 47 45 B4>)
$$ ##END=
$$ 
$$ hash MD5
$$ FD 24 16 A1 0A B4 27 48 87 2A 38 13 E1 02 BF 22
##$RELAX= 
##$RELAX= 
##$RELAX= 
##$RELAX= 
##$RELAX= 
##$RELAX= 
$$ Bruker specific parameters
$$ --------------------------
##$DU= <F:/spectra>
##$EXPNO= 1
##$NAME= <H-F>
##$PROCNO= 1
##$TYPE= <nmr>
##$USER= <she>
##$AMP= (0..31)
100 100 100 100 100 100 100 100 100 100 100 100 100 100 100 100 100 100 
100 100 100 100 100 100 100 100 100 100 100 100 100 100 
##$AQSEQ= 0
##$AQ_mod= 1
##$AUNM= <au_zg>
##$AUTOPOS= <>
##$BF1= 200.13
##$BF2= 200.13
##$BF3= 200.13
##$BF4= 200.13
##$BF5= 200.13
##$BF6= 200.13
##$BF7= 200.13
##$BF8= 200.13
##$BYTORDA= 1
##$CFDGTYP= 0
##$CFRGTYP= 5
##$CHEMSTR= <none>
##$CNST= (0..31)
1 1 145 1 1 1 1 1 1 1 1 1 1 1 1 1 1 1 1 1 1 1 1 1 1 1 1 1 1 1 1 1 
##$CPDPRG= <>
##$CPDPRG1= <>
##$CPDPRG2= <>
##$CPDPRG3= <>
##$CPDPRG4= <mlev>
##$CPDPRG5= <mlev>
##$CPDPRG6= <mlev>
##$CPDPRG7= <mlev>
##$CPDPRG8= <mlev>
##$CPDPRGB= <>
##$CPDPRGT= <>
##$D= (0..31)
0 1.2 0 0 0 0 0 0 0 0.06 0 0.03 0 0 0 0 0.0002 0 0 0 0 0 0 0 0 0 0 0 0 
0 0 0 
##$DATE= 1630398750
##$DBL= (0..7)
120 120 120 120 120 120 120 120 
##$DBP= (0..7)
150 150 150 150 150 150 150 150 
##$DBP07= 0
##$DBPNAM0= <>
##$DBPNAM1= <>
##$DBPNAM2= <>
##$DBPNAM3= <>
##$DBPNAM4= <>
$$ [...]
##$SUBNAM3= <"">
##$SUBNAM4= <"">
##$SUBNAM5= <"">
##$SUBNAM6= <"">
##$SUBNAM7= <"">
##$SUBNAM8= <"">
##$SUBNAM9= <"">
##$SW= 20.0188882624521
##$SWIBOX= (0..15)
0 0 2 0 0 0 0 0 0 0 0 0 0 0 0 0 
##$SW_h= 4006.41025641026
##$TD= 16384
##$TD0= 1
##$TE= 0
##$TE2= 300
##$TE3= 300
##$TEG= 300
##$TL= (0..7)
0 120 120 120 120 120 120 120 
##$TP= (0..7)
150 150 150 150 150 150 150 150 
##$TP07= 0
##$TPNAME0= <>
##$TPNAME1= <>
##$TPNAME2= <>
##$TPNAME3= <>
##$TPNAME4= <>
##$TPNAME5= <>
##$TPNAME6= <>
##$TPNAME7= <>
##$TPOAL= (0..7)
0.5 0.5 0.5 0.5 0.5 0.5 0.5 0.5 
##$TPOFFS= (0..7)
0 0 0 0 0 0 0 0 
##$TUNHIN= 0
##$TUNHOUT= 0
##$TUNXOUT= 0
##$USERA1= <user>
##$USERA2= <user>
##$USERA3= <user>
##$USERA4= <user>
##$USERA5= <user>
##$V9= 5
##$VALIST= <valist>
##$VCLIST= <CCCCCCCCCCCCCCC>
##$VD= 0
##$VDLIST= <DDDDDDDDDDDDDDD>
##$VPLIST= <PPPPPPPPPPPPPPP>
##$VTLIST= <TTTTTTTTTTTTTTT>
##$WBST= 1024
##$WBSW= 4
##$XGAIN= (0..3)
0 0 0 0 
##$XL= 0
##$YL= 0
##$YMAX_a= 270645
##$YMIN_a= -426568
##$ZGOPTNS= <>
##$ZL1= 120
##$ZL2= 120
##$ZL3= 120
##$ZL4= 120
##$ABSF1= 17.50077
##$ABSF2= -2.518269
##$ABSG= 5
##$ABSL= 3
##$ALPHA= 0
##$AQORDER= 0
##$ASSFAC= 0
##$ASSFACI= 0
##$ASSFACX= 0
##$ASSWID= 0
##$AUNMP= <proc_1d>
##$AZFE= 0.1
##$AZFW= 0.1
##$BCFW= 0
##$BC_mod= 2
##$BYTORDP= 0
##$COROFFS= 0
##$CY= -3
##$DATMOD= 1
##$DC= 0
##$DFILT= <>
##$DTYPP= 0
##$F1P= 0
##$F2P= 0
##$FCOR= 1
##$FTSIZE= 16384
##$FT_mod= 6
##$GAMMA= 0
##$GB= 0
##$INTBC= 1
##$INTSCL= 1.334414e-10
##$ISEN= 128
##$LB= 0.24
##$LEV0= 0
##$LPBIN= 0
##$MAXI= 10000
##$MC2= 0
##$MEAN= 0
##$ME_mod= 0
##$MI= 1.114404
##$NCOEF= 0
##$NC_proc= -6
##$NLEV= 6
##$NOISF1= 3.799351
##$NOISF2= 2.8
##$NSP= 0
##$NTH_PI= 0
##$NZP= 0
##$OFFSET= 17.50933
##$PC= 1
##$PHC0= -13357.15
##$PHC1= 8.60098
##$PH_mod= 1
##$PKNL= yes
##$PPARMOD= 0
##$PSCAL= 0
##$PSIGN= 0
##$REVERSE= no
##$SF= 200.130005063111
##$SI= 16384
##$SIGF1= 3
##$SIGF2= 2
##$SINO= 5.538805
##$SIOLD= 16384
##$SREGLST= <1H.CDCl3>
##$SSB= 0
##$STSI= 16384
##$STSR= 0
##$SW_p= 4006.41025641026
##$SYMM= 0
##$S_DEV= 0
##$TDeff= 16384
##$TDoff= 0
##$TI= <>
##$TILT= no
##$TM1= 0
##$TM2= 0
##$TOPLEV= 0
##$USERP1= <user>
##$USERP2= <user>
##$USERP3= <user>
##$USERP4= <user>
##$USERP5= <user>
##$WDW= 1
##$XDIM= 16384
##$YMAX_p= 348939177
##$YMIN_p= -291380
$$ End of Bruker specific parameters
$$ ---------------------------------
##NTUPLES= NMR SPECTRUM
##VAR_NAME=  FREQUENCY,     SPECTRUM/REAL,   SPECTRUM/IMAG
##SYMBOL=    X,             R,               I
##VAR_TYPE=  INDEPENDENT,   DEPENDENT,       DEPENDENT
##VAR_FORM=  AFFN,          ASDF,            ASDF
##VAR_DIM=   16384,         16384,           16384
##UNITS=     HZ,            ARBITRARY UNITS, ARBITRARY UNITS
##FACTOR=    0.24454680195387, 1,            1
##FIRST=     3504.14245155147, 0,            0
##LAST=      -502.267804858795, 0,           0
##MIN=       -502.267804858795, -291380,     0
##MAX=       3504.14245155147, 348939177,    0
$$ Real data points
##PAGE= N=1
##DATA TABLE= (X++(R..R)), XYDATA
$$ [...]
$$ plain form
6940 -728 114261 -50530 46663 10704 -11910 -26452 -16583 -15051 15628 17580 11976 -19410 -41701
6927 -41701 -13395 -94886 -81179 -27099 44797 15037 11396 79921 190838 67676 -7604 58498
6915 58498 55338 82386 152088 88267 86751 101183 218035 106685 128200 78896 66450 33847
6903 33847 137233 81789 80543 141673 107112 39174 101492 73540 -42101 100024 91789 -1016
6891 -1016 177011 175875 120560 231619 297940 191909 142692 264690 353130 390204 301999
6880 301999 546485 589261 601715 542800 405766 339695 229735 197575 165492 200656 202437
6869 202437 169457 179107 48728 124555 48919 -30548 12246 57782 13962 70765 105288 104183
6857 104183 77820 -6026 21016 -11193 -6296 114078 33933 634 8917 -25537 71424 -21010
$$ packed form
6940g28J14989j64791R7193l5959k2614j4542R869J532L0679J952n604l1386k2291
6927d1701K8306q1491J3707N4080P1896k9760l641O8525J10917j23162p5280O6102
6915E8498l160K7048O9702o3821j516J4432J16852j11350K1515m9304j2446l2603
6903C3847J03386n5444j246O1130l4561o7938O2318k7952j15641J42125q235r2805
6891a016J78027j136n5315J11059O6321j06031m9217J21998Q8440L7074q8205
6880C01999K44486M2776J2454n8915j37034o6071j09960l2160l2083L5164J781
6869B02437l2980R650j30379P5827p5636p9467M2794M5536m3820N6803L4523j105
6857A04183k6363q3846K7042l2209M897J20374q0145l3299Q283l4454R6961r2434
$$ plain form
6845 -21010 22923 44558 -8160 -38182 82897 225755 135971 74991 -29896 95616 67341
6834 67341 -51369 -24406 37282 39979 18567 60518 27009 29983 -58590 72587 173342 246836
6822 246836 109801 17244 -59190 -20584 59431 87460 15207 -135605 -171999 -78923 -75757
6811 -75757 -63184 -27096 -38673 -30440 67438 -9805 -79161 -53188 7771 54783 86948 107964
6799 107964 107240 156859 89172 64464 41026 35271 43202 150599 120456 48809 80752 68686
6787 68686 83590 102414 63364 91214 37410 68221 84222 53825 52852 19429 105633 218162
6775 218162 122554 -93352 -81204 20120 11056 -34321 -4181 -14868 -62954 17972 114119
6764 114119 95257 184822 178293 68812 93809 154535 166653 10227 76186 64260 81752
$$ packed form
6845b1010M3933K1635n2718l0022J21079J42858q9784o0980j04887J25512k8275
6834F7341j18710K6963O1688K697k1412M1951l3509K974q8573J31177J00755P3494
6822B46836j37035r2557p6434L8606Q0015K8029p2253j50812l6394R3076L166
6811g5757J2573L6088j1577Q233R7878p7243o9356K5973O0959M7012L2165K1016
6799A07964p24M9619o7687k4708k3438n755P931J07397l0143p1647L1943j2066
6787F8686J4904J8824l9050K7850n3804L0811J6001l0397r73l3423Q6204J12529
6775B18162r5608k15906J2148J01324r064m5377L0140j0687m8086Q0926R6147
6764A14119j8862Q9565o529j09481K4997O0726J2118j56426O5959j1926J7492
$$ plain form
6753 81752 116632 140259 121952 122277 188155 214667 115634 194989 62123 -6911 121368 188874
6741 188874 80188 79305 127469 134899 253558 147949 193339 99467 130838 190376 223336 280566
6729 280566 233737 183223 136985 163473 238347 146840 109506 155327 215865 254256 87055
6718 87055 258203 275566 205052 250813 262270 301275 203116 108641 37142 285735 322019
6707 322019 165298 234816 283084 253799 256489 138480 181080 95922 78598 240455 245304
6696 245304 333344 315600 327240 259764 269870 361852 354283 187106 170916 302022 280740
6685 280740 283429 387419 323091 515031 388111 331332 383305 469233 477558 454331 464149 417388
6673 417388 431868 418026 364572 362334 484944 594185 619776 371443 452836 431056 481684
$$ packed form
6753H1752L4880K3627j8307L25O5878K6512r9033P9355j32866o9034J28279O7506
6741A88874j08686q83M8164P430J18659j05609M5390r3872L1371N9538L2960N7230
6729B80566m6829n0514m6238K6488P4874r1507l7334M5821O0538L8391j67201
6718H7055J71148J7363p0514M5761J1457L9005r8159r4475p1499K48593L6284
6707C22019j56721O9518M8268k9285K690j18009M2600q5158j7324J61857M849
6696B45304Q8040j7744J1640o7476J0106R1982p569j67177j6190J31106k1282
6685B80740K689J03990o4328J91940j26920n6779N1973Q5928Q325k3227R818m6761
6673D17388J4480j3842n3454k238J22610J09241K5591k48333Q1393k1780N0628
$$ plain form
6662 481684 409680 490891 454938 482414 625344 553047 564007 609072 514427 529747 454614
6651 454614 343771 479928 561317 583397 586482 463508 558918 587789 556761 593331 578659
6640 578659 519225 635913 629551 655273 668242 669506 778653 813532 744159 778245 671596
6629 671596 590324 684692 721460 744728 782421 870149 868968 879250 805598 839815 947952 1016715
6617 1016715 998690 1024246 912371 938906 1081578 1179557 1223645 1265991 1260915 1406536 1464207
6606 1464207 1456288 1394090 1420986 1426243 1464749 1536394 1552220 1665496 1717756 1798310 1794364 1853362
6594 1853362 1972695 2026908 1950762 2036934 2126851 2082065 2207877 2345281 2490509 2562303 2566753
6583 2566753 2666914 2785416 2804290 2847411 2861056 2917441 3016968 3210821 3127229 3114387 3272859
$$ packed form
6662D81684p2004Q1211l5953K7476J42930p2297J0960M5065r4645J5320p5133
6651D54614j10843J36157Q1389K2080L085j22974R5410K8871l1028L6570j4672
6640E78659n9434J16688o362K5722J2969J264J09147L4879o9373L4086j06649
6629F71596q1272R4368L6768K3268L7693Q7728j181J0282p3652L4217J08137O8763
6617A016715j8025K5556j11875K6535J42672R7979M4088M2346n076J45621N7671
6606A464207p919o2198K6896N257L8506P1645J5826J13276N2260Q0554l946N8998
6594A853362J19333N4213p6146Q6172Q9917m4786J25812J37404J45228P1794M450
6583B566753J00161J18502J8874M3121J3645N6385R9527J93853q3592j2842J58472
$$ plain form
6572 3272859 3442578 3551479 3600664 3597302 3682552 3862820 3923491 3844874 3914629 4201671 4200605
6561 4200605 4381959 4557692 4794038 4955455 5088701 5314809 5479446 5811063 5981294 6229560
6551 6229560 6526823 6718313 7042777 7452221 7861973 8333838 8857604 9333529 9950048 10610061
6541 10610061 11177961 11851073 12688976 13612782 14659490 15964852 17363238 19205052 21255292
6532 21255292 23767891 26719501 30237313 34571961 39589122 45570548 52809033 61960324
6524 61960324 73399215 86452509 99049678 107177193 106989961 97974889 82931473 67307276
6516 67307276 54174517 44554187 37754382 32722257 28881968 25923780 23406988 21188898
6508 21188898 19147480 17367719 15862147 14508666 13340679 12269406 11310368 10472229
$$ packed form
6572C272859J69719J08901M9185l362Q5250J80268O0671p8617O9755K87042j066
6561D200605J81354J75733K36346J61417J33246K26108J64637L31617J70231K48266
6551F229560K97263J91490L24464M09444M09752M71865N23766M75925O16519O60013
6541A0610061N67900O73112Q37903R23806J046708J305362J398386J841814K050240
6532B1255292K512599K951610L517812M334648N017161N981426P238485R151291
6524F1960324J1438891J3053294J2597169Q127515j87232r015072j5043416j5624197
6516F7307276j3132759r620330o799805n032125l840289k958188k516792k218090
6508B1188898k041418j779761j505572j353481j167987j071273r59038q38139
$$ plain form
6500 10472229 10073720 9598430 9144938 8649327 8186533 7911276 7551327 7240931 6928071
6491 6928071 6611076 6365069 6105490 5881842 5697916 5461854 5191046 4930058 4732202 4466862
6481 4466862 4305507 4191062 4009931 3785181 3576957 3532164 3412970 3256970 3143510 3000644
6471 3000644 2914734 2826622 2732885 2675542 2572072 2525855 2372181 2577845 2597393 2334843 2368670
6460 2368670 2233268 2243662 2187703 2083772 2078688 2003496 2050458 1898208 1896105 1820326 1803066
6449 1803066 1758497 1836933 1882209 1717411 1691994 1709932 1602050 1551224 1579698 1521007 1408855
6438 1408855 1369749 1355788 1266694 1209923 1083091 1164786 1263401 1143970 1053823 989791 1069781
6427 1069781 1112727 1000677 1075968 1141951 1165706 1127811 1181062 1102695 1045901 1132761 1194005
$$ packed form
6500A0472229l98509m75290m53492m95611m62794k75257l59949l10396l12860
6491F928071l16995k46007k59579k23648j83926k36062k70808k60988j97856k65340
6481D466862j61355j14445j81131k24750k08224m4793j19194j56000j13460j42866
6471C000644q5910q8112r3737n7343j03470m6217j53674K05664J9548k62550L3827
6460B368670j35402J0394n5959j03931n084p5192M6962j52250k103p5779j7260
6449A803066m4569P8436M5276j64798k5417J7938j07882n0826K8474n8691j12152
6438A408855l9106j3961q9094n6771j26832Q1695R8615j19431r0147o4032P9990
6427A069781M2946j12050P5291O5983K3755l7895N3251p8367n6794Q6860O1244
$$ plain form
6416 1194005 1241472 1278266 1293847 1359212 1289637 1326997 1276595 1393225 1461775 1444126 1559344
6405 1559344 1637037 1778395 1941237 2151659 2254143 2383833 2685243 2945144 3112267 3224023
6395 3224023 3164833 3209050 3134994 2994625 2697837 2419450 2254217 2067571 1797373 1628452
6385 1628452 1608214 1469669 1290987 1206690 1275931 1122261 985457 935965 877260 808400 816563
6374 816563 754313 752322 753226 732295 651719 568294 630654 672426 656254 602909 514569 422531
6362 422531 495096 519741 467628 583590 526549 452936 575412 500203 400609 371313 417088
6351 417088 320530 359481 429503 484459 457181 398435 440225 380945 401036 401620 273453 250509
6339 250509 389958 495448 450752 393280 417645 426412 546080 477157 378060 425973 397468
$$ packed form
6416A194005M7467L6794J5581O5365o9575L7360n0402J16630O8550j7649J15218
6405A559344P7693J41358J62842K10422J02484J29690L01410K59901J67123J11756
6395C224023n9190M4217p4056j40369k96788k78387j65233j86646k70198j68921
6385A628452k0238j38545j78682q4297O9241j53670j36804m9492n8705o8860Q163
6374H16563o2250j991R04k0931q0576q3425O2360M1772j6172n3345q8340r2038
6362D22531P2565K4645n2113J15962n7041p3613J22476p5209r9594k9296M5775
6351D17088r6558L8951P0022N4956k7278n8746M1790n9280K0091N84j28167k2944
6339B50509J39449J05490m4696n7472K4365Q767J19668o8923r9097M7913k8505
$$ plain form
6328 397468 322303 210760 145067 166544 203124 275631 187114 172491 225062 263260 274859
6317 274859 176541 294914 340460 356495 299575 221832 270306 174451 270578 262316 154212
6306 154212 140544 188013 213923 249815 405819 370005 316078 167839 238447 303935 356135
6295 356135 301764 362892 411526 365184 424572 502290 544472 512954 467294 391938 405023 407300
6283 407300 368909 322551 239762 320611 181417 149811 191641 225173 353365 251924 262887
6272 262887 257749 163172 275556 292648 261693 306133 224157 240605 171374 31382 83844
6261 83844 223852 133753 172714 138332 93138 211021 248884 184835 122681 133276 163750
6250 163750 139775 144459 116935 118883 107276 158349 225841 146597 66524 42530 -56936 -10205
$$ packed form
6328C97468p5165j11543o5693K1477L6580P2507q8517j4623N2571L8198J1599
6317B74859r8318J18373M5546J6035n6920p7743M8474r5855R6127q262j08104
6306A54212j3668M7469K5910L5892J56004l5814n3927j48239P0608O5488N2200
6295C56135n4371O1128M8634m6342N9388P7718M2182l1518m5660p5356J3085K277
6283D07300l8391m6358q2789Q0849j39194l1606M1830L3532J28192j01441J0963
6272B62887n138r4577J12384J7092l0955M4440q1976J6448o9231j39992N2462
6261H3844J40008r0099L8961l4382m5194J17883L7863o4049o2154J0595L0474
6250A63750k3975M684k7524J948j1607N1073O7492p9244q0073k3994r9466M6731
$$ plain form
6238 -10205 78021 136721 164426 7085 21082 58621 86804 155758 183054 195405 222651 162946
6226 162946 105321 77350 37886 83541 203679 143992 83742 82438 101211 86901 135307 32230
6214 32230 -29250 35081 118583 95381 98040 266617 168990 124202 116475 155394 73458 48499
6202 48499 70258 28157 89187 -52011 -37999 37825 -17882 75744 3885 119169 189204
6191 189204 280681 251255 46697 99058 161531 81370 -34854 31683 62568 70919 114093
6180 114093 113517 134990 76961 105392 79185 123949 131442 77049 175896 298013 374630 304788
6168 304788 323030 339652 317764 296763 253680 322497 493002 623353 590335 610064 644892
6157 644892 570970 450217 377487 287412 186926 216025 266599 260571 325364 265812 241521
$$ packed form
6238a0205Q8226N8700K7705j57341J3997L7539K8183O8954K7296J2351K7246n9705
6226A62946n7625k7971l9464M5655J20138n9687o0250j304J8773j4310M8406j03077
6214C2230o1480O4331Q3502k3202K659J68577r7627m4788p727L8919q1936k4959
6202D8499K1759m2101O1030j41198J4012P5824n5707R3626p1859J15284P0035
6191A89204R1477k9426k04558N2361O2473q0161j16224O6537L0885Q351M3174
6180A14093n76K1473n8029K8431k6207M4764P493n4393R8847J22117P6617o9842
6168C04788J8242J6622k1888k1001m3083O8817J70505J30351l3018J9729L4828
6157F44892p3922j20753p2730r0075j00486K9099N0574o028O4793n9552k4291
$$ plain form
6146 241521 219255 139677 128379 52510 136961 151787 38085 63338 78879 51631 30734
6135 30734 82994 131519 179283 6971 56779 203073 158865 96050 57257 145858 91814
6124 91814 70435 72170 -19664 111162 83705 55030 107954 -3675 57380 26826 65978 139909
6112 139909 31413 -89471 -54557 88812 145833 59564 -6944 15393 83217 67071 61878
6101 61878 110225 171264 116011 125250 3519 124138 230777 176246 54624 132709 33197
6090 33197 32832 32913 -14665 -2645 80584 159902 -20891 15622 -59196 43013 -10179 -84401
6078 -84401 49839 81219 106755 75180 141604 -8255 36443 106714 10977 -40581 -125506
6067 -125506 -65448 55491 107816 162919 129221 80373 39139 25638 -17258 -72115 -14145
$$ packed form
6146B41521k2266p9578j1298p5869Q4451J4826j13702K5253J5541k7248k0897
6135C0734N2260M8525M7764j72312M9808J46294m4208o2815l8793Q8601n4044
6124I1814k1379J735r1834J30826k7457k8675N2924j11629O1055l0554L9152P3931
6112A39909j08496j20884L4914J43369N7021q6269o6508K2337O7824j6146n193
6101F1878M8347O1039n5253R239j21731J20619J06639n4531j21622P8085r9512
6090C3197l65Q1m7578J2020Q3229P9318j80793L6513p4818J02209n3192p4222
6078h4401J34240L1380K5536l1575O6424j49859M4698P0271r5737n1558q4925
6067a25506O0058J20939N2325N5103l3698m8848m1234j3501m2896n4857N7970
$$ plain form
6056 -14145 -23362 10298 49824 35632 30035 26309 -53582 -86923 -19443 16811 20076 44903 20767
6043 20767 6781 82100 200544 163509 68700 63878 -45375 -55857 61384 27400 39381
6032 39381 -38032 52108 98510 85501 60475 37140 -17512 -21620 84202 102648 90175 178898
6020 178898 201521 163856 168527 47798 15760 70224 73435 160574 74102 35681 120540 89635
6008 89635 -70603 -70528 -5366 50226 -38568 1550 31689 87355 114722 37640 103608 83566
5996 83566 29040 98926 39196 44402 153836 161920 88649 66282 68567 90387 187528 49588
5984 49588 84242 101865 25419 82257 180879 73928 40787 67162 23095 99716 61594 100639
5972 100639 149502 192376 88174 99423 80222 63232 17892 120702 165703 112387 40022
$$ packed form
6056a4145r217L3660L9526j4192n597l726p9891l3341O7480L6254L265K4827k4136
6043B0767j3986P5319J18444l7035r4809m822j09253j0482J17241l3984J1981
6032C9381p7413R0140M6402j3009k5026k3335n4652m108J05822J8446j2473Q8723
6020A78898K2623l7665M671j20729l2038N4464L211Q7139q6472l8421Q4859l0905
6008H9635j60238P5O5162N5592q8794M0118L0139N5666K7367p7082O5968k0042
5996H3566n4526O9886n9730N206J09434Q084p3271k2367K285K1820R7141j37940
5984D9588L4654J7623p6446N6838R8622j06951l3141K6375m4067P6621l8122L9045
5972A00639M8863M2874j04202J1249j9201j6990m5340J02810M5001n3316p2365
$$ plain form
5961 40022 -14105 90998 -6013 147535 216885 160170 84698 160351 220886 164689 39923
5950 39923 143213 126110 140495 105594 69456 84786 172469 91300 143806 199421 174448 90839
5938 90839 79460 119555 113139 144666 159624 193566 103114 82554 41771 174715 153977 168352
5926 168352 68727 106513 247134 180151 55870 94463 73446 119953 101291 119059 44777
5915 44777 -29304 140329 103559 178112 226088 178222 174025 226593 147455 75464 45582 236067
5903 236067 88020 10270 43876 95428 151383 120615 56507 -196 60244 70864 144203
5892 144203 89955 117320 119774 160355 208927 156218 11244 21352 11127 -11380 -48299 33564
5880 33564 218553 155435 114510 59509 81041 127300 154060 163745 78506 95530 18364 63294
$$ packed form
5961D0022n4127J05103r7011J53548O9350n6715p5472P5653O0535n6197j24766
5950C9923J03290j7103J4385l4901l6138J5330Q7683q1169N2506N5615k4973q3609
5938I0839j1379M0095o416L1527J4958L3942r0452k0560m0783J32944k0738J4375
5926A68352r9625L7786J40621o6983j24281L8593k1017M6507j8662J7768p4282
5915D4777p4081J69633l6770P4553M7976m7866m197N2568p9138p1991k9882J90485
5903B36067j48047p7750L3606N1552N5955l0768o4108n6703O0440J0620P3339
5892A44203n4248K7365K454M0581M8572n2709j44974J0108j0225k2507l6919Q1863
5880C3564J84989o3118m0925n5001K1532M6259K6760R685q5239J7024p7166M4930
$$ plain form
5868 63294 48933 26015 92323 38692 172593 129618 111731 142448 121427 249505 217373
5857 217373 150578 60229 112165 202744 189288 302639 213160 190531 143832 51597 -4875
5846 -4875 97793 99354 12282 159745 168789 148268 51416 130624 13945 35639 192318 98185
5834 98185 138644 259845 228965 149247 64920 139395 4951 23939 47880 75592 168898
5823 168898 153766 179560 250591 145714 145015 195151 147249 141818 103099 41209 88453 105991
5811 105991 64672 189118 155775 203302 214586 226698 221229 260839 138796 169944 121892
5800 121892 256355 202055 220040 261366 270082 213499 201640 193995 124800 157707 197008 156581
5788 156581 53079 68880 30646 192819 91698 137457 46120 99497 164382 133774 227360
$$ packed form
5868F3294j4361k2918O6308n3631J33901m2975j7887L0717k1021J28078l2132
5857B17373o6795r0349N1936R0579j3456J13351q9479k2629m6699r2235n6472
5846d875J02668J561q7072J47463R044k0521r6852P9208j16679K1694J56679r4133
5834I8185M0459J21201l0880p9718q4327P4475j34444J8988K3941K7712R3306
5823A68898j5132K5794P1031j04877o99N0136m7902n431l8719o1890M7244J7538
5811A05991m1319J24446l3343M7527J1284J2112n469L9610j22043L1148m8052
5800A21892J34463n4300J7985M1326Q716n6583j1859p645o9195L2907L9301m0427
5788A56581j03502J5801l8234J62173j01121M5759r1337N3377O4885l0608R3586
$$ plain form
5777 227360 212724 178015 159427 238365 164410 196102 141610 220269 174807 185322 232031 235925
5765 235925 145842 180316 231812 61530 181747 212767 215581 275535 215711 188694 202490
5754 202490 200122 184467 228369 277191 232581 186985 133410 87954 191524 204609 102640
5743 102640 242903 321463 134790 222446 300823 171680 252103 322515 302619 275360 364928
5732 364928 434101 304066 168089 225538 202223 245590 215386 230698 141209 227279 245083
5721 245083 310561 230615 199746 119288 130705 202402 268667 277438 382556 357369 295419 291959
5709 291959 309958 265209 174533 316678 280177 209410 185903 201032 156127 194366 320793
5698 320793 371415 362900 312318 250081 296425 318910 430448 475154 392732 410296 504292 472441
$$ packed form
5777B27360j4636l4709j8588P8938p3955L1692n4492P8659m5462J0515M6709L894
5765B35925r0083L4474N1496j70282J20217L1020K814N9954n9824k7017J3796
5754B02490k368j5655M3902M8822m4610m5596n3575m5456J03570J3085j01969
5743A02640J40263P8560j86673Q7656P8377j29143Q0423P0412j9896k7259Q9568
5732C64928O9173j30035j35977N7449k3315M3367l0204J5312q9489Q6070J7804
5721B45083O5478p9946l0869q0458J1417P1697O6265Q771J05118k5187o1950l460
5709B91959J7999m4749r0676J42145l6501p0767k3507J5129m4905L8239J26427
5698C20793N0622q515n0582o2237M6344K2485J11538M4706q2422J7564R3996l1851
$$ plain form
5686 472441 464441 382354 464501 483457 555659 504931 426315 431895 477741 463140 447997 451160
5674 451160 464848 464289 456849 456836 493213 364647 364862 357146 442343 432378 510074 486200 454410
5661 454410 546154 625916 572826 552443 712649 801097 952551 899062 707199 675644 671254
5650 671254 630475 698086 727783 754392 577886 459853 456595 592462 567598 488317 472055
5639 472055 535046 497744 506197 491862 476060 460368 492620 638007 628272 477624 443684 609191
5627 609191 680122 556605 494003 480001 397967 577209 481448 358126 469224 550867 455978
5616 455978 463565 509816 570860 566989 462402 461117 470383 483968 455501 450819 364216 472011
5604 472011 441679 384975 484902 344607 195538 225299 388576 459768 507056 469951 330702
$$ packed form
5686D72441q000q2087Q2147J8956P2202n0728p8616N580M5846j4601j5143L163
5674D51160J3688n59p440j3L6377j28566K15p716Q5197r965P7696k3874l1790
5661D54410R1744P9762n3090k0383J60206Q8448J51454n3489j91863l1555m390
5650F71254m0779O7611K9697K6609j76506j18033l258J35867k4864p9281j6262
5639D72055O2991l7302Q453j4335j5802j5692L2252J45387r735j50648l3940J65507
5627F09191P0931j23517o2602j4002q2034J79242r5761j23322J11098Q1643r4889
5616D55978P587M6251O1044l871j04587j285R266J3585k8467m682q6603J07795
5604D72011l0332n6704R9927j40295j49069K9761J63277P1192M7288l7105j39249
$$ plain form
5593 330702 506778 562574 562596 532178 448179 452510 497441 587725 637903 596813 609230 662983
5581 662983 731254 759095 654864 553514 743602 646039 608449 670765 680697 746864 685707
5570 685707 640980 682521 656007 586966 628598 749952 741739 739030 715161 766845 708815 678067
5558 678067 763531 666297 676708 756155 806204 703258 823235 841879 812262 843366 974364
5547 974364 1002200 960411 888623 1066351 1116373 1032478 1066982 1106906 952038 854887 995162
5536 995162 1058909 1095245 1047661 1039514 1119713 1027319 1020206 1143725 1052029 1109141 1137819 1146563
5524 1146563 1249289 1371650 1311062 1288610 1331345 1288240 1353370 1291216 1320827 1319391 1441242
5513 1441242 1498955 1498016 1467839 1426752 1407324 1477520 1395923 1329667 1378940 1494620 1539891 1417366
$$ packed form
5593C30702J76076N5796K2l0418q3999M331M4931R0284N0178m1090J2417N3753
5581F62983O8271K7841j04231j01350J90088r7563l7590O2316R932O6167o1157
5570F85707m4727M1541k6514o9041M1632J21354q213k709k3869N1684n8030l0748
5558F78067Q5464r7234J0411P9447N0049j02946J19977J8644k9617L1104J30998
5547I74364K7836m1789p1788J77728N0022q3895L4504L9924j54868r7151J40275
5536I95162O3747L6336m7584q147Q0199r2394p113J23519r1696N7112K8678Q744
5524A146563J02726J22361o0588k2452M2735m3105O5130o2154K9611j436J21851
5513A441242N7713r39l0177m1087j9428P0196q1597o6256M9273J15680M5271j22525
$$ plain form
5501 1417366 1512248 1541127 1601777 1501583 1544247 1575389 1690726 1714846 1566212 1553432 1663999
5490 1663999 1823088 1804236 1745840 1712348 1677285 1829166 1945487 1992181 1983854 2027497 2103581
5479 2103581 2187115 2091218 2089344 2211303 2314353 2212116 2253685 2340792 2397173 2329496 2346366
5468 2346366 2330306 2382251 2381019 2319258 2440950 2606361 2724990 2821737 2972844 2944707 3047394
5457 3047394 3082769 3257903 3350167 3342310 3396894 3490754 3504178 3640223 3874604 3935251 3961724
5446 3961724 4020607 4189470 4253919 4357916 4565368 4539636 4685430 4872428 4926180 4955441
5436 4955441 5103431 5298254 5390088 5571116 5695589 5650570 5907693 6168642 6241330 6349755
5426 6349755 6553350 6800780 6965104 7122304 7378590 7582670 7904895 8135247 8545250 8973583
$$ packed form
5501A417366R4882K8879O0650j00194M2664L1142J15337K4120j48634j2780J10567
5490A663999J59089j8852n8396l3492l5063J51881J16321M6694q327M3643P6084
5479B103581Q3534r5897j874J21959J03050j02237M1569Q7107N6381o7677J6870
5468B346366j6060N1945j232o1761J21692J65411J18629R6747J51107k8137J02687
5457C047394L5375J75134R2264p857N4584R3860J3424J36045K34381O0647K6473
5446C961724N8883J68863O4449J03997K07452k5732J45794J86998N3752K9261
5436D955441J47990J94823R1834J81028J24473m5019K57123K60949P2688J08425
5426F349755K03595K47430J64324J57200K56286K04080L22225K30352M10003M28333
$$ plain form
5416 8973583 9253490 9439595 9750793 10167931 10584119 11014037 11422005 11846721 12467491 12947971
5406 12947971 13609741 14447474 15136713 15992098 17038769 18015463 19175031 20491108 22000059
5397 22000059 23755670 25869379 28289328 31159040 34619414 38686758 43656861 49518396
5389 49518396 55908035 61903222 65507175 65304780 61950901 57315437 52837177 48512469
5381 48512469 44634554 41611958 39628907 38280316 37564683 37454049 37856538 38620109 39992249
5372 39992249 41784176 44039307 46724421 50352391 54813676 60294570 67066425 75384487
5364 75384487 85572659 97331741 108654644 115886823 114509028 104232085 89797929
5357 89797929 76334608 66001872 58253533 52457807 48111054 44645515 41923750 39671658
$$ packed form
5416H973583K79907J86105L11198M17138M16188M29918M07968M24716O20770M80480
5406A2947971O61770Q37733O89239Q55385J046671R76694J159568J316077J508951
5397B2000059J755611K113709K419949K869712L460374M067344M970103N861535
5389D9518396O389639N995187L603953k02395l353879m635464m478260m324708
5381D8512469l877915l022596j983051j348591p15633j10634M02489P63571J372140
5372C9992249J791927K255131K685114L627970M461285N480894O771855Q318062
5364G5384487J0188172J1759082J1322903P232179j377795j0276943j4434156
5357H9797929j3463321j0332736p748339n795726m346753l465539k721765k252092
$$ plain form
5349 39671658 37998973 36846065 36067960 35772145 35944268 36629189 37645702 39253966 41435635
5340 41435635 44328071 47830432 52178928 57104609 61955849 65553874 65600603 61321546
5332 61321546 54444961 47209020 40860554 35843640 32092592 29160711 26673847 24539091
5324 24539091 22717959 21327024 20067637 19007694 18184956 17507442 17041103 16727593 16751571
5315 16751571 16754600 16837690 17015745 17299952 17122849 16842701 16198926 15340840 14595821 14044318
5305 14044318 13538970 12933373 12515399 11820420 11192046 10604205 10193898 9845329 9447750
5296 9447750 9128619 8972407 8916226 8928643 8885720 8863339 8909126 9015946 9159816 9418266
5286 9418266 9718117 9928220 10064946 9952505 9646091 9422787 9306645 9245796 9259114 9097626
$$ packed form
5349C9671658j672685j152908p78105k95815J72123O84921J016513J608264K181669
5340D1435635K892436L502361M348496M925681M851240L598025M6729m279057
5332F1321546o876585p235941o348466n016914l751048k931881k486864k134756
5324B4539091j821132j390935j259387j059943q22738o77514m66339l13510K3978
5315A6751571L029Q3090J78055K84207j77103k80148o43775q58086p45019n51503
5305A4044318n05348o05597m17974o94979o28374n87841m10307l48569l97579
5296I447750l19131j56212n6181J2417m2923k2381M5787J06820J43870K58450
5286I418266K99851K10103J36726j12441l06414k23304j16142o0849J3318j61488
$$ plain form
5276 9097626 8672245 8026966 7467747 6884793 6677983 6364756 5965349 5687477 5407527 5229705
5266 5229705 5088153 4991497 4908760 4747425 4655938 4773987 4722019 4763440 4644964 4737566 4729629
5255 4729629 4640975 4805525 4685869 4658234 4893523 4796805 4479434 4342807 4118008 3874412
5245 3874412 3783831 3663267 3601128 3580150 3362516 3188049 3042054 3035913 3029724 2965773 2838375
5234 2838375 2893567 3086023 3044027 2977023 2961080 3030059 2848666 2762674 2870794 2896327 2803301
5223 2803301 2840647 2934567 2926318 2941113 2868979 3018791 3194643 3189668 3218888 3393992 3548220
5212 3548220 3503288 3544829 3577259 3559938 3629124 3641116 3497226 3356252 3398421 3369279 3286805
5201 3286805 3269500 3207681 3248073 3282812 3411194 3493364 3456477 3517614 3648519 3860086 3994105
$$ packed form
5276I097626m25381o45279n59219n82954k06810l13227l99407k77872k79950j77822
5266E229705j41552r6656q2737j61335r1487J18049n1968M1421j18476R2602p937
5255D729629q8654J64550j19656k7635K35289r6718l17371j36627k24799k43596
5245C874412r0581j20564o2139k0978k17634j74467j45995o141o189o3951j27398
5234B838375N5192J92456m1996o7004j5943O8979j81393q5992J08120K5533r3026
5223B803301L7346R3920q249J4795p2134J49812J75852m975K9220J75104J54228
5212C548220m4932M1541L2430j7321O9186J1992j43890j40974M2169k9142q2474
5201C286805j7305o1819M0392L4739J28382Q2170l6887O1137J30905K11567J34019
$$ plain form
5190 3994105 4107313 4215439 4518350 4745688 4831896 4906761 4958288 4730251 4585180 4451366
5180 4451366 4325491 4189242 4087609 4068400 4081017 3992577 4126600 4248665 4315523 4511798
5170 4511798 4604122 4730724 4758749 4981859 5403760 5952195 6345618 6903970 7557324 8340774
5160 8340774 9190771 10187524 11529720 13259275 14702031 15001168 13476060 11178941 9157147
5151 9157147 7632678 6828642 6234697 5681876 5339074 5080394 4792249 4634481 4520961
5142 4520961 4385105 4361491 4342310 4180875 4205196 4171113 4150333 4142592 4374932 4507654 4707415
5131 4707415 4866516 4816938 4544380 4378936 4143757 3870756 3875592 3721700 3726061 3702859 3740843
5120 3740843 3691643 3569124 3497622 3423378 3444836 3595697 3593666 3698131 3570999 3617243 3686436
$$ packed form
5190C994105J13208J08126L02911K27338Q6208P4865N1527k28037j45071j33814
5180D451366j25875j36249j01633j9209J2617q8440J34023J22065O6858J96275
5170D511798R2324J26602K8025K23110M21901N48435L93423N58352O53354P83450
5160H340774Q49997R96753J342196J729555J442756K99137j525108k297119k021794
5151I157147j524469q04036n93945n52821l42802k58680k88145j57768j13520
5142D520961j35856k3614j9181j61435K4321l4083k0780p741K32340J32722J99761
5131D707415J59101m9578k72558j65444k35179k73001M836j53892M361k3202L7984
5120C740843m9200j22519p1502p4244K1458J50861k031J04465j27132M6244O9193
$$ plain form
5109 3686436 3742302 3914428 4104008 4147475 4192394 4264704 4471187 4793168 4905679 4814238
5099 4814238 4651406 4569100 4691117 4678408 4644408 4599375 4610971 4741014 4904398 5153760
5089 5153760 5184065 5272501 5347736 5416100 5513718 5654971 5728978 5873446 6108299 6338842 6666396
5078 6666396 7027388 7332864 7733686 8110839 8601685 9050302 9194473 8976331 8715711 8438799
5068 8438799 8287455 8042177 8146615 8346420 8480765 8535283 8665090 8822400 8897663 9040420
5058 9040420 9164245 9341372 9565502 9960760 10323302 10597552 10912695 11332588 11875512 12521867
5048 12521867 13238584 14036853 14897495 15540952 16157061 16405177 16410245 16489704 16752991 17290803
5038 17290803 17961776 18668983 19608840 20686706 22048574 23773781 25423656 27497674 29956456
$$ packed form
5109C686436N5866J72126J89580M3467M4919P2310K06483L21981J12511r1441
5099D814238j62832q2306J22017j2709l4000m5033J1596J30043J63384K49362
5089E153760L0305Q8436P5235O8364R7618J41253P4007J44468K34853K30543L27554
5078F666396L60992L05476M00822L77153M90846M48617J44171k18142k60620k76912
5068H438799j51344k45278J04438J99805J34345N4518J29807J57310P5263J42757
5058I040420J23825J77127K24130L95258L62542K74250L15143M19893N42924O46355
5048A2521867P16717P98269Q60642O43457O16109K48116N068P9459K63287N37812
5038A7290803O70973P07207R39857J077866J361868J725207J649875K074018K458782
$$ plain form
5029 29956456 32841953 36135550 39883476 43981133 47917013 51248617 53108325 53117090 51853843
5020 51853843 50072934 48456897 46903071 45643518 44626207 43663521 42989915 42675328 42851622
5011 42851622 43847097 45263604 47197573 49780356 52934630 56749561 61182232 66230470
5003 66230470 72285993 78879259 85860836 92485609 97123176 97863166 93522629 85436299
4995 85436299 76369430 68087374 61163589 55605631 51258052 47651624 44733948 42303515
4987 42303515 40508341 39080660 38154152 37674233 37697348 38235213 39167520 40785832 42738341
4978 42738341 45195102 47888475 50895782 53959275 56568339 57639871 56694029 53291979
4970 53291979 48156270 42841027 38200995 34345703 31361201 29045100 27163358 25575804
$$ packed form
5029B9956456K885497L293597L747926M097657L935880L331604J859708Q765j263247
5020E1853843j780909j616037j553826j259553j017311r62686o73606l14587J76294
5011D2851622R95475J416507J933969K582783L154274L814931M432671N048238
5003F6230470O055523O593266O981577O624773M637567P39990m340537q086330
4995H5436299r066869q282056o923785n557958m347579l606428k917676k430433
4987D2303515j795174j427681r26508m79919K3115N37865R32307J618312J952509
4978D2738341K456761K693373L007307L063493K609064J071532r45842l402050
4970E3291979n135709n315243m640032l855292k984502k316101j881742j587554
$$ plain form
4962 25575804 24266117 22984612 21568132 20370767 19259599 18121173 17161410 16423842
4954 16423842 15817171 15127200 14645924 14165696 13664918 13318625 13129783 12950477 12783299
4945 12783299 12666048 12934755 12897190 12927920 13124626 13195539 13413109 13675838 13857365 13880533
4935 13880533 13867878 13424395 12850617 12282705 11564658 11024697 10434460 9974749 9588210 9269964
4925 9269964 9003618 8814268 8747216 8640661 8561143 8588323 8588927 8582894 8702036 8662655 8961737
4914 8961737 9010570 9208274 9423368 9466466 9565230 9523448 9365030 9122381 8644488 8216312
4904 8216312 7826571 7453743 7166213 6839479 6628849 6541660 6290689 6109056 5931125 5700809
4894 5700809 5595153 5617182 5532946 5329308 5335639 5347355 5417239 5470997 5611366 5698510 5668811
$$ packed form
4962B5575804j309687j281505j416480j197365j111168j138426r59763p37568
4954A6423842o06671o89971m81276m80228n00778l46293j88842j79306j67178
4945A2783299j17251K68707l7565L0730J96706P0913K17570K62729J81527K3168
4935A3880533j2655m43483n73778n67912p18047n39961n90237m59711l86539l18246
4925I269964k66346j89350o7052j06555p9518K7180O04o033J19142l9381K99082
4914H961737M8833J97704K15094M3098R8764m1782j58418k42649m77893m28176
4904H216312l89741l72828k87530l26734k10630q7189k50971j81633j77931k30316
4894E700809j05656K2029q4236k03638O331J1716O9884N3758J40369Q7144k9699
$$ plain form
4883 5668811 5879449 6165258 6279312 6281954 6402327 6327586 6196586 6225764 6344727 6566358
4873 6566358 6655070 6877541 7272825 7408406 7316852 7198154 7041335 7011352 7276984 7355732
4863 7355732 7546790 7975925 8419906 9070029 9892045 10783967 11781568 13002349 14412528
4854 14412528 15876822 17367159 18615109 19136228 19190349 18707301 17636612 16055929 14396936
4845 14396936 12737810 11266250 10019062 9023856 8394826 7882453 7626686 7256224 7069123
4836 7069123 6990871 6813948 6712203 6607976 6340498 6119875 5822564 5604839 5681616 5687752
4826 5687752 5451208 5380427 5222923 5130567 4951119 4568236 4338791 4198084 4009909 3888783
4816 3888783 3761906 3653542 3648022 3711500 3694004 3774225 3851950 3703521 3677092 3578656 3533593
$$ packed form
4883E668811K10638K85809J14054K642J20373p4741j31000K9178J18963K21631
4873F566358Q8712K22471L95284J35581r1554j18698j56819k9983K65632P8748
4863G355732J91058M29135M43981O50123Q22016Q91922R97601J220781J410179
4854A4412528J464294J490337J247950N21119N4121m83048j070689j580683j658993
4845A4396936j659126j471560j247188r95206o29030n12373k55767l70462j87101
4836G069123p8252j76923j01745j04227k67478k20623k97311k17725P6777O136
4826E687752k36544p0781j57504r2356j79448l82883k29445j40707j88175j21126
4816C888783j26877j08364n520O3478j7496Q0221P7725j48429k6429r8436m5063
$$ plain form
4805 3533593 3573219 3493969 3327897 3347201 3244298 3409932 3384021 3309394 3311621 3161322 2953843
4794 2953843 2817711 2610034 2593035 2574981 2417850 2269283 2263080 2115374 1994325 2012952
4784 2012952 1941655 1989571 2011130 1941881 1935849 1914677 1894399 1931211 1802592 1759440 1907700
4773 1907700 1843185 1932340 1846641 1808289 1795448 1698228 1789999 1770706 1697049 1638021 1567404
4762 1567404 1573937 1621001 1587842 1581054 1626285 1582812 1595082 1662271 1524385 1544692 1603661 1589151
4750 1589151 1494718 1511488 1442260 1496334 1529265 1378410 1404653 1541973 1493963 1526158 1526297
4739 1526297 1489016 1589699 1685266 1570694 1536739 1730431 1791961 1764782 1810201 1853374 1975875
4728 1975875 1996924 2010802 2045119 2097225 2080112 1864004 1737647 1622597 1501128 1544673 1661370
$$ packed form
4805C533593L9626p9250j66072J9304j02903J65634k5911p4627K227j50299k07479
4794B953843j36132k07677j6999j8054j57131j48567o203j47706j21049J8627
4784B012952p1297M7916K1559o9249o032k1172k0278L6812j28619m3152J48260
4773A907700o4515Q9155q5699l8352j2841r7220R1771j9293p3657n9028p0617
4762A567404O533M7064l3159o788M5231m3473J2270O7189j37886K0307N8969j4510
4750A589151r4433J6770o9228N4074L2931j50855K6243J37320m8010L2195J39
4739A526297l7281J00683R5567j14572l3955J93692O1530k7179M5419M3173J22501
4728A975875K1049J3878L4317N2106j7113k16108j26357j15050j21469M3545J16697
$$ plain form
4717 1661370 1579142 1569414 1426655 1431231 1492544 1498858 1509743 1492451 1582022 1593731 1673218 1594405
4705 1594405 1519491 1449723 1357390 1367773 1415599 1459590 1386300 1292898 1156116 1213806 1195523
4694 1195523 1174162 1151777 1069273 1101603 1134448 1136563 1169515 1237860 1166237 1144175 1175085 1256778
4682 1256778 1294107 1261219 1225176 1403602 1415749 1285685 1322817 1378101 1267181 1358197 1553664
4671 1553664 1588540 1557829 1520396 1450376 1361463 1328129 1299511 1174990 1141322 1015986 1055555
4660 1055555 1027254 962326 1013683 1106008 1011214 995483 989131 901270 980431 1001214 1008457 1040984
4648 1040984 1043167 1061233 1118520 1128702 1061000 1085556 962118 856430 1010402 987318 888673
4637 888673 961355 1057272 1083985 1039060 1003336 1094360 1002068 922455 993027 982644 877456
$$ packed form
4717A661370q2228r728j42759M576O1313O314J0885j7292Q9571J1709P9487p8813
4705A594405p4914o9768r2333J0383M7826M3991p3290r3402j36782N7690j8283
4694A195523k1361k2385q2504L2330L2845K115L2952O8345p1623k2062L0910Q1693
4682A256778L7329l2888l6043J78426J2147j30064L7132N5284j10920R1016J95467
4671A553664L4876l0711l7433p0020q8913l3334k8618j24521l3668j25336L9569
4660A055555k8301o4928N1357R2325r4794j5731o352q7861P9161K0783P243L2527
4648A040984K183J8066N7287J0182o7702K4556j23438j05688J53972k3084r8645
4637H88673P2682R5917K6713m4925l5724R1024r2292p9613P0572j0383j05188
$$ plain form
4626 877456 947303 956539 952142 976134 1025256 998934 1099644 1130952 1091113 1118705 1116538 999367
4614 999367 1049194 1107866 1123229 1165899 1137514 1155529 1186589 1189917 1228508 1216222 1270411 1254680
4602 1254680 1287297 1370931 1348802 1288713 1395030 1246866 1269965 1301089 1209857 1193003 1304551
4591 1304551 1498528 1427080 1419178 1439835 1473294 1505046 1524184 1412523 1351067 1337721 1437462
4580 1437462 1497078 1438787 1479071 1537505 1697824 1717780 1643419 1588637 1640881 1560850 1571614
4569 1571614 1689709 1687634 1715407 1720414 1786967 1777577 1725267 1649663 1788874 1807207 1790227 1720353
4557 1720353 1648398 1823468 1896626 1896485 1888375 1927555 1894976 1946441 1966259 2008021 2026590 2104062
4545 2104062 2178666 2255044 2269461 2266938 2399180 2475404 2410748 2448709 2581314 2562592 2622336
$$ packed form
4626H77456O9847R236m397K3992M9122k6322J00710L1308l9839K7592k167j17171
4614I99367M9827N8672J5363M2670k8385J8015L1060L328L8591j2286N4189j5731
4602A254680L2617Q3634k2129o0089J06317j48164K3099L1124r1232j6854J11548
4591A304551J93977p1448p902K0657L3459L1752J9138j11661o1456j3346R9741
4580A437462N9616n8291M0284N8434J60319J9956p4361n4782N2244q0031J0764
4569A571614J18095k075K7773N007O6553r390n2310p5604J39211J8333j6980o9874
4557A720353p1955J75070P3158j41q110L9180l2579N1465J9818M1762J8569P7472
4545B104062P4604P6378J4417k523J32242P6224o4656L7961J32605j8722N9744
$$ plain form
4534 2622336 2640264 2669731 2828658 2858881 2753120 2809020 2764632 2793718 2844169 2969932 3111045
4523 3111045 3099372 3161261 3194465 3300814 3451141 3494172 3644821 3755778 3958691 3971003
4513 3971003 4135794 4212617 4127217 4217795 4272276 4245150 4410332 4521488 4532986 4699829 4765090
4502 4765090 4825479 4887002 5016860 5103324 5283839 5412957 5455351 5685359 5714180 5820980
4492 5820980 5918697 6041811 6269853 6496412 6584086 6710722 6853847 7003638 7145057 7363530
4482 7363530 7505943 7776937 8054896 8415309 8785314 9069837 9526236 10031516 10394747 10812220
4472 10812220 11285453 11838155 12363340 12825329 13425087 14143205 15063435 16032450 17066355
4463 17066355 18049318 19138801 20402750 21932990 23703103 25866840 28638841 31939825
$$ packed form
4534B622336J7928K9467J58927L0223j05761N5900m4388K9086N0451J25763J41113
4523C111045j1673O1889L3204J06349J50327M3031J50649J10957K02913J2312
4513C971003J64791P6823q5400R0578N4481k7126J65182J11156J1498J66843O5261
4502D765090O0389O1523J29858Q6464J80515J29118M2394K30008K8821J06800
4492E820980R7717J23114K28042K26559Q7674J26636J43125J49791J41419K18473
4482G363530J42413K70994K77959L60413L70005K84523M56399N05280L63231M17473
4472A0812220M73233N52702N25185M61989N99758P18118R20230R69015J033905
4463A7066355R82963J089483J263949J530240J770113K163737K772001L300984
$$ plain form
4455 31939825 35862277 40489231 45925053 52364715 60169374 69901361 82961012 99151831
4447 99151831 117159241 131909572 135486342 126537417 107385891 86057862 68710762
4440 68710762 56810594 48795934 42766367 38409266 34816359 31729353 29016584 26701907
4432 26701907 24643120 23037944 21683794 20510651 19671350 18809380 18146634 17743088 17354674
4423 17354674 17096942 16802149 16655419 16505018 16450350 16495793 16569763 16644349 16936728 17083517
4413 17083517 17448723 17743002 18030144 18432612 18912756 19541142 20114122 20893350 21730876
4404 21730876 22873872 24264843 26192312 28314392 31050024 34422758 38517731 43415864
4396 43415864 49494780 56673879 65737416 77363711 91912625 108264737 122249044 127084208
$$ packed form
4455C1939825L922452M626954N435822O439662P804659R731987J3059651J6190819
4447I9151831J8007410J4750331L576770q948925j9151526k1328029j7347100
4440F8710762j1900168q014660o029567m357101l592907l087006k712769k314677
4432B6701907k058787j605176j354150j173143q39301q61970o62746m03546l88414
4423A7354674k57732k94793j46730j50401n4668M5443P3970P4586K92379J46789
4413A7083517L65206K94279K87142M02468M80144O28386N72980P79228Q37526
4404B1730876J142996J390971J927469K122080K735632L372734M094973M898133
4396D3415864O078916P179099R063537J1626295J4548914J6352112J3984307M835164
$$ plain form
4388 127084208 123466881 112511448 94587684 75993243 60941888 50819993 43627350
4381 43627350 38196362 33839673 30295632 27345669 24817503 22677664 20782006 19121392
4373 19121392 17699046 16464124 15552593 14731240 14010060 13378460 12853794 12126144 11597852
4364 11597852 11086862 10610088 10342157 9893754 9479536 9118142 8749167 8463129 8150073
4355 8150073 7946875 7729062 7379722 7065340 6802049 6627801 6410672 6185547 5947840 5827551
4345 5827551 5598604 5475671 5374809 5270703 5149310 4973876 4827410 4568081 4451816 4389900
4335 4389900 4252776 4318387 4370587 4248106 4100249 4131829 4093634 3918891 3963405 3860807
4325 3860807 3756263 3616517 3627779 3510463 3467898 3369250 3380734 3437069 3450068 3296009 3166544
$$ packed form
4388A27084208l617327j0955433j7923764j8594441j5051355j0121895p192643
4381D3627350n430988m356689l544041k949963k528166k139839j895658j660614
4373A9121392j422346j234922r11531q21353p21180o31600n24666p27650n28292
4364A1597852n10990m76774k67931m48403m14218l61394l68975k86038l13056
4355H150073k03198k17813l49340l14382k63291j74248k17129k25125k37707j20289
4345E827551k28947j22933j00862j04106j21393j75434j46466k59329j16265o1916
4335D389900j37124O5611N2200j22481j47857L1580l8195j74743M4514j02598
4325C860807j04544j39746J1262j17316m2565r8648J1484N6335J2999j54059j29465
$$ plain form
4314 3166544 3168392 3183948 3072988 2947408 2867772 2913794 2916147 2671150 2652347 2726628 2624556
4303 2624556 2516967 2428846 2390772 2464216 2416450 2367860 2400999 2366302 2307840 2391570 2311410
4292 2311410 2341466 2328846 2269703 2240210 2224798 2166879 2224479 2179654 2114432 2279950 2374228
4281 2374228 2279707 2187469 2158253 2147578 2132364 2203489 2276435 2287165 2271213 2164625 2178497
4270 2178497 2011121 2001883 2012465 1945845 1928334 2043951 2008087 1907672 1877403 1986760 1952235
4259 1952235 1824604 1964391 2000089 1959809 1945329 1887033 1961436 2015426 1972318 1935945 1899881
4248 1899881 1840738 1782157 1805722 1833969 1983845 1942279 1895300 1872264 1737511 1908472 1924496
4237 1924496 1967774 2081028 2050097 1988787 1852116 1957944 1912928 2054176 1911712 1897702
$$ packed form
4314C166544J848J5556j10960j25580p9636M6022K353k44997j8803P4281j02072
4303B624556j07589q8121l8074P3444m7766m8590L3139l4697n8462Q3730q0160
4292B311410L0056j2620n9143k9493j5412n7919N7600m4825o5222J65518R4278
4281B374228r4521r2238k9216j0675j5214P1125P2946J0730j5952j06588J3872
4270B178497j67376r238J0582o6620j7511J15617l5864j00415l0269J09357l4525
4259A952235j27631J39787L5698m0280j4480n8296P4403N3990m3108l6373l6064
4248A899881n9143n8581K3565K8247J49876m1566m6979k3036j34753J70961J6024
4237A924496M3278J13254l0931o1310j36671J05828m5016J41248j42464j4010
$$ plain form
4227 1897702 1864080 1916660 1921676 2029295 2052868 2042485 2029853 1935285 2004190 2097735 2013142
4216 2013142 2008078 2030864 2130227 2160964 2190575 2082204 2127979 2145497 2031641 2056602 2029605
4205 2029605 2113102 2115154 2093782 2089537 2129452 2189147 2198901 2152409 2163145 2228522 2304938 2194990
4193 2194990 2185484 2226335 2204089 2148626 2173502 2248116 2440289 2363706 2395285 2460094 2486088
4182 2486088 2466058 2341846 2420322 2433876 2510257 2565778 2520041 2520948 2590300 2723695 2803694
4171 2803694 2943138 3095399 3143852 3245030 3389105 3554296 3744885 3949277 4339336 4719141
4161 4719141 4767971 4761315 4629807 4244893 3955828 3724829 3522027 3319050 3329409 3357028
4151 3357028 3147587 3142463 3077808 2989670 2994425 2829433 2950561 2930700 2952542 2971062 2845558
$$ packed form
4227A897702l3622N2580N016J07619K3573j0383j2632r4568O8905R3545q4593
4216B013142n064K2786R9363L0737K9611j08371M5775J7518j13856K4961k6997
4205B029605Q3497K052k1372m245L9915N9695R754m6492J0736O5377P6416j09948
4193B194990r506M0851k2246n5463K4876P4614J92173p6583L1579O4809K5994
4182B486088k0030j24212P8476J3554P6381N5521m5737R07O9352J33395P9999
4171B803694J39444J52261M8453J01178J44075J65191J90589K04392L90059L79805
4161D719141M8830o656j31508l84914k89065k30999k02802k02977J0359K7619
4151C357028k09441n124o4655q8138M755j64992J21128j9861K1842J8520j25504
$$ plain form
4140 2845558 2843130 2985957 2868091 2889853 2959916 3056264 3097513 2996114 3108468 3152944 3064569
4129 3064569 3085580 3031299 2969393 3067709 3042989 3119258 3221932 3182991 3145641 3177169 3408350
4118 3408350 3486889 3438118 3332875 3353326 3460183 3566866 3623127 3656158 3679864 3788372 3795257
4107 3795257 4024064 4104791 4257821 4269496 4211641 4195961 4230958 4116398 4037810 4024792 4108293
4096 4108293 4112923 3962104 3979694 4050156 4113104 3971071 4020233 4005361 4082423 4165651 4261651
4085 4261651 4172510 4173910 4213578 4238000 4190883 4220337 4248117 4251320 4253149 4312716 4377259 4411645
4073 4411645 4532969 4651974 4614474 4671177 4673086 4686294 4702531 4897611 4888665 4990990 5001181
4062 5001181 4906277 5132329 5244139 5217879 5350613 5392956 5367329 5313254 5365827 5511916 5550235
$$ packed form
4140B845558k428J42827j17866K1762P0063R6348M1249j01399J12354M4476q8375
4129C064569K1011n4281o1906R8316k4720P6269J02674l8941l7350L1528K31181
4118C408350P8539m8771j05243K0451J06857J06683N6261L3031K3706J08508O885
4107C795257K28807Q0727J53030J1675n7855j5680L4997j14560p8588j3018Q3501
4096D108293M630j50819J7590P0462O2948j42033M9162j4872P7062Q3228R6000
4085D261651q9141J400L9668K4422m7117K9454K7780L203J829N9567O4543L4386
4073D411645J21324J19005l7500N6703J909J3208J6237J95080q946J02325J0191
4062E001181r4904K26052J11810k6260J32734M2343k5627n4075N2573J46089L8319
$$ plain form
4051 5550235 5574781 5675142 5710994 5775315 5878139 6031251 6040675 6002039 6077175 6301047 6363792
4040 6363792 6302945 6300745 6423939 6496905 6635765 6746131 6747585 6803840 6889572 7030382 7116723
4029 7116723 7277132 7321841 7460711 7663468 7841219 7972099 7987304 8029131 8085018 8144647
4019 8144647 8144864 8237125 8253726 8286692 8349652 8467335 8550907 8676161 8779502 8887971 8994955
4008 8994955 9035817 9227301 9306671 9373820 9609814 9841522 9942786 10207787 10454439 10616124
3998 10616124 10927297 11097842 11207042 11494524 11579380 11811116 12030813 12025760 12016438 12177284
3988 12177284 12270393 12328082 12379345 12411593 12519655 12541086 12740512 12838569 12993098 13222798
3978 13222798 13378509 13510967 13633271 13916823 14105620 14345784 14682200 14994989 15273366
$$ packed form
4051E550235K4546J00361L5852O4321J02824J53112R424l8636P5136K23872O2745
4040F363792o0847k200J23194P2966J38860J10366J454N6255Q5732J40810Q6341
4029G116723J60409M4709J38870K02757J77751J30880J5205M1827N5887N9629
4019H144647K17R2261J6601L2966O2960J17683Q3572J25254J03341J08469J06984
4008H994955M0862J91484P9370O7149K35994K31708J01264K65001K46652J61685
3998A0616124L11173J70545J09200K87482Q4856K31736K19697n053r322J60846
3988A2177284R3109N7689N1263L2248J08062K1431J99426R8057J54529K29700
3978A3222798J55711J32458J22304K83552J88797K40164L36416L12789K78377
$$ plain form
3969 15273366 15542251 15770875 16019467 16184679 16491646 16729640 17099431 17608608 17799422
3960 17799422 17977176 18202282 18359117 18478120 18657335 18983086 19154354 19360757 19689079
3951 19689079 19992301 20229404 20478511 20799127 21066770 21351733 21803522 22111946 22449260
3942 22449260 22750363 23248204 23690551 24048024 24569155 25161615 25819834 26698588 27446061
3933 27446061 28427217 29379539 30445191 31460011 32630922 33864237 35193869 36735485
3925 36735485 38404370 40116877 42176608 44306703 46708833 49350912 52169881 55124073
3917 55124073 58610226 62611876 67693187 73525456 80555606 88769760 98756866 110732922
3909 110732922 124979309 141665527 161903329 187362290 219563715 259322136 303522659
$$ packed form
3969A5273366K68885K28624K48592J65212L06967K37994L69791N09177J90814
3960A7799422J77754K25106J56835J19003J79215L25751J71268K06403L28322
3951A9689079L03222K37103K49107L20616K67643K84963M51789L08424L37314
3942B2449260L01103M97841M42347L57473N21131N92460O58219Q78754P47473
3933B7446061R81156R52322J065652J014820J170911J233315J329632J541616
3925C6735485J668885J712507K059731K130095K402130K642079K818969K954192
3917E5124073L486153M001650N081311N832269P030150Q214154R987106J1976056
3909A10732922J4246387J6686218K0237802K5458961L2201425L9758421M4200523
$$ plain form
3902 303522659 340168102 348939177 322766703 272363772 220464374 179507698 150551712
3895 150551712 129734742 114103025 101984649 92153186 83890971 76832870 70632143 65450323
3887 65450323 60949806 56947156 53390402 50240628 47584877 45470838 43739707 42262305
3879 42262305 40988250 39732231 38616874 37802567 36957183 36394206 36019035 35592807 35378303
3870 35378303 35329339 35524925 35834964 36124253 36273578 36194215 35893665 35036327 33948277 33172749
3860 33172749 32776912 32789603 33172701 33698960 33897814 33830053 33463197 32693813 31680782 30535936
3850 30535936 29644976 28953238 28654383 28539052 28876707 29639874 30567533 32003259 33770623
3841 33770623 36196579 38606210 40524571 41887457 42586662 41444792 39020465 36295954
$$ packed form
3902C03522659L6645443Q771075k6172474n0402931n1899398m0956676k8955986
3895A50551712k0816970j5631717j2118376r831463q262215p058101o200727n181820
3887F5450323m500517m002650l556754l149774k655751k114039j731131j477402
3879D2262305j274055j256019j115357q14307q45384n62977l75171m26228k14504
3870C5378303m8964J95586L10039K89289J49325p9363l00550q57338j088050p75528
3860C3172749l95837J2691L83098N26259J98854o7761l66856p69384j013031j144846
3850C0535936q90960o91738k98855j15331L37655P63167R27659J435726J767364
3841C3770623K425956K409631J918361J362886O99205j141870k424327k724511
$$ plain form
3833 36295954 33516647 30582113 28264705 26504374 25281295 24350570 23625490 23033460 22812141
3824 22812141 22845100 23054638 23532524 23975054 23680243 22285556 20616897 19124642 18193912
3815 18193912 17522164 16732602 16167297 15686896 15286122 14953500 14600333 14282482 13867923
3806 13867923 13477275 13255209 13068792 12982429 12927363 12799716 12604250 12533234 12310223 12130805
3796 12130805 12072713 11952312 11806100 11696485 11605341 11611453 11520721 11434567 11285127 11223589 11252876
3785 11252876 11298976 11419959 11435319 11394217 11429931 11531991 11674332 11715484 11680092 11664646 11735373
3774 11735373 11809683 11801570 11757694 11766240 11943721 11994225 11806706 11781355 11740134 11851730 12020318
3763 12020318 12045452 12156579 12296823 12536992 12659960 12841708 13098731 13478048 13783368 14025835
$$ packed form
3833C6295954k779307k934534k317408j760331j223079r30725p25080n92030k21319
3824B2812141L2959K09538M77886M42530k94811j394687j668659j492255r30730
3815A8193912o71748p89562n65305m80401m00774l32622l53167l17851m14559
3806A3867923l90648k22066j86417q6363n5066j27647j95466p1016k23011j79418
3796A2130805n8092j20401j46212j09615r1144O112r0732q6154j49440o1538K9287
3785A1252876M6100J20983J5360m1102L5714J02060J42341M1152l5392j5446P0727
3774A1735373P4310q113m3876Q546J77481N0504j87519k5351m1221J11596J68588
3763A2020318K5134J11127J40244K40169J22968J81748K57023L79317L05320K42467
$$ plain form
3753 14025835 14380644 14865569 15167039 15713728 16312021 17052596 17892269 18907176 20083472
3744 20083472 21536699 23164399 25159606 27403093 30090153 32899529 35289996 35912007
3736 35912007 34512735 32448979 30601053 29542243 28914022 28598138 28503505 28456800 28259817
3727 28259817 27719083 26893713 26137182 25486409 25202167 25120505 25053393 25154218 25569206 25892648
3717 25892648 26076263 25875929 24793092 23501263 22354226 21197049 20025171 18992659
3709 18992659 18163787 17591779 17115894 16917617 16774035 16743141 16894677 17307550 17750986 18198166
3699 18198166 19079664 20176379 21676928 23580988 25863510 27423041 27557682 26712368 26065253
3690 26065253 26396377 27685795 29828765 32284318 33396993 31695538 27873054 23849035
$$ packed form
3753A4025835L54809M84925L01470N46689N98293P40575Q39673J014907J176296
3744B0083472J453227J627700J995207K243487K687060K809376K390467O22011
3736C5912007j399272k063756j847926j058810o28221l15884r4633m6705j96983
3727B8259817n40734q25370p56531o50773k84242q1662o7112J00825M14988L23442
3717B5892648J83615k00334j082837j291829j147037j157177j171878j032512
3709A8992659q28872n72008m75885j98277j43582l0894J51536M12873M43436M47180
3699A8198166Q81498J096715J500549J904060K282522J559531J34641q45314o47115
3690B6065253L31124J289418K142970K455553J112675j701455l822484m024019
$$ plain form
3682 23849035 20683846 18515860 16803537 15383616 14295339 13515175 12836893 12242681 11734464
3673 11734464 11350282 10800455 10429997 10078317 9755079 9511142 9161031 9046437 8825320
3664 8825320 8709142 8587818 8451130 8386834 8206363 8134815 8182408 8088205 8032229 7940695 7979998
3653 7979998 7893477 7816440 7863863 7833398 7862942 7899575 8015278 8057073 8151536 8414292 8725641
3642 8725641 8922342 9101759 9244435 9310097 9102605 8866406 8676874 8418459 8289151 8294954
3632 8294954 8487228 8533396 8408379 8409985 8533298 8643316 8788393 8945187 9003682 9090656
3622 9090656 9192654 9236091 9323681 9470578 9678563 9865081 10081464 10190268 10271214 10488613
3612 10488613 10673893 10818199 11012161 11225842 11561724 11902764 12207497 12649344 13129639
$$ packed form
3682B3849035l165189k167986j712323j419921j088277p80164o78282n94212n08217
3673A1734464l84182n49827l70458l51680l23238k43937l50111j14594k21117
3664H825320j16178j21324j36688o4296j80471p1548M7593r4203n5976r1534L9303
3653G979998q6521p7037M7423l0465K9544L6633J15703M1795R4463K62756L11349
3642H725641J96701J79417J42676O5662k07492k36199j89532k58415j29308N803
3632H294954J92274M6168j25017J606J23313J10018J45077J56794N8495Q6974
3622I090656J01998M3437Q7590J46897K07985J86518K16383J08804Q0946K17399
3612A0488613J85280J44306J93962K13681L35882L41040L04733M41847M80295
$$ plain form
3603 13129639 13503194 14081000 14707760 15340584 15935886 16700602 17672681 18736573 20000912
3594 20000912 21494504 23218244 25239991 27532301 30152675 33207363 36795203 40663892
3586 40663892 43829391 45013123 43888943 41228021 38070580 34998555 32281785 30256809
3578 30256809 28534668 27172715 26132622 25457972 25021017 24834451 24977605 25134071 25390146
3569 25390146 25948756 26770201 27730589 28716577 30001092 31508385 33331065 35203240 37392000
3560 37392000 39696604 41895945 43720668 45127566 46204228 46610378 46335728 45440536 44243576
3551 44243576 42883505 41623285 40396683 39455819 38613657 37856443 37250423 37004849 37043404
3542 37043404 37474852 38116157 39005731 39990951 41296488 42795667 44394788 46315443 48321122
$$ packed form
3603A3129639L73555N77806O26760O32824N95302P64716R72079J063892J264339
3594B0000912J493592J723740K021747K292310K620374L054688L587840L868689
3586D0663892L165499J183732j124180k660922l157441l072025k716770k024976
3578C0256809j722141j361953j040093o74650m36955j86566J43154J56466K56075
3569B5390146N58610Q21445R60388R85988J284515J507293J822680J872175K188760
3560C7392000K304604K199341J824723J406898J076662M06150k74650q95192j196960
3551D4243576j360071j260220j226602r40864q42162p57214o06020k45574L8555
3542C7043404M31448O41305Q89574R85220J305537J499179J599121J920655K005679
$$ plain form
3533 48321122 50655729 53075975 55502866 57743359 59990270 61608519 62432407 62526919 61925949
3524 61925949 60484261 58468012 56265350 53709710 51028319 48227877 45739877 43804711
3516 43804711 42474009 41336684 40605630 40245956 39893264 39671241 39741413 40052727 40594672
3507 40594672 41498243 42724911 43928723 45384622 46953876 48426720 49717216 50659757
3499 50659757 51152051 50947357 49828102 47836039 45118396 41890975 38690168 35626006
3491 35626006 32890088 30708390 29032435 27563715 26207565 25107724 24202040 23469207
3483 23469207 22969082 22555353 22374480 22212275 22220366 22256869 22303247 22276519 22599451 22937895
3473 22937895 23127190 22955893 22597090 21946326 20774642 19521896 18205891 17176802 16064774
$$ packed form
3533D8321122K334607K420246K426891K240493K246911J618249Q23888R4512o00970
3524F1925949j441688k016249k202662k555640k681391k800442k488000j935166
3516D3804711j330702j137325p31054l59674l52692k22023P0172L11314N41945
3507D0594672R03571J226668J203812J455899J569254J472844J290496R42541
3499E0659757M92294k04694j119255j992063k717643l227421l200807l064162
3491C5626006k735918k181698j675955j468720j356150j099841r05684p32833
3483B3469207n00125m13729j80873j62205Q091L6503M6378k6728L22932L38444
3473B2937895J89295j71297l58803o50764j171684j252746j316005j029089j112028
$$ plain form
3464 16064774 15244618 14604824 13893102 13525923 13117371 12698067 12258065 12099303 11935146
3455 11935146 11705299 11590792 11374124 11347840 11243630 11157799 10897997 10717798 10633277 10574856
3445 10574856 10578420 10339239 10288176 10337861 10413267 10502541 10517048 10432969 10412834 10600062 10586628
3434 10586628 10596539 10802595 10903741 11113676 11272231 11413894 11534514 11628502 11847243 11997009
3424 11997009 12279350 12433147 12538341 12614971 12876493 13011927 13364456 13723177 13860644 14206148
3414 14206148 14619249 15006218 15461029 15906010 16369239 17135224 17586682 17952790 18203827
3405 18203827 18208863 18418640 18758713 19165782 19619905 20285127 20835741 21308897 21605762 21556123
3395 21556123 21561145 21648582 21853626 22295830 22758798 23288981 23931286 24704824 25702729 26735833
$$ packed form
3464A6064774q20156o39794p11722l67179m08552m19304m40002j58762j64157
3455A1935146k29847j14507k16668k6284j04210q5831k59802j80199q4521n8421
3445A0574856L564k39181n1063M9685P5406Q9274J4507q4079k0135J87228j3434
3434A0586628R911K06056J01146K09935J58555J41663J20620R3988K18741J49766
3424A1997009K82341J53797J05194P6630K61522J35434L52529L58721J37467L45504
3414A4206148M13101L86969M54811M44981M63229P65985M51458L66108K51037
3405A8203827N036K09777L40073M07069M54123O65222N50614M73156K96865m9639
3395B1556123N022Q7437K05044M42204M62968N30183O42305P73538R97905J033104
$$ plain form
3385 26735833 27833934 28938479 30054681 31078070 31882162 32676866 33566540 34464907 35430889
3376 35430889 36264368 37246979 38515915 39706493 40673142 41405721 41607313 41417617 40935493
3367 40935493 40395684 40107650 39994290 40342136 40959686 41767231 42692475 43520857 44241235
3358 44241235 45000453 45764640 46574966 47714819 49079008 50389463 51961076 53589969 55238605
3349 55238605 57022938 59002028 61228175 63379281 65041124 66212993 66814261 66688787
3341 66688787 66097483 65052249 63816354 62788725 61918869 61313463 61008401 60883814 60878182
3332 60878182 60870494 61279531 61805986 62286514 62960990 64119299 66109924 68616533 71550440
3323 71550440 74827666 78106823 81138327 83779640 85426896 86328169 86801244 87332538 87873344
$$ packed form
3385B6735833J098101J104545J116202J023389Q04092P94704Q89674Q98367R65982
3376C5430889Q33479R82611J268936J190578R66649P32579K01592j89696m82124
3367D0935493n39809k88034j13360L47846O17550Q07545R25244Q28382P20378
3358D4241235P59218P64187Q10326J139853J364189J310455J571613J628893J648636
3349E5238605J784333J979090K226147K151106J661843J171869O01268j25474
3341F6688787n91304j045234j235895j027629q69856o05406l05062j24587n632
3332F0878182p688M09037N26455M80528O74476J158309J990625K506609K933907
3323G1550440L277226L279157L031504K641313J647256R01273M73075N31294N40806
$$ plain form
3314 87873344 87836486 87126411 85971734 84587570 83288775 82535896 82126297 82252024 82231347
3305 82231347 82168096 81979332 81488798 80982642 80691650 80641237 80493226 79907296 78965907 78185003
3295 78185003 77432005 76821135 76004585 74797489 73265046 71866080 70956553 70485128 70389942
3286 70389942 70356777 70623626 70867656 71014328 70829713 69953190 68244555 65973281 63439232
3277 63439232 61084582 59275646 58054441 57016613 55888225 54380916 52998156 51852818
3269 51852818 51016207 50752706 50657245 50509644 50326775 50181066 50444487 50912468 51476948 52213993
3259 52213993 53156284 54074330 54641009 54596957 53964962 52848678 51290225 49903142 48555973
3250 48555973 47128798 45342794 43429726 41704290 40357928 39226753 38474826 38018830
$$ packed form
3314H7873344l6858p10075j154677j384164j298795p52879m09599J25727k0677
3305H2231347o3251j88764m90534n06156k90992n0413j48011n85930r41389p80904
3295G8185003p52998o10870q16550j207096j532443j398966r09527m71425r5186
3286G0389942l3165K66849K44030J46672j84615q76523j708635k271274k534049
3277F3439232k354650j808936j221205j037828j128388j507309j382760j145338
3269E1852818q36611k63501r5461j47601j82869j45709K63421M67981N64480P37045
3259E2213993R42291R18046N66679m4052o31995j116284j558453j387083j347169
3250D8555973j427175j786004j913068j725436j346362j131175p51927m55996
$$ plain form
3242 38018830 37659255 37661794 37823837 37903885 37801433 37268777 36473879 35395075 34271568 33396245
3232 33396245 32882300 32374418 32003773 31627195 30946898 30132176 29417525 28709524 28245204
3223 28245204 28179997 28241463 28314422 28306924 28038422 27579866 27228503 26686937 25871821 24959655
3213 24959655 24024166 23015113 21928608 20922651 20061441 19350282 18743178 18321587 18016028
3204 18016028 17739312 17533879 17212485 16898758 16597348 16063136 15498721 15127143 14683683
3195 14683683 14221065 13955344 13860975 13879142 13955544 13847605 13763008 13786997 13533814 13003976
3185 13003976 12654797 12356804 11996040 11674972 11315084 11133051 10897294 10710798 10645311 10551812
3175 10551812 10297283 10021047 9820926 9721725 9605905 9525216 9521261 9489276 9309262 9228394
$$ packed form
3242C8018830l59575K539J62043Q0048j02452n32656p94898j078804j123507q75323
3232C3396245n13945n07882l70645l76578o80297q14722p14651p08001m64320
3223B8245204o5207O1466P2959p498k68502m58556l51363n41566q15116r12166
3213B4959655r35489j009053j086505j005957q61210p11159o07104m21591l05559
3204A8016028k76716k05433l21394l13727l01410n34212n64415l71578m43460
3195A4683683m62618k65721r4369J8167P6402j07939q4597K3989k53183n29838
3185A3003976l49179k97993l60764l21068l59888j82033k35757j86496o5487r3499
3175A0551812k54529k76236k00121r9201j15820q0689l955l1985j80014q0868
$$ plain form
3165 9228394 9291624 9448333 9375950 9213932 9109651 9024054 9030278 8898909 8878919 8883873 8860858
3154 8860858 8787846 8882068 8932845 8974659 8935184 9079092 9213663 9242147 9250973 9313406 9348363
3143 9348363 9459271 9555175 9657819 9753132 9743575 9807866 9854823 9879294 9831264 9678065 9627845
3132 9627845 9458749 9415153 9310241 9257792 9249472 9146286 9160562 9110156 9201055 9264081 9182895
3121 9182895 9394267 9450646 9527067 9611697 9764346 10011050 10007527 10106624 10158183 10136602 9954035
3110 9954035 9999482 10112694 10055844 9937211 9904907 9884522 9904427 9770208 9656991 9499211
3100 9499211 9379360 9217174 9254580 9243109 9220858 9093461 9000679 8980764 8925441 8895560 8923260
3089 8923260 9044198 9145190 9157108 9211503 9354557 9443419 9492597 9469287 9430972 9455355 9360467
$$ packed form
3165I228394O3230J56709p2383j62018j04281q5597O224j31369j9990M954k3015
3154H860858p3012R4222N0777M1814l9475J43908J34571K8484Q826O2433L4957
3143I348363J10908R5904J02644R5313r557O4291M6957K4471m8030j53199n0220
3132I627845j69096m3596j04912n2449q320j03186J4276n0406R0899O3026q1186
3121I182895K11372N6379P6421Q4630J52649K46704l523R9097N1559k1581j82567
3110I954035M5447J13212n6850j18633l2304k0385J9905j34219j13217j57780
3100I499211j19851j62186L7406j1471k2251j27397r2782j9915n5323k9881K7700
3089H923260J20938J00992J1918N4395J43054Q8862M9178k3310l8315K4383r4888
$$ plain form
3078 9360467 9342275 9258686 9241665 9221085 9137531 9189293 9274672 9381322 9478757 9750749 10067003
3067 10067003 10332253 9972165 9168560 8395512 7887334 7528203 7078466 6972892 6824678
3058 6824678 6650066 6505732 6424496 6366400 6481874 6588023 6479720 6513855 6602009 6845296
3048 6845296 6943840 7108311 7365032 7457942 7729723 8259832 8639988 9320435 10063126 10923997
3038 10923997 11460151 10848388 9645773 8451636 7504599 7031484 6726277 6398348 6172506
3029 6172506 5995346 5814766 5705341 5409355 5220858 5134681 5194179 5225573 5198118 5210378
3019 5210378 5178538 5243062 5495139 5618161 5815738 5977635 6295060 6712271 7107940 7534627
3009 7534627 7532817 7198561 6677226 6085000 5676545 5500198 5386855 5282318 5218422 5281442
$$ packed form
3078I360467j8192q3589j7021k0580q3554N1762Q5379J06650R7435K71992L16254
3067A0067003K65250l60088q03605p73048n08178l59131m49737j05574j48214
3058F824678j74612j44334q1236n8096J15474J06149j08303L4135Q8154K43287
3048F845296R8544J64471K56721R2910K71781N30109L80156O80447P42691Q60871
3038A0923997N36154o11763j202615j194137r47037m73115l05207l27929k25842
3029F172506j77160j80580j09425k95986j88497q6177N9498L1394k7455J2260
3019E210378l1840O4524K52077J23022J97577J61897L17425M17211L95669M26687
3009G534627j810l34256n21335n92226m08455j76347j13343j04537o3896O3020
$$ plain form
2999 5281442 5330220 5225776 5108740 5072376 5009743 5039134 5027918 5008476 4909142 4695557 4691992
2988 4691992 4641882 4616825 4607827 4692201 4595459 4460162 4472653 4686683 4667177 4702098 4784823
2977 4784823 4915145 4911074 4974578 5009116 5053419 5062390 5006113 5160534 5257770 5267308 5093486
2966 5093486 5183582 5121507 5074086 4984721 4962935 4835265 4849458 4810603 4743047 4782946 4887947
2955 4887947 4870230 4901905 5001780 5061160 5047926 5174987 5071523 5117606 5104052 5049491 4891789
2944 4891789 4936711 4923904 4851660 4907034 4924482 4900998 5077994 5086743 5009474 5042297 5077597
2933 5077597 5153064 5107678 5052161 4956852 4963532 4953574 4992079 4889306 4809240 4894723 4936705 4837763
2921 4837763 4734829 4738629 4687776 4582750 4465812 4408158 4465734 4559366 4572627 4455544 4394029
$$ packed form
2999E281442M8778j04444j17036l6364o2633K9391j1216j9442r9334k13585l565
2988D691992n0110k5057q998Q4374r6742j35297J2491K14030j9506L4921Q2725
2977D784823J30322m071O3504L4538M4303Q971n6277J54421R7236R538j73822
2966E093486R0096o2075m7421q9365k1786j27670J4193l8855o7556L9899J05001
2955D887947j7717L1675R9875N9380j3234J27061j03464M6083j3554n4561j57702
2944D891789M4922j2807p2244N5374J7448k3484J76996Q749p7269L2823L5300
2933E077597P5467m5386n5517r5309O680r958L8505j02773q0066Q5483M1982r8942
2921D837763j02934L800n0853j05026j16938n7654N7576R3632J3261j17083o1515
$$ plain form
2910 4394029 4431215 4416296 4380107 4365352 4425100 4513089 4411500 4351257 4277010 4205883 4180051
2899 4180051 4107488 4061023 4015081 3917034 3829258 3721041 3700358 3662938 3620734 3539162 3542414
2888 3542414 3438262 3462169 3471611 3380531 3355425 3294638 3301315 3177551 3170801 3089980 2966031
2877 2966031 2902992 2913510 2944596 2870881 2945328 2925304 2753725 2669848 2725849 2740273 2718703
2866 2718703 2554271 2473604 2396967 2432552 2378248 2227270 2249821 2189220 2198995 2255753 2118407
2855 2118407 2025909 1975376 2017367 1902528 1892410 1775050 1781664 1733102 1709473 1776219 1680320
2844 1680320 1589625 1578625 1483765 1394042 1470134 1453113 1404204 1394677 1412198 1310642 1133617
2833 1133617 1303728 1250355 1212665 1100129 1121050 1216977 1218990 1138942 1075441 1128666 1135750
$$ packed form
2910D394029L7186j4919l6189j4755N9748Q7989j01589o0243p4247p1127k5832
2899D180051p2563m6465m5942r8047q7776j08217k0683l7420m2204q1572L252
2888C542414j04152K3907R442r1080k5106o0787O677j23764o750q0821j23949
2877B966031o3039J0518L1086p3715P4447k0024j71579q3877N6001J4424k1570
2866B718703j64432q0667p6637L5585n4304j50978K2551o0601R775N6758j37346
2855B118407r2498n0533M1991j14839j0118j17360O614m8562k3629O6746r5899
2844A680320r0695j1000r4860q9723P6092j7021m8909r527J7521j01556j77025
2833A133617J70111n3373l7690j12536K0921R5927K013q0048o3501N3225P084
$$ plain form
2822 1135750 1132064 1031449 1098903 1104571 1047376 950525 1070699 1068984 972390 922409 860988 832562
2810 832562 834775 742714 844781 770193 668982 814896 914474 871453 881505 836181 927424
2799 927424 884118 853515 893041 921575 824217 732272 727950 708932 706779 578870 588667 653573
2787 653573 569108 644324 584873 600556 698327 666907 646009 647581 637097 689643 578466 603489
2775 603489 580127 596960 752290 552822 530418 608023 608796 536469 611839 581207 590574 667977
2763 667977 530360 466579 393185 399553 385264 324256 420635 394704 387279 278685 326865 381417
2751 381417 308406 349111 319391 302390 297776 386897 376914 361101 332050 239652 202240 242460
2739 242460 282153 178929 154596 253058 375616 343318 263329 213477 226051 305905 252492
$$ packed form
2822A135750l686j00615O7454N668n7195r6851J20174j715r6594m9981o1421k8426
2810H32562K213r2061J02067p4588j01211J45914R9578m3021J0052m5324R1243
2799I27424m3306l0603L9526K8534r7358r1945m322j9018k153j27909R797O4906
2787F53573q4465P5216n9451J5683R7771l1420k0898J572j0484N2546j11177K5023
2775F03489k3362J6833J55330j99468k2404P7605P73p2327P5370l0632R367P7403
2763F67977j37617o3781p3394O368j4289o1008R6379k5931p425j08594M8180N4552
2751C81417p3011M0705k9720j7001m614Q9121r983j5813k9051r2398l7412M0220
2739B42460L9693j03224k4333R8462J22558l2298p9989m9852J2574P9854n3413
$$ plain form
2728 252492 251740 280025 172829 215622 331621 225944 148007 178864 282629 223459 164820
2717 164820 163309 190053 273047 193048 126247 186920 126378 86483 171461 128177 39935 7213
2705 7213 132253 206198 78959 80918 181590 193272 128513 166581 222608 203985 289165 193112
2693 193112 135044 209685 222696 50663 66451 39897 100404 65293 46644 80230 21980
2682 21980 81032 115223 -21779 12429 48861 -11819 71630 -42268 33737 104271 95451 1194
2670 1194 -23297 -17100 -3650 71288 106145 46113 -5218 43364 49544 16137 60737 21661
2658 21661 27325 -4250 -84165 -112023 69961 131893 66296 -30281 22066 83715 50885 109126
2646 109126 100988 51446 -52869 56632 18525 27385 -18115 -53048 20375 102044 14451 -88024
$$ packed form
2728B52492p52K8285j07196M2793J15999j05677p7937L0857J03765n9170n8639
2717A64820j511K6744Q2994p9999o6801O0673o0542l9895Q4978m3284q8242l2722
2705G213J25040P3945j27239J959J00672J1682o4759L8068N6027j8623Q5180r6053
2693A93112n8068P4641J3011j72033J5788k6554O0507l5111j8649L3586n8250
2682B1980N9052L4191j37002L4208L6432o0680Q3449j13898P6005P0534q820r4257
2670A194k4491O197J3450P4938L4857o0032n1331M8582O180l3407M4600l9076
2658B1661N664l1575p9915k7858J81984O1932o5597r6577N2347O1649l2830N8241
2646A09126q138m9542j04315J09501l8107Q860m5500l4933P3423Q1669q7593j02475
$$ plain form
2634 -88024 -36370 -10032 -117301 -23916 -43124 -17813 -65095 1770 52513 -2405 36387 -34876
2622 -34876 -134707 -255963 -73862 -93842 -187199 -53077 25878 -107427 20000 48319 -40173
2611 -40173 -48510 -117644 -172044 -18762 60154 29798 -56902 -146430 -174010 -105500 -135226 -59780
2599 -59780 -3495 -37554 -87874 -112324 -6808 -80630 -105527 -41119 -50551 -79210 -110882 -122168
2587 -122168 -95460 -144397 -138996 -43779 -98374 -109241 -57749 -30934 -30852 -64367 -142922 -137239 -54636
2574 -54636 -58416 -97123 -91397 -89833 -27936 26000 -58878 48918 -3711 -33424 -88373 -134083
2562 -134083 -101326 3167 2674 27050 30071 50403 -44675 -114213 -50135 -39977 -16106 -53212
2550 -53212 -31795 -19227 -49657 -5558 14854 -35635 -85060 -103111 -18734 19303 132090 124280
$$ packed form
2634h8024N1654K6338j07269R3385j9208K5311m7282O6865N0743n4918L8792p1263
2622c4876r9831j21256J82101j9980r3357J34122P8955j33305J27427K8319q8492
2611d0173q337o9134n4400J53282P8916l0356q6700q9528k7580O8510k9726P5446
2599e9780N6285l4059n0320k4450J05516p3822k4897O4408r432k8659l1672j1286
2587a22168K6708m8937N401R5217n4595j0867N1492K6815Q2l3515p8555N683Q2603
2574e4636l780l8707N726J564O1897N3936q4878J07796n2629k9713n4949m5710
2562a34083L2757J04493m93K4376L021K0332r5078o9538O4078J0158K3871l7106
2550e3212K1417J2568l0430M4099K0412n0489m9425j8051Q4377L8037J12787p810
$$ plain form
2538 124280 17611 -29297 -88594 -113695 -193976 -141652 -105079 -127505 -33414 -96574 -76033
2527 -76033 55545 -56833 -87260 -62031 -76173 -119541 -143808 -105934 -90627 -114444 -89021
2516 -89021 -44671 -30187 -103106 -99047 18492 -63730 -47947 -7888 16677 39969 -55848 -112617
2504 -112617 -111777 -150690 -134237 -156758 -16438 -36924 -87510 849 -52444 -82809 -145723 -53547
2492 -53547 -56358 -142703 -82464 -119512 -213198 -68861 -34264 -133106 -124991 -36820 -27560 -97489
2480 -97489 -45481 -143071 -34646 -22955 -97489 -120628 -76287 -66105 -95141 -47754 -23202 -143135
2468 -143135 -107499 -4499 -33870 4550 27852 -61350 19903 -41170 29417 49501 4943
2457 4943 37445 36723 20486 23302 86573 -78980 -128275 -32580 96453 -625 -67285 -105635
$$ packed form
2538A24280j06669m6908n9297k5101q0281N2324L6573k2426R4091o3160K0541
2527g6033J31578j12378l0427K5229j4142m3368k4267L7874J5307k3817K5423
2516h9021M4350J4484p2919M059J17539q2222J5783M0059K4565K3292r5817n6769
2504a12617Q40l8913J6453k2521J40320k0486n0586Q8359n3293l0365o2914R2176
2492e3547k811q6345O0239l7048r3686J44337L4597r8842Q115Q8171R260o9929
2480i7489N2008r7590J08425J1691p4534k3139M4341J0182k9036M7387K4552j19933
2468a43135L5636J03000k9371L8420K3302q9202Q1253o1073P0587K0084m4558
2457D943L2502p22j6237K816O3271j65553m9295R5695J29033r7078o6660l8350
$$ plain form
2445 -105635 -87876 68667 115317 57299 -40917 -33976 16684 -66962 -129980 -57641 -39667 -67877
2433 -67877 -123401 -198139 -67789 -158348 -143765 -104274 -176873 -179353 -116366 -158563 -29863 -16622
2421 -16622 -191636 -81789 -63396 -47033 -86448 -57116 -30339 -105514 -56437 -155203 -91367
2410 -91367 -278 -44782 -48908 -122244 -94994 -59540 -58773 -36060 -38844 57908 132196 -105181
2398 -105181 -118523 -82632 -82252 -65729 -143297 -43978 4747 62135 66737 25625 -101590 -9799
2386 -9799 4936 2679 -67050 -144629 -87706 -59748 -157723 -104453 59187 43095 17089 -30964
2374 -30964 4413 -74881 80646 7886 39177 69753 7715 29254 -52876 -80099 -77384 29177
2362 29177 47268 -49100 52988 74317 -9567 -32749 -76583 10475 13580 23806 -102757 -127121
$$ packed form
2445a05635J7759J56543M6650n8018r8216O941N0660q3646o3018P2339J7974k8210
2433f7877n5524p4738J30350r0559J4583L9491p2599k480O2987m2197J28700J3241
2421a6622j75014J09847J8393J6363l9415K9332K6777p5175M9077r8766O3836
2410i1367R1089m4504m126p3336K7250L5454P67K2713k784R6752P4288k37377
2398a05181j3342L5891L80J6523p7568R9319M8725N7388M602m1112j27215R1791
2386i799J4735k257o9729p7579N6923K7958r7975N3270J63640j6092k6006m8053
2374c0964L5377p9294J55527p2760L1291L0576o2038K1539q2130k7223K715J06561
2362B9177J8091r6368J02088K1329q3884k3182m3834Q7058L105J0226j26563k4364
$$ plain form
2350 -127121 -27151 -46239 -52547 70559 6502 -69462 -104638 -87971 -86574 -120433 -31038 9536
2338 9536 -52835 -50684 -75418 -106625 -40120 -30181 -15021 20396 17939 31233 71801 17941 99002
2325 99002 -28397 -78260 -87803 -27029 23221 -3282 94384 52760 40143 39703 52800 -7713
2313 -7713 37354 50107 31652 41654 -4357 34187 29183 -17991 23540 -40751 -37888 -6123
2301 -6123 5138 196460 287779 336390 249396 297915 416080 307825 227994 162101 111429
2290 111429 87157 206515 54333 138485 193733 104375 210810 119186 60103 113338 111447
2279 111447 127774 81190 39998 57572 62690 34616 -55423 26193 13930 16300 141872 42613
2267 42613 -59252 -30596 5508 94174 90799 50804 65205 26675 1882 65258 135356 56600
$$ packed form
2350a27121R9970j9088o308J23106o4057p5964l5176J6667J397l3859Q9395M0574
2338I536o2371K151k4734l1207O6505R939J5160L5417k457J3294M0568n3860Q1061
2325I9002j27399m9863r543O0774N0250k6503R7666m1624j2617m40J3097o0513
2313g713M5067J2753j8455J0002m6011L8544n004m7174M1531o4291K863L1765
2301f123J1261J91322R1319M8611q6994M8519J18165j08255p9831o5893n0672
2290A11429k4272J19358j52182Q4152N5248q9358J06435r1624n9083N3235j891
2279A11447J6327m6584m1192J7574N118k8074r0039Q1616j2263K370J25572r9259
2267D2613j01865K8656L6104Q8666l375l9995J4401l8530k4793O3376P0098p8756
$$ plain form
2255 56600 4538 57112 9746 96486 16312 3527 181727 241425 82901 -59392 1243
2244 1243 118799 35004 106917 69800 49761 112410 58913 159936 123959 166632 163315 59149
2232 59149 18825 1040 19079 55352 92184 -44892 3174 17063 35166 68085 137381 101411
2220 101411 54554 11451 13039 94171 161917 194217 230569 213344 297573 271290 255384 228467
2208 228467 268085 331215 212054 161587 264525 212966 116192 269921 311931 292339 291644
2197 291644 333595 191692 162602 276576 394497 374421 296974 231091 232867 205327 332076
2186 332076 320426 286085 245998 321820 310999 266463 338725 415351 408806 335260 352835 252158
2174 252158 282101 288108 307081 353794 525720 438940 398384 372691 364609 318215 332719 301198
$$ packed form
2255E6600n2062N2574m7366Q6740q0174j2785J78200N9698j58524j42293O0635
2244A243J17556q3795P1913l7117k0039O2649n3497J01023l5977M2673l317j04166
2232E9149m0324j7785J8039L6273L6832j37076M8066J3889J8103L2919O9296l5970
2220A01411m6857m3103J588Q1132O7746L2300L6352j7225Q4229k6283j5906k6917
2208B28467L9618O3130j19161n0467J02938n1559r6774J53729M2010j9592o95
2197B91644M1951j41903k9090J13974J17921k0076p7447o5883J776k7540J26749
2186C32076j1650l4341m0087P5822j0821m4536P2262P6626o545p3546J7575j00677
2174B52158K9943O007J8973M6713J71926q6780m0556k5693q082m6394J4504l1521
$$ plain form
2162 301198 317975 439805 419926 330824 309528 457283 444634 483487 482418 546684 475772
2151 475772 494539 635356 732617 687856 678386 714500 706045 707707 805707 764358 842507 876539
2139 876539 793740 691423 760157 724913 819954 897257 899569 913020 934871 1022113 1085264 1155094
2127 1155094 1145594 1124907 1178724 1307146 1368622 1380565 1544044 1486492 1355677 1450031 1547742
2116 1547742 1505085 1439687 1512707 1684879 1731962 1822906 1798697 1952890 1954933 1985958 2049846
2105 2049846 2100986 2067336 2131968 2308108 2320890 2322206 2482284 2528885 2506686 2623771 2731241
2094 2731241 2733573 2815248 2828968 2962388 3084450 3217571 3395279 3509749 3673790 3916654
2084 3916654 4143267 4384117 4525170 4727437 4940506 5180971 5560481 5911502 6296423 6722805
$$ packed form
2162C01198J6777J21830j9879q9102k1296J47755j2649L8853j069O4266p0912
2151D75772J8767J40817R7261m4761r470L6114q455J662R8000m1349P8149L4032
2139H76539q2799j02317O8734l5244R5041P7303K312J3451K1851Q7242O3151O9830
2127A155094r500k0687N3817J28422O1476J1943J63479n7552j30815R4354R7711
2116A547742m2657o5398P3020J72172M7083R0944k4209J54193K043L1025O3888
2105B049846N1140l3650O4632J76140J2782J316J60078M6601k2199J17085J07470
2094B731241K332Q1675J3720J33420J22062J33121J77708J14470J64041K42864
2084C916654K26613K40850J41053K02267K13069K40465L79510L51021L84921M26382
$$ plain form
2074 6722805 7189364 7707300 8368831 8989413 9715185 10705015 11843081 13014542 13899255
2065 13899255 14991407 16647942 18675744 21340336 24239541 27869676 32463899 38706873
2057 38706873 46394655 56967089 68628933 76889589 70716147 56142742 42526882 33126589
2049 33126589 27571293 23301806 20226477 17729640 15882545 14502251 13477296 12538172
2041 12538172 11728677 10762429 9838712 8764397 7897349 7095992 6637642 6244728 5982967
2032 5982967 5686255 5419182 5040113 4784227 4471087 4405475 4113350 3956153 3839082 3669777
2022 3669777 3547134 3493684 3338753 3143091 2987759 2850940 2723628 2551460 2326553 2342914
2012 2342914 2194479 2029945 1947009 1917446 1850987 1804564 1628240 1528858 1646288 1554213 1610015
$$ packed form
2074F722805M66559N17936O61531O20582P25772R89830J138066J171461Q84713
2065A3899255J092152J656535K027802K664592K899205L630135M594223O242974
2057C8706873P687782J0572434J1661844Q260656o173442j4573405j3615860r400293
2049C3126589n555296m269487l075329k496837j847095j380294j024955r39124
2041A2538172q09495r66248r23717j074315q67048q01357m58350l92914k61761
2032E982967k96712k67073l79069k55886l13140o5612k92125j57197j17071j69305
2022C669777j22643n3450j54931j95662j55332j36819j27312j72168k24907J6361
2012B342914j48435j64534q2936k9563o6459m6423j76324r9382J17430r2075N5802
$$ plain form
2001 1610015 1552299 1447009 1533288 1349955 1445703 1311347 1310414 1206075 1189011 1210135 1200906
1990 1200906 1105911 1209056 1117546 1094729 1081271 1032491 1035359 939202 1013865 1106782 1056082
1979 1056082 1016105 860988 833849 726914 615024 592417 578049 602050 559061 550390 627254
1968 627254 554771 494943 532421 535498 489322 355596 353865 271740 415453 382312 314024 288575
1956 288575 235834 280721 356529 317239 336613 330665 304007 246866 309311 327593 405240 384435
1944 384435 362266 386572 371136 417057 288715 289533 272138 260196 270751 272384 242475 246631
1932 246631 154317 237830 243403 258606 176346 137883 113795 167253 266967 169366 123344 102949
1920 102949 223753 249061 137137 91379 71236 151696 175378 121753 168766 134118 170588
$$ packed form
2001A610015n7716j05290Q6279j83333R5748j34356r33j04339j7064K1124r229
1990A200906r4995J03145r1510k2817j3458m8780K868r6157P4663R2917n0700
1979A056082l9977j55117k7139j06935j11890k2607j4368K4001m2989q671P6864
1968F27254p2483n9828L7478L077m6176j33726j731q2125J43713l3141o8288k5449
1956B88575n2741M4887P5808l9290J9374n948k6658n7141O2445J8282P7647k0805
1944C84435k2169K4306j5436M5921j28342Q18j7395j1942J0555J633k9909M156
1932B46631r2314Q3513N573J5203q2260l8463k4088N3458R9714r7601m6022k0395
1920A02949J20804K5308j11924m5758k0143Q0460K3682n3625M7013l4648L6470
$$ plain form
1909 170588 90256 106325 181482 111211 166683 263442 52854 99317 216227 178544 116137
1898 116137 128924 32515 33940 66227 101340 63807 130178 151023 156995 222960 224693 82159
1886 82159 43893 123081 257358 326346 171277 167877 194515 118941 159712 122449 177414 65395
1874 65395 116360 177781 137643 125675 63201 67673 95140 -21806 -50913 -40292 -10214 179937
1862 179937 12755 -122700 -22424 123722 86936 -7273 -147087 -72340 -18700 112925
1852 112925 145913 95360 212501 132259 25710 18913 -12334 -40447 66762 3136 -49226
1841 -49226 -104149 -37119 -20999 -2413 28793 -29795 20762 78393 5554 37760 115169 30885
1829 30885 44678 19518 137560 168685 186368 211542 113686 123886 162198 44139 38310 63523
$$ packed form
1909A70588q0332J6069P5157p0271N5472R6759k10588M6463J16910l7683o2407
1898A16137J2787r6409J425L2287L5113l7533O6371K0845N972O5965J733j42534
1886H2159l8266P9188J34277O8988j55069l400K6638p5574M0771l7263N4965j12019
1874F5395N0965O1421m0138j1968o2474M472K7467j16946k9107J0621L0078J90151
1862A79937j67182j35455J00276J46146l6786r4209j39814P4747N3640J31625
1852A12925L2988n0553J17141q0242j06549o797l1247k8113J07209o3626n2362
1841d9226n4923O7030J6120J8586L1206n8588N0557N7631p2839L2206P7409q4284
1829C0885J3793k5160J18042L1125J7683K5174r7856J0200L8312j18059n829K5213
$$ plain form
1817 63523 110310 90278 215603 207909 263651 302830 299942 330537 297371 332754 264996 194976
1805 194976 131906 127149 91643 65730 22351 31558 -58056 27810 34138 19784 3186 21438
1793 21438 75623 42671 36540 47261 24147 76676 60551 -86113 -12436 13129 -42406 -87298
1781 -87298 -5887 86343 19573 -78276 -51889 -1507 -28612 -17461 -110292 -60156 27399 82915
1769 82915 -16087 -9422 47203 -31426 74831 -97259 -100120 -88373 -113971 -121133 -119452 -43899
1757 -43899 -45499 -90961 -52523 4073 30410 -77958 12421 48303 -46487 -129761 -19731 98660
1745 98660 39514 45078 -25609 -98198 -92744 -189629 -135645 -92203 -135881 -31831 -128353 -79722
1733 -79722 24145 -30056 35980 24440 -100849 -10037 -24019 -32617 -12199 13413 28199 2011
$$ packed form
1817F3523M6787k0032J25325p694N5742L9179k888L0595l3166L5383o7758p0020
1805A94976o3070m757l5506k5913m3379R207q9614Q5866O328j4354j6598J8252
1793B1438N4185l2952o131J0721k3114N2529j6125j46664P3677K5565n5535m4892
1781h7298Q1411R2230o6770r7849K6387N0382k7105J1151r2831N0136Q7555N5516
1769H2915r9002O665N6625p8629J06257j72090k861J1747k5598p162J681P5553
1757d3899j600m5462L8438N6596K6337j08368R0379L5882r4790q3274J10030J18391
1745I8660n9146N564p0687p2589N454r6885N3984M3442m3678J04050r6522M8631
1733g9722J03867n4201O6036j1540j25289R0812j3982q598K0418K5612J4786k6188
$$ plain form
1721 2011 -82529 -135459 -81576 -105609 -129358 -116848 -46817 -128 19486 -41313 -29074 -79280
1709 -79280 -78346 -31370 -115709 -212003 -76901 -77487 -119810 -29763 61036 33575 -57112 -51271 556
1696 556 52706 21364 57222 113131 100875 49563 -85379 -46999 19656 -23250 -68367 -115722
1684 -115722 -25735 42721 93738 72742 -3283 -100414 -4319 102069 32544 -66178 -33768
1673 -33768 -117672 -147497 -68292 -19503 49756 -646 41070 54447 -55176 -113573 -131045 -71188
1661 -71188 -91586 -234735 -118235 -43396 -140020 -183450 -85012 7665 39828 3413 -48039
1650 -48039 -85808 -94839 20168 -77414 -76466 -51846 -77079 -43675 -72496 28551 74815 11395
1638 11395 14615 -22041 -4892 -128493 -192148 -181884 -138414 -114881 -98698 -162746 -88650 4952
$$ packed form
1721B011q4540n2930N3883k4033k3749J2510P0031M6689J9614o0799J2239n0206
1709g9280R34M6976q4339r6294J35102n86m2323R0047R0799k7461r0687N841N1827
1696E56N2150l1342L5858N5909j2256n1312j34942L8380O6655m2906m5117m7355
1684a15722Q9987O8456N1017k0996p6025r7131R6095J06388o9525r8722L2410
1673c3768q3904k9825P9205M8789O9259n0402M1716J3377j09623n8397j7472N9857
1661g1188k0398j43149J16500P4839r6624m3430R8438R2677L2163l6415n1452
1650d8039l7769r031J15007r7582R48K4620k5233L3404k8821J01047M6264o3420
1638A1395L220l6656J7149j23601o3655J0264M3470K3533J6183o4048P4096R3602
$$ plain form
1626 4952 -18886 -110468 -183464 -94952 -64734 -19505 -25927 -88543 -66695 -34134 -54631 -77831
1614 -77831 -51455 -49868 -156954 -68811 -5673 -51978 99082 62706 -67384 -85698 -60749
1603 -60749 -73328 -82142 -72824 -124074 -138864 -171593 -68336 41129 -25929 40796 -69813 -146394
1591 -146394 -89436 -45377 -142211 -222749 -99015 -44068 -229347 -276043 -201214 -118148 -172463
1580 -172463 -109471 34909 -60023 -189647 -103412 -6574 -76500 -66303 41607 -53514 -106049
1569 -106049 11928 62347 -6320 -167584 -127628 -207473 -158683 53273 -14263 46555 -93596
1558 -93596 -115044 -7936 -64048 1629 -181460 -107994 -51226 -56348 -82629 -67877 53188
1547 53188 -31257 -161391 -54773 -573 7734 -136559 -50840 -12761 -152456 79945 -65760
$$ packed form
1626D952k3838r1582p2996Q8512L0218M5229o422o2616K1848L2561k0497k3200
1614g7831K6376J587j07086Q8143O3138m6305J51060l6376j30090j8314K4949
1603f0749j2579q814R318n1250j4790l2729J03257J09465o7058O6725j10609p6581
1591a46394N6958M4059r6834q0538J23734N4947j85279m6696P4829Q3066n4315
1580a72463O2992J44380r4932j29624Q6235R6838o9926J0197J07910r5121n2535
1569a06049J17977N0419o8667j61264L9956p9845M8790K11956o7536O0818j40151
1558i3596k1448J07108n6112O5677j83089P3466N6768n122k6281J4752J21065
1547E3188q4445j30134J06618N4200Q307j44293Q5719L8079j39695K32401j45705
$$ plain form
1536 -65760 -139589 -68201 -43569 33341 24928 52212 -56143 21192 60272 -23292 -66478 -69869
1524 -69869 -195526 -131050 -42085 59647 -78492 -42339 37710 84939 30863 25395 26175 14852
1512 14852 -12807 -91964 -171921 -19667 21104 44469 53266 -123910 -44590 7358 17771 17250
1500 17250 -64209 53840 37312 -82190 -153766 -76825 -107845 -123928 -23262 -96679 -111623
1489 -111623 -61197 -117732 -134755 -146772 -126083 -211374 -224657 -146989 -113005 -4817 59743
1478 59743 144724 -26459 11541 75049 -3675 -73482 41857 -41769 84389 131607 62114
1467 62114 -104452 -10362 -37184 -48698 -57819 -97728 -43958 563 -3926 -101690 -99193 -110097
1455 -110097 -117217 -87974 -114492 -170319 -48289 -31200 -180634 -149151 -93526 -29098 -108037
$$ packed form
1536f5760p3829P1388K4632P6910q413K7284j08355P7335L9080q3564m3186l391
1524f9869j25657O4476Q8965J01732j38139L6153Q0049M7229n4076n468P80j1323
1512A4852k7659p9157p9957J52254M0771K3365Q797j77176P9320N1948J0413n21
1500A7250q1459J18049j6528j19502p1576P6941l1020j6083J00666p3417j4944
1489a11623N0426n6535j7023j2017K0689q5291j3283P7668L3984J08188O4560
1478E9743Q4981j71183L8000O3508p8724o9807J15339q3626J26158M7218o9493
1467F2114j66566R4090k6822j1514r121l9909N3770M4521m489r7764K497j0904
1455a10097p120K9243k6518n5827J22030J7089j49434L1483N5625O4428p8939
$$ plain form
1444 -108037 -97079 -88635 -38422 -17388 -23415 -30363 -148448 -92382 -35204 25112 4676 -69887
1432 -69887 -160710 -108535 -55916 -10614 22315 38471 84601 -78316 -77132 -48532 -27431 -108525
1420 -108525 -120367 -193793 -200187 -8932 34191 26958 -6724 -29737 19679 15690 -96607 -31917
1408 -31917 -98207 -149496 -107589 95572 28047 -148599 -127592 -17910 63134 13794 38075
1397 38075 10718 26168 -65686 -85761 52444 90723 21768 -35602 -116789 -132880 -22194
1386 -22194 1201 -11923 44409 59438 -42221 -127948 -54265 -25203 58040 71718 18502 33574
1374 33574 -23849 13427 -15399 -10258 -51995 -66404 -25798 -27857 -31948 -36211 -40067 -55934 -9708
1361 -9708 -28977 -99742 -24423 -48246 83247 30328 36397 -13205 -114925 -141172 -117455 17576
$$ packed form
1444a08037J0958Q444N0213K1034o027o948j18085N6066N7178O0316k0436p4563
1432f9887r0823N2175N2619M5302L2929J6156M6130j62917J184K8600K1101q1094
1420a08525j1842p3426o394J91255M3123p233l3682k3013M9416l989j12297O4690
1408c1917o6290n1289M1907K03161o7525j76646K1007J09682Q1044m9340K4281
1397C8075k7357J5450r1854k0075J38205L8279o8955n7370q1187j6091J10686
1386b2194K3395j3124N6332J5029j01659q5727P3683K9062Q3243J3678n3216J5072
1374C3574n7423L7276k8826N141m1737j4409M0606k059m091m263l856j5867M6226
1361i708j9269p0765P5319k3823J31493n2919O069m9602j01720k6247K3717J35031
$$ plain form
1349 17576 -52116 -71239 -68793 -19474 -4716 15582 -25290 -115608 -108505 -45481 -69626 15437
1337 15437 77179 56775 -19828 8192 -50252 -99582 -26790 -86149 -28000 -103268 -143441 -69501
1325 -69501 -115956 -90426 -42316 -72171 -97296 -53090 -67081 -43177 -36898 -41166 -12261 -134721
1313 -134721 -113686 -41965 -92274 -24196 -63015 -105001 -100042 -105946 -84959 -106944 2058 -15419
1301 -15419 41473 8997 -30743 -5172 2387 -18915 -1403 17121 46859 102151 -5420 -147104
1289 -147104 -54380 -72047 -83369 -27909 -34026 -30487 -14306 -45269 -20807 20688 -66702 -97812
1277 -97812 35914 21452 10973 -83783 37368 6754 -32963 52692 -22096 34211 15502
1266 15502 52154 53458 84296 52378 -32645 -93445 -11596 18186 9530 67166 19373 13277
$$ packed form
1349A7576o9692j9123K446M9319J4758K0298m0872r0318P103O3024k4145Q5063
1337A5437O1742k0404p6603K8020n8444m9330P2792n9359N8149p5268m0173P3940
1325f9501m6455K5530M8110k9855k5125M4206j3991K3904O279m268K8905j22460
1313a34721K1035P1721n0309O8078l8819m1986M959n904K0987k1985J09002j7477
1301a5419N6892l2476l9740K5571P559k1302J7512J8524K9738N5292j07571j41684
1289a47104R2724j7667j1322N5460o117L539J6181l0963K4462M1495q7390l1110
1277i7812J33726j4462j0479r4756J21151l0614l9717Q5655p4788N6307j8709
1266A5502L6652J304L0838l1918q5023o0800Q1849K9782q656N7636m7793o096
$$ plain form
1254 13277 -18467 32007 80666 -56156 -56216 -88423 -98327 -25615 22640 -35752 -204692 -200706
1242 -200706 -91731 -138290 -16653 92973 131629 -10547 23956 -34742 37150 16622 -55781
1231 -55781 -26224 -121524 43153 47110 -61486 -15203 17059 -12573 -94832 -94448 -45733 -81602
1219 -81602 -27814 73310 48157 -6020 10667 -4563 -86500 -81078 76451 44640 -106960
1208 -106960 -127143 18886 -63238 -120447 5178 28362 69758 47030 -89567 -37972 -25225
1197 -25225 -87739 -78982 -170167 -22666 -9699 -82677 -68411 42203 -16069 37824 -65510
1186 -65510 -148650 -103913 -64787 -17633 8681 60310 1798 55452 110673 32989 73955 -3871
1174 -3871 61814 168209 125853 59439 -86214 34031 61031 133006 97783 151588 20483
$$ packed form
1254A3277l1744N0474M8659j36822o0l2207r904P2712M8255n8392j68940L986
1242b00706J08975m6559J21637J09626L8656j42176L4503n8698P1892k0528p2403
1231e5781K9557r5300J64677L957j08596M6283L2262k9632q2259L84M8715l5869
1219h1602N3788J01124k5153n4177J6687j5230q1937N422J57529l1811j51600
1208a06960k0183J46029q2124n7209J25625K3184M1396k2728j36597N1595J2747
1197b5225o2514Q757r1185J47501J2967p2978J4266J10614n8272N3893j03334
1186f5510q3140M4737L9126M7154K6314N1629n8512N3654N5221p7684M0966p7826
1174c871O5685J06395m2356o6414j45653J20245K7000P1975l5223N3805j31105
$$ plain form
1163 20483 -26433 -100427 -126702 -38964 -83747 -57549 -31466 -41891 -35038 35516 -10564 -41561
1151 -41561 -95791 -132549 -119890 -89955 -79378 -12190 28436 86539 86965 41357 16120 10001
1139 10001 -127715 -151062 -56965 -3098 -45477 -33337 -69884 -116817 -50976 65565 31874
1128 31874 -93166 -106769 -9971 -4039 3873 79965 -64693 8907 -62633 -85767 -5598 -6930
1116 -6930 -48725 -29387 -11317 -101666 -157987 -50274 35735 70282 43850 14042 -98983 37624
1104 37624 34804 83380 9503 -21210 53277 24207 4280 14940 62542 -64326 -195844 -92152
1092 -92152 59971 95229 101544 19839 -35169 -186516 -72572 -18804 -3929 -46042 -129017
1081 -129017 -60038 -39802 -107463 -181070 -154107 -26687 -54294 -113978 15572 -50563 56401
$$ packed form
1163B0483m6916p3994k6275Q7738m4783K6198K6083j0425O853P0554m6080l0997
1151d1561n4230l6758J2659K9935J0577O7188M0626N8103M26m5608k5237o119
1139A0001j37716k3347R4097N3867m2379J2140l6547m6933O5841J16541l3691
1128C1874j25040j3603R6798N932P912P6092j44658P3600p1540k3134Q0169j332
1116f930m1795J9338J8070r0349n6321J07713Q6009L4547k6432k9808j13025J36607
1104C7624k820M8576p3877l0713P4487k9070j9927J0660M7602j26868j31518J03692
1092i2152J52123L5258O315q1705n5008j51347J13944N3768J4875m2113q2975
1081a29017O8979K0236o7661p3607K6963J27420k7607n9684J29550o6135J06964
$$ plain form
1070 56401 107815 -25132 -50204 68383 76410 -222 -70110 -92762 -109092 -13211 123808
1059 123808 58335 -62531 -16420 22269 -46451 -82182 -97858 -235966 -166101 -15739 -28647
1048 -28647 -76744 -105124 46101 -25324 -119083 -87529 -102260 -119179 -80933 -26221 -17725 -128932
1036 -128932 61 22793 5464 -73193 -61993 -4763 22602 -26667 -118343 -80829 -60058
1025 -60058 -91674 -5448 73477 -39867 -134009 -164842 -77854 -110582 -69372 -44369 -76024 -98083
1013 -98083 -147272 -146091 -26504 68601 11279 16588 -46887 -87699 -71762 12026 103620 100028
1001 100028 -140862 -174724 -99913 -36854 62269 8185 -36398 -213 12788 24369 58109
990 58109 37223 -141135 -168176 -100696 43080 39449 17648 -57924 -68763 -47818 -9403 71441
$$ packed form
1070E6401N1414j32947k5072J18587Q027p6632o9888k2652j6330R5881J37019
1059A23808o5473j20866M6111L8689o8720l5731j5676j38108O9865J50362j2908
1048b8647m8097k8380J51225p1425r3759L1554j4731j6919L8246N4712Q496j11207
1036a28932J28993K2732j7329p8657J1200N7230K7365m9269r1676L7514K0771
1025f0058l1616Q6226P8925j13344r4142l0833Q6988l2728M1210K5003l1655k2059
1013i8083m9189J181J19587R5105n7322N309o3475m0812J5937Q3788R1594l592
1001A00028k40890l3862P4811O3059R9123n4084m4583L6185J3001J1581L3740
990E8109k0886j78358k7041O7480J43776l631k1801p5572j0839K0945L8415Q0844
$$ plain form
978 71441 58717 25413 -92667 -117777 -90377 -49637 -56754 -53559 -112847 -161142 -39690 10847
966 10847 51825 -41309 -57951 42542 3905 -66136 -43051 46028 -2756 75479 154233 -25573
954 -25573 6187 106073 -9337 -8411 -90338 39947 159002 51079 33023 -40635 -46050 68812
942 68812 90845 5233 35317 11643 15273 -22264 -24613 36969 -95590 -128199 -87332 -26935
930 -26935 37573 23779 33121 113679 86658 76992 128357 153869 132802 241366 158238 90114
918 90114 -23357 1056 -26575 24428 33003 -38740 -62997 35401 68317 76275 27164 -6847
906 -6847 77725 117049 10322 28264 45798 -16634 -6178 52564 123688 12067 12607 -12033
894 -12033 29837 -46833 32732 3795 -29079 -43751 -74115 54669 52798 -1078 8884 108004
$$ packed form
978G1441j2724l3304j18080k5110K7400M0740p117L195n9288m8295J21452N0537
966A0847M0978r3134j6642J00493l8637p0041K3085Q9079m8784P8235P8754j79806
954b5573L1760R9886j15410R26q1927J30285J19055j07923j8056p3658n415J14862
942F8812K2033q5612L0084k3674L630l7537k349O1582j32559l2609M0867O0397
930b6935O4508j3794R342Q0558k7021r666N1365K5512k1067J08564q3128o8124
918I0114j13471K4413k7631N1003Q575p1743k4257R8398L2916P958m9111l4011
906f847Q4572L9324j06727J7942J7534o2432J0456N8742P1124j11621N40k4640
894a2033M1870p6670P9565k8937l2874j4672l0364J28784j871n3876R962R9120
$$ plain form
882 108004 147157 67920 152525 141887 -27579 -23471 15013 32002 -55691 -67902 -52792 -19775
870 -19775 20634 57462 -34186 -61711 4824 69105 6959 116123 61222 30554 27640 5735
858 5735 71613 132389 135301 98033 145746 101172 59348 -31423 -4013 109371 108463 230471
846 230471 122130 -10277 -9155 -39526 43453 5812 -6419 -14399 104889 87114 23557 -39182
834 -39182 -54389 -24263 46309 10123 25373 -178780 -40744 94491 22194 -75265 -41256
823 -41256 30692 91584 146206 35128 82518 11760 -10288 6636 63349 166657 22480
812 22480 -21160 18175 -45342 -71537 -67145 -43971 47828 10891 174857 148098 122583 34669
800 34669 10703 78813 -19140 8501 -33003 -33800 2773 -25868 -46588 -53418 -72116 20653 103226
$$ packed form
882A08004L9153p9237Q4605j0638j69466M108L8484J6989q7693j2211J5110L3017
870a9775M0409L6828r1648k7525O6535O4281o2146J09164n4901l0668k914k1905
858E735O5878O0776K912l7268M7713m4574m1824r0771K7410J13384r08J22008
846B30471j08341j32407J122l0371Q2979l7641j2231p980J19288j7775o3557o2739
834c9182j5207L0126P0572l6186J5250k04153J38036J35235p2297r7459L4009
823d1256P1948O0892N4622j11078M7390p0758k2048J6924N6713J03308j44177
812B2480m3640L9335o3517k6195M392K3174R1799l6937J63966k6759k5515q7914
800C4669k3966O8110r7953K7641m1504p97L6573k8641k0720o830j8698R2769Q2573
$$ plain form
787 103226 17590 -109478 -57398 -94847 -57396 135877 137208 73530 63407 114406 83400 -65643
775 -65643 11316 41532 57596 115137 87687 -26485 -44288 89479 178398 183278 80598 47830
$$ packed form
787A03226q5636j27068N2080l7449L7451J93273J331o3678j0123N0999l1006j49043
775f5643P6959L0216J6064N7541k7450j14172j7803J33767Q8919M880j02680l2768
$$ [...]
##END NTUPLES=NMR SPECTRUM
##END=
