##TITLE=1H_EC-3259(IV-2)
 CDCl3, 8 sc, 
 31.8.2021
##JCAMPDX= 6.0         $$ Bruker NMR JCAMP-DX V2.0
##DATA TYPE= NMR SPECTRUM
##DATA CLASS= NTUPLES
##ORIGIN= UXNMR, Bruker Analytische Messtechnik GmbH
##OWNER= root
$$ XWIN-NMR		Version 3.5
$$ Tue Aug 31 12:27:54 2021 Russian Standard Time (UT+4h)  she@DPX200
##.OBSERVE FREQUENCY= 200.131506
##.OBSERVE NUCLEUS= ^1H
##.ACQUISITION MODE= SIMULTANEOUS
##.ACQUISITION SCHEME= undefined
##.AVERAGES= 8
##.DIGITISER RES= 18
##SPECTROMETER/DATA SYSTEM= spect
##.PULSE SEQUENCE= zg30
##.SOLVENT NAME= CDCl3
##.SHIFT REFERENCE= (INTERNAL, CDCl3, 0, 17.5008)
##AUDIT TRAIL= $$ (NUMBER, WHEN, WHO, WHERE, WHAT)
$$ ##TITLE= Audit trail, XWIN-NMR		Version 3.5
$$ ##JCAMPDX= 5.01
$$ ##ORIGIN= Bruker BioSpin GmbH
$$ ##OWNER= she
$$ F:/spectra/data/she/nmr/H-F/1/pdata/1/auditp.txt
$$ ##AUDIT TRAIL=  $$ (NUMBER, WHEN, WHO, WHERE, WHAT)
(   1,<2021-08-31 12:25:49.81 +0400>,<she>,<DPX200>,
      <created by zg, POWCHK disabled, PULCHK disabled
       configuration hash MD5:
       00 E9 B6 7A A2 85 ED C7 34 08 36 98 17 FE 4E 26
       data hash MD5: 16K
       D1 21 D4 31 75 65 28 B4 C2 94 F9 1A 01 32 7C 6E>)
(   2,<2021-08-31 12:25:52.68 +0400>,<she>,<DPX200>,
      <Start of raw data processing
       efp BC_mod = 2 LB = 0.24 FT_mod = 6 PKNL = 1 PHC0 = -13361.04 PHC1 = 12.60098 SI = 16K 
       data hash MD5: 16K
       40 BC 50 4C D3 14 5D 12 FA EC 56 D6 49 77 92 0D>)
(   3,<2021-08-31 12:26:14.78 +0400>,<she>,<DPX200>,
      <pk PHC0 = 3.817266 PHC1 = -4.8 
       data hash MD5: 16K
       9E 8F 08 C0 C9 38 AE D5 54 B1 16 5A 03 3C 86 7D>)
(   4,<2021-08-31 12:26:17.82 +0400>,<she>,<DPX200>,
      <abs ABSG = 5 
       data hash MD5: 16K
       7A EC 2A 86 D7 34 64 BC 57 3E 5B 05 21 BF 9B 0F>)
$$ ##END=
$$ 
$$ hash MD5
$$ DE E6 F2 C2 D6 4D D5 22 7C 55 3B 78 3D DE 6E B9
##$RELAX= 
##$RELAX= 
##$RELAX= 
##$RELAX= 
##$RELAX= 
##$RELAX= 
$$ Bruker specific parameters
$$ --------------------------
##$DU= <F:/spectra>
##$EXPNO= 1
##$NAME= <H-F>
##$PROCNO= 1
##$TYPE= <nmr>
##$USER= <she>
##$AMP= (0..31)
100 100 100 100 100 100 100 100 100 100 100 100 100 100 100 100 100 100 
100 100 100 100 100 100 100 100 100 100 100 100 100 100 
##$AQSEQ= 0
##$AQ_mod= 1
##$AUNM= <au_zg>
##$AUTOPOS= <>
##$BF1= 200.13
##$BF2= 200.13
##$BF3= 200.13
##$BF4= 200.13
##$BF5= 200.13
##$BF6= 200.13
##$BF7= 200.13
##$BF8= 200.13
##$BYTORDA= 1
##$CFDGTYP= 0
##$CFRGTYP= 5
##$CHEMSTR= <none>
##$CNST= (0..31)
1 1 145 1 1 1 1 1 1 1 1 1 1 1 1 1 1 1 1 1 1 1 1 1 1 1 1 1 1 1 1 1 
##$CPDPRG= <>
##$CPDPRG1= <>
##$CPDPRG2= <>
##$CPDPRG3= <>
##$CPDPRG4= <mlev>
##$CPDPRG5= <mlev>
##$CPDPRG6= <mlev>
##$CPDPRG7= <mlev>
##$CPDPRG8= <mlev>
##$CPDPRGB= <>
##$CPDPRGT= <>
##$D= (0..31)
0 1.2 0 0 0 0 0 0 0 0.06 0 0.03 0 0 0 0 0.0002 0 0 0 0 0 0 0 0 0 0 0 0 
0 0 0 
##$DATE= 1630398349
##$DBL= (0..7)
120 120 120 120 120 120 120 120 
##$DBP= (0..7)
150 150 150 150 150 150 150 150 
##$DBP07= 0
##$DBPNAM0= <>
##$DBPNAM1= <>
##$DBPNAM2= <>
##$DBPNAM3= <>
##$DBPNAM4= <>
$$ [...]
##$SUBNAM3= <"">
##$SUBNAM4= <"">
##$SUBNAM5= <"">
##$SUBNAM6= <"">
##$SUBNAM7= <"">
##$SUBNAM8= <"">
##$SUBNAM9= <"">
##$SW= 20.0188882624521
##$SWIBOX= (0..15)
0 0 2 0 0 0 0 0 0 0 0 0 0 0 0 0 
##$SW_h= 4006.41025641026
##$TD= 16384
##$TD0= 1
##$TE= 0
##$TE2= 300
##$TE3= 300
##$TEG= 300
##$TL= (0..7)
0 120 120 120 120 120 120 120 
##$TP= (0..7)
150 150 150 150 150 150 150 150 
##$TP07= 0
##$TPNAME0= <>
##$TPNAME1= <>
##$TPNAME2= <>
##$TPNAME3= <>
##$TPNAME4= <>
##$TPNAME5= <>
##$TPNAME6= <>
##$TPNAME7= <>
##$TPOAL= (0..7)
0.5 0.5 0.5 0.5 0.5 0.5 0.5 0.5 
##$TPOFFS= (0..7)
0 0 0 0 0 0 0 0 
##$TUNHIN= 0
##$TUNHOUT= 0
##$TUNXOUT= 0
##$USERA1= <user>
##$USERA2= <user>
##$USERA3= <user>
##$USERA4= <user>
##$USERA5= <user>
##$V9= 5
##$VALIST= <valist>
##$VCLIST= <CCCCCCCCCCCCCCC>
##$VD= 0
##$VDLIST= <DDDDDDDDDDDDDDD>
##$VPLIST= <PPPPPPPPPPPPPPP>
##$VTLIST= <TTTTTTTTTTTTTTT>
##$WBST= 1024
##$WBSW= 4
##$XGAIN= (0..3)
0 0 0 0 
##$XL= 0
##$YL= 0
##$YMAX_a= 157305
##$YMIN_a= -231909
##$ZGOPTNS= <>
##$ZL1= 120
##$ZL2= 120
##$ZL3= 120
##$ZL4= 120
##$ABSF1= 17.49833
##$ABSF2= -2.520708
##$ABSG= 5
##$ABSL= 3
##$ALPHA= 0
##$AQORDER= 0
##$ASSFAC= 0
##$ASSFACI= 0
##$ASSFACX= 0
##$ASSWID= 0
##$AUNMP= <proc_1d>
##$AZFE= 0.1
##$AZFW= 0.1
##$BCFW= 0
##$BC_mod= 2
##$BYTORDP= 0
##$COROFFS= 0
##$CY= -3
##$DATMOD= 1
##$DC= 0
##$DFILT= <>
##$DTYPP= 0
##$F1P= 0
##$F2P= 0
##$FCOR= 1
##$FTSIZE= 16384
##$FT_mod= 6
##$GAMMA= 0
##$GB= 0
##$INTBC= 1
##$INTSCL= 1.334414e-10
##$ISEN= 128
##$LB= 0.24
##$LEV0= 0
##$LPBIN= 0
##$MAXI= 10000
##$MC2= 0
##$MEAN= 0
##$ME_mod= 0
##$MI= 1.114404
##$NCOEF= 0
##$NC_proc= -8
##$NLEV= 6
##$NOISF1= 3.799351
##$NOISF2= 2.8
##$NSP= 0
##$NTH_PI= 0
##$NZP= 0
##$OFFSET= 17.50077
##$PC= 1
##$PHC0= -13357.22
##$PHC1= 7.80098
##$PH_mod= 1
##$PKNL= yes
##$PPARMOD= 0
##$PSCAL= 0
##$PSIGN= 0
##$REVERSE= no
##$SF= 200.130006775562
##$SI= 16384
##$SIGF1= 3
##$SIGF2= 2
##$SINO= 5.538805
##$SIOLD= 16384
##$SREGLST= <1H.CDCl3>
##$SSB= 0
##$STSI= 16384
##$STSR= 0
##$SW_p= 4006.41025641026
##$SYMM= 0
##$S_DEV= 0
##$TDeff= 16384
##$TDoff= 0
##$TI= <>
##$TILT= no
##$TM1= 0
##$TM2= 0
##$TOPLEV= 0
##$USERP1= <user>
##$USERP2= <user>
##$USERP3= <user>
##$USERP4= <user>
##$USERP5= <user>
##$WDW= 1
##$XDIM= 16384
##$YMAX_p= 534714109
##$YMIN_p= -1128307
$$ End of Bruker specific parameters
$$ ---------------------------------
##NTUPLES= NMR SPECTRUM
##VAR_NAME=  FREQUENCY,     SPECTRUM/REAL,   SPECTRUM/IMAG
##SYMBOL=    X,             R,               I
##VAR_TYPE=  INDEPENDENT,   DEPENDENT,       DEPENDENT
##VAR_FORM=  AFFN,          ASDF,            ASDF
##VAR_DIM=   16384,         16384,           16384
##UNITS=     HZ,            ARBITRARY UNITS, ARBITRARY UNITS
##FACTOR=    0.24454680195387, 1,            1
##FIRST=     3502.42933252104, 0,            0
##LAST=      -503.980923889222, 0,           0
##MIN=       -503.980923889222, -1128307,    0
##MAX=       3502.42933252104, 534714109,    0
$$ Real data points
##PAGE= N=1
##DATA TABLE= (X++(R..R)), XYDATA
$$ [...]
6725B17565l81403K96486J040588l66878k02028j21657k76050l5334j57035R0332
6715A04586M27187j07573J29872J13377k62799N42645J68813l37071n68544k47735
6705c7242K06061L59293J17917J32047Q7018P4176j6959l24509K71720o1340l28292
6694D79890J71106J42400o5474j376M34703M7455l32634q0892l87041K72275j69905
6683E10507m4083M06500l2686J04767k57012j87887j30772M7314N08670l53292
6673E72026l4775j63769M47698J43616k76985K86078k17178j20207o3735J65298
6663G38067J79140p7257l98010K29772K83647K65627R8469l3762J61888k2677
6653A424904J62187l62528k09440J48776j05942N10746j49500o40645L11657L99037
$$ plain form
6725 217565 -163838 132648 1173236 806358 604330 482673 206623 171289 14254 104586
6715 104586 531773 424200 554072 667449 404650 947295 1116108 779037 210493 -37242
6705 -37242 168819 528112 646029 778076 865094 939270 922311 597802 869522 808182 479890
6694 479890 650996 793396 727922 726546 1161249 1208704 876070 795178 408137 680412 510507
6683 510507 466424 872924 840238 945005 687993 500106 369334 416648 925318 572026
6673 572026 537251 373482 821180 964796 687811 973889 756711 636504 572769 738067
6663 738067 917207 839950 441940 671712 955359 1220986 1319455 1285693 1447581 1424904
6653 1424904 1587091 1224563 1015123 1163899 1057957 1568703 1419203 778558 1090215 1489252
6643A489252J1433m71908M17668j11532R801j82922K83651M47350J52176j58145
6633A886824m14518j67151K97790K7032l40078K2450L61609K19089m12092N1481
6623A532436j07613m75867L03979K09369K88793k29450R407L21028K62744J53545
6613B268371l35428K96331M71209N4416k22090K1176m6117J32503K40375m7282
6603B833464L92103R2686K62622J55919m03510M40620j5289N85440n25684K64336
6593D082707L04225J48350L24205J80143n58678J00251p7235m9405O72599j81222
6583D945940M37728M74037k05297M11220K38210P3716K14396J38185M73419j67036
6573G034518N67316L41223K54655k01338O62024N34396L74405M43885M23616O71703
$$ plain form
6643 1489252 1500685 1028777 1446445 1334913 1344714 1161792 1445443 1892793 2044969 1886824
6633 1886824 1472306 1305155 1602945 1629977 1289899 1312349 1673958 1893047 1480955 1532436
6623 1532436 1424823 948956 1252935 1462304 1751097 1521647 1531054 1852082 2114826 2268371
6613 2268371 1932943 2229274 2700483 2754899 2532809 2553985 2507868 2640371 2880746 2833464
6603 2833464 3225567 3318253 3580875 3736794 3333284 3773904 3758615 4344055 3818371 4082707
6593 4082707 4386932 4535282 4859487 5039630 4480952 4581203 4503968 4454563 5127162 4945940
6583 4945940 5383668 5857705 5652408 6063628 6301838 6375554 6589950 6728135 7201554 7034518
6573 7034518 7601834 7943057 8197712 7996374 8658398 9192794 9567199 10011084 10434700 11106403
6563A1106403O64497Q87463M72436Q66721K35284M51756J278567J115243P46010
6554A7824380Q66507J231125J868659K181594J891120K973952L794831L753785
6546C6385953N338864N566245O495594P718091R270216J2045807J3120152J6753822
6538A12694744J7424892J6797212R731540k099707j3179303k1128906k1571066
6531I8669406j8529849j3931642j0508765p983980n617416l961214l877915l285836
6523C0972789l023340k826224j578690j924568j643609j583982j588509q85019
6515A5918848j670664q02348n69255q96293n24686k91035p24656p984m04302p38397
6505I289228o5345K4708m06079O6789r80955l75549L80933p0920o15881m33025
$$ plain form
6563 11106403 11770900 12658363 13130799 13997520 14232804 14684560 15963127 17078370 17824380
6554 17824380 18690887 19922012 21790671 23972265 25863385 28837337 32632168 36385953
6546 36385953 41724817 47291062 53786656 61504747 70774963 82820770 95940922 112694744
6538 112694744 130119636 146916848 156648388 154548681 141369378 120240472 98669406
6531 98669406 80139557 66207915 55699150 47715170 42097754 38136540 34258625 30972789
6523 30972789 27949449 25123225 23544535 21619967 19976358 18392376 16803867 15918848
6515 15918848 14248184 13445836 12876581 11980288 11455602 11164567 10439911 10431927 10027625 9289228
6505 9289228 9223883 9248591 8842512 8909301 7928346 7552797 7933730 7862810 7246929 6813904
6495F813904m33516l28073j49878n52495L52984l84617m26504k50757O0950j19063
6485D582935Q2569l14383k52068Q0507m50118l58372j37923K80216k83702o5837
6475C163824M77083o89987K18812l5546k21357J25830k65908J78150L05721j91546
6465C065076o3404J46974j84288j83749j5546J41848j88981j16918K69718k33893
6455B636837K0249K11985o0365k77347n21164k8681j94650J34174j19360l65723
6445A435955M51955K86699l73072J82812p0361l85904k54126J00099K5876N43318
6435A943251l0521m13291K4495k51231J36057k44554J54194J59114m72329m63191
6425E41994M6315L28694K11098j13336L15025j43667j11368k90661J91285K90543
$$ plain form
6495 6813904 6380388 6052315 5902437 5349942 5702926 5318309 4891805 4641048 4701998 4582935
6485 4582935 4665504 4351121 4099053 4179560 3729442 3371070 3233147 3513363 3229661 3163824
6475 3163824 3640907 2950920 3169732 3134186 2912829 3038659 2772751 2950901 3256622 3065076
6465 3065076 3001672 3148646 2964358 2780609 2765063 2906911 2717930 2601012 2870730 2636837
6455 2636837 2657086 2869071 2808706 2531359 2010195 1981514 1786864 1921038 1801678 1435955
6445 1435955 1887910 2174609 1801537 1984349 1913988 1528084 1273958 1374057 1399933 1943251
6435 1943251 1912730 1499439 1523934 1272703 1408760 1164206 1318400 1477514 1005185 541994
6425 541994 588309 917003 1128101 1014765 1329790 1186123 1074755 784094 975379 1265922
6415A265922j61991J82034j18013L36585k12089j09589O3400j22274K30727n3604
6405A301108L42938p87501k82968N36419J02020P1471m57205o3181P7891Q6678
6395I27670k4435J03915m0295l45552k1776l92624N83130J35500r1073p5421J83753
6384I42792J21909m23947L01490M38307J34940m66926J35747j23372N47980J6632
6374A625552n03603J35870M4963M75516m2397K8538K61875l44684N70753L20242
6364B572625J70329j44593l50125L09584p6704l40232m6856k66133p52625l38663
6354G36607J17223l13318J83370N54221P077j20704K470j27787k37103k48200
6344E53856M42373k10123l60707O45950J32935l65949l11822L2177j02972k81641
$$ plain form
6415 1265922 1103931 1285965 1167952 1504537 1292448 1182859 1246259 1123985 1354712 1301108
6405 1301108 1644046 856545 573577 1109996 1212016 1283487 826282 763101 840992 927670
6395 927670 903235 1007150 966855 621303 599527 206903 790033 925533 834460 759039 942792
6384 942792 1064701 640754 942244 1380551 1515491 1048565 1184312 1060940 1608920 1625552
6374 1625552 1121949 1257819 1302782 1778298 1735901 1764439 2026314 1681630 2252383 2572625
6364 2572625 2742954 2598361 2248236 2557820 2481116 2140884 2094028 1827895 1075270 736607
6354 736607 853830 540512 723882 1278103 1285180 1164476 1166946 1039159 802056 553856
6344 553856 996229 786106 425399 1071349 1204284 838335 526513 558690 455718 174077
6334A74077l68634O57270j33505J78648K06609q8239m1355k73793j70796L69000
6324E09282j09648L08910k30l43957L19224l2675R1759k10351k56838j33742K22704
6313C64438j93337O646M52535L00204k3580m62588j80812P0689o4724L44190J63132
6302G76793q8163o17437J07392K07299p725m4637l75446N06901L8643q0368J74042
6291E97294j37929Q0621l87304N22396n30861o6223K11469l3763j67373j00184
6281a1857L53960Q2882j12397P3956j91741m6269j0426q9107J64508J64337k05768
6270A72078j98252M80006M70562k00674j88229o3853l61684R3648l6603J86550
6260C53549K70398k26884j59708j24799l40929L8733L36629j1365o5719J59597
$$ plain form
6334 174077 -194557 462713 329208 507856 714465 626226 584871 311078 140282 509282
6324 509282 399634 708544 708314 364357 683581 650906 742665 532314 275476 141734 364438
6313 364438 171101 177747 630282 930486 906906 444318 263506 334195 269471 613661 776793
6302 776793 688630 71193 178585 385884 378159 333522 -41924 464977 503620 423252 597294
6291 597294 459365 539986 152682 675078 144217 77994 289463 255700 88327 -11857
6281 -11857 342103 424985 312588 386544 194803 148534 138108 49001 213509 377846 172078
6270 172078 -26174 453832 924394 723720 535491 471638 109954 203602 166999 353549
6260 353549 623947 397063 237355 112556 -228373 -189640 146989 135624 69905 229502
6250B29502K35650p1619j57548J5570j4110K06784j78263J02497L53634n61594
6240A60503J42281J46640l49937n3482K02048j5093J80412K2932K8463J64185
6230F28952n00811J43461r3105R6948j65382j17166M73227K23879o16565K28280
6220C01718K20217j58279J92017L00378p9430l93763n84137M95555m27364K04952
6210G1864M30176q55k26990K4838J10230K02317K40711l2150m80123l87432n8883
6199a06297Q4803K81481J88239M5248k47311j83935L1413N11944j27318k74722
6189B03545K47186K19857n19819k40413M37763L55730K23879m66908L7461Q5446
6179E83727K05168P1576k717N20083j12632k63383K7858j02240R7703j91590k87175
$$ plain form
6250 229502 465152 393533 235985 251555 237445 444229 265966 368463 722097 160503
6240 160503 302784 449424 99487 46005 248053 232960 413372 436304 464767 628952
6230 628952 128141 271602 178497 275445 110063 -7103 466124 690003 73438 301718
6220 301718 521935 363656 555673 856051 776621 382858 -201279 294276 -133088 71864
6210 71864 502040 501185 274195 299033 409263 611580 852291 820141 340018 -47414 -106297
6199 -106297 -21494 259987 448226 493474 246163 62228 93641 605585 478267 203545
6189 203545 450731 670588 150769 -89644 348119 703849 927728 460820 498281 583727
6179 583727 788895 860471 857754 1377837 1265205 1001822 1029680 927440 1025143 833553 546378
6168E46378P0463K63129j64378J86297j75359l57428R9992l56908J96927K6379
6158C35492L75047r1910j76138l97054J34359K51726l4780r8530m64873k88582
6148d55243L77781K03855m2707L49475k05104l24663N6871K44197R6697n72369
6138b71210L42178P2395M65763l26856m76086O10484j35204J8038k050m59584
6128a62132M47028n7315J50302j09804K46974l75486l12866O48631L50924r4458
6118G31798J6764l45286K5770J07800L8401J9027j29320j8587L32609L52545o75200
6107D56321j70630j65118M5197N27892j48187l55214L29m60192L33051K38764
6097C02213m68456J37312K97181K15108l66719r1118K68522J60064l52510K46619
$$ plain form
6168 546378 616841 879970 715592 901889 726530 369102 469094 112186 309113 335492
6158 335492 710539 618629 442491 45437 179796 431522 396742 298212 -166661 -455243
6148 -455243 -77462 126393 83686 433161 228057 -96606 -39735 204462 301159 -271210
6138 -271210 70968 143363 609126 282270 -193816 416668 281464 299502 297452 -162132
6128 -162132 284896 227581 377883 268079 515053 139567 -173299 475332 826256 731798
6118 731798 748562 403276 429046 536846 575247 594274 464954 446367 778976 1131521 456321
6107 456321 285691 120573 165770 693662 545475 190261 190590 -269602 63449 302213
6097 302213 -166243 -28931 268250 483358 116639 25521 294043 454107 101597 348216
6087C48216p1528l63794k7957L10201j99531P8013J15881L7243q2442k83111R26
6076a37883J54193J16007L89331k01435m71869N03198q1827K20193L3499K02089
6066G25496N8217l90292j07165K1087l93086J00628R4906K32770J50484K31332
6056G24377l7717J2322l70303l47436L32895J20924j23564J23637j96352K42891
6046D81674r6436l702r5135l105O2578J79645P8304m39246m0919M70732R3495
6035F87885o8093k46382J0801l15943K19621k84311m7686K27564O18769j38229
6025F63996p09987j370M29311k07212J804J77976k8459J72719K5999M6746J8889
6014E90412r08505K14792J51872J31106J22558J97143k90606J34J48715j6037
$$ plain form
6087 348216 276688 -87106 -115063 195138 -4393 73620 189501 226744 144302 -138809 -137883
6076 -137883 16310 132317 521648 320213 -151656 351542 269715 489908 523407 725496
6066 725496 783713 393421 286256 307343 -85743 14885 109791 342561 493045 724377
6056 724377 686660 698982 328679 -18757 314138 435062 311498 435135 238783 481674
6046 481674 385238 381536 286401 283296 345874 525519 603823 164577 123658 594390 687885
6035 687885 619792 373410 384211 68268 287889 3578 -44108 183456 802225 663996
6025 663996 -45991 -47361 381950 174738 176542 354518 326059 498778 524777 571523 590412
6014 590412 -318093 -103301 48571 179677 302235 499378 208772 208906 357621 341584
6004C41584M17813p14472R0546K13150K40250k68724M676L6001J75826j34339
5994D02311k22006j33958P0416M60661J2311r2578k96787l44928L38415K03445
5984C97302L39930M7482n74708J43805O2212n00057J21274M18282j097l70909
5974H3516N22549r4303K44686n47041k83553M91376N24236j22595l73445l01394
5964A44032j78779J36641J1956k46792L33091M09478l42788m42328N87469k28696
5954A83284K79007J42959k00984l78417M6787j95066M7833N10362k34515j14982
5944H6268o7675K42474R0020K0769r313P4876p308k81380N34792J11926l5051
5933G60398n51939N1896O13266k95938J36921K92943k44638n64104J34630M76689
$$ plain form
6004 341584 759397 44925 135471 348621 588871 320147 324823 360824 536650 402311
5994 402311 180305 46347 116763 577424 589735 497157 200370 -144558 193857 397302
5984 397302 737232 784714 210006 353811 416023 -84034 37240 455522 454425 83516
5974 83516 606065 511762 756448 209407 -74146 417230 941466 818871 445426 144032
5964 144032 -34747 101894 113850 -132942 200149 609627 266839 -175489 411980 183284
5954 183284 462291 605250 404266 25849 72636 -122430 -74597 435765 201250 86268
5944 86268 18593 261067 351087 371856 362543 437419 430111 148731 683523 795449 760398
5933 760398 208459 260355 873621 577683 714604 1007547 762909 198805 333435 810124
5923H10124j86461P8912r3146j80922J33020K37673j69034J84409j72148p3256
5913E69171N49904Q2611j04106L2922J64331m63521j03527k69295M34319j04303
5903G88506j1933O1135J96968j63643K4556K67994J52912n02619j06092o3083
5893F44701l40764l49002J59142M51672K46193l50152L33851M61491j76584j92615
5883H87933K9443J09853K8635k61503l39344J09171j02818o414K77269j19124
5873F13101M1966K19413m45327J46758J98708M07334k42359k98731j5703j69827
5863D55333K97785J93256k49246k51995k57400J47520L37659Q9059L8597J46529
5853I47097J04978m66492K61281K3499M02443l00037j31765o76199J31747L30669
$$ plain form
5923 810124 623663 702575 609429 428507 561527 799200 630166 814575 642427 569171
5913 569171 1119075 1201686 1097580 1130502 1294833 831312 727785 458490 892809 788506
5903 788506 776573 837708 1034676 871033 895589 1163583 1316495 813876 707784 644701
5893 644701 303937 -45065 114077 565749 811942 461790 795641 1257132 1080548 887933
5883 887933 917376 1027229 1055864 794361 455017 564188 461370 454956 732225 613101
5873 613101 655067 874480 429153 575911 774619 1181953 939594 640863 625160 455333
5863 455333 753118 946374 697128 445133 187733 335253 672912 761971 800568 947097
5853 947097 1052075 585583 846864 870363 1272806 972769 841004 164805 296552 627221
5843F27221M50943k20633j7175j8246m47950K02393O2737L05123K05962K98678
5833A449053m40985l8855j03327K79694J88101j94190l21677r1946k93570J20014
5823E52312K22690J94417K71098M03599j98415r466p8335m22606m15184J26758
5813F46868K36023J0499L93945K10427k41057l15276K5888L50099k90824n44474
5803D82118R5605P12688K95815j25956p8725J12037K84329k14463j66020M67171
5793A864599P552l25308j49736j74201m14540J83042J7067k65L33067j75403k04589
5782I61285m7680M25473n21890j73887Q9468j66044l51942j6869L44867K04547
5772G47328J81124l25822k19776M97608M98819O02K82997L1904k07926J32639
$$ plain form
5843 627221 1078164 857531 840356 822110 374160 576553 639290 944413 1150375 1449053
5833 1449053 1008068 969213 865886 1145580 1333681 1139491 817814 725868 432298 552312
5823 552312 775002 969419 1240517 1644116 1445701 1436235 1357900 935294 520110 646868
5813 646868 882891 893390 1287335 1497762 1256705 941429 967317 1317416 1026592 482118
5803 482118 577723 1290411 1586226 1460270 1381545 1493582 1777911 1563448 1397428 1864599
5793 1864599 1872151 1546843 1397107 1222906 808366 991408 1008475 1008210 1341277 1165874 961285
5782 961285 913605 1339078 817188 643301 732769 566725 214783 197914 542781 747328
5772 747328 928452 602630 382854 880462 1379281 1379883 1662880 1694784 1486858 1619497
5762A619497j51616N48330k35986k92627o05870m66053K88107J65670j7766j27940
5752G23746R3200j07499l57154K36915K21893K22619j31512q501J92919M9098
5742A135724M37987m39836K59008n3022k49577K33125j18116J29260k40630j31465
5732I62458L41798j05717N09554o16204j93466J71914L01696M71299j8973k83164
5722A541195n85344m42245M81287k55689K51647M6850o2664K04271J13503K70586
5712A563397L28582N5807o22923q161N12789j36452l46846M39970J57754j44766
5702A799151K48471r6885l1624l28167o82551O27767N83541k70215m00155k13760
5692A235573k8809N26346j78139l80227J16711K96059R2630L17050k2863l59344
$$ plain form
5762 1619497 1467881 2016211 1780225 1487598 881728 415675 703782 869452 851686 723746
5752 723746 816946 709447 352293 589208 811101 1033720 902208 893707 1086626 1135724
5742 1135724 1573711 1133875 1392883 1339861 1090284 1323409 1205293 1334553 1093923 962458
5732 962458 1304256 1198539 1708093 1091889 898423 1070337 1372033 1843332 1824359 1541195
5722 1541195 955851 513606 994893 739204 990851 1037701 975037 1179308 1292811 1563397
5712 1563397 1891979 1947786 1324863 1316702 1829491 1693039 1346193 1786163 1943917 1799151
5702 1799151 2047622 1950737 1919113 1590946 908395 1536162 2119703 1849488 1449333 1235573
5692 1235573 1206764 1733110 1554971 1174744 1291455 1587514 1680144 1997194 1974331 1614987
5682A614987k4898j02178M43859j06979K70008K16267m12103N867r414j70005
5672A725411j13461J33933n6948n841O1923P5706k90263N2712J48904l47773K7660
5661A411963K3048K28037l23147k76745P25766K7056n61155L3297K49704J3196
5651A551020L25953j47319K18133j96610L79196l03591l30024M87185j71537l21507
5641A490899K28697J34809l21945j71597J61992m4748P0143p6911m86906J98971
5631A183404L51811L64529N53643m36133l00509J29k2989M6056k06643Q986O6761
5620A609045r526K13976P8687K61471l36036l0185J12623L87260k76402m59562
5610A551351J63018n67606M94905M27298j78129O5700k74725m70687J18887j3787
$$ plain form
5682 1614987 1590089 1487911 1931770 1824791 2094799 2311066 1898963 1904830 1895416 1725411
5672 1725411 1611950 1745883 1688935 1683094 1745017 1820723 1530460 1583172 1732076 1384303 1411963
5661 1411963 1435011 1663048 1339901 1063156 1788922 1815978 1254823 1288120 1537824 1551020
5651 1551020 1876973 1729654 1947787 1751177 2130373 1826782 1496758 1983943 1812406 1490899
5641 1490899 1719596 1854405 1532460 1360863 1522855 1478107 1548250 1471339 984433 1183404
5631 1183404 1535215 1899744 2453387 2017254 1716745 1716874 1693885 1739941 1533298 1542284 1609045
5620 1609045 1599519 1813495 1892182 2153653 1817617 1787432 1900055 2287315 2010913 1551351
5610 1551351 1714369 1146763 1641668 2068966 1890837 1956537 1681812 1211125 1330012 1316225
5600A316225N36982l8089j23384m9231K42564J32722k02117N31708J62808m80360
5590B029828l31227Q83134L93581m05186j73057M01613L79107o30442m54595n4309
5580B038447m16321J46478N76035o5912n4816K72476J52392p6454K7579O8752
5570B668656m5886p0622l18809J22535K22002j6793q4158K51783j85682K68298
5560B811324K21000k93758J31636M59502Q1441O3634J31828J27032j58936k20100
5550C354603K89102l12402j15446q546j83819r3369J73908K01453K92829k05855
5540C392458k79344J96979J76837k59197M03301m94728k91897K08087P92919j61045
5530C684370m21450O4393P1184j42400K53562O97461m90546k28327L71253m34283
$$ plain form
5600 1316225 1853207 1815118 1691734 1642503 1885067 2017789 1815672 2347380 2510188 2029828
5590 2029828 1698601 2581735 2975316 2570130 2397073 2798686 3177793 2547351 2092756 2038447
5580 2038447 1622126 1768604 2344639 2278727 2223911 2496387 2648779 2572325 2599904 2668656
5570 2668656 2622770 2552148 2233339 2355874 2577876 2561083 2476925 2728708 2543026 2811324
5560 2811324 3032324 2738566 2870202 3329704 3411145 3474779 3606607 3733639 3574703 3354603
5550 3354603 3643705 3331303 3215857 3207311 3023492 2930123 3104031 3305484 3598313 3392458
5540 3392458 3113114 3310093 3486930 3227733 3631034 3136306 2844409 3052496 3845415 3684370
5530 3684370 3262920 3327313 3398497 3256097 3509659 4207120 3716574 3488247 3859500 3425217
5520C425217J16872J75970Q347K49365L20275J55659m0556m53891O6932K36120
5510D260310j05101l3048J1454J80488P5278L49016J8973J68661j08803j07879
5500D709349P2033L56576L62940l84876k16345j46113l46482L03466k83186J63312
5490D590674M13594N09756J29816l56673L37144N6108L51688l42511L14864O63488
5480F667948m94457O6141L95732K80400L47682K71460n7341o8814J25224N0221
5470G584196K99113J37265K70386M52500L63394K38236R7721o051R3208o7889
5460I462079j15283J14627N62698L09570J51017Q19015K24084M35789M82300O03479
5450A3049375l34889N85043M254k84476Q83962P21701N85125Q75331J40522N55363
$$ plain form
5520 3425217 3542089 3718059 3726406 3975771 4296046 4451705 4411149 3957258 4024190 4260310
5510 4260310 4155209 4122161 4133615 4314103 4389381 4738397 4757370 4926031 4817228 4709349
5500 4709349 4781382 5137958 5500898 5116022 4899677 4753564 4407082 4710548 4427362 4590674
5490 4590674 5004268 5514024 5643840 5287167 5624311 5680419 6032107 5689596 6004460 6667948
5480 6667948 6173491 6239632 6635364 6915764 7263446 7534906 7477565 7408751 7533975 7584196
5470 7584196 7883309 8020574 8290960 8743460 9106854 9345090 9442811 9436760 9529968 9462079
5460 9462079 9346796 9461423 10024121 10333691 10484708 11303723 11527807 11963596 12445896 13049375
5450 13049375 12714486 13299529 13303783 13019307 13903269 14624970 15210095 16085426 16225948 16781311
5440A6781311M69578L90986J025403P18358Q94197J339306Q47970Q92551J133569
5431B4493229J153946J899963J271060K100058K523548J893334J732335J933385
5423C9000858K307611K456182K655758L349710M326030N487574N787963O731108
5415G2102794O971043P597249Q533179Q167844M787964k157833o474475p892173
5407I1635592o984927n211248k415333j350360J5615J725200K304428L351592
5399H3070559M660131N637550O353801P749918R251746Q101108M287282L448970
5391A32561065M466857N847942Q991074J1062571J4176688J4128188P231507o895405
5383A91570487j8023358k1762880k0312858j5267090j1752316q429587o088605
$$ plain form
5440 16781311 17250889 17641875 18667278 19385636 20279833 21619139 22467109 23359660 24493229
5431 24493229 25647175 27547138 28818198 30918256 33441804 35335138 37067473 39000858
5423 39000858 41308469 43764651 46420409 49770119 54096149 59583723 65371686 72102794
5415 72102794 79073837 86671086 95204265 103372109 108160073 106002240 99527765 91635592
5407 91635592 84650665 79439417 77024084 75673724 75689339 77414539 79718967 83070559
5399 83070559 87730690 93368240 99722041 107471959 116723705 124824813 129112095 132561065
5391 132561065 137027922 142875864 151866938 162929509 177106197 191234385 198465892 191570487
5383 191570487 173547129 151784249 131471391 116204301 104451985 96022398 89933793
5376H9933793l837774k632769j341216p05265p12747o64155j468216r32687k15619
5367G7423345L43619J904114L117137M031271M223795N233010O591759P197035
5359A10065085M768221j401774q317041j1387648j1172365r377509p611420n703146
5351E9862403m161886l591403k329073j532551k082683j827415k142821j845981
5343D0348590j716097k406297k180895p85527m36315j211522l79068n36903M2295
5334C0738261M51300M29504J013996O74651j42980p22456p64905j419216o55819
5325B9602336o13552m080O88810P23622j39097m35039j091308k092675j414164
5316B5224853j433617r81777q60779r98448k94910l39769m56470n01427L61632
$$ plain form
5376 89933793 86096019 83463250 82122034 81416769 80704022 80039867 78571651 77638964 77423345
5367 77423345 77766964 79671078 82788215 86819486 91043281 96276291 102868050 110065085
5359 110065085 114833306 113431532 105114491 93726843 82554478 73176969 65565549 59862403
5351 59862403 55700517 52109114 49780041 48247490 46164807 44337392 42194571 40348590
5343 40348590 38632493 36226196 34045301 33259774 32823459 31611937 31232869 30695966 30738261
5334 30738261 31189561 31619065 32633061 33307712 33164732 32442276 31677371 30258155 29602336
5325 29602336 28988784 28984704 29673514 30397136 30258039 29823000 28731692 26639017 25224853
5316 25224853 23791236 22809459 21948680 20950232 20655322 20315553 19859083 19357656 19719288
5307A9719288n51395Q2333Q23032k88576n59050m07772p84564p05051l54272p526
5297A6966447j16848M4042N91532j74981n68994j045535j033711r62716p34144
5288A2965092j19208o37934Q44088l10371o39034k10073j041633n52350n23284
5279I775293P3391l02194o02378n57083m4577J8845p2327m91094l04355K66709
5269G760230K12681j3125M4774k23777r784j56665J07528l10997N51739J60156
5259H122760l1624J5913m5571K22732j92773k34468l75233j8491J91238j71089
5249G483394r6587Q7687j18259r0007K32618J17310K69479l886N9747R1211K11963
5238H244670j09107P46333L94074k31816K02429O00604N16922J53751N28535J579754
$$ plain form
5307 19719288 19167893 19250226 20073258 19784682 19225632 18817860 18033296 17328245 16973973 16966447
5297 16966447 16849599 16893641 17485173 17310192 16741198 15695663 14661952 13699236 12965092
5288 12965092 12845884 12207950 13052038 12741667 12102633 11892560 10850927 10298577 9775293
5279 9775293 9848684 9546490 8944112 8387029 8342452 8361297 8288970 7797876 7493521 7760230
5269 7760230 7972911 7959786 8004560 7780783 7770999 7614334 7721862 7410865 7962604 8122760
5259 8122760 8091136 8107049 8061478 8284210 8091437 7856969 7481736 7463245 7654483 7483394
5249 7483394 7386807 7474494 7356235 7266228 7498846 7616156 7885635 7881749 7941496 8032707 8244670
5238 8244670 8135563 8881896 9275970 9044154 9246583 9847187 10364109 10517860 11046395 12626149
5228A2626149K27473P08752R66089J9719l47245o42315p82645j017759m73082
5219A1285136J73290l44198N3106j43742P4796O9658L04058L04859M22323N8932
5209A2258218N42245J046064M87301M73132J019644J744661J233242J660470J978515
5200B2443492Q09179n48692r32257j435842j606506j415564j113801j393643j65657
5191A4640709K36840j22715p5377O84186j36163K02148j37315O98091Q68771R13690
5181A7772865O75570J862960J575207K051325K565219K922027L265402L441429
5173C6132004L764882M564182O053601Q184011N572395k613327q518285q980322
5165D4159141q178802o148515l670847k959940j675808j459107j140779l04729
$$ plain form
5228 12626149 12853622 13562374 14528463 14548182 14200937 13558622 12775977 11758218 11285136
5219 11285136 11458426 11114228 11167334 11023592 11098388 11168046 11472104 11776963 12199286 12258218
5209 12258218 12800463 13846527 14333828 14806960 15826604 17571265 18804507 20464977 22443492
5200 22443492 23252671 22703979 21771722 20335880 18729374 17313810 16200009 14806366 14640709
5191 14640709 14877549 14754834 14679457 15363643 15227480 15429628 15292313 15990404 16859175 17772865
5181 17772865 18448435 20311395 21886602 23937927 26503146 29425173 32690575 36132004
5173 36132004 39896886 44461068 50514669 58698680 64271075 61657748 53139463 44159141
5165 44159141 35980339 29831824 26160977 23201037 21525229 20066122 18925343 18620614
5157A8620614k75235o87380n65582r96744j10350q8298n52582N25828K27363M54279
5147A6551913Q09916Q61776J661920L187543J329083j106971j756317k076554
5139A9462309j895319r85846m44535j018681n73455m48444l98383l63242m09854
5130A2924550k67516o87535o68603K83803o0958o95329n27392M8514l58625K01835
5120A0192744l36412O4870M41528J85020O7003n2999j36543R8292L832K47217
5110A0774552r4509N3996K46344K06775p9280M4592N25665P31948M86929l2542
5100A2864470p87754n00181M47387J57609J92251j45201K09488L47702J095221
5091A3880992L38279j08860m3067K33985Q17094L0659M99826L76386L46010M55608
$$ plain form
5157 18620614 18345379 17657999 17092417 16095673 15985323 15897025 15344443 15870271 16097634 16551913
5147 16551913 17361829 18223605 19885525 23073068 24402151 23295180 21538863 19462309
5139 19462309 17566990 16581144 16136609 15117928 14544473 14096029 13697646 13334404 12924550
5130 12924550 12657034 11969499 11300896 11584699 11523741 10828412 10301020 10349534 9990909 10192744
5120 10192744 9856332 9921202 10362730 10547750 10614753 10561754 10425211 10523503 10527335 10774552
5110 10774552 10680043 10734039 10980383 11187158 11107878 11152470 11678135 12410083 12897012 12864470
5100 12864470 12076716 11576535 12023922 12181531 12373782 12228581 12438069 12785771 13880992
5091 13880992 14219271 14110411 14067344 14301329 15118423 15149082 15648908 16025294 16371304 16826912
5081A6826912R17699J095888K48056K94454K86246Q04778J416036J183937O78062
5072B3752068N87184J323467O66775P45520J341570J903556J485474K649090L152816
5063C7607520K999377L764821M939625N719563O531238P446080N947484K671100
5055G7626808r95239l118576l924893l696261k865802k577375j446118j081976
5047E7920568q76455J04061J020406J304676J902917K201834L569168M977769
5039G2124944N675331O045504P001757Q691798R828213J1598662J2585918J0241680
5031A43793807K446308q317782j4882304j5890696j3828601j0245373q243093
5024G4832266o047215n265904l567367k443688j992266j022805r19620k24651
$$ plain form
5081 16826912 17744611 18840499 19088555 19383009 19669255 20474033 21890069 23074006 23752068
5072 23752068 24339252 25662719 26329494 27075014 28416584 30320140 31805614 34454704 37607520
5063 37607520 40606897 44371718 49311343 55030906 61562144 69008224 74955708 77626808
5055 77626808 76631569 73512993 69588100 65891839 63026037 60448662 59002544 57920568
5047 57920568 57044113 57148174 58168580 59473256 61376173 63578007 67147175 72124944
5039 72124944 77800275 83845779 90847536 99539334 109367547 120966209 133552127 143793807
5031 143793807 146240115 137922333 123040029 107149333 93320732 83075359 74832266
5024 74832266 68785051 63519147 59951780 57508092 55515826 54493021 53573401 53348750
5016E3348750J149625J176494K026973L140594K604747L153568M042812N127599
5008G5771162N760016N112553L618745j773577o586385r371939r163595p394783
5000E5972197n459651m265714l045179j842226j990536j001885l82508m68174
4992C7516324j59965k97202J10419o40906m22619j057984k122017k071786j903068
4983B8951196j732507j386527j092277j058631p94920l89031j87343n26792K57576
4974B2040744J74982J98160N97200K30961R53787J278096J068946P52580N73051
4965B7868507J07093j80299j150604j591143j460144j383780j215132j072064
4957A9922434q53089r01234o92299n66622n17669K40305k80455j58265O1682l60498
$$ plain form
5016 53348750 54498375 55674869 57701842 60842436 63447183 66600751 70643563 75771162
5008 75771162 81531178 86643731 90262476 88488899 81902514 72530575 63366980 55972197
5000 55972197 50512546 46246832 43201653 41359427 39368891 38367006 37984498 37516324
4992 37516324 37356359 37059157 37169576 36528670 36106051 35048067 32926050 30854264 28951196
4983 28951196 27218689 25832162 24739885 23681254 22886334 22497303 22309960 21783168 22040744
4974 22040744 22215726 22413886 23011086 23242047 24195834 25473930 26542876 27295456 27868507
4965 27868507 27975600 27795301 26644697 25053554 23593410 22209630 20994498 19922434
4957 19922434 19069345 18168111 17475812 16909190 16391521 16631826 16351371 16193106 16254788 15894290
4947A5894290M5277N18099K36933J59393O35995L49326M43422K46510L31517l3836
4937A8826926l63322r99416k60741m27971j28910n99488L51379J0756j92948J24875
4927A6341140J81164j8126P5593M28002L55654P2650L3430j88925L35443L12758
4917A7928783p0176L28689M90818J68511J93505J65257L0495O91210Q8356O73221
4907B0688669L70735K10754M70304Q21619P20461O13690N81520Q06685J179327
4898B6463764R69506Q32568R98544J582915J312137J297476J714436J912337K465747
4889C9549430K527568J728350K772145L815813M476065M974940M722813K600530
4881F7167654J413604J836400L337251N146046O529592Q203416J0476370J2849545
$$ plain form
4947 15894290 15939567 16457666 16694599 16853992 17489987 17839313 18282735 18529245 18860762 18826926
4937 18826926 18463604 17464188 17203447 16775476 16646566 16047078 16398457 16409213 16216265 16341140
4927 16341140 16522304 16504178 16579771 17007773 17363427 17436077 17469507 17280582 17616025 17928783
4917 17928783 17858607 18187296 18678114 18846625 19040130 19205387 19235882 19927092 20015448 20688669
4907 20688669 21059404 21270158 21740462 22562081 23282542 23896232 24477752 25284437 26463764
4898 26463764 27433270 28265838 29264382 30847297 32159434 33456910 35171346 37083683 39549430
4889 39549430 42076998 43805348 46577493 50393306 54869371 59844311 64567124 67167654
4881 67167654 68581258 70417658 73754909 78900955 85430547 93633963 104110333 116959878
4873A16959878J4495417J7982787K2543269K6924041K9427018K8474804L1209427
4866B88016641K5911941N988220L11566o523927k6746065l2873326l2294435l3629725
4858A88160890k9011567k4262073j9392371j4344705j0850153r094419p545076
4851G3660526n819191n817540m593698m500234m280411k917689l247617k864709
4843C9619437k025684j818544j909513j182756j529161j375690j173207j122365
4835B7482517q55242p82817o38003r85128r08984l92177p92010q46082j040490
4826B0241584o65776n49152p59203n51287q75491j44297p17778o0107l80791n25546
4816A5012156m21931J1932m82544k87272l72129m52201M932n22840M10119p23543
$$ plain form
4873 116959878 131455295 149438082 171981351 198905392 228332410 256807214 288016641
4866 288016641 313928582 319916802 320228368 313704441 286958376 254085050 221790615 188160890
4858 188160890 159149323 134887250 115494879 101150174 90300021 81205602 73660526
4851 73660526 67841335 62023795 57430097 52929863 48649452 45731763 42484146 39619437
4843 39619437 37593753 35775209 33865696 32682940 31153779 29778089 28604882 27482517
4835 27482517 26627275 25844458 25206455 24221327 23312343 22920166 22128156 21282074 20241584
4826 20241584 19575808 19026656 18267453 17716166 16840675 16696378 15978600 15918493 15537702 15012156
4816 15012156 14590225 14602157 14119613 13832341 13460212 13008011 13012943 12490103 12900222 12176679
4806A2176679l09713j53819j33117K8156k65236j20432j72341l96477k71430k58793
4796A0123477l2997j09966P5533p33497j46052k76779p31258P78593K30715k31647
4786H946122l49706k09760j84215l41206k68497O1222k71758k27511j81568R187
4776F982310o04866L86676Q1190p1487L28510n74669L1088j7790o37041m49400
4766E454521J41352j29281J62481K6090J78619l39723P7431q0084n56794k03342
4756D731270M88396m1752m50096L4210R44487j29433m92926R4966K90446l48255
4746E121313J44223N72908m5611O2135o15581L01526O0900p53425n3724M0489
4736D835153j31321L07035m19263M7329l3754l42149l60988j21256O2730j0639
$$ plain form
4806 12176679 11866966 11713147 11580030 11608186 11342950 11222518 11050177 10653700 10382270 10123477
4796 10123477 10090480 9980514 10056047 9322550 9176498 8899719 8168461 8947054 9177769 8946122
4786 8946122 8596416 8386656 8202441 7861235 7592738 7653960 7382202 7154691 6973123 6982310
4776 6982310 6377444 6764120 6845310 6773823 7102333 6527664 6558752 6540962 5903921 5454521
4766 5454521 5595873 5466592 5629073 5655163 5833782 5494059 5571490 5491406 4934612 4731270
4756 4731270 5219666 5177914 4727818 4762028 5706515 5577082 5084156 5179122 5469568 5121313
4746 5121313 5265536 5838444 5792833 5854968 5239387 5540913 5601813 4848388 4794664 4835153
4736 4835153 4703832 5010867 4591604 4638933 4605179 4263030 3902042 3780786 3843516 3832877
4726C832877J74561M2075j01928l63045k93570J47301M14676M5120n23531L05066
4716C679602J8152j288K55121j02302l82590p7390j8144l13906L069L9526k50523
4705B849327J62007K30783l6222j83883k22193l24835j949l79766M88026n7440
4695B523855J58328L82051o4347m94106K20177J01210K5176o8215l54775l67055
4685B062299K1117K75469L30469J53356p06298j78727K06056M5466k34596l8481
4675A936130K83987L72243j55637j91323j33745J9229l19270j13614M43850M92475
4665B634325k03713J36460j94029m80769o9612K66824K02291J90752m67343m32422
4655A582764j7229M47354k94950K93135q4636l0983n8044m5151K97483L30155
$$ plain form
4726 3832877 4007438 4049513 3947585 3584540 3290970 3438271 3852947 3898067 3374536 3679602
4716 3679602 3697754 3696466 3951587 3849285 3466695 3389305 3371161 3057255 3060324 3099850 2849327
4705 2849327 3011334 3242117 3205895 3022012 2799819 2474984 2473035 2093269 2581295 2523855
4695 2523855 2682183 3064234 2999887 2505781 2725958 2827168 2852344 2784129 2429354 2062299
4685 2062299 2083416 2358885 2689354 2842710 2136412 1957685 2163741 2209207 1974611 1936130
4675 1936130 2220117 2592360 2436723 2245400 2111655 2130884 1811614 1698000 2141850 2634325
4665 2634325 2430612 2567072 2373043 1892274 1822662 2089486 2291777 2482529 2015186 1582764
4655 1582764 1565535 2012889 1717939 2011074 1926438 1895455 1837411 1792260 2089743 2419898
4645B419898l53978J05722n7738r4111K4156p0253l49108j62021K99482L4754
4635A796803M37899k33561k59170M6869m0537j54280r56K22784K61509J68535
4625B245895j89122o46672O6838O73504L26650l37019J52577p8706j3891l1668
4615B168386n2378k3445k83628J62475N15255j23364l5626l26085l11888L37989
4605B027691N474l9844J38492l2143L0276K97728J70591L60797M99531m47148
4595C011445j42527K52094O07176J90881j64735j57888q3597k21385j57077N44756
4585C679143k20370l54362k85025l0624j02957K92482o1357j8672K26853k86205
4575B838906r3362j43874j23305L02479K34722p0111o20408J8994j37258q4226
$$ plain form
4645 2419898 2065920 2171642 2113904 2019793 2043949 1973696 1624588 1462567 1762049 1796803
4635 1796803 2234702 2001141 1741971 1788840 1748303 1594023 1593067 1815851 2077360 2245895
4625 2245895 2056773 1410101 1476939 2150443 2477093 2140074 2292651 2213945 2200054 2168386
4615 2168386 2116008 2092563 1808935 1971410 2486665 2363301 2327675 2001590 1689702 2027691
4605 2027691 2033165 1993321 2131813 2099670 2129946 2427674 2598265 2959062 3458593 3011445
4595 3011445 2868918 3121012 3728188 3919069 3754334 3596446 3512849 3291464 3134387 3679143
4585 3679143 3458773 3104411 2819386 2788762 2685805 2978287 2916930 2898258 3125111 2838906
4575 2838906 2745544 2601670 2478365 2780844 3015566 2945455 2325047 2344041 2206783 2122557
4565B122557M05734j97103L89178n36852q590K84180L44973J56642N1503o5496
4555B946726l77868O9234M37634J98269k13199m14370N74636R3317j66863l0306
4545C117210J42822N1938k38428K32510K64998K29181J91514k46244L83147n5551
4535D073097r1651K48061K54319j42771N8462M05781k23766J78873J11890Q4086
4525D956381P9655L58940n90092L07826L93245l74146r4013L73012J67953R06579
4515F485340j17471l47506N8529K69814p53649L25368Q41894M1471J7515q7464
4505F733841J01236K24183M27496K92325J9049N81398M47532J50447J40458M77305
4495I595270L34434L99580L90946N89649O44625O79694O06114L35136J090466
$$ plain form
4565 2122557 2528291 2331188 2720366 2183514 2174924 2459104 2804077 2960719 3012222 2946726
4555 2946726 2568858 2638092 3075726 3273995 3060796 2646426 3221062 3314379 3147516 3117210
4545 3117210 3260032 3311970 3073542 3306052 3571050 3800231 3991745 3745501 4128648 4073097
4535 4073097 3981446 4229507 4483826 4341055 4399517 4805298 4581532 4760405 4872295 4956381
4525 4956381 5036036 5394976 4804884 5112710 5505955 5131809 5037796 5410808 5578761 6485340
4515 6485340 6367869 6020363 6078892 6348706 5595057 5920425 6762319 6803790 6821305 6733841
4505 6733841 6835077 7059260 7486756 7779081 7798130 8379528 8827060 8977507 9117965 9595270
4495 9595270 9929704 10329284 10720230 11309879 11954504 12634198 13240312 13575448 14665914
4486A4665914J195039M14102J000382J257181R90326Q93937R42950K267696K855982
4477B6483509K853295L454160M397574M856128O051444O321401Q379533J0306209
4469G3103253J3679886J7612096J9093699J1081997P08595j2071941k0932045
4462A02275540k0211339j6473639j1614366p958047n225534m147408l465800k970853
4454C0208554k144010k038389k129855j434114j356262j282893q69072r63594
4446A7990365m30331j95651j012407j83400j39151N28677l32797q79094j338P14649
4436A6059522N59221J31597J20313K5335O52702Q02990R51193Q4140N77661O78124
4426B0642798Q74954Q33166R51977J975285K039313K621353L236722L866301M819478
$$ plain form
4486 14665914 15860953 16275055 17275437 18532618 19522944 20416881 21359831 23627527 26483509
4477 26483509 29336804 32790964 37188538 42044666 48096110 54417511 62797044 73103253
4469 73103253 86783139 104395235 123488934 134570931 135279526 123207585 102275540
4462 102275540 82064201 65590562 53976196 46018149 40792615 36645207 33179407 30208554
4454 30208554 28064544 26026155 23896300 22462186 21105924 19823031 18953959 17990365
4446 17990365 17560034 17364383 16351976 16168576 16029425 16558102 16225305 15346211 15344873 16059522
4436 16059522 16618743 16750340 16870653 16895988 17548690 18351680 19302873 19387013 19964674 20642798
4426 20642798 21517752 22350918 23302895 25278180 27317493 29938846 33175568 37041869 41861347
4417D1861347N050806P031034P830893J0129729J3217688J6548770J6118212N814831
4409A23603310J195050o178903j8188867j8510503j6102217j2653291q347494
4402D4817085o204679n042602l546768k632187k262004k133001k083544j710749
4394A9201551j726212j544938q12778p48676o81557n93958p28154o40102p07142
4385A1018034n14863l13671k88158m48960m78614M8446l34788p06135l52319o85
4375G628287J98782l75325p51240J77452j56232m43936J45613L0478l89942j22487
4365E941450L28390o31512l79605J97258l34168N7253m78575k18504Q3201k61856
4355D303332j08602j84192j92684J97642K66159m00148j44216J9800m1946J49767
$$ plain form
4417 41861347 46912153 53943187 61774080 71903809 85121497 101670267 117788479 123603310
4409 123603310 124798360 118619457 100430590 81920087 65817870 53164579 44817085
4402 44817085 38612406 33569804 30023036 27390849 25128845 22995844 20912300 19201551
4394 19201551 17475339 15930401 15117623 14368947 13687390 13093432 12365278 11725176 11018034
4385 11018034 10503171 10189500 9901342 9452382 8973768 9022214 8687426 7981291 7628972 7628287
4375 7628287 7827069 7451744 6700504 6877956 6721724 6277788 6423401 6453879 6063937 5941450
4365 5941450 6269840 5638328 5258723 5455981 5121813 5179066 4700491 4481987 4565188 4303332
4355 4303332 4194730 4010538 3817854 4015496 4281655 3881507 3737291 3757091 3715145 3864912
4345C864912L68005m80560q2922L6447k87219K66775l88677J90863N4395l16439
4335C225580j1816M72607K58369j00802k11309r6838L4294j67368K85266o66537
4325C021446J0034M23562j48580m23068j40614k48789K85091n34161M7307J76847
4315B469075n27486J89265J93314Q6510k54076O04477l65511j87542L74654m63067
4305B119613j18148K27413N08217r3734n45634l81977K32889j64667K02022J94772
4295B180766q5082J82354k15894m54967k18133M84097K46139j21376j14051N59185
4285B443038M5524r4709j87958J14611q94j54137L16440j63738K37106l1619m32221
4274B091443m74435j41427Q11317j29278K08527J7224l46289J26047Q3939J33940
$$ plain form
4345 3864912 4232917 3752357 3669435 3705882 3418663 3685438 3296761 3487624 3542019 3225580
4335 3225580 3213764 3686371 3944740 3843938 3632629 3535791 3570085 3402717 3687983 3021446
4325 3021446 3031480 3455042 3306462 2883394 2742780 2493991 2779082 2244921 2292228 2469075
4315 2469075 1941589 2130854 2324168 2410678 2156602 2761079 2395568 2208026 2582680 2119613
4305 2119613 2001465 2228878 2737095 2643361 2097727 1715750 1948639 1783972 1985994 2180766
4295 2180766 2095684 2278038 2062144 1607177 1389044 1873141 2119280 1997904 1883853 2443038
4285 2443038 2488562 2393853 2205895 2320506 2319612 2165475 2481915 2318177 2555283 2523664 2091443
4274 2091443 1617008 1475581 2286898 2157620 2366147 2383371 2037082 2163129 2247068 2381008
4264B381008l50381j29709J6979J0064m10823K10913L58344J1321k01785m3536
4254A852395L39954l48742L4600J04612k51449k68078M32961K67129P3090l54716
4244A881756l49126K62585k23171J40265M20948q0994J3374k81067J51191R3223
4234B028984j19192L02290Q9139l65368J6331J81622r8067n1916l00840j00970
4224A582013M52938j13143n20825M27516K37697k65842J25189K07782J80720j44404
4214B169641O427K31929R7806k8982l84242J32650j24014K34256j15914j71469
4204B048088K02890K53660J90951N3617k95804J08534k05636L86908L18325n2412
4194C009121j30871k48241J17274M32527N4135o38093K83983K41450N47098M47824
$$ plain form
4264 2381008 2030627 1900918 1917897 1927961 1517138 1728051 2086395 2097716 1895931 1852395
4254 1852395 2192349 1843607 1878207 1982819 1731370 1463292 1896253 2163382 2236472 1881756
4244 1881756 1532630 1795215 1572044 1712309 2133257 2052263 2065637 1784570 1935761 2028984
4234 2028984 1909792 2212082 2301221 1935853 1952184 2133806 2035739 1983823 1682983 1582013
4224 1582013 2034951 1921808 1400983 1828499 2066196 1800354 1925543 2133325 2314045 2169641
4214 2169641 2176068 2407997 2505803 2476821 2092579 2225229 2101215 2335471 2219557 2048088
4204 2048088 2250978 2504638 2695589 2749206 2453402 2561936 2356300 2743208 3061533 3009121
4194 3009121 2878250 2630009 2747283 3179810 3233945 2595852 2879835 3121285 3668383 4116207
4184D116207L0218J66498J52947R6732M42014O07729K15051l02805M8182O6437
4174E639210l69018m3324m61280l35112j56917m25664o1259R4722J12845l62992
4164C631211k57448n02524O7759o8464j23488L4552j4596N33797L05311M50956
4154D057066j92948j46342k60377n55237L33608K59934k11985L48978k10373J79902
4144C602226j56549J36960K11228l04547K57133L15956O4720j57333K18869J89930
4134D378593m68483J13002R4264k29812L81989n8675J97993L42471L91821m916
4124E138247k06430K71081K93797k7139N4398R4497O22975J26041r4513J52602
4114F425556K72457l16705m48530k78263q145k06967o59906O6050m30754k46120
$$ plain form
4184 4116207 4146425 4312923 4465870 4562602 5004616 5612345 5827396 5524591 5572773 5639210
4174 5639210 5270192 5226868 4765588 4430476 4273559 3847895 3786636 3881358 3994203 3631211
4164 3631211 3373763 2871239 2938998 2870534 2747046 2781598 2767002 3300799 3606110 4057066
4154 4057066 3864118 3717776 3457399 2902162 3235770 3495704 3283719 3632697 3422324 3602226
4144 3602226 3445677 3582637 3793865 3489318 3746451 4062407 4127127 3969794 4188663 4378593
4134 4378593 3910110 4023112 4117376 3887564 4269553 4210878 4408871 4751342 5143163 5138247
4124 5138247 4931817 5202898 5496695 5469556 5523954 5618451 6241426 6367467 6272954 6425556
4114 6425556 6698013 6381308 5932778 5654515 5646370 5439403 4779497 4845547 4414793 4168673
4104D168673L73516l68691q2946K30265k74674P4004J94942l51159N82164L72263
4094D918357K2144q782k65602k06754N50842J83071K66584M18739m24453j99435
4084E254711j41905j27261o3358M49367K09925n47966m3060J95393P6508M95847
4074E758201k05242m41905K4215K75423J32873Q51981J92290j69112K38641j72193
4064F485172Q9508k14753K31103J81447k31832l02751K50998L61813N00802J76565
4054G528072O00263q4623k66120M94111J58311L18053J7376K11588J52141M05989
4044I535161N00715P35494O14799M51355J36793O77774J04956K19543M16642L4139
4034A3427371m16174J13554l19256l01140m49675J56283J42061O07051L85536
$$ plain form
4104 4168673 4542189 4173498 4090552 4320817 4046143 4120147 4315089 3963930 4546094 4918357
4094 4918357 4940501 4931719 4666117 4459363 5010205 5193276 5459860 5878599 5454146 5254711
4084 5254711 5112806 4985545 4922187 5371554 5581479 5033513 4990453 5185846 5262354 5758201
4074 5758201 5552959 5111054 5135269 5410692 5543565 6395546 6587836 6418724 6657365 6485172
4064 6485172 6574680 6359927 6591030 6772477 6540645 6237894 6488892 6850705 7351507 7528072
4054 7528072 8128335 8043712 7777592 8271703 8430014 8748067 8765443 8977031 9129172 9535161
4044 9535161 10035876 10771370 11386169 11837524 11974317 12652091 12757047 12976590 13393232 13427371
4034 13427371 13011197 13124751 12805495 12504355 12054680 12210963 12353024 12960075 13345611
4025A3345611M69910N05639K28217k3881j46472L01517L22561P08056M06941K15459
4015A6333558L70497J565382P25817J403610R81P2556N40245J40668q8478j0872
4005B1053964k99121m76848k42342k9618j4785o02277n43554k87661N4369J77142
3995A8789269m798l01995N2543n9950J15749Q38529j19458L08542K89135M95329
3985B0402895O71725O88255L71009N15791L60206R79819J284889O04358Q97069
3976B6776016M7894N61119J13634n3262p81420j11255L31179n33721L70780L53010
3966B7073974N19575J52237M3359L71137M04783O51136N46164O14060M17423L83591
3956C1177439L16570N79647J288720J078996O42559J618825R09575J439368P97797
$$ plain form
4025 13345611 13815521 14321160 14549377 14525496 14379024 14680541 15003102 15711158 16118099 16333558
4015 16333558 16704055 18269437 18995254 20398864 20399845 20472401 21012646 21153314 21064836 21053964
4005 21053964 20754843 20277995 20035653 20006035 19991250 19388973 18845419 18557758 18612127 18789269
3995 18789269 18784471 18482476 18535019 18475069 18590818 19429347 19309889 19618431 19907566 20402895
3985 20402895 21074620 21762875 22133884 22649675 23009881 23989700 25274589 25878947 26776016
3976 26776016 26823910 27385029 27498663 27445401 26663981 26552726 26883905 26350184 26720964 27073974
3966 27073974 27593549 27745786 27789145 28160282 28565065 29216201 29762365 30376425 30793848 31177439
3956 31177439 31494009 32073656 33362376 34441372 35083931 36702756 37612331 39051699 39849496
3947C9849496K163523J759202J322893K457360L132355J593948K182334L062053
3939E7523164L159835K865398L479508L685475L610518M463757M688306N830537
3931H9306498O990622Q660131J0309803J2777530J4666860J7357574K0987141
3924A81056159K4524330K8213209L4126851M2699933N4883778O8520673O8230431
3917E02255364L2458745k1202945o5552459p8036106o9213071n3279622l7398681
3910B10031225k6864111j9932934j5447652j2110288j0211933q615184p045806
3903A09803317o065950o117053n476927m738559m228029k938071k553150k036723
3895G5648855j316767r80179k8520L31538J111820M34626J791019K445607K254103
$$ plain form
3947 39849496 42013019 43772221 45095114 47552474 50684829 52278777 54461111 57523164
3939 57523164 60682999 63548397 67027905 70713380 74323898 78787655 83475961 89306498
3931 89306498 96297120 104957251 115267054 128044584 142711444 160069018 181056159
3924 181056159 205580489 233793698 267920549 310620482 365504260 434024933 502255364
3917 502255364 534714109 513511164 447958705 369922599 300709528 247429906 210031225
3910 210031225 183167114 163234180 147786528 135676240 125464307 116849123 109803317
3903 109803317 103737367 97620314 92143387 87404828 83176799 80238728 77685578 75648855
3895 75648855 74332088 73351909 73323389 73654927 74766747 75201373 76992392 79437999 81692102
3886H1692102L319225M304730O178701P114873P514887M524677j560012m947299
3878A08141884o111844m593235k373650j520444l6447J031180J210156K487075
3870I8234675K977722L905689M318886O069361O701976R137010J2150052J4149701
3862A57645072J6922154K0915048K5540306L0030632L7044334M6835920N6247060
3855C91180526N0890593L8197870L9829120J0744087l2952478l9582131n2031070
3848D06276517o3088827n6551200m6904702l6509443k5866042j9932885j5456780
3841A41966638j2128790j0185000q332955p820355p068953o373339o517333m893963
3833G8645950m150905l808882l600098k598239j246298j050604j134598p21178
$$ plain form
3886 81692102 85011327 89316057 95494758 102609631 110124518 114649195 113089183 108141884
3878 108141884 102030040 97436805 95063155 93542711 93506264 94537444 95747600 98234675
3870 98234675 101212397 105118086 109436972 115506333 122208309 131345319 143495371 157645072
3862 157645072 174567226 195482274 221022580 251053212 288097546 334933466 391180526
3855 391180526 442071119 480268989 520098109 530842196 497889718 458307587 406276517
3848 406276517 343187690 286636490 239731788 203222345 177356303 157423418 141966638
3841 141966638 129837848 119652848 111319893 103499538 96430585 90057246 83539913 78645950
3833 78645950 74495045 70686163 67086065 64487826 63241528 62190924 61056326 60335148
3825F0335148r89759j536148j962872k967469k603135k426985j863442j766885
3817D4218453j255230j779093j386043r27889o08611q63390o90760j771009m96598
3808C4439830q56427q65556m50791o14133p57223r74242r99066l78303o91219
3799B7852870k62388m94970l3421M30669j95690L50507p672O2901j37278J80521
3789B7746049O49929k38259j31246K7738j67570m62814K94838J49241n26706K12517
3779B7553717j7116L52169k38057O32536L06328P53999R08665Q95424N80477J399865
3769C3128007J821583J866868J772041K319314K567809L274203M800236N601567
3761E7151628O060114L978102j104720l156879l065080j664234k94036R0506J294986
$$ plain form
3825 60335148 59345389 57809241 55846369 52878900 50275765 47848780 45985338 44218453
3817 44218453 42963223 41184130 39798087 38870198 38261587 37398197 36707437 34936428 34439830
3808 34439830 33583403 32717847 32267056 31652923 30895700 29921458 28922392 28544089 27852870
3799 27852870 27590482 27095512 27062091 27492760 27297070 27647577 27639905 27702806 27565528 27746049
3789 27746049 28395978 28157719 28026473 28054211 27886641 27423827 27718665 27867906 27341200 27553717
3779 27553717 27536601 27888770 27650713 28283249 28589577 29343576 30252241 31147665 31728142 33128007
3769 33128007 34949590 36816458 38588499 40907813 43475622 46749825 51550061 57151628
3761 57151628 63211742 67189844 66085124 62928245 59863165 58198931 57904895 57995401 59290387
3752E9290387K557377L401098K866371n71070k821156l239124k358922m75092
3744E8649869O58938J869329L302856N274020O696342L150596l537004n895119
3736G0169827o043974m799527k042148Q3229P81632K273606K796980L893827M597750
3727G1711202M611200M499843M751896O032537M039319n356368r665112j0232706
3719G0391811q687191o586256m036954k497082j090829j002850n57426p44487
3711D5188736p91962J71283M56541J644513K375092K929050K631862L550361M416234
3702F2571710N882597O898422Q684699O087921J659898j696739p357494j1505283
3694G1225731j0664881r046211o203013m946012l168989k009357k292095k147110
$$ plain form
3752 59290387 61847764 65248862 68115233 67544163 64723007 61483883 59124961 58649869
3744 58649869 59308807 61178136 64480992 69755012 76451354 79601950 76064946 70169827
3736 70169827 64125853 59326326 57284178 57367407 58149039 60422645 63219625 67113452 71711202
3727 71711202 76322402 80822245 85574141 91606678 95645997 90289629 80624517 70391811
3719 70391811 61704620 55118364 51081410 48584328 47493499 46490649 45933223 45188736
3711 45188736 44396774 44568057 45024598 46669111 49044203 51973253 54605115 58155476 62571710
3702 62571710 68454307 75352729 84037428 90125349 91785247 90088508 82731014 71225731
3694 71225731 60560850 51514639 45311626 40365614 37196625 35187268 32895173 30748063
3686C0748063j666018j408032j053018j073237j507971J29679q65966p98271p60184
3677B1745045m22054L64388m05496j09209l03853j29302k47282j93848k36557
3668B0061832M78792O47871N99155n1586l91660m040r1142M51688n978j37905
3658B1557027K25387P61829L60341N0672l38247l15181l66979Q9229J16480m2249
3648B2098309O71655O17821N73594k47317j27788j73616J58845n21573J69430
3639B3219360M91326k21072J03089K21124K87222N07677Q9649O44801M52390M17277
3629B6212843J76742L71843O15954P6477Q78281P61642J094254J062847O50357
3620C1901240R41660Q94348O79232J136520J072308J385059J556307P28525J217223
$$ plain form
3686 30748063 29082045 27674013 26620995 25547758 24039787 24169466 23303500 22505229 21745045
3677 21745045 21322991 21687379 21281883 21172674 20868821 20739519 20492237 20298389 20061832
3668 20061832 20540624 21188495 21787650 21736064 21344404 21340364 21249222 21700910 21694932 21557027
3658 21557027 21782414 22544243 22904584 22955256 22617009 22301828 21934849 22024078 22140558 22098309
3648 22098309 22769964 23387785 23961379 23714062 23586274 23412658 23571503 23049930 23219360
3639 23219360 23710686 23489614 23592703 23813827 24101049 24608726 24698375 25343176 25795566 26212843
3629 26212843 26389585 26761428 27377382 27453859 28332140 29093782 30188036 31250883 31901240
3620 31901240 32842900 33737248 34416480 35553000 36625308 38010367 39566674 40295199 41512422
3611D1512422J696334J147893P08271J9271l22032k12128p76446p86196m9599
3602D2937790Q1058J79471P21285P21726R01825Q86896J416230J621800K302213
3593E1770294K721950K803400L241315K812242L436699L702447M063908L174081
3585G7726336L178997K815007K213594J526614N14404k92042j076033j563556
3577H5043321j663888j294076j472175j426954j624440m36779L42881J74505K67816
3568G7910211J810044K618188K158671K238025L035630K927005K553643L924894
3560I9176311L785025L899604L986364L538058L454092L325164K099653J093152
3552A24357423j81392q14323k175757k914667l286576l006313l763632l756683
$$ plain form
3611 41512422 43208756 44356649 45064920 45084191 44762159 44550031 43773585 42987389 42937790
3602 42937790 43018848 43198319 43919604 44641330 45543155 46430051 47846281 49468081 51770294
3593 51770294 54492244 57295644 60536959 63349201 66785900 70488347 74552255 77726336
3585 77726336 80905333 83720340 85933934 87460548 87974952 87682910 86606877 85043321
3577 85043321 83379433 82085357 80613182 79186228 77561788 77125009 77467890 77642395 77910211
3568 77910211 79720255 82338443 84497114 86735139 89770769 92697774 95251417 99176311
3560 99176311 102961336 106860940 110847304 114385362 117839454 121164618 123264271 124357423
3552 124357423 124176031 123361708 121185951 118271284 114984708 111978395 108214763 104458080
3544A04458080l120183k545712j052093p41847k64482J90590P48955J040278J187543
3535I9901129J104938J965424K326401K735825K654080K368873K116371K112720
3527A17285761J435471J034802r593q52278k075834l319594m342479m587834m596120
3518I9972302m657234l780818l362147k385851k689878k348914j712703j176375
3510G7858382j433346j030225o36158p50082k42247n16583m75137j13489r37736
3501G1723379J1271o20705r23069N8074p33959j871850k407231k566522k089949
3492F0579439k028606j991925j282705k375683j526889r21370j249491j271487
3484D7931283n17207q08864l85737o88636q84179n11924j20028n8323m63764L33996
$$ plain form
3544 104458080 101337897 98792185 97740092 96998245 96733763 96924353 97673308 98713586 99901129
3535 99901129 101006067 102971491 105297892 108033717 110687797 113056670 115173041 117285761
3527 117285761 118721232 119756034 119746441 118894163 116818329 113498735 109156256 104568422 99972302
3518 99972302 95315068 91534250 88172103 85786252 83096374 80747460 79034757 77858382
3510 77858382 76425036 75394811 74758653 74008571 73766324 73249741 72774604 72661115 71723379
3501 71723379 71734650 71113945 70190876 70248950 69514991 67643141 65235910 62669388 60579439
3492 60579439 58550833 56558908 55276203 52900520 51373631 50452261 49202770 47931283
3484 47931283 47414076 46605212 46219475 45530839 44646660 44134736 44014708 43956385 43492621 43826617
3474D3826617L32621M35043K67504M23688k98582J57172N9661k03049m91369p03195
3464D3806111j88675j072390m78729p76270p87476n31399m20782o27928m89149
3455C8433313J091328j22181N3383M53974J3538P23567J018778L39620J012564
3446D3017884J329767J189668J094061R81648R41859Q81000R80788J498746J766066
3437E3681487P62909J30911m73452o92945k80961n97053m29410J33182K60993
3428E2495661K45737K11690K51052j56251l76546R4666L7640K25466J055129K79242
3418E4363486J305671J451606K178275K270713K112954K863012K776227J832312
3410G1154256K065315J415654J068857P15040Q067K04276j36081k41684K49241
$$ plain form
3474 43826617 44159238 44594281 44861785 45285473 44986891 45144063 45203724 45000675 44509306 43806111
3464 43806111 43617436 42545046 42066317 41290047 40502571 39971172 39550390 38922462 38433313
3455 38433313 39524641 39402460 39455843 39909817 39923355 40646922 41665700 42005320 43017884
3446 43017884 44347651 45537319 46631380 47613028 48554887 49435887 50416675 51915421 53681487
3437 53681487 54444396 54575307 54101855 53408910 53127949 52530896 52101486 52234668 52495661
3428 52495661 52741398 52953088 53204140 53047889 52671343 52766009 52803649 53029115 54084244 54363486
3418 54363486 55669157 57120763 59299038 61569751 63682705 66545717 69321944 71154256
3410 71154256 73219571 74635225 75704082 76419122 76427189 76631465 76495384 76253700 76502941
3401G6502941K65178K01576r7413p65038q46287n36961j315057n57775P5616O87518
3391G3614298R65551J257244K084869K224431J954184J630259K249992K302059
3383H8282887J567210K199859J942438J740243J647357J163288J958139J426914
3375A01928335K595681K098452J468531J318825M76379q47970r78314j580975
3367A06478944j247281j481817j368689m95387L68960K49962P69753J341733P24410
3358A05340588J267919J103990J628860K541455K950058L557040L836182L714667
3350A25940759M876146M020443K838310J445625k19227O10149J011649K90468
3342A40814322o00509j242148j859207k443066j413496J4730N78644L13688N62647
$$ plain form
3401 76502941 76768119 76969695 76872282 76107244 75260957 74723996 73408939 72851164 72926780 73614298
3391 73614298 74579849 75837093 77921962 80146393 82100577 83730836 85980828 88282887
3383 88282887 89850097 92049956 93992394 95732637 97379994 98543282 100501421 101928335
3375 101928335 104524016 106622468 108090999 109409824 109886203 109038233 108059919 106478944
3367 106478944 105231663 103749846 102381157 101885770 102254730 102504692 103274445 104616178 105340588
3358 105340588 106608507 107712497 109341357 111882812 114832870 118389910 122226092 125940759
3350 125940759 130816905 134837348 137675658 139121283 138902056 139512205 140523854 140814322
3342 140814322 140213813 138971665 137112458 134669392 133255896 133270626 133849270 134162958 134725605
3333A34725605N98367K52677l74977l24931j94155N2706k86838j321571p35176
3324A32391707j447956q30408r34658j059356j443480k279691j713840j154922
3316A21527396k02379m54058K607K41381j84782k41948l14521j640365k684564
3307A16048767l507618l501707k785938k135423j444307j620250j904518k116030
3299I7032976k438413j109777n93469J60033K39004o49957P37877O50202K12132
3290I4240608O50702P05717P00102R86908N25091p0168q59744j165442k557125
3281I3156649k682460k618838k817758k636293k477467k351740j770719k112515
3273G3688859j094863o39302m73336j60199O92814K80628P28410J27557q05798
$$ plain form
3333 134725605 135323972 135576649 135201672 134876741 134682586 134735292 134448454 133126883 132391707
3324 132391707 130943751 130113343 129178685 128119329 126675849 124396158 122682318 121527396
3316 121527396 121325017 120870959 120873566 121114947 120930165 120688217 120373696 118733331 116048767
3307 116048767 112541149 109039442 106253504 104118081 102673774 101053524 99149006 97032976
3299 97032976 94594563 93484786 92891317 93051350 93290354 92640397 93378274 94028476 94240608
3290 94240608 94891310 95597027 96297129 97284037 97809128 97738960 96879216 95713774 93156649
3281 93156649 90474189 87855351 85037593 82401300 79923833 77572093 75801374 73688859
3273 73688859 72593996 71954694 71481358 71321159 72013973 72294601 73023011 73150568 72344770
3264G2344770j196979k408788j651809j491976q05565k36170q24944j020523j391080
3255F1316936q66594l63089j259754n33241L3908m30571N857p8330o72954l82734
3245E6769434r02569m63262j265114j722488j920708j687304j531233j563090
3237D5713666j256656j006323j354959r54050l3974l59390j67550m40950l9730
3228D0100084J53462r92882r77241l19133j93878p67479J24466l47758m88197
3219C6291444j68666m51935m62590k69245n63638m12352p40845r07953q77082
3210C1437138p36959o54781o96099m71173k93781p5892m60019J62343K56823K7987
3200B8495587J27781Q3757n08406j22393j47889j82229n4795m6535P7295j71571
$$ plain form
3264 72344770 71147791 68739003 67087194 65595218 64789653 64553483 63728539 62708016 61316936
3255 61316936 60450342 60087253 58827499 58294258 58328166 57897595 57903452 57825122 57152168 56769434
3245 56769434 55866865 55403603 54138489 52416001 50495293 48807989 47276756 45713666
3237 45713666 44457010 43450687 42095728 41141678 41107704 40748314 40580764 40139814 40100084
3228 40100084 40253546 39260664 38283423 37964290 37770412 37002933 37127399 36779641 36291444
3219 36291444 36122778 35670843 35208253 34939008 34375370 33963018 33222173 32314220 31437138
3210 31437138 30700179 30045398 29349299 28878126 28584345 28508453 28048434 28210777 28467600 28495587
3200 28495587 28623368 28707125 28198719 28076326 27928437 27746208 27691413 27644878 27722173 27550602
3190B7550602p3308l53669k13217j72452L31364J25493j65632R4407k17139j38196
3180B6768253o13250o34649K08038n2528n20849j093006l3695m1232k65165j47252
3170B3574665K05607Q5708K83920j19252K6379M21731N81173J5670j15498L53895
3160B5313998J97120J50126o8466l4713K28950j78224p07999o67351j64355k31601
3150B3837485q42833l71657r5512l22133J15950m65667m69944M62931o39010l29495
3140B0880115L60871l57942j25518L76304k38612J56309J04544J63442O54408
3131B1973921J13210m58038O84797K84088l14666j08755p6860l04309J37712k25742
3121B1705358j57334K97077j65802p41088o67254m11446l93070l2939J80442l0988
$$ plain form
3190 27550602 27477294 27123625 26910408 26737956 27069320 27194813 27029181 27123588 26906449 26768253
3180 26768253 26155003 25520354 25728392 25675864 25155015 24062009 24028314 23987082 23721917 23574665
3170 23574665 23780272 23865980 24149900 24030648 24057027 24478758 25059931 25075601 24960103 25313998
3160 25313998 25511118 25661244 25592778 25558065 25787015 25608791 24900792 24233441 24069086 23837485
3150 23837485 22994652 22622995 22527483 22205350 22321300 21855633 21385689 21848620 21209610 20880115
3140 20880115 21240986 20883044 20757526 21133830 20895218 21051527 21156071 21319513 21973921
3131 21973921 22087131 21629093 22313890 22597978 22283312 22174557 22097697 21793388 21931100 21705358
3121 21705358 21548024 21845101 21679299 20938211 20270957 19859511 19466441 19433502 19613944 19582956
3111A9582956k69058k94724l08064L20010Q1665j52781M50004M86289L67803m10657
3101A9853443N03312o066L79270N33073N22759M22962K75808L99172J334401O12859
3091B4830993n5313l35278P791k02725k12265l76360j017302r07113j102957o44176
3081A9985295j313221m27249l47837m24304m09369r4474m32010l39442k71631
3072A5925758n02756J12632J4894J98698J68255r7061M44767P47855K03113n72000
3062A6644155p91231n65507m72740n98598l54953l9170J94768k62531k23399L8252
3052A3569046k29629L44302J21527M15735L73321l21347j26103m97219J83744
3043A3833377l15304k06083L78848j51574j30616k49296M33917Q02206j84853
$$ plain form
3111 19582956 19313898 19019174 18711110 19031120 19112785 18960004 19410008 19896297 20264100 19853443
3101 19853443 20356755 20350689 20729959 21263032 21785791 22208753 22484561 22883733 24218134 24830993
3091 24830993 24775680 24440402 24448193 24245468 24033203 23656843 22639541 21732428 20629471 19985295
3081 19985295 18672074 18244825 17896988 17472684 17063315 16968841 16536831 16197389 15925758
3072 15925758 15423002 15535634 15550528 15749226 15917481 15820420 16265187 17013042 17216155 16644155
3062 16644155 15852924 15287417 14814677 14216079 13861126 13821956 14016724 13754193 13530794 13569046
3052 13569046 13339417 13683719 13805246 14220981 14594302 14272955 14146852 13649633 13833377
3043 13833377 13518073 13311990 13690838 13539264 13408648 13159352 13593269 14395475 14210622
3034A4210622j87543m32262m52734q36168o01749J31202n70758J5083L48161J62274
3024A1786128K09821o88010M18509k64298o9731L93856j68403l04349J24432k48644
3014A1189311k36216M02736K21449J01851k46377N23543N4959P7906k65140k82244
3004A1541778l99238p4711m58477k33940k32054o91946O404j0392l05653K90887
2994I432658J68996r7151l3629l16812p5449O59826M7875o00441O28467M4433
2984I858773l6960m8695J11681K21810L79812l1176m868J6103p77587J03226M64563
2973A0256682j65743m36088l45852O36332j58803o04329n08683L05063J42678
2964I121257R7929J35840K65796R2294r7208j89671K67587k25427o8543K86271
$$ plain form
3034 14210622 14023079 13590817 13138083 12301915 11700166 11831368 11260610 11275693 11623854 11786128
3024 11786128 11995949 11307939 11726448 11462150 11392419 11786275 11617872 11313523 11437955 11189311
3014 11189311 10953095 11355831 11577280 11679131 11432754 11956297 12011256 12089162 11824022 11541778
3004 11541778 11142540 11067829 10609352 10375412 10143358 9451412 9457816 9447424 9141771 9432658
2994 9432658 9601654 9504503 9470874 9154062 9078613 9738439 9786314 9185873 9814340 9858773
2984 9858773 9821813 9773118 9884799 10106609 10486421 10455245 10450377 10466480 9688893 9792119 10256682
2973 10256682 10090939 9654851 9308999 9945331 9786528 9182199 8673516 8978579 9121257
2964 9121257 9219186 9355026 9620822 9713116 9615908 9426237 9693824 9468397 9399854 9686125
2954I686125l14039O00471P4623k10155m41635k25108j18714k25582k10692R5272
2944H710566j62526L19599k29809k622r8247L07389k7960l00682M41387K6383
2934H983478k06185J05805j55097n32520N775L39496k95409J6900L08924m7800
2924H523367j27273k09281N8166J29202o41743k63783P07708K6498l42860j93014
2914G666987p679P7313K693k28640M51151m6162l1206j53371k13334m32947m00386
2903F684419K06103j28496o1298k02189j54921L45921n57084K20589M16772m65224
2893F304592o19659Q8063o1600O6008n6030l81600j82006j22984O77897J04167
2883E816848k49691N66655k0506m90536N9944j51265j01979M3199L55184m4036
$$ plain form
2954 9686125 9372086 9972557 10047180 9837025 9395390 9170282 9051568 8825986 8615294 8710566
2944 8710566 8548040 8867639 8637830 8635208 8536961 8844350 8816390 8515708 8957095 8983478
2934 8983478 8777293 8883098 8728001 8195481 8201256 8540752 8245343 8262243 8571167 8523367
2924 8523367 8396094 8186813 8244979 8374181 7732438 7468655 8176363 8202861 7860001 7666987
2914 7666987 7659308 7736621 7739314 7510674 7961825 7915663 7884457 7731086 7517752 7084805 6684419
2903 6684419 6890522 6762026 6700728 6498539 6343618 6689539 6132455 6353044 6769816 6304592
2893 6304592 5684933 5772996 5711396 5777404 5721374 5339774 5157768 5034784 5712681 5816848
2883 5816848 5567157 6133812 6113306 5622770 5682714 5531449 5429470 5472669 5827853 5783817
2873E783817K88367O9479o27294j61013l64472L12891k5368n04928M2319k19665
2863D594133J81323n8933k2994k01579k41268L9256O4873j89630M7717P5947L42964
2852D631809n64062j3289j76743L72824K77475J89977K33252N9913k95697L08158
2842E023617Q2363j53047q0886K87321O5697K47944J71634k85493N691O1299j81149
2831E244991n50574o1178l108l02399p09457j20274o6659m41177L42402K94358
2821C626925J49193m176l03928N49261k19680J794k8887j74260j56961K59840
2811C699121j56674L66699M31873L6607K05290L31228j93924n57800M27814l27018
2801D263216l05741m63814O8411m65905j92930N15549m26455k23605k62736l9566
$$ plain form
2873 5783817 6072184 6141663 5514369 5353356 4988884 5301775 5276407 4771479 4813798 4594133
2863 4594133 4775456 4716523 4693529 4491950 4250682 4289938 4354811 4165181 4212898 4288845 4631809
2852 4631809 4067747 4054458 3877715 4250539 4528014 4717991 4951243 5011156 4715459 5023617
2842 5023617 5105980 4952933 4872047 5159368 5225065 5473009 5644643 5359150 5364841 5426140 5244991
2831 5244991 4694417 4633239 4630131 4327732 3618275 3498001 3431342 2990165 3332567 3626925
2821 3626925 3776118 3771942 3468014 4017275 3797595 3799389 3770502 3596242 3439281 3699121
2811 3699121 3542447 3909146 4341019 4377626 4582916 4914144 4720220 4162420 4590234 4263216
2801 4263216 3957475 3493661 3562072 3096167 2903237 3418786 2992331 2768726 2505990 2466424
2791B466424o7871k35089r0543Q1755J95002J44776l90098j54545J96806N52117
2781B698734k76338J05139r6210J20317n22581m02580N82912o15904k41128M82324
2771A834685j01133J74622l14077m5707J12492j71580K56227J15932o64980k05327
2761I91154K51757L09983j26689O4961l8487M26294l3323l28570J1214j18487
2751A409807j84571l9668p0469K83297L08631k45104p1706k26279J81608j45956
2741A199590j24594r2909k50058K21754n19439k38678L53487L05333l37572j48166
2731C68748J60519l74977J03575N69063n77751l47816L3291n7288L23348K12876
2721D13588m8827k47903J70031M53906j4468j43867J38178n00356O8155K2242
$$ plain form
2791 2466424 2398553 2163464 2072921 2154676 2349678 2494454 2104356 1949811 2146617 2698734
2781 2698734 2422396 2527535 2431325 2551642 2029061 1626481 2209393 1593489 1352361 1834685
2771 1834685 1733552 1908174 1594097 1548390 1660882 1489302 1745529 1861461 1196481 991154
2761 991154 1242911 1552894 1426205 1491166 1452679 1878973 1845650 1517080 1528294 1409807
2751 1409807 1225236 1185568 1115099 1398396 1707027 1461923 1390217 1163938 1345546 1199590
2741 1199590 1074996 982087 732029 953783 434344 195666 549153 854486 516914 368748
2731 368748 529267 154290 257865 826928 249177 -98639 -65348 -122636 200712 413588
2721 413588 364761 116858 286889 740795 726327 582460 720638 220282 288437 310679
2711C10679n15626Q7945N06441M02864M4573n55693J96552l43773j91928j09703
2701a67669J52915K48625k84234l13979R7875L19957J18932l89515q1851M6444
2691b52500J20055K35607L9280n82239J75886o4405Q1527N8149Q0945N21202J99117
2680F12624m25839m2885O7981J62156L35802l88754l40904q3094l44296L57544
2670h9665J87158l20541N0673j49541R5281o5110L30225m64197k56317N84719
2660i7315j31124p7303k90526O35055K0497m4438l36682k1998R9878j46317L29176
2649f1097J64703K33956j08223J66289n34232l5599J8456p4517L3205k15671l35983
2638g48713J97680O55164l8839j2624l04392j38318M13034k71360L86893J43240
$$ plain form
2711 310679 -204947 -117002 389439 792303 836876 281183 477735 133962 -57966 -167669
2701 -167669 -14754 233871 -50363 -364342 -266467 53490 172422 -217093 -298944 -252500
2691 -252500 -132445 103162 142442 -439797 -263911 -328316 -246789 -188640 -107695 413507 612624
2680 612624 186785 143900 211881 374037 709839 321085 -19819 -102913 -447209 -89665
2670 -89665 97493 -223048 -172375 -321916 -226635 -291745 38480 -425717 -682034 -97315
2660 -97315 -228439 -305742 -596268 38787 59284 14846 -321836 -343834 -243956 -390273 -61097
2649 -61097 103606 337562 229339 395628 -138604 -174203 -155747 -230264 -197059 -412730 -748713
2638 -748713 -551033 104131 65292 52668 -251724 -390042 22992 -248368 138525 281765
2628B81765M62314j56798m55073j82631J53382K30975l27020J68814L74330n26075
2618B3983K86106K25073n76343J05836K77559l94797l70197L88979L6009K06253
2608B08461l94123k39873M0840K51398K59715m09773J51147K56423j3287L4352
2598A45280j84112p3166N96005l63768j45262j6680l9842r8542k53647j6457L35898
2587a14293j73327l35493N48469q5529o4924J36316l5616J16696J19668m44410
2577c32443K45745p8973n5773L0312J03918N07043J18647n1434l59114l9272j44305
2566e5649k04088K98292j50544L07035J92224k35689j89785L00629K05427l49972
2556A17880K81865N41814j67156j1760l94801k32492j17649J75716r2115l6974
$$ plain form
2628 281765 744079 587281 132208 -50423 102959 333934 6914 175728 550058 23983
2618 23983 310089 535162 -41181 64655 342214 -52583 -422780 -33801 2208 208461
2608 208461 -185662 -425535 -384695 -133297 126418 -283355 -132208 124215 110928 145280
2598 145280 -38832 -111998 484007 120239 -25023 -41703 -81545 -180087 -433734 -450191 -114293
2587 -114293 -287620 -623113 -74644 -160173 -225097 -88781 -124397 -7701 111967 -332443
2577 -332443 -86698 -165671 -221444 -191132 -87214 419829 538476 487042 127928 88656 -55649
2566 -55649 -259737 38555 -111989 195046 387270 151581 -38204 262425 467852 117880
2556 117880 399745 941559 774403 762643 367842 135350 17701 193417 101302 64328
2546F4328J26713Q0050j15539L61859l07269j14205P20802l73817K08305O9475
2536G20702p2383k15516J99429K07977M9717j25694J73914l79222M0045l23251
2526B75718P4395j56453m5755L13261K80493l53031j59384L77283M40390j99978
2516H46939j527P4468M5348J81034l21537r44L00917l13648n62576L75842K2452
2505F46768k8209N8922L31127k63899K02020J09447L89483n97578p27259L07373
2495D28195p6896j42686K01O07317J73719P5172m00333k5560q7792L48450J4039
2484I13826l95491Q4480q1458j01115j3360M45740k40208m91513m23154K50528
2474e1725L67290L60765M4126j87466k06707k37727L77809o0423k18930K36718
$$ plain form
2546 64328 191041 271091 155552 517411 210142 95937 816739 442922 651227 720702
2536 720702 648319 432803 632232 840209 889926 764232 938146 558924 598969 275718
2526 275718 350113 193660 147905 461166 741659 388628 229244 606527 1046917 846939
2516 846939 845412 919880 965228 1146262 824725 823781 1124698 811050 248474 624316 646768
2505 646768 618559 677481 1008608 744709 946729 1056176 1445659 848081 120822 428195
2495 428195 351299 208613 208814 816131 989850 1065022 664689 639129 551337 899787 913826
2484 913826 518335 602815 521357 420242 406882 852622 612414 120901 -302253 -51725
2474 -51725 315565 676330 720456 532990 326283 88556 466365 405942 187012 423730
2464D23730J45014n3140m2597M1253j4768j04288k10862k0704L74901R5411l67191
2453B66759o10515N02636l9908r0350J17507j69681N64006l7821n32683L15289
2443B85239l5676j22111L17166J08969m56663l06063M31418j16667j16674l36708
2433c47770L63084M4074K04258K14172k78377Q4498K2455l62176k48299J41479
2423a62602K91683r5416L62443m70479k60684L79265Q8483K25726Q9656k10456
2413B37619K92022J49574n97254q5038N28996k78846j92941m0289J82601J34142
2403C30586L48922l57688m43051l9323q7182K87242J9919k86783k64823L54369
2393a37812m47756n0030M31940K04893K08815K64286k89726n30824M97076j08127
$$ plain form
2464 423730 568744 515604 473007 514260 499492 395204 184342 163638 538539 633950 266759
2453 266759 -343756 158880 118972 28622 146129 -23552 540454 502633 -30050 285239
2443 285239 249563 127452 444618 553587 96924 -209139 222279 105612 -11062 -347770
2433 -347770 15314 59388 263646 477818 199441 283939 306394 -55782 -304081 -162602
2423 -162602 129081 33665 396108 -74371 -335055 44210 132693 358419 448075 237619
2413 237619 529641 679215 81961 -3077 525919 247073 54132 13843 196444 330586
2403 330586 679508 321820 -121231 -160554 -247736 39506 59425 -227358 -492181 -137812
2393 -137812 -585568 -635598 -203658 1235 210050 474336 184610 -346214 150862 42735
2383D2735n6748K2965l9952l4353k87357N88899m7499j29785J36675P9505j14992
2372A60093m6520o8431j25437J69877j55360J61200j4305n85775p470L56801k36298
2361c91625J51513k5654m14433K65351L42953L73461k78303J48623J63718N5735
2351C91339n51950J40019J8549J08078j33067l48236K24762K03141o220J19602
2341A66017J7924J78615J80221k36129J51189j15773k80885m72846L18480N0857
2331d2330l7253Q2900P94670j98304L0982l14284l9815k02438l18192N66054K28924
2320E50914l87895n98985K85950q2575O04224m3331K27365M37760j31806J53171
2310A014792l80063L82454K6733p45243M66152j70881J87075O36386l1594k43687
$$ plain form
2383 42735 -14013 8952 -31000 -65353 -352710 236189 188690 58905 195580 275085 160093
2372 160093 113573 45142 -80295 89582 -65778 95422 81117 -504658 -512128 -155327 -391625
2361 -391625 -240112 -265766 -680199 -414848 -71895 301566 23263 171886 335604 391339
2351 391339 -160611 -20592 -2043 106035 -27032 -375268 -150506 52635 46415 166017
2341 166017 183941 362556 542777 306648 457837 342064 61179 -411667 -93187 -42330
2331 -42330 -79583 3317 797987 599683 630665 316381 276566 74128 -244064 321990 550914
2320 550914 163019 -435966 -150016 -232591 371633 328302 555667 993427 861621 1014792
2310 1014792 634729 1017183 1043916 298673 764825 593944 781019 1417405 1385811 1142124
2300A142124K78532J0970m00981L1896l60342n63447p3409M67504q5468n62844
2290a15465r9187Q0863M35105j47468K30694J76545l16238L06224m8939K6083
2280E28217l01541j21446L89963L83701l10807l73387N7166M4805o889l34241
2270d4459K27252p7115M21506o61268P5781J37296M46675q1004L37389R2350j89533
2259F84870J89504k16761j65536m6180J51646Q6394k23474l14331J35461J83242
2249D64835K77844k24853N05939k03449l50545J85442j34895K37435J25008P4011
2239I56772M26894j21428k09494l10037O2209m9375K2072N22658J86920k81848
2229A205343k14120j55625L06123J59990n13963j95345K85065p9719O4994o8597
$$ plain form
2300 1142124 1420656 1431626 1030645 1062541 702199 138752 65343 532847 447379 -115465
2290 -115465 -214652 -133789 301316 153848 384542 561087 244849 551073 502134 528217
2280 528217 226676 105230 495193 878894 568087 194700 251866 296671 289782 -44459
2270 -44459 182793 105678 527184 -134084 -58303 78993 525668 444664 782053 874403 684870
2259 684870 874374 657613 492077 445897 597543 683937 460463 146132 281593 464835
2249 464835 742679 517826 1023765 820316 469771 655213 520318 757753 882761 956772
2239 956772 1383666 1262238 1052744 742707 804916 755541 777613 1300271 1487191 1205343
2229 1205343 991223 835598 1141721 1301711 787748 592403 877468 797749 862743 794146
2219G94146j42132O4707K94639k92148K89627M75010k86244j53928M79799o4177
2209A459299l35409J4478p2085j09888j01585J67170L39829l56604l67244J0758
2199F48719Q4591L10526K13731k5227o4400o6267K02042j99569q659J82740L36500
2188A614727l05273k12831K48346M5339k52944j70454N11288K35154N74771k12695
2178B075428l52879j82294p6321L72315q3140N75113m91899L4550J52166k30612
2168A792427P7722P6113m24830M31679L56514P9030j00585j54414J02123L72766
2158B608545m8811J02478o20488M97019M63721k41908L70951j92791L00212K63051
2148C501979n34609k85257k8241J51685O02259j11509M85226J63786j06990N8659
$$ plain form
2219 794146 652014 716721 1011360 719212 1008839 1483849 1197605 1043677 1523476 1459299
2209 1459299 1123890 1138368 1066283 956395 854810 1021980 1361809 1005205 637961 648719
2199 648719 733310 1043836 1257567 1232340 1167940 1101673 1303715 1104146 1095487 1278227 1614727
2188 1614727 1309454 1096623 1344969 1390308 1137364 966910 1478198 1713352 2288123 2075428
2178 2075428 1722549 1540255 1463934 1836249 1753109 2328222 1836323 1870873 2023039 1792427
2168 1792427 1870149 1946262 1521432 1953111 2309625 2388655 2288070 2133656 2235779 2608545
2158 2608545 2559734 2662212 2041724 2538743 3002464 2760556 3131507 2938716 3238928 3501979
2148 3501979 2967370 2682113 2653872 2805557 3407816 3296307 3781533 3945319 3838329 3896988
2138C896988m3319N44846K75404O9231k88284K36666K61331J60851K91577m79770
2128D925521L30855N3780J48993O31001N95821k08429K51525N89958n38212j79314
2118F601499N57504L08456M94190J02817M3421M05813Q0098m09974J54387J12682
2108H450893N07087K70748O44354O82439J91368M61185N44933J42619K18474K01056
2098A2315156K37791L03454J037869K07247M11273M25721Q89045Q45806J339865
2089A8013227J023020J097670J218109J392693J112213J645251J735080J742485
2081B8979748K029806K686059K243499K701937K988643L690624M393331M709610
2073E4423257M563711O406433O667230R020517J1433561J4116750J4732415K0136983
$$ plain form
2138 3896988 3853669 4398515 4673919 4743150 4454866 4691532 4952863 5113714 5405291 4925521
2128 4925521 5256376 5310156 5459149 6090150 6685971 6477542 6729067 7319025 6780813 6601499
2118 6601499 7159003 7467459 7961649 8064466 8107887 8513700 8593798 8183824 8338211 8450893
2108 8450893 8957980 9228728 9873082 10555521 10746889 11208074 11753007 11895626 12114100 12315156
2098 12315156 12552947 12856401 13894270 14101517 14512790 14938511 15827556 16673362 18013227
2089 18013227 19036247 20133917 21352026 22744719 23856932 25502183 27237263 28979748
2081 28979748 31009554 33695613 35939112 38641049 41629692 45320316 49713647 54423257
2073 54423257 58986968 65393401 72060631 81081148 92514709 106631459 121363874 141500857
2065A41500857K4286131L3753565M3649339O0227616J5589707m7649909m9109386
2058B22247920n1687381l7282555k4566368j7365844j2833800q570814p158660
2051F2782498n595592l890703l202714k713514l610459m756447l855961l847257
2043C1309851k995143k467251j611393j258564j546943j662239j056604n02949
2035A8208765j007358q19431m67023p58647o23047l65534o75711q38741p4471
2026A2578802m13453m41019o12656m28854n66981o71016m9436l68576o41308k84166
2016H101337l00089j95813k12019m18643j43826m98982j55940J6813j96760o9859
2006E926219O8628j71155l29328k23989k29994k02458M79308k09497n6994k26673
$$ plain form
2065 141500857 165786988 199540553 243189892 303417508 319007215 271357306 222247920
2058 222247920 170560539 133277984 108711616 91345772 78511972 69941158 62782498
2051 62782498 57186906 53296203 50093489 47379975 43769516 39013069 35157108 31309851
2043 31309851 28314708 25847457 24236064 22977500 21430557 19768318 18711714 18208765
2035 18208765 17201407 16381976 15914953 15156306 14533259 14167725 13492014 12653273 12578802
2026 12578802 12165349 11724330 11111674 10682820 10115839 9444823 9395387 9026811 8385503 8101337
2016 8101337 7801248 7605435 7393416 6974773 6830947 6331965 6176025 6192838 5996078 5926219
2006 5926219 5994847 5823692 5494364 5270375 5040381 4837923 5317231 5107734 5050740 4824067
1996D824067l5372n25730j00930O45066M8193R5636l56811n98078L73427Q3196
1986D452664M3484n3916n84729j26682K5701m59577L14694n78039j93374k55239
1976B584987l50830K44374K26139j3176l63310K41789m56496o723p0848K03399
1966B239305k96335k08510Q9567L45424l50992p17271j4528K29910m7996J52286
1956A420860K23016K98843k57091o09995K05780k07816J91611K06650j45167m02822
1946I23869k2999m8212k86229J32836P2746m33281O64232K81256o9617l89352
1936H25249j10196Q4111K81916k56193m53120N543N33431j9386j18517L33106
1926A105944P7245m08446o555K00623l83801j20447k12234P7409j6904K81202
$$ plain form
1996 4824067 4788695 4262965 4162035 4807101 4855294 4950930 4594119 3996041 4369468 4452664
1986 4452664 4496148 4442232 3857503 3730821 3756522 3296945 3611639 3033600 2840226 2584987
1976 2584987 2234157 2478531 2704670 2691494 2328184 2569973 2113477 2106754 2035906 2239305
1966 2239305 1942970 1734460 1824027 2169451 1818459 1101188 1086660 1316570 1268574 1420860
1956 1420860 1643876 1942719 1685628 1075633 1281413 1073597 1265208 1471858 1326691 923869
1946 923869 900870 852658 566429 699265 772011 338730 1002962 1284218 1214601 825249
1936 825249 715053 799164 1081080 824887 371767 377310 910741 891355 772838 1105944
1926 1105944 1183189 774743 768188 968811 585010 464563 252329 329738 312834 594036
1916E94036J87333o15873r3477L90926k82824J47377M20806J03653k86662k62886
1906C02409L49646r6897K07997m85214j97429L32306k35290p3612O9721J72591
1896C46228j10878R3717K9621K75062j78623j02440K51426q217k36k63421l99879
1885f7640m230L52224J96173J42047k98852P632m1877O4823j10516K0116M37070
1874F96970L5323m12440L05868j28388k00552o8767o2626M25769k99201K1467
1864C13423k51277M35414K17469k97607J23686n08340m00053Q9928k16463M40689
1854e3131j12867j33944L44365M2109k05268K1483Q88984m46418m43444q1667
1844a79798L53888L01660j40268j30789j67598K67733L1325n40309j70432K09092
$$ plain form
1916 594036 781369 165496 72019 462945 180121 327498 748304 851957 565295 302409
1906 302409 652055 555158 763155 277941 80512 412818 177528 103916 173637 346228
1896 346228 235350 329067 358688 633750 455127 352687 604113 595896 595660 332239 -67640
1885 -67640 -71870 280354 476527 618574 319722 327354 285477 350300 239784 259900 696970
1874 696970 732293 319853 625721 497333 296781 228014 165388 591157 291956 313423
1864 313423 62146 497560 715029 417422 541108 32768 -367285 -277357 -493820 -53131
1854 -53131 -165998 -299942 44423 86532 -118736 -97253 791731 345313 -98131 -179798
1844 -179798 174090 475750 335482 204693 37095 304828 336153 -204156 -374588 -165496
1834a65496N80774M6267n352j91632l44607k25543K23744K71970P8274J5965J15172
1823C99536N96213j77800N110l87N64310L38650k98581o98339l11433k9368J68613
1812E56524j44462k67668O5073j15210k5927m2976K03764K38697p6101n58600
1802a66886K17461K87069l02563K87082j71504K88601m07054l93393K42390k2921
1792a41718L4979R8568J42574R8963l93855K26736M4253J48701k02195k9634r2991
1781f5619r8851R2153N6782l7871J96747l8067j09120J08404k11554j19351K67750
1770D1403J34523Q706p7836l76926J38285J55024L01460o19509j56272L54275
1760i6867J00897J19817j58123j08904l40389K59446K33474J79910k75951j15428
$$ plain form
1834 -165496 415278 461545 456193 264561 -80046 -305589 -81845 190125 268399 284364 399536
1823 399536 995749 817949 823059 822672 1386982 1725632 1427051 728712 417279 387911 556524
1812 556524 412062 144394 209467 94257 68330 25354 229118 467815 391714 -166886
1802 -166886 50575 337644 35081 322163 150659 439260 32206 -361187 -118797 -141718
1792 -141718 -106739 -8171 134403 233366 -160489 66247 110500 259201 57006 27372 -65619
1781 -65619 -164470 -72317 -15535 -53406 143341 105274 -3846 104558 -106996 -226347 41403
1770 41403 175926 184632 106796 -270130 -131845 23179 324639 -294870 -451142 -96867
1760 -96867 4030 123847 -34276 -143180 -483569 -224123 9351 189261 -86690 -202118
1750b02118J68047j16000j51455m3541j34320j14474R71700m08169J63568J42453
1740B75691j67255m69775j04826L98474k48034J39088m10055Q4269J46689q1501
1730d37235Q679j74789N24226M66308j33700j80563j19967l15997J93120J75545
1720E627j93175R5734j31121j75238J59325l6943K28929l93911L13208j3575j73742
1709c14882K12784q520j28004j48467L24016K39788n06672r0414K85939J55811
1699B1379N1629j41785m26233R5465M08889l56655j7734j80877j40918P4678L43861
1688b68301J08969j76649L05712n5213l71132J74216P27083m54431J25642J93313
1678C09209r04017L37125p1574k08898J46119L40960K67355m93521R2052N88000
$$ plain form
1750 -202118 -34071 -150071 -301526 -345067 -479387 -593861 377839 -30330 133238 275691
1740 275691 108436 -361339 -466165 -67691 -315725 -176637 -586692 -502423 -355734 -437235
1730 -437235 -428556 -603345 -79119 387189 253489 72926 -47041 -363038 -169918 5627
1720 5627 -187548 -91814 -222935 -398173 -238848 -275791 -46862 -440773 -127565 -141140 -314882
1709 -314882 -102098 -110618 -238622 -387089 -63073 176715 -329957 -420371 -134432 21379
1699 21379 73008 -68777 -495010 -399545 9344 -347311 -365045 -545922 -686840 -612162 -268301
1688 -268301 -159332 -335981 -30269 -85482 -456614 -282398 444685 -9746 115896 309209
1678 309209 -594808 -257683 -329257 -538155 -392036 -51076 216279 -277242 -185190 402810
1668D02810j42031n13892n4050K22630k38592l7593K04621M0627K16874j71164
1658f9760l79342M76896j38674o58404J24121M50525M53672J49227J37722j20180
1648D25803L8259l94693P4889K66748n45279M1529k85347J37481J71027o1978
1638a31561m34662J781K49102N00812l46542M4192N52258p20265R1189L6136l72494
1627e30054j70710R8647J24101M99145j23356p8235l2139M5273n1240j43722J89863
1616a72427N29034k41523J7828J89153m27911L75227j87350o90900J99218K32806
1606a76845m14513K26K71860L77329j5240k02346o2221N0097l15629k34949M75445
1595b46786J5303j55175J47864j12822j06283K95053M511l5758R1448k3877J19145
$$ plain form
1668 402810 260779 -253113 -307163 -84533 -323125 -360718 -156097 -115470 101404 -69760
1658 -69760 -449102 27794 -110880 -769284 -645163 -194638 259034 408261 545983 425803
1648 425803 464062 69369 144258 411006 -134273 -92744 -378091 -240610 -69583 -131561
1638 -131561 -566223 -564442 -315340 185472 -161070 -116878 435380 -284885 -193696 -157560 -530054
1627 -530054 -700764 -602117 -478016 21129 -102227 -180462 -212601 -167328 -218568 -362290 -172427
1616 -172427 356607 115084 132912 322065 -105846 269381 82031 -608869 -409651 -176845
1606 -176845 -591358 -591132 -319272 58057 42817 -159529 -221750 -171653 -487282 -722231 -246786
1595 -246786 -231483 -386658 -238794 -351616 -457899 -162846 -158335 -194093 -102645 -126522 -7377
1584g377k57425j2627N6154O6597K09494L94712m93888n14859j9088J7194J65982
1573c95131L18790j09400j75301K00959Q7962k59166J51868j51158L20936p4935
1563h4576q5726M39094m07503J32702l4238J04127O8073p3989J64462j01441m27489
1552c06504J10291K55130l27503P6899J52945R570k9665n1361k24440J19657j84925
1541c99906J24201M0575m21225K97863l13830J12951P7453J00602p1388j68325
1531f21029K06324L19255n7902L73791m02439o18631P17013m29291K95695Q6764
1521a30450O4802J27072l28846j07949L4715L38025j47585O56177n36281q1526
1511a11846K75650k05668k41093O45734j77717p77769L87281k12419N2798J43728
$$ plain form
1584 -7377 -264802 -277429 -221275 -154678 54816 449528 -44360 -559219 -578307 -561113 -395131
1573 -395131 -76341 -185741 -361042 -160083 -72121 -331287 -179419 -330577 -9641 -84576
1563 -84576 -170302 268792 -138711 -6009 -40247 63880 131953 57964 222426 120985 -306504
1552 -306504 -196213 58917 -268586 -191687 -38742 -29172 -58837 -110198 -334638 -214981 -399906
1541 -399906 -275705 -235130 -656355 -358492 -672322 -559371 -481918 -381316 -452704 -621029
1531 -621029 -414705 -95450 -153352 220439 -182000 -800631 -83618 -512909 -217214 -130450
1521 -130450 -65648 61424 -267422 -375371 -340656 -2631 -150216 505961 -30320 -111846
1511 -111846 163804 -41864 -282957 362777 185060 -592709 -205428 -417847 -365049 -221321
1501b21321O9899n7716r8301k43422L18371L09066l26139m17681O6426M51904
1491a48914J63793p6192j56321R752J93584N8621J08546n59751M78930k15006
1481a42958l10966J27891L1882K07850Q231K35231k41859k13946N6341Q0124j34682
1470b96861L6215K73496M99468m30844k2622K57067l17411l58248k75394L30378
1460c04756K86244l24554k1192k62120J76251M16712K56317k96351L52120M6183
1450C24854m58008k9339m11335k3532J73072O3093L506K47099J46464k77654k17528
1439d59308r8889J14065J27380l24364l94943n4392R58857Q7821J73346N929k07812
1428g2310p6660m17526N74457k1342m66343L10500K62826J36669j60690m43181
$$ plain form
1501 -221321 -151422 -209138 -307439 -550861 -232490 76576 -249563 -667244 -600818 -148914
1491 -148914 14879 -61313 -217634 -207882 -14298 44323 152869 -406882 72048 -142958
1481 -142958 -453924 -326033 -294151 -86301 -78070 157161 -84698 -298644 -242303 -162179 -296861
1470 -296861 -260646 12850 512318 81474 58852 315919 -1492 -359740 -635134 -304756
1460 -304756 -18512 -343066 -364258 -626378 -450127 -33415 222902 -73449 278671 324854
1450 324854 -133154 -162493 -573828 -597360 -424288 -361195 -357689 -110590 35874 -241780 -459308
1439 -459308 -558197 -444132 -316752 -641116 -1036059 -1090451 -131594 -43773 129573 135502 -72310
1428 -72310 -148970 -566496 7961 -13381 -479724 -169224 93602 230271 69581 -373600
1418c73600K2926K38328K88112K20940r8066k12465K32674m02473j91059J4502
1408b60181j17476j36712q4232O02245K65402m77254j04609K11078j47216l59008
1398f07963L17264L22437l57860l70538K69938J75180J23710j02087M12345j42951
1388C9475j53304j75826k91358L19876j71796M4598N2380L16331L30125k2746
1378B87755j40951p8905j38445M14372k53404J59788J19309n04869k10859L31253
1368a4956K17069N41876j68303p02610Q4721N1268l83891O3138J74184j13753
1358b51257K11339j0626K16450q6485m17977j23079M01288L54965M0579j49171
1348A86026j07870J16629K4638P3147l37097J54584k42956l38528J92913j09376
$$ plain form
1418 -373600 -350674 -112346 175766 396706 298640 86175 318849 -83624 -274683 -260181
1408 -260181 -377657 -514369 -598601 3644 269046 -208208 -312817 -101739 -248955 -607963
1398 -607963 -290699 31738 -326122 -696660 -426722 -251542 -127832 -229919 182426 39475
1388 39475 -113829 -289655 -581013 -261137 -432933 -388335 -335955 -19624 310501 287755
1378 287755 146804 67899 -70546 343826 90422 250210 369519 -135350 -346209 -14956
1368 -14956 202113 743989 575686 -126924 -42203 9065 -374826 -311688 -137504 -251257
1358 -251257 -39918 -50544 165906 79421 -338556 -461635 -60347 294618 335197 186026
1348 186026 78156 194785 219423 292570 -44527 110057 -132899 -471427 -278514 -387890
1338c87890l7826l7695L09706L22515r2996m7517k79147k15315M72532Q0203N1338
1327A37908O506l19977M9579K62357m4003j57711K84175l11790j57774Q568l8712
1316b80874O4648n1232r4418J68796O5788N623k80936k89212M14802J82245Q4491
1305a0279o6717m55677j22296K81879J21847m06977J49538O9503J69979N93808
1295C24608p5484m88703j24369L99720l734j53306j55880K0679M43106L51510
1285E38147p26835k65104K47130l51040J86656L22925o4971J9864K27017K13374
1275C47163K64713J3200m92728j57814J4214p5645j10760k40463L03707k38628
1265c73041J80423K53431N707n5077k02676J95024k16313j43227m8561N45756
$$ plain form
1338 -387890 -425716 -463411 -153705 168810 75814 28297 -250850 -466165 6367 86570 137908
1327 137908 144414 -175563 -125984 136373 92370 -65341 218834 -92956 -250730 -242162 -280874
1316 -280874 -216226 -267458 -361876 -193080 -127292 -121669 -402605 -691817 -277015 -94770 -10279
1305 -10279 -76996 -532673 -654969 -373090 -251243 -658220 -508682 -439179 -269200 324608
1295 324608 249124 -239579 -363948 35772 32038 -121268 -277148 -256469 186637 538147
1285 538147 -188688 -453792 -206662 -557702 -371046 -48121 -113092 -93228 133789 347163
1275 347163 611876 625076 132348 -25466 -11252 -86897 -197657 -438120 -134413 -373041
1265 -373041 -192618 60813 66520 11443 -191233 3791 -212522 -355749 -404310 141446
1255A41446L76344k46073n21538m15155P0327M83849k69125m7417M07598j35958
1245a55702l13622J16971n8278K19196j58657J56332m1908j34509J66169j225
1235b05233j55171m7057M8245K01953j80945O7476J84426r5475L25539J13304
1225B57062l87826J85301M143N07322j44218l84801N4024K96997k17890r1288
1215G8826k93694p3290j31084J1957O48356k79155j2967j88667P0756j12591K46215
1204c5338r9980k14154J62097O92887k15819r1544l05611J33140K0484m40824
1194c94662O9350J69277n14806K04704o4172M25944k54654m07576O05137L01949
1184A40491o6423l4927M9290k26791l5614K61306r8955l6991j71087K6577J09245
$$ plain form
1255 141446 517790 271717 -249821 -664976 -594649 -110800 -379925 -427342 -19744 -155702
1245 -155702 -469324 -352353 -410631 -191435 -350092 -193760 -235668 -370177 -204008 -205233
1235 -205233 -360404 -407461 -359216 -157263 -338208 -270732 -86306 -181781 143758 257062
1225 257062 -130764 54537 58680 566002 421784 36983 91007 388004 170114 78826
1215 78826 -214868 -288158 -419242 -407285 241071 -38084 -51051 -239718 -168962 -281553 -35338
1204 -35338 -135318 -349472 -187375 505512 289693 198149 -107462 25678 46162 -394662
1194 -394662 -325312 -156035 -670841 -466137 -530309 -104365 -359019 -766595 -161458 140491
1184 140491 74068 39141 88431 -138360 -173974 87332 -11623 -48614 -219701 -193124 -83879
1173h3879K29961N5438m40003j30688k8670K64159J21784K91260l73927j41758
1163b36323J58381P2960l78112K47597k82396O4223p5169K12232K4090k08263
1153d00780L52323L60428K2796j69931k52469j56550Q7973j56249j77087R1649
1143c97897o5899L91769J24132k58295j9921K39405j8311J7458k43834k3324K40555
1132a4162N3021K63867j96914J57734j45543L9836K70190P1326o13781k69873
1122c84299r8072Q14240k00240k99180J71363J24936j64635j95761j96286L92265
1112c5669J46925Q9932P6316n080k34688j55265K98168p4628q6957M502j52519
1101a28963k03513q4906k8434M32919L47008l01629k44260j11438K64799J88723
$$ plain form
1173 -83879 146082 201520 -238483 -369171 -397841 -133682 -11898 279362 -94565 -236323
1163 -236323 -77942 -4982 -383094 -135497 -417893 -353670 -428839 -216607 -192517 -400780
1153 -400780 -48457 311971 334767 164836 -87633 -244183 -156210 -312459 -489546 -397897
1143 -397897 -463796 -72027 52105 -206190 -226111 13294 -5017 12441 -231393 -254717 -14162
1132 -14162 38859 302726 105812 263546 118003 157839 428029 499355 -114426 -384299
1122 -384299 -482371 331869 131629 -167551 3812 128748 -35887 -231648 -427934 -35669
1112 -35669 111256 201188 277504 272424 37736 -117529 180639 106011 19054 23556 -128963
1101 -128963 -332476 -417382 -445816 -12897 334111 32482 -211778 -323216 -58417 130306
1091A30306j61067j38984m27995L67243J83246j77862j89790J19987J12314J20810
$$ plain form
1091 130306 -30761 -169745 -597740 -230497 -47251 -225113 -414903 -294916 -182602 -61792
$$ [...]
##END NTUPLES=NMR SPECTRUM
##END=
