##TITLE=1H_EC-3259(IV-1)
 CDCl3, 8 sc, 
 31.8.2021
##JCAMPDX= 6.0         $$ Bruker NMR JCAMP-DX V2.0
##DATA TYPE= NMR SPECTRUM
##DATA CLASS= NTUPLES
##ORIGIN= UXNMR, Bruker Analytische Messtechnik GmbH
##OWNER= root
$$ XWIN-NMR		Version 3.5
$$ Tue Aug 31 11:51:19 2021 Russian Standard Time (UT+4h)  she@DPX200
##.OBSERVE FREQUENCY= 200.131506
##.OBSERVE NUCLEUS= ^1H
##.ACQUISITION MODE= SIMULTANEOUS
##.ACQUISITION SCHEME= undefined
##.AVERAGES= 8
##.DIGITISER RES= 18
##SPECTROMETER/DATA SYSTEM= spect
##.PULSE SEQUENCE= zg30
##.SOLVENT NAME= CDCl3
##.SHIFT REFERENCE= (INTERNAL, CDCl3, 0, 17.4947)
##AUDIT TRAIL= $$ (NUMBER, WHEN, WHO, WHERE, WHAT)
$$ ##TITLE= Audit trail, XWIN-NMR		Version 3.5
$$ ##JCAMPDX= 5.01
$$ ##ORIGIN= Bruker BioSpin GmbH
$$ ##OWNER= she
$$ F:/spectra/data/she/nmr/H-F/1/pdata/1/auditp.txt
$$ ##AUDIT TRAIL=  $$ (NUMBER, WHEN, WHO, WHERE, WHAT)
(   1,<2021-08-31 11:49:54.31 +0400>,<she>,<DPX200>,
      <created by zg, POWCHK disabled, PULCHK disabled
       configuration hash MD5:
       00 E9 B6 7A A2 85 ED C7 34 08 36 98 17 FE 4E 26
       data hash MD5: 16K
       C1 1E 66 7E A4 C8 95 7B 6D A8 5B 21 C9 B8 36 FE>)
(   2,<2021-08-31 11:49:58.10 +0400>,<she>,<DPX200>,
      <Start of raw data processing
       efp BC_mod = 2 LB = 0.24 FT_mod = 6 PKNL = 1 PHC0 = -13360.34 PHC1 = 10.40099 SI = 16K 
       data hash MD5: 16K
       35 37 18 D4 9A 0F 87 2F 2D 42 75 78 95 A5 0E 9D>)
(   3,<2021-08-31 11:50:19.43 +0400>,<she>,<DPX200>,
      <pk PHC0 = -0.8419814 PHC1 = 4.8 
       data hash MD5: 16K
       A1 6F AF 95 A1 DD 4C 34 AD 16 AF 2B 82 42 D6 F1>)
(   4,<2021-08-31 11:50:22.85 +0400>,<she>,<DPX200>,
      <abs ABSG = 5 
       data hash MD5: 16K
       0B 26 A8 FB 28 84 D2 A0 4A 0C F1 DF 13 3E 39 93>)
$$ ##END=
$$ 
$$ hash MD5
$$ 01 30 C3 27 2E B9 03 3C 94 F9 CB 0B AE 84 7E 31
##$RELAX= 
##$RELAX= 
##$RELAX= 
##$RELAX= 
##$RELAX= 
##$RELAX= 
$$ Bruker specific parameters
$$ --------------------------
##$DU= <F:/spectra>
##$EXPNO= 1
##$NAME= <H-F>
##$PROCNO= 1
##$TYPE= <nmr>
##$USER= <she>
##$AMP= (0..31)
100 100 100 100 100 100 100 100 100 100 100 100 100 100 100 100 100 100 
100 100 100 100 100 100 100 100 100 100 100 100 100 100 
##$AQSEQ= 0
##$AQ_mod= 1
##$AUNM= <au_zg>
##$AUTOPOS= <>
##$BF1= 200.13
##$BF2= 200.13
##$BF3= 200.13
##$BF4= 200.13
##$BF5= 200.13
##$BF6= 200.13
##$BF7= 200.13
##$BF8= 200.13
##$BYTORDA= 1
##$CFDGTYP= 0
##$CFRGTYP= 5
##$CHEMSTR= <none>
##$CNST= (0..31)
1 1 145 1 1 1 1 1 1 1 1 1 1 1 1 1 1 1 1 1 1 1 1 1 1 1 1 1 1 1 1 1 
##$CPDPRG= <>
##$CPDPRG1= <>
##$CPDPRG2= <>
##$CPDPRG3= <>
##$CPDPRG4= <mlev>
##$CPDPRG5= <mlev>
##$CPDPRG6= <mlev>
##$CPDPRG7= <mlev>
##$CPDPRG8= <mlev>
##$CPDPRGB= <>
##$CPDPRGT= <>
##$D= (0..31)
0 1.2 0 0 0 0 0 0 0 0.06 0 0.03 0 0 0 0 0.0002 0 0 0 0 0 0 0 0 0 0 0 0 
0 0 0 
##$DATE= 1630396193
##$DBL= (0..7)
120 120 120 120 120 120 120 120 
##$DBP= (0..7)
150 150 150 150 150 150 150 150 
##$DBP07= 0
##$DBPNAM0= <>
##$DBPNAM1= <>
##$DBPNAM2= <>
##$DBPNAM3= <>
##$DBPNAM4= <>
$$ [...]
##$SUBNAM3= <"">
##$SUBNAM4= <"">
##$SUBNAM5= <"">
##$SUBNAM6= <"">
##$SUBNAM7= <"">
##$SUBNAM8= <"">
##$SUBNAM9= <"">
##$SW= 20.0188882624521
##$SWIBOX= (0..15)
0 0 2 0 0 0 0 0 0 0 0 0 0 0 0 0 
##$SW_h= 4006.41025641026
##$TD= 16384
##$TD0= 1
##$TE= 0
##$TE2= 300
##$TE3= 300
##$TEG= 300
##$TL= (0..7)
0 120 120 120 120 120 120 120 
##$TP= (0..7)
150 150 150 150 150 150 150 150 
##$TP07= 0
##$TPNAME0= <>
##$TPNAME1= <>
##$TPNAME2= <>
##$TPNAME3= <>
##$TPNAME4= <>
##$TPNAME5= <>
##$TPNAME6= <>
##$TPNAME7= <>
##$TPOAL= (0..7)
0.5 0.5 0.5 0.5 0.5 0.5 0.5 0.5 
##$TPOFFS= (0..7)
0 0 0 0 0 0 0 0 
##$TUNHIN= 0
##$TUNHOUT= 0
##$TUNXOUT= 0
##$USERA1= <user>
##$USERA2= <user>
##$USERA3= <user>
##$USERA4= <user>
##$USERA5= <user>
##$V9= 5
##$VALIST= <valist>
##$VCLIST= <CCCCCCCCCCCCCCC>
##$VD= 0
##$VDLIST= <DDDDDDDDDDDDDDD>
##$VPLIST= <PPPPPPPPPPPPPPP>
##$VTLIST= <TTTTTTTTTTTTTTT>
##$WBST= 1024
##$WBSW= 4
##$XGAIN= (0..3)
0 0 0 0 
##$XL= 0
##$YL= 0
##$YMAX_a= 101486
##$YMIN_a= -128239
##$ZGOPTNS= <>
##$ZL1= 120
##$ZL2= 120
##$ZL3= 120
##$ZL4= 120
##$ABSF1= 17.50566
##$ABSF2= -2.51338
##$ABSG= 5
##$ABSL= 3
##$ALPHA= 0
##$AQORDER= 0
##$ASSFAC= 0
##$ASSFACI= 0
##$ASSFACX= 0
##$ASSWID= 0
##$AUNMP= <proc_1d>
##$AZFE= 0.1
##$AZFW= 0.1
##$BCFW= 0
##$BC_mod= 2
##$BYTORDP= 0
##$COROFFS= 0
##$CY= -3
##$DATMOD= 1
##$DC= 0
##$DFILT= <>
##$DTYPP= 0
##$F1P= 0
##$F2P= 0
##$FCOR= 1
##$FTSIZE= 16384
##$FT_mod= 6
##$GAMMA= 0
##$GB= 0
##$INTBC= 1
##$INTSCL= 1.334414e-10
##$ISEN= 128
##$LB= 0.24
##$LEV0= 0
##$LPBIN= 0
##$MAXI= 10000
##$MC2= 0
##$MEAN= 0
##$ME_mod= 0
##$MI= 1.114404
##$NCOEF= 0
##$NC_proc= -8
##$NLEV= 6
##$NOISF1= 3.799351
##$NOISF2= 2.8
##$NSP= 0
##$NTH_PI= 0
##$NZP= 0
##$OFFSET= 17.49467
##$PC= 1
##$PHC0= -13361.18
##$PHC1= 15.20099
##$PH_mod= 1
##$PKNL= yes
##$PPARMOD= 0
##$PSCAL= 0
##$PSIGN= 0
##$REVERSE= no
##$SF= 200.130007996587
##$SI= 16384
##$SIGF1= 3
##$SIGF2= 2
##$SINO= 5.538805
##$SIOLD= 16384
##$SREGLST= <1H.CDCl3>
##$SSB= 0
##$STSI= 16384
##$STSR= 0
##$SW_p= 4006.41025641026
##$SYMM= 0
##$S_DEV= 0
##$TDeff= 16384
##$TDoff= 0
##$TI= <>
##$TILT= no
##$TM1= 0
##$TM2= 0
##$TOPLEV= 0
##$USERP1= <user>
##$USERP2= <user>
##$USERP3= <user>
##$USERP4= <user>
##$USERP5= <user>
##$WDW= 1
##$XDIM= 16384
##$YMAX_p= 312355263
##$YMIN_p= -1701767
$$ End of Bruker specific parameters
$$ ---------------------------------
##NTUPLES= NMR SPECTRUM
##VAR_NAME=  FREQUENCY,     SPECTRUM/REAL,   SPECTRUM/IMAG
##SYMBOL=    X,             R,               I
##VAR_TYPE=  INDEPENDENT,   DEPENDENT,       DEPENDENT
##VAR_FORM=  AFFN,          ASDF,            ASDF
##VAR_DIM=   16384,         16384,           16384
##UNITS=     HZ,            ARBITRARY UNITS, ARBITRARY UNITS
##FACTOR=    0.24454680195387, 1,            1
##FIRST=     3501.20862069447, 0,            0
##LAST=      -505.201635715788, 0,           0
##MIN=       -505.201635715788, -1701767,    0
##MAX=       3501.20862069447, 312355263,    0
$$ Real data points
##PAGE= N=1
##DATA TABLE= (X++(R..R)), XYDATA
$$ [...]
$$ plain form
6605 1898528 1785219 2190478 2169511 2099749 2187510 2125392 2446036 2640187 2652859 2888569
6595 2888569 3249991 3252017 2766051 3171913 3369294 3331769 3418315 3285908 3315844 3188461
6585 3188461 3354970 3850191 4273981 4396274 4516867 4770459 5107539 4954847 4681732 4695716
6575 4695716 5589764 6074215 6195186 6958087 7162309 7505296 8168018 8604677 9010641 9828872
6565 9828872 10510449 11643111 12944087 13726024 15244773 16415269 17970864 20387196 22935400
6556 22935400 25730587 29932679 34076904 38774707 45014480 52655857 61861715 72777829
6548 72777829 83181574 90216427 90831455 84285926 72838353 59978222 48099193 38939287
6540 38939287 32111739 27499526 23856410 20980969 19014043 16938497 15870237 14518926
$$ packed form
6605A898528j13309M05259k0967o9762Q7761o2118L20644J94151J2672K35710
6595B888569L61422K026m85966M05862J97381l7525Q6546j32407K9936j27383
6585C188461J66509M95221M23790J22293J20593K53592L37080j52692k73115J3984
6575D695716Q94048M84451J20971P62901K04222L42987O62722M36659M05964Q18231
6565I828872O81577J132662J300976P81937J518749J170496J555595K416332K548204
6556B2935400K795187M202092M144225M697803O239773P641377R205858J0916114
6548G2777829J0403745P034853O15028o545529j1447573j2860131j1879029r159906
6540C8939287o827548m612213l643116k875441j966926k075546j068260j351311
$$ plain form
6532 14518926 13239064 12115767 10869945 10614220 9748024 8927287 8228273 8092274 7736294
6523 7736294 6971538 6374256 6496305 6484831 6018333 5473026 5011457 5388175 5429960 4961458
6513 4961458 4462855 4153325 3634750 3531512 3422946 3409375 3553942 3393120 3383363 2878979
6503 2878979 2681776 2580569 2520976 2552075 2210329 1613459 2001935 2318065 1952942 2187332
6493 2187332 2371083 2300517 1988547 1751606 1465168 1454137 1214239 1775199 2011595 1700111
6483 1700111 1699727 1648437 1755621 1250180 1463001 1559219 1209486 1537161 1042266 688454
6473 688454 736361 1397861 1726818 1679102 1705866 1185063 713692 1168673 1515189 1143230
6463 1143230 562198 1100799 1139706 1017581 697751 559166 375015 736460 982350 981193
$$ packed form
6532A4518926j279862j123297j245822k55725q66196q20737o99014j35999l55980
6523G736294p64756n97282J22049j1474m66498n45307m61569L76718M1785m68502
6513D961458m98603l09530n18575j03238j08566j3571J44567j60822r757n04384
6503B878979j97203j01207n9593L1099l41746n96870L88476L16130l65123K34390
6493B187332J83751p0566l11970k36941k86438j1031k39898N60960K36396l11484
6483A700111l84n1290J07184n05441K12821R6218l49733L27675m94895l53812
6473F88454M7907O61500L28957m7716K6764n20803m71371M54981L46516l71959
6463A143230n81032N38601L8907j22125l19830j38585j84151L61445K45890j157
$$ plain form
6453 981193 786076 637843 1079875 1047583 743240 812927 612331 453826 416003 171613
6443 171613 232372 473181 231677 237214 152386 201557 112553 410383 701953 377136 -140934
6432 -140934 131277 201764 174839 479116 181471 228769 69681 423220 728034 545653
6422 545653 420419 323842 324000 650806 600652 434232 357241 90914 -130132 9053 177505
6411 177505 225395 73368 243691 28728 -154128 -54643 -172602 336483 566460 440765
6401 440765 415429 307957 179296 -189350 -317646 58796 148038 -162848 362744 47524
6391 47524 -348464 78112 212098 63104 62926 -369829 -504281 -297620 20332 -116346
6381 -116346 34959 150088 -150434 -349314 -160116 162394 178419 -106584 -220790 -563530
$$ packed form
6453I81193j95117j48233M42032l2292l04343O9687k00596j58505l7823k44390
6443A71613O0759K40809k41504N537q4828M9171q9004K97830K91570l24817n18070
6432a40934K72211P0487k6925L04277k97645M7298j59088L53539L04814j82381
6422E45653j25234r6577J58L26806n0154j66420p6991k66327k21046J39185J68452
6411A77505M7890j52027J70323k14963j82856R9485j17959N09085K29977j25695
6401D40765k5336j07472j28661l68646j28296L76442Q9242l10886N25592l15220
6391D7524l95988M26576J33986j48994j78m32755j34452K06661L17952j36678
6381a16346J51305J15129l00522j98880J89198L22510J6025k85003j14206l42740
$$ plain form
6371 -563530 -398214 -87778 -279936 -37205 -140775 552314 435649 -452667 -235774 390902
6361 390902 382240 228694 317989 104650 -82452 -451164 -98475 -494784 41842 -2742
6351 -2742 -127660 276716 422098 393731 -254971 -148288 -73626 -46322 178080 198282 -100578
6340 -100578 120198 101563 -77953 87339 -72023 -54449 203636 239142 -17370 -432937
6330 -432937 -143432 -181433 340519 220642 424425 408107 -462650 -525333 -745124 -626128
6320 -626128 -301159 -399076 -610115 -498832 -618434 -210148 -186186 -699242 -552552 -192227
6310 -192227 -129218 -48255 -348247 -536335 -87631 376672 647399 736417 218114 -472099
6300 -472099 -137841 -537038 -480138 -358694 -743814 -667965 -468099 -549101 -535227 -193620
$$ packed form
6371e63530J65316L10436j92158K42731j03570O93089j16665q88316K16893O26676
6361C90902q662j53546Q9295k13339j87102l68712L52689l96309N36626m4584
6351b742j24918M04376J45382k8367o48702J06683P4662K7304K24402K0202k98860
6340a00578K20776j8635j79516J65292j59362J7574K58085L5506k56512m15567
6330d32937K89505l8001N21952j19877K03783j6318q70757o2683k19791J18996
6320f26128L24969r7917k11039J11283j19602M08286K3962n13056J46690L60325
6310a92227O3009Q0963k99992j88088M48704M64303K70727Q9018n18303o90213
6300d72099L34258l99197N6900J21444l85120P5849J99866q1002J3874L41607
$$ plain form
6290 -193620 -462943 -240488 224181 230548 173627 33712 85824 -215068 -358001 -9426
6280 -9426 -447880 -164286 99026 18265 -70313 103452 309092 380205 529994 434711 288665
6269 288665 121617 2872 30005 651187 554271 402642 246457 487669 644489 418556
6259 418556 -216273 31836 -74519 -374654 -282322 -559588 -20737 -84729 193461 59914
6249 59914 -7524 167391 183925 220504 49420 -144055 -319376 53471 430164 236299
6239 236299 -124303 -240224 167179 -392663 -302393 -95199 -10786 34208 28805 -97198 -374851
6228 -374851 98472 175956 -153002 71251 198914 -328570 -288829 -230839 -66548 -345247
6218 -345247 49107 130603 -97395 -484908 -234832 -100422 -54747 242789 20683 -19623
$$ packed form
6290a93620k69323K22455M64669O367n6921j39915N2112l00892j42933L48575
6280i426m38454K83594K63312q0761q8578J73765K05640P1113J49789r5283j46046
6269B88665j67048j18745K7133O21182r6916j51629j56185K41212J56820k25933
6259D18556o34829K48109j06355l00135R2332k77266N38851o3992K78190j33547
6249E9914o7438J74915J6534L6579j71084j93475j75321L72847L76693j93865
6239B36299l60602j15921M07403n59842R0270K07194Q4413M4994n403j26003k77653
6228c74851M73323P7484l28958K24253J27663n27484L9741N7990J64291k78699
6218c45247L94354Q1496k27998l87513K50076J34410M5675K97536k22106m0306
$$ plain form
6208 -19623 109373 304742 66863 -129592 -3297 -264950 -45074 -52777 -22623 -118797 -103438
6197 -103438 23970 -171085 -304669 -25808 121715 138161 36784 92423 65211 107463
6187 107463 379914 257682 381159 625729 237833 -356401 -285896 -279882 -141216 133488
6177 133488 -147858 -218682 -85197 -239157 151234 -236666 -359456 90914 86070 -1319
6167 -1319 -286010 -169961 -71220 -123741 -210810 189862 -4707 -70714 -205397 -516134 -415130
6156 -415130 -396192 190132 -46807 -109693 -235215 -110999 -118095 -644278 -320682 -593235
6146 -593235 144196 145385 137264 406576 333943 154955 -55582 -146432 -207495 -176990 -7850
6135 -7850 -5711 -94139 -575939 -684941 -183725 -362661 -48099 -133115 279588 324989 173005
$$ packed form
6208a9623J28996J95369k37879j96455J26295k61653K19876p703L0154r6174J5359
6197a03438J27408j95055j33584K78861J47523J6446j01377N5639k7212M2252
6187A07463K72451j22232J23477K44570l87896n94234P0505O014J38666K74704
6177A33488k81346p0824J33485j53960L90391l87900j22790M50370m844q7389
6167a319k84691J16049R8741n2521q7069M00672j94569o6007j34683l10737J01004
6156d15130J8938N86324k36939o2886j25522J24216p096n26183L23596k72553
6146e93235P37431J189q121K69312p2633j78988k10537r0850o1063L0505J69140
6135g850K139q8428m81800j09002N01216j78936L14562q5016M12703M5401j51984
$$ plain form
6124 173005 -89567 -184699 -402490 -87313 -160637 -504354 -173691 242613 -275203 113747
6114 113747 148918 446546 182445 -87848 -307312 -123859 193282 261097 250627 217377
6104 217377 -304295 -265662 23955 -191690 -204647 -288413 -688509 -634565 -289016 407833
6094 407833 163142 -292899 38621 124582 -320225 -267929 25480 78452 -205535 -162856
6084 -162856 265500 67278 21326 283444 197986 -120106 226041 119904 67948 -116025
6074 -116025 -5346 -153972 -307170 239929 -32326 -212649 120028 -312901 187295 -31283
6064 -31283 466039 48763 173783 260403 461480 220832 -406057 -476482 -88179 -277719
6054 -277719 -717604 -665913 -180726 -226186 -281011 -169198 -143778 111 -273624 -262877 -306024
$$ packed form
6124A73005k62572r5132k17791L15177p3324l43717L30663M16304n17816L88950
6114A13747L5171K97628k64101k70293k19464J83453L17141O7815j0470l3250
6104B17377n21672L8633K89617k15645j2957q3766m00096N3944L45549O96849
6094D07833k44691m56041L31520Q5961m44807N2296K93409N2972k83987M2679
6084a62856M28356j98222m5952K62118q5458l18092L46147j06137n1956j83973
6074a16025J10679j48626j53198N47099k72255j80323L32677m32929N00196k18578
6064c1283M97322m17276J25020Q6620K01077k40648o26889p0425L88303j89540
6054b77719m39885N1691M85187m5460n4825J11813K5420J43889k73735J0747m3147
$$ plain form
6043 -306024 268295 106470 -683739 -717841 -433602 -175806 -187027 -436824 -204643 100993
6033 100993 -243188 -261218 -214601 -201510 -160709 -537814 7461 -13476 76276 -305506 -360396
6022 -360396 83986 -178161 -153647 103541 -345208 77524 -248333 -290927 -559305 -468926
6012 -468926 122178 7599 -145320 -193223 141400 -590780 -611097 -204028 301206 -148532
6002 -148532 -4131 -62768 -280208 -495978 -636539 -853597 -435913 -87327 -547259 -1094713
5992 -1094713 -247628 -214852 -318697 -265579 -160273 136469 85971 -96816 -169569 -117287
5982 -117287 237149 286171 -240137 -19036 17975 240112 -10476 -132235 -77713 -159061
5972 -159061 -299884 262667 139591 -294057 -249858 -169204 -400377 -277887 -228319 -354889
$$ packed form
6043c06024N74319j61825p90209l4102K84239K57796j1221k49797K32181L05636
6033A00993l44181j8030M6617J3091M0801l77105N45275k0937Q9752l81782n4890
6022c60396M44382k62147K4514K57188m48749M22732l25857m2594k68378R0379
6012d68926N91104j14579j52919m7903L34623p32180k0317M07069N05234m49738
6002a48532J44401n8637k17440k15770j40561k17058M17684L48586m59932n47454
5992a094713Q47085L2776j03845N3118J05306K96742n0498j82787p2753N2282
5982a17287L54436M9022n26308K21101L7011K22137k50588j21759N4522q1348
5972a59061j40823N62551j23076m33648M4199Q0654k31173J22490M9568j26570
$$ plain form
5962 -354889 -162935 -245865 -178072 -102171 -184031 7597 307674 -18159 235096 22601
5952 22601 -159373 -276334 -184607 79462 -250444 194412 -288837 25250 231193 -200810
5942 -200810 186180 887801 232999 132762 48902 31288 248676 85146 -8938 -234858
5932 -234858 -183959 92639 -206739 77589 2486 -77038 -283212 -167217 -101392 -174711 16535
5921 16535 23601 281494 86370 -181083 79161 122518 166191 581929 487086 398464 327343
5910 327343 -24218 1566 399708 507603 520599 -211771 -243500 217756 596190 353190
5900 353190 52902 249675 411713 246737 -84358 -94288 154276 211344 274718 -160489
5890 -160489 -335536 -17661 -182885 -159881 193371 -25418 192691 -232554 -239244 -512445
$$ packed form
5962c54889J91954q2930O7793P5901q1860J91628L00077l25833K53255k12495
5952B2601j81974j16961R1727K64069l29906M44856m83249L14087K05943m32003
5942b00810L86990P01621o54802j00237q3860j7614K17388j63530r4084k25920
5932b34858N0899K76598k99378K84328p5103p9524k06174J15995O5825p3319J91246
5921A6535P066K57893j95124k67453K60244M3357M3673M15738r4843q8622p1121
5910C27343l51561K5784L98142J07895J2996p32370l1729M61256L78434k43000
5900C53190l00288J96773J62038j64976l31095r930K48564N7068O3374m35207
5890a60489j75047L17875j65224K3004L53252k18789K18109m25245o690k73201
$$ plain form
5880 -512445 -190200 57561 -140994 -121200 -464149 -404769 -327258 -567022 -452129 -338174
5870 -338174 -122566 165657 -151506 -444944 236148 301440 9497 308626 -463225 -489981
5860 -489981 -328929 -140132 -365542 -83857 -367794 -451810 -372336 -65789 -57556 -99230 -190265
5849 -190265 -308715 -46228 73367 250366 615443 359296 -159262 -441051 -330306 -198166
5839 -198166 -32178 117569 4195 84020 -205167 -680846 -549221 -486414 -70667 672548
5829 672548 342531 213367 -200075 -188444 4722 -453010 -234499 -198835 -62442 -299491
5819 -299491 -259758 238492 -69802 209940 256980 -174701 -360846 -225350 -120772 253365
5809 253365 -143264 -113842 27101 -98950 -331529 168163 -140381 -405946 -179895 -397743
$$ packed form
5880e12445L22245K47761j98555J9794l42949N9380P7511k39764J14893J13955
5870c38174K15608K88223l17163k93438O81092O5292k91943K99129p71851k6756
5860d89981J61052J88797k25410K81685k83937q4016P9474L06547Q233m1674r1035
5849a90265j18450K62487J19595J76999L65077k56147n18558k81789J10745J32140
5839a98166J65988J49747j13374P9825k89187m75679J31625O2807M15747P43215
5829F72548l30017j29164m13442J1631J93166m57732K18511L5664J36393k37049
5819b99491L9733M98250l08294K79742M7040m31681j86145J35496J04578L74137
5809B53365l96629K9422J40943j26051k32579M99692l08544k65565K26051k17848
$$ plain form
5799 -397743 -435635 -20538 55376 -186868 -410832 -560626 -243139 -316849 -54199 -107694
5789 -107694 -90069 146110 174486 26985 136260 -412661 -593338 -287891 -190168 -212699
5779 -212699 -92980 -258133 196930 260796 285589 569234 143653 196631 69395 125204
5769 125204 41472 17937 -431213 -42222 -344533 -553064 -740698 -731700 -421095 -643198
5759 -643198 -435146 -227077 -151377 -329980 -487186 -14233 -286746 -33992 94698 62813
5749 62813 30911 9800 253981 -440551 -286153 201285 82471 -160558 204212 -40073
5739 -40073 -261652 207940 157005 19321 66141 -203795 -121361 98945 311026 186337
5729 186337 312882 309657 381697 206082 300817 283002 6952 270653 288276 152221 467251
$$ packed form
5799c97743l7892M15097P5914k42244k23964j49794L17487p3710K62650n3495
5789a07694J7625K36179K8376j47501J09275n48921j80677L05447R7723k2531
5779b12699J19719j65153M55063O3866K4793K83645m25581N2978j27236N5809
5769A25204q3732k3535m49150L88991l02311k08531j87634Q998L10605k22103
5759f43198K08052K08069P5700j78603j57206M72953k72513K52754J28690l1885
5749F2813l1902k1111K44181o94532J54398M87438j18814k43029L64770k44285
5739d0073k21579M69592n0935j37684M6820k69936Q2434K20306K12081j24689
5729A86337J26545l225P2040j75615R4735j7815k76050K63701J7623j36055L15030
$$ plain form
5718 467251 776248 472636 662048 321259 -411570 -240275 -392245 -5053 293903 223905
5708 223905 158238 92643 207394 695576 278928 -104390 -169945 237254 41216 -60328
5698 -60328 588201 643827 719636 818066 929538 802364 1120248 743511 799352 381090 111971
5687 111971 583129 737929 146301 12346 72147 -59205 61704 81098 633827 611527
5677 611527 443308 781961 910406 703811 -82787 378247 273699 -51500 254349 735298
5667 735298 759000 586580 865015 334479 440076 755814 728029 467981 712540 769363
5657 769363 468891 168288 176185 396452 107927 -462638 -55525 172593 115357 -2370
5647 -2370 -234544 68115 386669 271656 4895 -72095 317993 -6068 286822 218050
$$ packed form
5718D67251L08997l03612J89412l40789p32829J71295j51970L87192K98956o9998
5708B23905o5667o5595J14751M88182m16648l83318o5555M07199j96038j01544
5698f0328O48529N5626P5809R8430J11472j27174L17884l76737N5841m18262k69119
5687A11971M71158J54800n91628j33955N9801j31352J20909J9394N52729k2300
5677F11527j68219L38653J28445k06595p86598M61034j04548l25199L05849M80949
5667G35298K3702j72420K78435n30536J05597L15738k7785k60048K44559N6823
5657G69363l00472l00603P897K20267k88525n70565M07113K28118n7236j17727
5647b370k32174L02659L18554j15013k66761p6990L90088l24061K92890o8772
$$ plain form
5637 218050 -238259 49084 122114 163141 -35410 -107276 264192 327896 635185 173955
5627 173955 110277 236141 -69318 379374 874616 463123 495742 589342 977746 912724
5617 912724 1070657 1294727 856944 828897 888185 982072 696413 1127421 644944 527381
5607 527381 241539 359846 970550 789698 658567 884451 560620 702146 1205970 1375980
5597 1375980 1693870 1670167 1300835 1353117 1451505 1413456 1355828 1562554 1393187 1577939
5587 1577939 1514815 1481827 1749482 1647764 1534878 2103787 1890563 1579510 1067921 1052509
5577 1052509 1492177 1624241 1231166 726866 1096074 1254234 1575926 1399077 1295207 1349967
5567 1349967 1543708 1381032 1191488 1131823 623103 875445 1573657 1606965 1533906 1746567
$$ packed form
5637B18050m56309K87343P3030M1027j98551p1866L71468O3704L07289m61230
5627A73955o3678J25864l05459M48692M95242m11493L2619R3600L88404o5022
5617I12724J57933K24070m37783k8047N9288R3887k85659M31008m82477j17563
5607E27381k85842J18307O10704j80852j31131K25884l23831J41526N03824J70010
5597A375980L17890k3703l69332N2282R8388l8049n7628K06726j69367J84752
5587A577939o3124l2988K67655j01718j12886N68909k13224l11053n11589j5412
5577A052509M39668J32064l93075n04300L69208J58160L21692j76849j03870N4760
5567A349967J93741j62676j89544n9665n08720K52342O98212L3308p3059K12661
$$ plain form
5557 1746567 1663830 1459828 1303862 1439659 1465358 1093846 942986 1394330 1666627 756239
5547 756239 1468064 1495177 1331443 1550215 1892962 2035248 1595100 1561738 1089411 1593164
5537 1593164 1804556 1379511 1666701 1858850 1865239 1986188 2039564 2304737 2151455 2143873
5527 2143873 2069210 2497784 2364019 2368817 2152010 2203577 2046670 2707327 2690135 2605324 2687803
5516 2687803 2557826 2802766 2291554 2320434 2489210 2403766 2585552 3307630 3072837 2646216
5506 2646216 3018688 3171849 2975346 2707824 2811426 3001144 3277346 3612451 3254374 3123873
5496 3123873 3083582 3668923 3846709 4285545 4246531 4022425 4371382 4898791 4748011 4634513
5486 4634513 4754638 5204442 5397861 5249174 5679514 5676657 5116817 5524284 5727216 5873241
$$ packed form
5557A746567q2737k04002j55966J35797K5699l71512j50860M51344K72297r10388
5547G56239P11825K7113j63734K18772L42747J42286m40148l3362m72327N03753
5537A593164K11392m25045K87190J92149O389J20949N3376K65173j53282p582
5527B143873p4663M28574j33765M798k16807N1567j56907O60657j7192q4811Q2479
5516B687803j29977K44940n11212K8880J68776q5444J81786P22078k34793m26621
5506B646216L72472J53161j96503k67522J03602J89718K76202L35105l58077j30501
5496C123873m0291N85341J77786M38836l9014k24106L48957N27409j50780j13498
5486D634513J20125M49804J93419j48687M30340k857n59840M07467K02932J46025
$$ plain form
5476 5873241 6002958 6301056 5855996 6658067 6723874 7109060 7838148 7996718 8038144 8306905
5466 8306905 8598995 9426193 10044828 10134909 9944073 9967516 10683265 10541897 10735526 10922139
5456 10922139 11034170 11624379 12007519 12159226 12885845 12879115 13845538 14311773 15375000 15817786
5446 15817786 16751625 17338036 17791838 18775742 19854377 21399045 23052424 24550398 26497171
5437 26497171 28638511 30882385 33961667 36708333 39536693 43415976 48018898 53882765
5429 53882765 60321293 67260406 74255646 79753762 82286259 82559636 82547501 82007319 80785817
5420 80785817 77489032 73446650 68937409 64834760 62017491 60408926 59678626 59207994
5412 59207994 60512354 61678377 63933677 68045809 72292665 78269405 85673539 94619319
$$ packed form
5476E873241J29717K98098m45060Q02071O5807L85186P29088J58570M1426K68761
5466H306905K92090Q27198O18635R0081j90836K3443P15749j41368J93629J86613
5456A0922139J12031N90209L83140J51707P26619o730R66423M66235J063227M42786
5446A5817786R33839N86411M53802R83904J078635J544668J653379J497974J946773
5437B6497171K141340K243874L079282K746666K828360L879283M602922N863867
5429E3882765O438528O939113O995240N498116K532497K73377j2135n40182j221502
5420H0785817l296785m042382m509241m102649k817269j608565p30300m70632
5412E9207994J304360J166023K255300M112132M246856N976740P404134Q945780
$$ plain form
5404 94619319 105645890 117932934 131542468 144302170 153207267 155839662 154135934 151148595
5396 151148595 147397645 142083691 132515955 119188919 105182933 92455225 82509146 74526117
5388 74526117 68542193 64526033 61723164 59377156 58071910 57452246 57243252 58712812
5380 58712812 61182820 64461035 68407413 73269913 78331944 83217289 86326652 86660495
5372 86660495 84864939 82848233 81089827 79232168 75772881 70166854 62207540 54309036
5364 54309036 47088338 41160678 37033431 33605822 30078326 27724952 26417862 24211209
5356 24211209 22801877 21163935 19433087 18622995 17881168 17078500 16359898 15646685 15161297
5347 15161297 14604713 13930069 13422763 12814782 12590607 12203973 11429584 10837378 10249865
$$ packed form
5404I4619319J1026571J2287044J3609534J2759702Q905097K632395j703728k987339
5396A51148595l750950n313954r567736j3327036j4005986j2727708r946079p983029
5388G4526117n983924m016160k802869k346008j305246o19664k08994J469560
5380E8712812K470008L278215L946378M862500N062031M885345L109363L33843
5372H6660495j795556k016706j758406j857659l459287n606027p959314p898504
5364E4309036p220698n927660m127247l427609l527496k353374j307090k206653
5356B4211209j409332j637942j730848q10092p41827q02668p18602p13213m85388
5347A5161297n56584o74644n07306o07981k24175l86634p74389n92206n87513
$$ plain form
5338 10249865 9755206 9742973 9997347 9794302 9054710 8527481 8550137 8708816 8013883 7809103
5328 7809103 7642808 7061017 6895289 6454460 6232267 6139906 6264392 5788869 5782109 5695142
5318 5695142 5654529 6011137 5935586 5988880 5679547 5412805 5351945 5395552 5072294 4969596
5308 4969596 4907290 4322677 3840494 3685791 3490685 3458502 3542341 4117071 3932326 3950799
5298 3950799 3833478 4102697 3890298 3729445 3540855 3281245 3592578 3164735 2848980 3007931
5288 3007931 3204658 2857730 3101767 3032222 2913635 3167269 3529121 2845185 2401360 2397306
5278 2397306 2521694 2420704 2511821 2089420 2241956 2331002 2477256 2533924 2797946 2354771
5268 2354771 2453881 2370821 2207084 2409868 2054960 2264922 2030351 2232583 2596471 2201852
$$ packed form
5338A0249865m94659j2233K54374k03045p39592n27229K2656J58679o94933k04780
5328G809103j66295n81791j65728m40829k22193r2361J24486m75523o760q6967
5318E695142m0613L56608p5551N3294l09333k66742o0860M3607l23258j02698
5308D969596o2306n84613m82183j54703j95106l2183Q3839N74730j84745J8473
5298C950799j17321K69219k12399j60853j88590k59610L11333m27843l15755J58951
5288C007931J96727l46928K44037o9545j18587K53634L61852o83936m43825m054
5278B397306J24388j00990R1117m22401J52536Q9046J46254N6668K64022m43175
5268B354771R9110q3060j63737K02784l54908K09962k34571K02232L63888l94619
$$ plain form
5258 2201852 2257588 2451020 2126070 1607364 1890537 2061598 2264724 2673930 2640858 2923125
5248 2923125 3131830 3618260 3873767 4203963 4132117 4071022 4956663 5620883 6323043 5997478
5238 5997478 5299466 4629765 3153500 2713793 2579909 2247067 2009793 2377872 2346011 2172705
5228 2172705 1873568 1770433 1986476 1900574 1673942 1582817 1205305 1094429 1029436 1003149
5218 1003149 1157652 1009004 1237912 1471204 1463093 1393466 1068397 1561902 1772658 1417787
5208 1417787 919430 1287936 788145 713783 504099 661841 752606 973236 1073376 757788
5198 757788 1119631 1286610 1518826 814395 567664 715950 717999 800277 1220767 1097418
5188 1097418 1300372 1187204 1016957 1065693 629017 927401 879040 1051984 1434361 1190576
$$ packed form
5258B201852N5736J93432l24950n18706K83173J71061K03126M09206l3072K82267
5248B923125K08705M86430K55507L30196p1846o1095Q85641O64220P02160l25565
5238E997478o98012o69701j476265m39707j33884l32842k37274L68079l1861j73306
5228B172705k99137j03135K16043q5902k26632r1125l77512j10876o4993k6287
5218A003149J54503j48648K28908K33292q111o9627l25069M93505K10756l54871
5208A417787m98357L68506m99791p4362k09684J57742R0765K20630J00140l15588
5198G57788L61843J66979K32216p04431k46731J48286K049Q2278M20490j23349
5188A097418K02954j13168j70247M8736m36676K98384m8361J72944L82377k43785
$$ plain form
5178 1190576 739547 1015146 1081169 954704 1196152 1070347 935629 903043 979337 939162
5168 939162 1424483 1154857 1647430 1468569 776059 1024337 1185597 1249262 1191820 1373709
5158 1373709 1865105 1471861 1404718 1508450 1098093 1190902 1729843 1743633 2145234 2190772
5148 2190772 1745344 1978172 1827579 1274147 1301118 950508 1093681 1552649 1079446 655743
5138 655743 1226925 1621405 1653621 1377437 812382 1034438 1050029 1171383 537076 718581
5128 718581 963330 1069654 937388 939596 1356273 1269942 578984 997971 1241023 1328992
5118 1328992 1463632 1036439 1286879 1476174 1193299 1679332 1370489 1271371 1596253 1231642
5108 1231642 1038102 1117932 1170704 1501710 1829575 1604569 1323982 1321882 1707686 1801561
$$ packed form
5178A190576m51029K75599O6023j26465K41448j25805j34718l2586P6294m0175
5168I39162M85321k69626M92573j78861o92510K48278J61260O3665n7442J81889
5158A373709M91396l93244o7143J03732m10357R2809N38941J3790M01601M5538
5148B190772m45428K32828j50593n53432K6971l50610J43173M58968m73203m23703
5138F55743N71182L94480L2216k76184n65055K22056J5591J21354o34307J81505
5128G18581K44749J06324j32266K208M16677q6331o90958M18987K43052Q7969
5118A328992J34640m27193K50440J89295k82875M86033l08843r9118L24882l64611
5108A231642j93540P9830N2772L31006L27865k25006k80587k100L85804R3875
$$ plain form
5098 1801561 1623693 1510875 1579504 2059043 1697388 1454953 1364692 1363455 1335765 1410929 1444434
5087 1444434 1585933 1252596 743094 1106079 1257380 1684157 1046711 1196346 1020777 1300781
5077 1300781 1177323 1190777 1579414 1464377 1809761 2116941 1782437 2051474 1855843 1491221
5067 1491221 1596661 1573719 1829436 1882945 2086843 1587821 1208263 1254512 1442567 1493799
5057 1493799 1145571 1325126 1384542 1732509 1560606 1377127 1095638 1397416 1258533 1359238
5047 1359238 1280675 1425884 1292572 1131071 1105176 1303498 1031275 1203310 1518882 1960046
5037 1960046 1769493 1302041 1395628 1296119 1409319 1188498 1190671 1107135 1031672 998012 1240935
5026 1240935 953441 1284525 1536654 1818525 1966241 1654835 1536963 1432474 1380225 1933334
$$ packed form
5098A801561j77868j12818O8629M79539l61655k42435r0261j237k7690P5164L3505
5087A444434J41499l33337n09502L62985J51301M26777o37446J49635j75569K80004
5077A300781j23458J3454L88637j15037L45384L07180l34504K69037j95631l64622
5067A491221J05440k2942K55717N3509K03898m99022l79558M6249J88055N1232
5057A493799l48228J79555N9416L47967j71903j83479k81489L01778j38883J00705
5047A359238p8563J45209j33312j61501k5895J98322k72223J72035L15572M41164
5037A960046j90553m67452R3587r9509J13200k20821K173q3536p5463l3660K42923
5026A240935k87494L31084K52129K81871J47716l11406j17872j04489n2249N53109
$$ plain form
5016 1933334 1602510 1917333 1945495 1507262 1672073 1824276 1313106 1005574 1301035 1273835
5006 1273835 1203224 1473467 1427409 1610932 1951752 1790425 1331889 1700865 992392 1588011
4996 1588011 1933619 1751604 1862835 2076473 1881247 1708910 1895437 1894908 1993391 2219042
4986 2219042 1949538 1812399 2113555 1999201 1856595 1787912 1918991 2029317 2064931 2031975
4976 2031975 1830855 2079595 2124777 1935050 2365038 1916230 1753594 2406588 2229574 2144062
4966 2144062 2499066 2357723 2372295 2669882 2654920 2713634 3033531 2947748 2806099 2417507
4956 2417507 2229154 2250349 2699313 2666275 3109930 3364408 3452512 2968799 2975393 3665398
4946 3665398 3909551 4164696 4169843 4435333 4457899 4463678 4962508 4844651 4987372 5148039
$$ packed form
5016A933334l30824L14823K8162m38233J64811J52203n11170l07532K95461k7200
5006A273835p0611K70243m6058J83523L40820j61327m58536L68976p08473N95619
4996A588011L45608j82015J11231K13638j95226j72337J86527n29R8483K25651
4986B219042k69504j37139L01156j14354j42606o8683J31079J10326L5614l2956
4976B031975k01120K48740M5182j89727M29988m48808j62636O52994j77014q5512
4966B144062L55004j41343J4572K97587j4962N8714L19897q5783j41649l88592
4956B417507j88353K1195M48964l3038M43655K54478Q8104m83713O594O90005
4946C665398K44153K55145N147K65490K2566N779M98830j17857J42721J60667
$$ plain form
4936 5148039 5332552 5730384 5922546 5876571 5968340 5735065 5385032 6178059 6651468 6996931
4926 6996931 7203508 7081934 7577943 7639046 8023963 8481635 8435114 7993822 8209373 8556448
4916 8556448 8537291 8678252 8776722 9330713 9743225 10204142 10678159 11049346 11188560 11547937
4906 11547937 12289309 12825704 13634462 14651136 15301029 15780808 17088025 18337691 19640142
4897 19640142 21033446 22195376 24071724 25658607 28449141 31314783 34311119 37783294
4889 37783294 42748168 47793129 53273646 59775510 68318515 78012237 90087340 104575118
4881 104575118 120171230 136016418 150560683 162471800 165691153 163529756 158830320
4874 158830320 145594874 127413282 110551781 93340105 77958099 65838826 56616366
$$ packed form
4936E148039J84513L97832J92162m5975R1769k33275l50033P93027M73409L45463
4926F996931K06577j21574M96009O1103L84917M57672m6521m41292K15551L47075
4916H556448j9157J40961R8470N53991M12512M60917M74017L71187J39214L59377
4906A1547937P41372N36395Q08758J016674O49893M79779J307217J249666J302451
4897A9640142J393304J161930J876348J586883K790534K865642K996336L472175
4889C7783294M964874N044961N480517O501864Q543005R693722J2075103J4487778
4881A04575118J5596112J5845188J4544265J1911117L219353k161397m699436
4874A58830320j3235446j8181592j6861501j7211676j5382006j2119273r222460
$$ plain form
4867 56616366 48989557 43584647 39368181 35134505 32076088 29549494 27133497 25414404
4859 25414404 23487552 22016169 21011886 19978099 18710834 17919448 17428213 16765603 15616759
4850 15616759 14794324 13822598 13040150 12563383 12177737 11534852 11418347 10627102 10107281
4841 10107281 9470351 9395897 9010620 8539905 8139916 7573397 7428552 7020753 7101944 6730583
4831 6730583 6713976 6119889 6069315 5709041 5588885 5758439 5733087 5373995 4997950 4946295
4821 4946295 4351430 4266076 3962998 4040360 4380869 3917271 4047885 4005252 4235662 4146884
4811 4146884 4046325 3682358 3687716 4023391 4244368 3699056 3397145 3245632 3402047 2977296
4801 2977296 2763799 2672108 2743938 3312122 3235993 2667843 2722903 3135717 2583661 2516259
$$ packed form
4867E6616366p626809n404910m216466m233676l058417k526594k415997j719093
4859B5414404j926852j471383j004283j033787j267265p91386m91235o62610j148844
4850A5616759q22435r71726p82448m76767l85646o42885j16505p91245n19821
4841A0107281o36930p4454l85277m70715l99989n66519j44845m07799Q1191l71361
4831F730583j6607n94087n0574l60274j20156J69554k5352l59092l76045n1655
4821D946295n94865q5354l03078P7362L40509m63598J30614m2633K30410q8778
4811D146884j00559l63967N358L35675K20977n45312l01911j51513J56415m24751
4801B977296k13497r1691P1830N68184p6129n68150N5060M12814n52056o7402
$$ plain form
4791 2516259 2212747 1763287 1700528 1847634 1837773 1866987 2064791 2166222 1664612 1413197
4781 1413197 1329223 1684229 2010268 1735942 1656914 1531608 1910068 1970300 1799749 2136158
4771 2136158 1761170 1515047 1307387 1518285 1701049 1327297 1688668 1248455 1209968 1310401
4761 1310401 1247151 1110265 1112826 1295906 853102 959377 1054236 1289380 1328145 1030957
4751 1030957 742720 534298 833560 797814 575103 639212 697617 1253887 1391080 1158354
4741 1158354 920657 445864 521336 445433 649427 1250031 1097476 963542 664442 631875
4731 631875 829011 812187 579725 567256 83211 225007 493956 1115372 708251 239181
4721 239181 326663 349787 812659 849309 393020 360084 372370 258094 507400 353367 510161
$$ packed form
4791B516259l03512m49460o2759J47106r861K9214J97804J01431n01610k51415
4781A413197q3974L55006L26039k74326p9028j25306L78460O0232j70551L36409
4771B136158l74988k46123k07660K10898J82764l73752L61371m40213l8487J00433
4761A310401o3250j36886K561J83080m42804J06275R4859K35144L8765k97188
4751A030957k88237k08422K99262l5746k22711O4109N8405N56270J37193k32726
4741A158354k37697m74793P5472p5903K03994O00604j52555j33934k99100l2567
4731F31875J97136j6824k32462j2469m84045J41796K68949O21416m07121m69070
4721B39181Q7482K3124M62872L6650m56289l2936J2286j14276K49306j54033J56794
$$ plain form
4710 510161 627841 486536 390382 602105 434542 219092 183320 494447 692351 807667
4700 807667 756527 767297 375209 251848 399135 1221264 339549 171120 650424 8729
4690 8729 316176 349339 631568 1040990 581822 753742 497951 262697 571817 456647
4680 456647 340143 618575 310239 512468 144471 285778 651443 608237 414935 587781
4670 587781 699539 -8728 161781 205857 273439 304825 801189 446792 269927 451039
4660 451039 488200 315262 284937 420255 422866 657053 824019 373772 505206 204510
4650 204510 273169 411610 127307 -50742 170104 114322 46928 -9737 208325 359716
4640 359716 -164041 21425 167899 200522 571520 -98612 -193867 -49250 160575 87833
$$ packed form
4710E10161J17680j41305r6154K11723j67563k15450l5772L11127J97904J15316
4700H07667n1140J0770l92088j23361J47287Q22129q81715j68429M79304o41695
4690H729L07447L3163K82229M09422m59168J71920k55791k35254L09120j15170
4680D56647j16504K78432l08336K02229l67997J41307L65665m3206j93302J72846
4670E87781J11758p08267J70509M4076O7582L1386M96364l54397j76865J81112
4660D51039L7161j72938l0325J35318K611K34187J66966m50247J31434l00696
4650B04510O8659J38441k84303j78049K20846n5782o7394n6665K18062J51391
4640C59716n23757J85466J46474L2623L70998o70132r5255J44617K09825p2742
$$ plain form
4630 87833 187602 193793 143229 330064 90594 78249 295204 289351 171523 390655 57844
4619 57844 475039 422914 677002 923867 878408 601636 739083 608302 398341 337343
4609 337343 781367 809528 470159 703435 904272 1000181 638070 1081068 1493667 1060755
4599 1060755 738482 919390 614382 359653 160955 174017 144871 562414 183177 198130
4589 198130 115972 372817 686115 337489 535218 32245 -1071 139669 482490 627543
4579 627543 380200 228396 -371831 -173464 113782 75764 621069 628566 429447 280564
4569 280564 160118 148384 332263 566867 199326 143513 -33129 400699 692179 431317
4559 431317 287483 220269 157090 474744 57110 -360146 33535 -69790 -79538 186912
$$ packed form
4630H7833R9769O191n0564J86835k39470j2345K16955n853j17828K19132l32811
4619E7844M17195n2125K54088K46865m5459k76772J37447j30781k09961o0998
4609C37343M44024K8161l39369K33276K00837R5909l62111M42998M12599m32912
4599A060755l22273J80908l05008k54729j98698J3062k9146M17543l79237J4953
4589A98130q2158K56845L13298l48626J97729n02973l3316J40740L42821J45053
4579F27543k47343j51804o00227J98367K87246l8018N45305P497j99119j48883
4569B80564j20446j1734J83879K34604l67541n5813j76642M33828K91480k60862
4559D31317j43834o7214o3179L17654m17634m17256L93681j03325r748K66450
$$ plain form
4549 186912 404331 249995 25509 167232 467323 280255 180325 214016 223336 7892
4539 7892 -220808 268374 338511 -178240 218793 278446 108922 77592 23933 156032 -186535
4528 -186535 -105351 -125774 -315278 -381984 -405704 -141318 -382815 -369797 19608 -35842 -483437
4517 -483437 -317568 -539811 -193245 352688 160769 165395 294820 -334324 344765 689247
4507 689247 472138 470314 356719 -75479 262011 394353 864255 515676 326720 254368
4497 254368 113490 218137 230166 524238 521193 294392 172519 300164 445627 240372
4487 240372 129014 227262 -33987 -169303 -56474 -206391 -55561 -169434 51145 137089
4477 137089 -328763 -97322 -17282 21179 -116148 301449 -99546 -258220 -176253 69503
$$ packed form
4549A86912K17419j54336k24486J41723L00091j87068r9930L3691R320k15444
4539G892k28700M89182P0137n16751L97033N9653j69524l1330n3659J32099l42567
4528a86535Q1184k0423j89504o6706k3720K64386k41497J3018L89405n5450m47595
4517d83437J65869k22243L46566N45933j91919M626J29425o29144O79089L44482
4507F89247k17109j824j13595m32198L37490J32342M69902l48579j88956p2352
4497B54368j40878J04647J2029K94072l045k26801j21873J27645J45463k05255
4487B40372j11358R8248k61249j35316J12829j49917J50830j13873K20579Q5944
4477A37089m65852K31441Q0040L8461j37327M17597m00995j58674Q1967K45756
$$ plain form
4467 69503 277160 386775 769872 582676 102340 54003 126657 -35777 -216196 453534
4457 453534 288259 260738 305796 336192 -57186 -432142 -360560 -192893 -227150 509455 119365
4446 119365 137517 -56080 -155002 160218 80641 174801 215561 -31921 285240 252774 227987
4435 227987 428229 528407 381919 353697 268810 -8929 364146 279138 32882 53407
4425 53407 349722 198499 382151 117212 183020 391694 427696 591755 601492 856904 569069
4414 569069 356072 274793 124731 282574 290586 519375 580525 422649 143371 186651 425453
4403 425453 261129 224768 269862 580862 752599 278983 -115302 -290302 122751 102201
4393 102201 -90974 156969 775479 541935 357867 43273 284578 430590 228960 154453
$$ packed form
4467F9503K07657J09615L83097j87196m80336m8337P2654j62434j80419O69730
4457D53534j65275k7521M5058L0396l93378l74956P1582J67667l4257P36605l90090
4446A19365J8152j93597r8922L15220p9577R4160M0760k47482L17161l2466k4787
4435B27987K00242J00178j46488k8222q4887k77739L73075q5008k46256K0525
4425E3407K96315j51223J83652k64939O5808K08674L6002J64059R737K55412k87835
4414E69069k12997q1279j50062J57843Q012K28789O1150j57876k79278M3280K38802
4403D25453j64324l6361M5094L11000J71737m73616l94285j75000M13053k0550
4393A02201j93175K47943O18510k33544j84068l14594K41305J46012k01630p4507
$$ plain form
4383 154453 223695 560933 227743 436101 805048 342202 386682 542747 506761 397782
4373 397782 324827 846393 818810 603069 444909 869562 418459 408593 635684 528628
4363 528628 584112 130104 188336 -149342 230222 354358 -14081 -129757 200141 739088
4353 739088 723300 374154 332264 281688 366558 223748 219823 545849 534705 121892 188218
4342 188218 218100 368891 13810 561937 507275 281625 247021 -101039 71923 249001
4332 249001 711953 561872 148211 -167800 -206344 -266699 118702 134974 254268 133889
4322 133889 -18839 410152 259759 214779 464757 315352 342732 281134 442133 239163
4312 239163 652025 221812 155774 424656 416184 729073 553748 492373 458236 438701 740409
$$ packed form
4383A54453O9242L37238l33190K08358L68947m62846M4480J56065l5986j08979
4373C97782p2955N21566k7583k15741j58160M24653m51103r866K27091j07056
4363E28628N5484m54008N8232l37678L79564J24136l68439j15676L29898N38947
4353G39088j5788l49146m1890n0576Q4870j42810l925L26026j1144m12813O6326
4342A88218K9882J50791l55081N48127n4662k25650l4604l48060J72962J77078
4332B49001M62952j50081m13661l16011l8544o0355L85401J6272J19294j20379
4322A33889j52728M28991j50393m4980K49978j49405K7380o1598J60999k02970
4312B39163M12862m30213o6038K68882q472L12889j75325o1375l4137j9535L01708
$$ plain form
4301 740409 457697 175909 758958 536977 309075 829715 742604 419006 320526 201763
4291 201763 494211 640059 776774 343131 672436 1451433 1037762 851192 1047179 802321
4281 802321 473910 603240 736272 897938 866266 833261 733830 871521 1006423 773274
4271 773274 417283 545039 824206 759875 919105 910621 751850 1129381 1456186 1474654
4261 1474654 780686 742225 1315140 1084624 961820 788065 620821 834803 1021712 1282256
4251 1282256 841658 916849 1127850 1177543 1582139 1500865 983766 982018 853792 961830
4241 961830 696937 811609 1060416 964128 1178810 1123965 898087 1020248 1567236 1595843
4231 1595843 1394869 1182156 1303533 1162382 1525892 1656474 2227595 2047530 2154782 1934140
$$ packed form
4301G40409k82712k81788N83049k21981k27902N20640q7111l23598r8480j18763
4291B01763K92448J45848J36715m33643L29305P78997m13671j86570J95987k44858
4281H02321l28411J29330J33032J61666l1672l3005r9431J37691J34902k33149
4271G73274l55991J27756K79167o4331J59230q484j58771L77531L26805J8468
4261A474654o93968l8461N72915k30516j22804j73755j67244K13982J86909K60544
4251A282256m40598P5191K11001M9693M04596q1274n17099j748j28226J08038
4241I61830k64893J14672K48807r6288K14682n4845k25878J22161N46988K8607
4231A595843k00974k12713J21377j41151L63510J30582N71121j80065J07252k20642
$$ plain form
4221 1934140 1966462 2309043 2312760 2671828 2229789 2151898 2907067 3322781 3436607 3557269
4211 3557269 3994960 3771352 3398604 3087190 2858209 2628081 2615565 2869057 3150352 3233589
4201 3233589 2392425 2249824 2292310 2305450 2318223 1903304 1450328 1738445 2136316 1753282
4191 1753282 1919733 2206130 2359089 2423854 2625681 2826280 2998813 3123576 3167804 3106410
4181 3106410 2576250 2491598 1931025 1627131 2349723 2039151 1796228 1693374 1372140 1443295
4171 1443295 1498983 1280555 1010569 1221732 1838789 2016019 2021274 1928430 1770268 1814027
4161 1814027 1410790 1292089 1776286 1870972 1707127 1323625 1428730 1510443 1598841 1948481
4151 1948481 1949231 1854426 1461510 1429822 1811912 1683174 1818543 1943540 1858209 2083826 2046144
$$ packed form
4221A934140L2322L42581L717L59068m42039p7891P55169M15714J13826J20662
4211C557269M37691k23608l72748l11414k28981k30128j2516K53492K81295Q3237
4201C233589q41164j42601M2486J3140J2773m14919m52976K88117L97871l83034
4191A753282J66451K86397J52959O4765K01827K00599J72533J24763M4228o1394
4181C106410n30160q4652n60573l03894P22592l10572k42923j02854l21234P1155
4171A443295N5688k18428k69986K11163O17057J77230N255r2844j58162M3759
4161A814027m03237j18701M84197R4686j63845l83502J05105Q1713Q8398L49640
4151A948481P50r4805l92916l1688L82090j28738J35369J24997q5331K25617l7682
$$ plain form
4140 2046144 2222211 1839401 1710129 1819204 2028782 2113854 2217250 2183403 2485735 2458490
4130 2458490 2704263 2653741 2371410 2719571 2632272 2629994 2278829 2356375 2403057 2240794 2249910
4119 2249910 1844087 2338766 2297550 2146527 2053285 2432149 2001169 1440725 1468845 2009319
4109 2009319 2265130 2049618 1660519 1824930 2182651 2250048 2252139 2066756 2143179 1978583
4099 1978583 1815385 2136940 1951075 1563629 1671661 1843814 1691753 1943321 2000323 1717806
4089 1717806 1805151 2236839 2319701 2480873 2540865 2488290 2196495 2285186 1432126 1680407
4079 1680407 2152540 2343451 2843913 2673184 2868085 2805806 2921810 3300820 3647660 3452678
4069 3452678 4076256 3656954 3488231 3571998 3681268 3743224 3597735 3122053 3634242 3350068
$$ packed form
4140B046144J76067l82810j29272J09075K09578Q5072J03396l3847L02332k7245
4130B458490K45773n0522k82331L48161q7299k278l51165P7546M6682j62263R116
4119B249910m05823M94679m1216j51023r3242L78864m30980n60444K8120N40474
4109B009319K55811k15512l89099J64411L57721O7397K091j85383P6423j64596
4099A978583j63198L21555j85865l87446J08032J72153j52061K51568N7002k82517
4089A717806Q7345M31688Q2862J61172N9992n2575k91795Q8691q53060K48281
4079A680407M72133J90911N00462j70729J94901o2279J16004L79010L46840j94982
4069C452678O23578m19302j68723Q3767J09270O1956j45489m75682N12189k84174
$$ plain form
4059 3350068 3527845 4209596 4004306 3983151 4378387 4469390 4484039 4365961 4549289 4838715
4049 4838715 5609857 5931294 5769954 5819691 5987104 5338159 5305363 5250578 5248685 5170182 5058497
4038 5058497 5413463 5657941 5994713 5688182 5915921 6428210 6576548 6649154 6550001 7384636
4028 7384636 7418806 7823763 8186128 8652057 9204086 10089716 11012932 12204156 13880248
4019 13880248 15220880 17450384 19575920 22005883 22728808 21277270 18744689 16113505
4011 16113505 14261426 13024573 12359144 11706428 11448542 12010907 11768008 11793717 11564586
4002 11564586 11477078 11394451 10912941 10646269 10806850 10508253 10800059 11391838 11607305 11654117
3992 11654117 11652335 11509899 11095702 11370880 11605049 11918889 11594646 11567631 12077172 12253247
$$ packed form
4059C350068J77777O81751k05290k1155L95236R1003J4649j18078J83328K89426
4049D838715P71142L21437j61340M9737J67413o48945l2796n4785j893p8503j11685
4038E058497L54966K44478L36772l06531K27739N12289J48338P2606r9153Q34635
4028G384636L4170M04957L62365M65929N52029Q85630R23216J191224J676092
4019A3880248J340632K229504K125536K429963P22925j451538k532581k631184
4011A6113505j852079j236853o65429o52716k57886N62365k42899K5709k29131
4002A1564586q7508q2627m81510k66672J60581k98597K91806N91779K15467M6812
3992A1654117j782j42436m14197K75178K34169L13840l24243k7015N09541J76075
$$ plain form
3982 12253247 12456033 12897755 13611873 13853610 14134022 14538426 15166802 15087155 15283327 16626063
3972 16626063 17527462 18769240 20046116 20577863 20727309 20719098 20909074 20731046 20593762
3963 20593762 20376593 20633711 20419158 20829391 21440600 22047907 22964930 23439071 24222237
3954 24222237 25011581 26188413 27401434 28755610 29783609 31181868 32746406 34435585
3946 34435585 36319939 38316749 40146294 42743167 45683799 49166283 53723390 58833128
3938 58833128 64460061 71143258 78821166 87391773 97597180 110048660 124978172 143952944
3930 143952944 166784953 195495978 229239682 266325481 295251361 298742838 276116657
3923 276116657 234544020 192055973 155584524 128253941 109573371 96049708 85999352
$$ packed form
3982A2253247K02786M41722P14118K41737K80412M04404O28376p9647J96172J342736
3972A6626063R01399J241778J276876N31747J49446q211J89976j78028j37284
3963B0593762k17169K57118k14553M10233O11209O07307R17023M74141P83166
3954B4222237P89344J176832J213021J354176J027999J398259J564538J689179
3946C4435585J884354J996810J829545K596873K940632L482484M557107N109738
3938E8833128N626933O683197P677908Q570607J0205407J2451480J4929512J8974772
3930A43952944K2832009K8711025L3743704L7085799K8925880L491477k2626181
3923B76116657m1572637m2488047l6471449k7330583j8680570j3523663j0050356
$$ plain form
3916 85999352 77948924 71212875 66286544 61434543 57985616 54710100 52359759 49356084
3908 49356084 47249296 45982263 44309133 43363003 42089121 41294529 40567216 39795199 39318758
3899 39318758 38896893 38481658 38234794 38011998 38152051 38029787 38164326 38545897 39405510
3890 39405510 39947996 40891457 41988386 42924246 44121397 45905377 47678413 50589912 53748194
3881 53748194 56733918 60617136 65580427 71173930 77887191 85939473 96111750 108744189
3873 108744189 123323977 141165808 163447245 189214259 217140381 242305856 259288508
3866 259288508 272550923 272670004 252326215 228992642 200595059 168099483 140515278
3859 140515278 117873513 100132208 87785623 77773860 70453306 64411029 59350338
$$ packed form
3916H5999352q050428o736049m926331m852001l448927l275516k350341l003675
3908D9356084k106788j267033j673130r46130j273882p94592p27313p72017m76441
3899C9318758m21865m15235k46864k22796J40053j22264J34539L81571Q59613
3890C9405510N42486R43461J096929R35860J197151J783980J773036K911499L158282
3881E3748194K985724L883218M963291N593503O713261Q052282J0172277J2632439
3873A08744189J4579788J7841831K2281437K5767014K7926122K5165475J6982652
3866B59288508J3262415J19081k0343789k3333573k8397583l2495576k7584205
3859A40515278k2641765j7741305j2346585j0011763p320554o042277n060691
$$ plain form
3852 59350338 55521073 52548797 49616849 47328600 45355821 42067778 40291613 38907731
3844 38907731 36761992 35310668 34117957 32407451 30645512 29364225 28113071 27325131
3836 27325131 26410398 24896968 23913404 23631052 22394523 21325414 21208600 20674628 19475744
3827 19475744 18920076 18477143 17858274 17353687 16895451 16475075 16737561 16335395 15749675
3818 15749675 15602201 15939268 16128983 15632797 15743112 15616796 15741273 16179291 16209920 16071074
3808 16071074 16418905 17046011 17550044 18116406 19519225 20793683 21185566 21093695 20137974
3799 20137974 18760270 17663255 16798663 16053745 16163776 16008207 15359523 14878121 15178958
3790 15178958 15493316 14894110 15040954 14800312 14772880 15233704 15152356 15084363 15022149 14832551
$$ packed form
3852E9350338l829265k972276k931948k288249j972779l288043j776165j383882
3844C8907731k145739j451324j192711j710506j761939j281287j251154p87940
3836B7325131r14733j513430r83564k82352j236529j069109j16814n33972j198884
3827A9475744n55668m42933o18869n04587m58236m20376K62486m02166n85720
3818A5749675j47474L37067J89715m96186J10315j26316J24477M38018L0629j38846
3808A6071074L47831O27106N04033N66362J402819J274458L91883r1871r55721
3799B0137974j377704j097015q64592p44918J10031j55569o48684m81402L00837
3790A5178958L14358n99206J46844k40642k7432M60824q1348o7993o2214j89598
$$ plain form
3780 14832551 15418129 15364455 15691817 15810208 15593459 15400405 16127836 16070315 16118102 16171717
3770 16171717 16262193 16536678 17187436 18002743 18489240 18729693 19109973 19475767 20023237 20526370
3760 20526370 21475669 21899621 22310158 22968462 23834716 25081058 26896831 28020992 29453093
3751 29453093 30963121 32675462 34341943 36642439 40118205 43628016 47585790 50954173
3743 50954173 55919699 61326436 68512674 76473225 85862007 96621071 109379460 125891063
3735 125891063 146160877 172640902 204981729 243449687 281822419 302769555 281613315
3728 281613315 235390351 189523763 147914102 118496322 98703451 84879272 74876321
3721 74876321 67351319 60868948 55696677 50962571 47428724 44118255 41371109 39127741
$$ packed form
3780A4832551N85578n3674L27362J18391k16749j93054P27431n7521M7787N3615
3770A6171717R0476K74485O50758Q15307M86497K40453L80280L65794N47470N03133
3760B0526370R49299M23952M10537O58304Q66254J246342J815773J124161J432101
3751B9453093J510028J712341J666481K300496L475766L509811L957774L368383
3743E0954173M965526N406737P186238P960551R388782J0759064J2758389J6511603
3735A25891063K0269814K6480025L2340827L8467958L8372732K0947136k1156240
3728B81613315m6222964m5866588m1609661k9417780j9792871j3824179j0002951
3721G4876321p525002o482371n172271m734106l533847l310469k747146k243368
$$ plain form
3713 39127741 36702863 34829108 32627477 30579827 29398338 27705428 27172358 26225285
3705 26225285 25107034 24850358 24027728 23041199 21791094 20717386 20081732 19044626 18110152
3696 18110152 17481822 17173794 16375815 15683076 15336651 14810680 14445337 13919339 13348410
3687 13348410 12911162 12704163 12810580 12377983 12125973 12296708 11889900 11465537 11557261 11517170
3677 11517170 11121607 11539719 11001519 10786821 10638166 10803419 11450694 11186337 11243545 11584596
3667 11584596 11093151 11403542 11661373 11608267 11576924 11374600 10858004 10498531 10511998 10583805
3657 10583805 10393678 10316148 10372638 10314359 10266998 9762609 9851126 9945196 9917762 10088500 10467257
3646 10467257 10287255 10472912 10427438 10654215 10615389 10393944 10312435 10813139 11388911 11595228
$$ packed form
3713C9127741k424878j873755k201631k047650j181489j692910n33070r47073
3705B6225285j118251k56676q22630r86529j250105j073708o35654j037106r34474
3696A8110152o28330l08028p97979o92739l46425n25971l65343n25998n70929
3687A3348410m37248k06999J06417m32597k52010J70735m06808m24363R1724m0091
3677A1517170l95563M18112n38200k14698j48655J65253O47275k64357N7208L41051
3667A1584596m91445L10391K57831n3106l1343k02324n16596l59473J3467P1807
3657A0583805j90127p7530N6490n8279m7361n04389Q8517R4070k7434J70738L78757
3646A0467257j80002J85657m5474K26777l8826k21445q1509N00704N75772K06317
$$ plain form
3636 11595228 12191743 12920817 13335783 13564088 14084723 15383796 16684921 17398202 17231058
3627 17231058 17740346 18053280 18069510 17634070 17751474 17570327 16684754 16732223 16578764 16173171
3617 16173171 16508783 16760692 16904494 17551500 18158275 19338770 19824964 20803728 22439674
3608 22439674 24703473 26152645 27489913 29892935 31992193 33659276 35641109 37474077
3600 37474077 38920577 39476478 39561928 39191178 38088321 36533952 34832674 33747566 32597495
3591 32597495 31999399 31274336 30557336 30577674 31073880 31420302 31530808 32000079 32947484 34021146
3581 34021146 34970426 36501998 38652802 40848532 42548642 44441433 46077194 47644756
3573 47644756 49590123 51265655 51987995 51923221 52042133 51709345 50792911 49907492 48503269
$$ packed form
3636A1595228N96515P29074M14966K28305N20635J299073J301125P13281j67144
3627A7231058N09288L12934J6230m35440J17404j81147q85573M7469j53459m05593
3617A6173171L35612K51909J43802O47006O06775J180495M86194R78764J635946
3608B2439674K263799J449172J337268K403022K099258J667083J981833J832968
3600C7474077J446500N55901Q5450l70750j102857j554369j701278j085108j150071
3591C2597495n98096p25063p17000K0338M96206L46422J10506M69271R47405J073662
3581C4021146R49280J531572K150804K195730J700110J892791J635761J567562
3573D7644756J945367J675532P22340o4774J18912l32788r16434q85419j404223
$$ plain form
3564 48503269 46947639 45958749 44463709 43154873 41321309 39327024 38174214 37294652
3556 37294652 36742219 36182598 36229788 36003140 35736425 36453096 37214742 38101152 39204223
3547 39204223 40542954 41704733 41988971 43519839 44980198 46109437 47069187 47535994 47344161
3538 47344161 46072070 44148744 41804891 39473862 36871566 33903553 32003926 30201394
3530 30201394 29092736 28130607 27513328 26692167 26023270 25619668 25253720 25337261 25531559
3521 25531559 25424458 25655413 26351126 27650535 28216157 29172318 29728402 29975804 30755111
3512 30755111 31430722 30992933 30295921 30058884 29625637 29436831 29013306 28488539 27574297
3503 27574297 27554605 27326217 27019042 27112268 26800111 26444685 26216071 25498332 25152370 24940198
$$ packed form
3564D8503269j555630r88890j495040j308836j833564j994285j152810q79562
3556C7294652n52433n59621M7190k26648k66715P16671P61646Q86410J103071
3547C9204223J338731J161779K84238J530868J460359J129239R59750M66807j91833
3538D7344161j272091j923326k343853k331029k602296k968013j899627j802532
3530C0201394j108658r62129o17279q21161o68897m03602l65948Q3541J94298
3521B5531559j07101K30955O95713J299409N65622R56161N56084K47402P79307
3512C0755111O75611m37789o97012k37037m33247j88806m23525n24767r14242
3503B7574297j9692k28388l07175R3226l12157l55426k28614p17739l45962k12172
$$ plain form
3493 24940198 25706434 26088100 26713204 27165622 28638732 29866416 30551897 31595166 33468756
3484 33468756 35677734 37258984 39331458 41720039 43511762 44717024 45248493 46335022
3476 46335022 47081596 48314831 48382055 48708472 48612956 47791609 47330737 46775428 46855210 47250006
3466 47250006 48533519 49617858 51000206 53059211 54908132 56882919 58957982 62652840
3458 62652840 66246199 70707328 75025606 79927180 84708611 89828605 95574310 99608539
3450 99608539 104157619 107770295 110928126 112659279 113457680 111813159 108864067 104017242
3442 104017242 98676493 92961571 88006425 82646187 78114509 74812516 71895154 68706027
3434 68706027 65637734 63129003 61051279 59336367 57807888 56999912 56304406 55686148 56032427
$$ packed form
3493B4940198P66236L81666O25104M52418J473110J227684O85481J043269J873590
3484C3468756K208978J581250K072474K388581J791723J205262N31469J086529
3476D6335022P46574J233235O7224L26417r5516q21347m60872n55309P9782L94796
3466D7250006J283513J084339J382348K059005J848921J974787K075063L694858
3458F2652840L593359M461129M318278M901574M781431N119994N745705M034229
3450I9608539M549080L612676L157831J731153P98401j644521k949092m846825
3442A04017242n340749n714922m955146n360238m531678l301993k917362l189127
3434F8706027l068293k508731k077724j714912j528479q07976o95506o18258L46279
$$ plain form
3425 56032427 56298035 56233970 57164554 58872131 60340967 62189242 64526559 66314868 66350789
3416 66350789 65549844 64320462 62387625 60659465 58893851 56555664 53115056 49735265
3408 49735265 46602010 44400605 42641062 41121604 39580916 38109397 36758506 36073417
3400 36073417 35275590 34851934 34802058 35222735 35062041 34826441 35767309 36476203 36709195 36719780
3390 36719780 36124939 35381594 34514881 33358910 32107327 31381023 30576571 29020072 27481697
3381 27481697 27117334 27032696 26473906 26333497 25679032 25842902 25381975 25797308 26500210 27043186
3371 27043186 27349932 27522464 28227597 28398259 29448682 30344083 31037389 31784187 31846700
3362 31846700 32395862 33080016 32842435 33520119 33804729 33841105 34438438 34599561 33601253 32521189
$$ packed form
3425E6032427K65608o4065R30584J707577J468836J848275K337317J788309L5921
3416F6350789q00945j229382j932837j728160j765614k338187l440608l379791
3408D9735265l133255k201405j759543j519458j540688j471519j350891o85089
3400C6073417p97827m23656m9876M20677j60694k35600R40868P08894K32992J0585
3390C6719780n94841p43345q66713j155971j251583p26304q04452j556499j538375
3381B7481697l64363q4638n58790j40409o54465J63870m60927M15333P02902N42976
3371B7043186L06746J72532P05133J70662J050423Q95401O93306P46798O2513
3362C1846700N49162O84154k37581O77684K84610L6376N97333J61123r98308j080064
$$ plain form
3352 32521189 31712704 31587680 31462657 31597921 31979807 32775404 33682538 35034516 35847311
3343 35847311 37301786 38428043 38460527 38974454 38940216 38496761 38458477 38843083 39350898 40056703
3333 40056703 41212628 42103507 43421590 44879422 46080303 47945200 49685463 50024088
3325 50024088 49454963 48363727 46519289 45052410 43490723 42435946 41236036 40600170
3317 40600170 40307145 40246567 39707020 39100111 38652100 38079860 37539814 37610469 37697916 37931307
3307 37931307 38543722 39494125 40325870 41780646 43419727 45454626 47373974 48728387 49557867
3298 49557867 48941769 48040165 46795006 45214747 43646568 42403929 40924710 39185534
3290 39185534 37643312 36373644 35092108 34038800 32734668 31861822 31580769 31429670 31045797
$$ packed form
3352C2521189q08485j25024j25023J35264L81886P95597R07134J351978Q12795
3343C5847311J454475J126257L2484N13927l4238m43455l8284L84606N07815P05805
3333D0056703J155925Q90879J318083J457832J200881J864897J740263L38625
3325E0024088n69125j091236j844438j466879j561687j054777j199910o35866
3317D0600170k93025o0578n39547o06909m48011n72240n40046P0655Q7447K33391
3307C7931307O12415R50403Q31745J454776J639081K034899J919348J354413Q29480
3298D9557867o16098r01604j245159j580259j568179j242639j479219j739176
3290C9185534j542222j269668j281536j053308j304132q72846k81053j51099l83873
$$ plain form
3281 31045797 31640414 31570180 30990309 30361079 29309532 29266542 28726366 28592955 28786899 29087025
3271 29087025 28944661 28713085 27921907 27751889 27925591 27632473 27741995 27857162 28185479
3262 28185479 28068022 28177616 27426450 25902324 24560680 22585232 21366680 20451699 19620873
3253 19620873 19138842 18504852 17803758 17741447 18097973 17914250 17720514 17351787 18101244 18668529
3243 18668529 18944275 19114652 18975607 18455382 18393089 18551269 18099224 18054728 17945393 18326323
3233 18326323 18816991 18440190 17822455 17331351 16312552 15620493 15245588 14418397 14240315
3224 14240315 13844926 13834675 13518376 13565824 13534498 13883382 13972276 13403457 13424761 13360745
3214 13360745 12900737 12579557 12670363 12325336 12482014 12145642 12102015 12466285 12244917 12356352
$$ packed form
3281C1045797N94617p0234n79871o29230j051547m2990n40176j33411J93944L00126
3271B9087025j42364k31576p91178j70018J73702k93118J09522J15167L28317
3262B8185479j17457J09594p51166j524126j341644j975448j218552r14981q30826
3253A9620873m82031o33990p01094o2311L56526j83723j93736l68727P49457N67285
3243A8668529K75746J70377j39045n20225o2293J58180m52045m4496j09335L80930
3233A8326323M90668l76801o17735m91104j018799o92059l74905q27191j78082
3224A4240315l95389j0251l16299M7448l1326L48884Q8894n68819K1304o4016
3214A3360745m60008l21180R0806l45027J56678l36372m3627L64270k21368J11435
$$ plain form
3204 12356352 12736745 11929482 11961328 12283243 12608469 12170253 12168197 12106545 12428495 12517165
3194 12517165 12418819 12647064 12548000 12965314 13184935 12767296 12659908 12430451 12309794 12896546
3184 12896546 12334374 12504486 12945954 13001410 12712366 13276710 13557166 13162704 13349745 13543451
3174 13543451 14007215 13834200 13832907 13838102 14289292 14290031 14419873 14503254 14686657 14979005 15149009
3163 15149009 15488876 14769893 14918861 15174540 15465206 15404910 15736158 16236122 16190430 16508108
3153 16508108 16732512 17152822 17403689 17706104 18102828 18015141 18115449 18681882 18983066 19145181
3143 19145181 19891687 20147045 20067104 19768777 20092306 20163657 20207770 20420420 20742202 21172743
3133 21172743 21760394 21818956 22212540 22730986 23155695 23528104 23868944 24520820 24884454 25051708
$$ packed form
3204A2356352L80393q07263L1846L21915L25226m38216k056o1652L21950Q8670
3194A2517165r8346K28245r9064M17314K19621m17639j07388k29457j20657N86752
3184A2896546n62172J70112M41468N5456k89044N64344K80456l94462J87041J93706
3174A3543451M63764j73015j293N195M51190P39J29842Q3381J83403K92348J70004
3163A5149009L39867p18983J48968K55679K90666o0296L31248M99964m5692L17678
3153A6508108K24404M20310K50867L02415L96724q7687J00308N66433L01184J62115
3143A9145181P46506K55358p9941k98327L23529P1351M4113K12650L21782M30541
3133B1172743N87651N8562L93584N18446M24709L72409L40840O51876L63634J67254
$$ plain form
3123 25051708 25696611 26778300 27412587 28157373 29191212 30076736 30890748 31731472 32658417
3114 32658417 33236350 33690930 34858688 36004332 36957307 38677308 40444950 42222173 44107876
3105 44107876 46722078 49169346 51864435 54840396 57576308 61352096 64566092 67828798
3097 67828798 71251001 74246482 76859673 78769150 79292614 78098428 75300301 71127281
3089 71127281 65770637 60829727 56730228 52836864 48892579 46263399 43494836 41269952
3081 41269952 39924159 37835648 36411643 34887647 33895770 32628199 31658370 31225153 30268056
3072 30268056 29601774 28810061 28197809 27635397 27065357 26485457 26225591 25736759 25098454
3063 25098454 24947720 24613955 23763932 23049785 22449350 21857545 21412077 20611820 20230328
$$ packed form
3123B5051708O44903J081689O34287P44786J033839Q85524Q14012Q40724R26945
3114C2658417N77933M54580J167758J145644R52975J720001J767642J777223J885703
3105D4107876K614202K447268K695089K975961K735912L775788L213996L262706
3097F7828798L422203K995481K613191J909477N23464j194186k798127m173020
3089G1127281n356644m940910m099499l893364l944285k629180k768563k224884
3081D1269952j345793k088511j424005j523996r91877j267571r69829m33217r57097
3072C0268056o66282p91713o12252n62412n70040n79900k59866m88832o38305
3063B5098454j50734l33765q50023p14147o00435n91805m45468q00257l81492
$$ plain form
3054 20230328 19765958 19407658 19211523 18342542 18093760 17853667 17550869 17455868 17215206 16967431
3044 16967431 17024943 16398934 16073367 16071994 16527842 15863903 15579890 15277382 14980747 15246547
3034 15246547 15220697 14724119 14435261 14682525 14704452 14687070 14132693 13902815 13874133 13474051
3024 13474051 12944542 13152155 13261440 12910937 12620348 12505654 12325193 11823167 11533655
3015 11533655 11778342 11692356 11795232 11692211 11875159 11551122 11307844 11514898 11487524 10701833
3005 10701833 10562708 10148927 10171659 10469703 10325411 9939241 9868579 9582555 9717688 9869219
2995 9869219 10036342 9951922 9587000 9735540 9824829 9592372 9137808 9303582 9101537 9139161
2985 9139161 8979860 8582503 8572813 8976865 8926275 8694480 8622769 8357335 8612589 8860071
$$ packed form
3054B0230328m64370l58300j96135q68981k48782k40093l02798r5001k40662k47775
3044A6967431N7512o26009l25567j373M55848o63939k84013l02508k96635K65800
3034A5246547k5850m96578k88858K47264K1927j7382n54377k29878k8682m00082
3024A3474051n29509K07613J09285l50503k90589j14694j80461n02026k89512
3015A1533655K44687q5986J02876j03021J82948l24037k43278K07054k7374p85691
3005A0701833j39125m13781K2732K98044j44292l86170p0662k86024J35133J51531
2995I869219J67123q4420l64922J48540Q9289k32457m54564J65774k02045L7624
2985I139161j59301l97357r690M04052n0590k31795p1711k65434K55254K47482
$$ plain form
2975 8860071 8684097 8578715 8674275 8779849 8525336 8252888 8002734 7982577 8037669 8277879
2965 8277879 7759187 7664129 8092050 8281464 7930747 7451104 7253681 7830769 7648991 7290822
2955 7290822 7123424 7363934 7188317 7669086 7487716 7662549 7896671 7469094 7584946 7444803
2945 7444803 7008792 7122670 7748215 7602225 7120525 6870018 6824309 6790622 6981261 6618348
2935 6618348 6457466 6860750 7001608 6775822 6970716 7286906 6940784 6832160 7170185 7155186
2925 7155186 6819373 6530600 6713579 6503828 6490846 6448739 6884303 6217691 6604077 6516240
2915 6516240 6476336 6531263 6862908 6813053 6609190 6698859 6343185 7081108 7037648 6955156 6899072
2904 6899072 6922012 7454933 7533529 7292029 7079075 7076253 7498209 7175540 7593817 7822507
$$ packed form
2975H860071j75974j05382R5560J05574k54513k72448k50154k0157N5092K40210
2965H277879n18692r5058M27921J89414l50717m79643j97423N77088j81778l58169
2955G290822j67398K40510j75617M80769j81370J74833K34122m27577J15852j40143
2945G444803m36011J13878O25545j45990m81700k50507m5709l3687J90639l62913
2935F618348j60882M03284J40858k25786J94894L16190l46122j08624L38025j4999
2925G155186l35813k88773J82979k09751j2982m2107M35564o66612L86386q7837
2915F516240l9904N4927L31645m9855k03863Q9669l55674P37923m3460q2492n6084
2904F899072K2940N32921P8596k41500k12954k822M21956l22669M18277K28690
$$ plain form
2894 7822507 7928899 8502300 8154516 8222027 8509173 8782017 9030041 9109769 9301991 9537822
2884 9537822 10184091 10775229 10943061 11582331 11732618 11381162 11959317 12663526 12696201 13008247
2874 13008247 13384478 13503754 13682475 13312601 13625320 13850384 13762151 13894962 13190790 13469377
2864 13469377 13867162 13400143 13026764 13312375 13839370 13677407 13656321 14066573 14246651 14788227
2854 14788227 15178465 15833246 16112938 16913662 17599818 18092298 18590334 19333654 20148702
2845 20148702 21006247 21566927 22308944 22819504 23240364 23039853 22109025 21480522 20898035
2836 20898035 20790605 20546029 20437104 20113434 19349730 18683479 17878234 17819309 17876370 17291491
2826 17291491 17543468 17530611 17664313 17719754 18234686 18705715 19539097 20110436 20849239 20843260
$$ packed form
2894G822507J06392N73401l47784O7511K87146K72844K48024P9728J92222K35831
2884I537822O46269N91138J67832O39270J50287l51456N78155P04209L2675L12046
2874A3008247L76231J19276J78721l69874L12719K25064q8233J32811p04172K78587
2864A3469377L97785m67019l73379K85611N26995j61963k1086M10252J80078N41576
2854A4788227L90238O54781K79692Q00724O86156M92480M98036P43320Q15048
2845B0148702Q57545N60680P42017N10560M20860k00511r30828o28503n82487
2836B0898035j07430k44576j08925l23670p63704o66251q05245n8925N7061n84879
2826A7291491K51977j2857J33702N5441N14932M71029Q33382N71339P38803n979
$$ plain form
2816 20843260 21513007 21983264 22419333 22867978 23880593 24869057 24873631 24107783 23871475 24047641
2806 24047641 23555455 23855315 23271660 22675974 22865925 23530863 23246744 22783749 22725474 22622674
2796 22622674 22995352 22861629 23054285 24182367 24893943 25238034 25712622 26358856 27193481
2787 27193481 27277848 27124607 26288648 25300676 24370695 24149367 23771832 23756197 23617437 23007701
2777 23007701 22695920 22695532 22839150 22933846 23092200 23719705 23760608 23974366 24433860 24638912
2767 24638912 24505521 24788759 24569662 24502140 24889094 24849673 24598579 24299608 23871709 23169171
2757 23169171 22969606 22031574 21178719 20679541 20172059 19481369 19077171 18418726 18409428 17924328
2747 17924328 17916324 18087999 17924406 18019018 17821329 17423830 17260205 16752956 16820021 16164511
$$ packed form
2816B0843260O69747M70257M36069M48645J012615R88464M574p65848k36308J76166
2806B4047641m92186K99860n83655n95686J89951O64938k84119m62995n8275j02800
2796B2622674L72678j33723J92656J128082P11576L44091M74588O46234Q34625
2787B7193481Q4367j53241q35959r87972r29981k21328l77535j5635j38760o09736
2777B3007701l11781l88J43618R4696J58354O27505M0903K13758M59494K05052
2767B4638912j33391K83238k19097o7522L86954l9421k51094k98971m27899p02538
2757B3169171j99565r38032q52855m99178n07482o90690m04198o58445r298m85100
2747A7924328q004J71675j63593R4612j97689l97499j63625n07249O7065o55510
$$ plain form
2737 16164511 15165898 15210234 14907855 14055898 13166167 12923130 12675866 12539912 11807995 11735109
2727 11735109 12012040 10724443 10823535 10431177 10324787 10386689 10025732 9653165 9198659 9055391
2717 9055391 9035694 8737332 8901654 8658528 8564754 8126647 7985506 7896089 8398230 8222584
2707 8222584 7165080 7284232 7406300 6979578 6784078 7114023 6659600 6363027 6259460
2698 6259460 6169033 5841362 5700412 6124647 6441938 6183198 5803799 5503945 5778810 5458220
2688 5458220 5857862 5233022 4840167 4982778 4709638 4389762 4513201 4554014 4358265 3967452
2678 3967452 4395332 4898289 4551578 4235533 3658186 3812946 4084941 4185967 4297937 4516523
2668 4516523 4054577 4081494 3236798 3627826 3900532 3838979 3978456 3289680 3269873 3336161
$$ packed form
2737A6164511r98613M4336l02379q51957q89731k43037k47264j35954p31917p2886
2727A1735109K76931j287597R9092l92358j06390O1902l60957l72567m54506j43268
2717I055391j9697k98362J64322k43126r3774m38107j41141q9417N02141j75646
2707H222584j057504J19152J22068m26722j95500L29945m54423k96573j03567
2698F259460r0427l27671j40950M24235L17291k58740l79399k99854K74865l20590
2688E458220L99642o24840l92855J42611k73140l19876J23439M0813j95749l90813
2678C967452M27880N02957l46711l16045n77347J54760K71995J01026J11970K18586
2668D516523m61946K6917q44696L91028K72706o1553J39477o88776j9807O6288
$$ plain form
2658 3336161 3474021 3262814 3351223 3406399 3429576 3536123 3227781 2754339 2526381 2686181
2648 2686181 2841576 3100546 2869851 2277517 1922832 1987951 2251140 2515702 2810437 2406049
2638 2406049 1868032 2107547 2241207 2082320 1971989 2218066 2600213 2662307 1979882 1511237
2628 1511237 2141666 1859121 2024973 1853734 1912359 1668730 2068117 2009788 1299865 1559801
2618 1559801 1923417 2171292 1660711 1472580 1675335 1734696 1585492 1668206 1813041 1701404
2608 1701404 1227400 1461589 1965425 1546976 1201784 906969 1167421 1376269 1407677 1036207
2598 1036207 1267041 1203887 1182023 1925523 1946116 1786044 1497606 1598028 1694465 1339759
2588 1339759 1319564 1286135 1311884 1353680 1256734 1242730 1184186 1369394 1256092 2176585 2081076
$$ packed form
2658C336161J37860k11207Q8409N5176K3177J06547l08342m73442k27958J59800
2648B686181J55395K58970k30695n92334l54685O5119K63189K64562K94735m04388
2638B406049n38017K39515J33660j58887j10331K46077L82147O2094o82425m68645
2628A511237O30429k82545J65852j71239N8625k43629L99387n8329p09923K59936
2618A559801L63616K47875n10581j88131K02755N9361j49204Q2714J44835j11637
2608A701404m74004K34189N03836m18449l45192k94815K60452K08848L1408l71470
2598A036207K30834o3154k1864P43500K0593j60072k88438J00422R6437l54706
2588A339759k0195l3429K5749M1796r6946j4004n8544J85208j13302R20493r5509
$$ plain form
2577 2081076 1455623 2151151 2162646 1925902 2141343 1969173 2170384 2252976 1846688 1740006
2567 1740006 1681427 2012411 1810675 2259553 2489435 2218091 2469063 2474823 2455101 2670901
2557 2670901 2839497 2818731 3476532 3448030 3116519 2837882 2445919 2673187 3555606 3805942
2547 3805942 3196520 3003111 3185508 3016316 2726805 3525025 4179081 3567892 3551668 3844346
2537 3844346 4083359 4355261 4395890 4269030 4431887 4506638 5101043 5054463 4836552 5387120
2527 5387120 5235992 5045087 5145941 5388825 5020919 4871921 4821769 4534899 4515618 5130998
2517 5130998 5140470 5134040 4815027 4646282 5341218 5348017 5279821 5247194 5265134 5457483 5763659
2506 5763659 6049471 6210100 5718828 5855611 5935933 5892814 6299858 6252919 6317156 6298539
$$ packed form
2577B081076o25453O95528J1495k36744K15441j72170K01211Q2592m06288j06682
2567A740006n8579L30984k01736M48878K29882k71344K50972N760j9722K15800
2557B670901J68596k0766O57801k8502l31511k78637l91963K27268Q82419K50336
2547C805942o09422j93409J82397j69192k89511P98220O54056o11189j6224K92678
2537C844346K39013K71902M0629j26860J62857P4751N94405m6580k17911N50568
2527E387120j51128j90905J00854K42884l67906j48998n0152k86870j9281O15380
2517E130998R472o430l19013j68745O94936O799o8196l2627J7940J92349L06176
2506E763659K85812J60629m91272J36783Q0322m3119M07044m6939O4237j8617
$$ plain form
2496 6298539 5791281 5540769 5439519 5668809 5570929 5172489 4697660 4525579 5049973 5698486
2486 5698486 5424771 4931106 5129255 4848995 4841891 4486504 4535029 4421857 4545144 4538864
2476 4538864 5075951 4906371 5034827 5018349 4991278 5165637 4602397 4736746 4949053 4500577
2466 4500577 4316922 4694043 3916371 3532740 2863541 3515826 3608759 3267807 2979264 2961810
2456 2961810 2986367 2821172 3000309 2846779 2544801 2448685 2323060 2065004 2019580 1921131
2446 1921131 1642567 2002679 2484670 2495827 2308451 2547771 2404552 2307106 2537397 1883928
2436 1883928 1384576 1573975 1470296 1505626 1682653 1136017 1276541 1147301 1056138 1060162
2426 1060162 912613 600320 934700 1214596 1390500 1307777 1161230 1173313 962011 895290
$$ packed form
2496F298539n07258k50512j01250K29290r7880l98440m74829j72081N24394O48513
2486E698486k73715m93665J98149k80260p104l55387M8525j13172J23287o280
2476D538864N37087j69580J28456j6478k7071J74359n63240J34349K12307m48476
2466D500577j83655L77121p77672l83631o69199O52285R2933l40952k88543j7454
2456B961810K4557j65195J79137j53530l01978r6116j25625k58056m5424r8449
2446A921131k78564L60112M81991J1157j87376K39320j43219r7446K30291o53469
2436A883928m99352J89399j03679L5330J77027n46636J40524j29240r1163M024
2426A060162j47549l12293L34380K79896J75904q2723j46547J2083k11302o6721
$$ plain form
2416 895290 511295 695615 466273 518548 995670 944989 1153486 370725 557153 1010710
2406 1010710 810849 509980 174567 574143 440597 596538 614875 386075 749133 601372
2396 601372 196979 353831 274755 77659 116116 135743 419648 245195 592561 510775
2386 510775 -105225 -194488 -92753 -66715 -302719 -474188 -252110 837246 396454 492205
2376 492205 710020 405044 527445 389017 -79331 1930 -39665 -39545 22387 -76404 445555
2365 445555 -114732 -22802 151553 117483 40806 -110941 -229669 -473010 -71040 55613
2355 55613 192684 229579 332159 160249 -171306 -265801 64525 -3069 257509 547420
2345 547420 145325 -83115 -370014 60532 184862 311992 507715 838055 655940 416971
$$ packed form
2416H95290l83995J84320k29342N2275M77122n0681K08497p82761J86428M53557
2406A010710j99861l00869l35413L99576j33546J55941J8337k28800L63058j47761
2396F01372m04393J56852p9076j97096L8457J9627K83905j74453L47366q1786
2386E10775o16000q9263J01735K6038k36004j71469K22078J089356m40792R5751
2376D92205K17815l04976J22401j38428m68348Q1261m1595J20O1932r8791N21959
2365D45555n60287R1930J74355l4070p6677j51747j18728k43341M01970J26653
2355E5613J37071L6895J02580j71910l31555r4495L30326o7594K60578K89911
2345E47420m02095k28440k86899M30546J24330J27130J95723L30340j82115k38969
$$ plain form
2335 416971 10802 -98163 216350 -167696 -155636 212732 595051 5881 -88803 14774
2325 14774 -43601 150886 413962 213994 -13743 536331 106139 -125480 179648 459730
2315 459730 227871 -5036 685231 781549 826835 1177009 985012 1389507 1548489 1633549
2305 1633549 1629432 1807419 888509 393581 453914 351925 338948 398736 384198 427113 856577
2294 856577 312250 283936 766634 524400 35448 153232 -58127 121282 173381 268361
2284 268361 -167979 -254494 -189479 -249794 624941 522883 129688 -241981 -108753 495765
2274 495765 213635 -181689 -78483 99534 -45662 514123 674181 521300 58266 76731
2264 76731 524255 695319 413293 368496 1194252 718496 553656 136174 557870 939510
$$ packed form
2335D16971m06169j08965L14513l84046J2060L68368L82319n89170r4684J03577
2325A4774n8375J94487K63076j99968k27737N50074m30192k31619L05128K80082
2315D59730k31859k32907O90267R6318M5286L50174j91997M04495J58982Q5060
2305A633549m117J77987r18910m94928O0333j01989j2977N9788j4538M2915M29464
2294H56577n44327k8314M82698k42234m88952J17784k11359J79409N2099R4980
2284B68361m36340q6515O5015o0315Q74735j02058l93195l71669J33228O04518
2274D95765k82130l95324J03206J78017j45196N59785J60058j52881m63034J8465
2264G6731M47524J71064k82026m4797Q25756m75756j64840m17482M21696L81640
$$ plain form
2254 939510 1213940 1350123 556347 101347 326489 577505 831178 372767 359604 340207
2244 340207 542970 740186 939688 620162 28777 101753 114403 190876 706811 643603
2234 643603 349179 834976 251893 470562 455121 247064 -116733 -142059 -116390 -85445
2224 -85445 246644 259812 159243 490233 246006 536406 608732 331347 516078 336071
2214 336071 71987 78044 616637 1087055 727760 749053 903999 699105 875186 781169
2204 781169 773697 480486 325726 522190 1226941 1344923 835574 1123030 1225098 1287014
2194 1287014 883888 785261 382819 526280 92459 55270 730812 1124455 931369 972950
2184 972950 1158166 821033 947582 937136 1078221 1232029 1549835 1546195 1118285 760920
$$ packed form
2254I39510K74430J36183p93776m55000K25142K51016K53673m58411j3163j9397
2244C40207K02763J97216J99502l19526n91385P2976J2650P6473N15935o3208
2234F43603k94424M85797n83083K18669j5441k08057l63797k5326K5669L0945
2224h5445L32089J3168j00569L30990k44227K90400P2326k77385J84731j80007
2214C36071k64084O057N38593M70418l59295K1293J54946k04894J76081r4017
2204G81169p472k93211j54760J96464P04751J17982n09349K87456J02068O1916
2194A287014m03126r8627m02442J43461m33821l7189O75542L93643j93086M1581
2184I72950J85216l37133J26549j0446J41085J53808L17806l640m27910l57365
$$ plain form
2174 760920 1201282 1209000 1290679 1220920 889950 1506952 1376065 1674969 1530289 1314566
2164 1314566 1226002 1036081 1546312 1884407 1807004 1931850 1790701 1823192 1627252 1728160
2154 1728160 2574113 2403656 2474950 2258340 2229386 2320163 1834867 1788977 2293421 2489319
2144 2489319 2737902 2827608 2743387 2775347 3054583 3354542 3920269 3704745 3874671 4013240
2134 4013240 4553711 4884570 4417167 5012635 4903670 4610175 5087761 5653607 5781214 6112336
2124 6112336 6324975 6716027 7055302 6963058 7015402 6994757 7159493 7622731 7910119 7754391
2114 7754391 7967540 8658259 8618523 8687565 9076800 9334037 9508472 10032432 10395510 10174267
2104 10174267 10478662 11164180 11560175 12589647 12854353 13039855 14177580 14807568 15528525
$$ packed form
2174G60920M40362P718Q1679o9759l30970O17002j30887K98904j44680k15723
2164A314566q8564j89921N10231L38095p7403J24846j41149L2491j95940J00908
2154A728160Q45953j70457P1294k16610k8954R0777m85296m5890N04444J95898
2144B489319K48583Q9706q4221L1960K79236K99959N65727k15524J69926J38569
2134D013240N40471L30859m67403N95468j08965k93495M77586N65846J27607L31122
2124F112336K12639L91052L39275r2244N2344k0645J64736M63238K87388j55728
2114G754391K13149O90719l9736O9042L89235K57237J74435N23960L63078k21243
2104A0174267L04395O85518L95995J029472K64706J85502J137725O29988P20957
$$ plain form
2095 15528525 16386041 17088531 17801983 18866772 19801660 21420620 22827785 24190253 25962876
2086 25962876 28044616 30489852 33507105 35989762 39650830 43735739 49072779 53789970
2078 53789970 58257882 63220416 69936831 78353694 89029767 100315306 116264912 136319994
2070 136319994 161381776 190255771 230664381 273508681 312355263 300562523 246435765
2063 246435765 200915526 154233385 122373460 101439296 87055082 75773191 67983039
2056 67983039 61923432 57232976 53387138 50224805 47102307 43599826 39520079 36619251
2048 36619251 33916374 32062316 30431275 28319665 26841001 25404906 23550176 21988999
2040 21988999 21422343 20445660 19414132 19077383 18145109 17029925 16038468 15180760 14656369
$$ packed form
2095A5528525Q57516P02490P13452J064789R34888J618960J407165J362468J772623
2086B5962876K081740K445236L017253K482657L661068M084909N337040M717191
2078E3789970M467912M962534O716415Q416863J0676073J1285539J5949606K0055082
2070A36319994K5061782K8873995M0408610M2844300L8846582j1792740n4126758
2063B46435765m5520239m6682141l1859925k0934164j4384214j1281891p790152
2056F7983039o059607m690456l845838l162333l122498l502481m079747k900828
2048C6619251k702877j854058j631041k111610j478664j436095j854730j561177
2040B1988999n66656r76683j031528l36749r32274j115184r91457q57708n24391
$$ plain form
2031 14656369 14061093 13698712 13301633 12151810 11481199 10895012 10631421 10434172 9797085
2022 9797085 9416410 8787825 8706407 8665570 8772593 8655237 8486434 7979363 7447517 7667660
2012 7667660 7453627 7160211 6740862 6250869 6094437 6337032 6477366 6429805 5945538 5631944
2002 5631944 5532543 5593110 5369639 5828967 5819738 5321143 4873354 4696880 5332819 5484262
1992 5484262 4933144 4805642 4997268 4592304 4422016 4481450 4547036 4535371 4140576 3548925
1982 3548925 3559208 3467472 3470466 3266686 2960749 2875080 2901740 2354914 2144562 2556566 2712604
1971 2712604 2337505 2421334 2927190 2620147 2286663 2181162 2321312 2398786 2271578 2202574
1961 2202574 2006463 2233773 2348775 1865067 1980388 1927475 1533119 1629242 1964328 1941332
$$ packed form
2031A4656369n95276l62381l97079j149823o70611n86187k63591j97249o37087
2022I797085l80675o28585q1418m0837J07023j17356j68803n07071n31846K20143
2012G667660k14033k93416m19349m89993j56432K42595J40334m7561m84267l13594
2002E631944r9401O0567k23471M59328r229m98595m47789j76474O35939J51443
1992E484262n51118j27502J91626m04964j70288N9434O5586j1665l94795n91651
1982C548925J0283r1736K994k03780l05937q5669K6660n46826k10352M12004J56038
1971B712604l75099Q3829N05856l07043l33484j05501J40150P7474j27208o9004
1961B202574j96111K27310J15002m83708J15321n2913l94356R6123L35086k2996
$$ plain form
1951 1941332 1617196 1674581 1232102 1354686 1534264 1569756 1546066 1610029 1662070 1500249
1941 1500249 1348442 1303282 1182994 1260755 1088600 1177568 1237539 1304110 1241816 1005475 894630
1930 894630 660033 717844 1375479 1132501 983625 501620 976172 1064130 1159439 1025448
1920 1025448 676129 583827 678625 1093619 931205 564090 709630 1199867 831915 886283
1910 886283 575885 402795 668619 835449 619333 516395 171939 521009 524975 331436
1900 331436 403876 579181 936927 662449 336035 348571 559789 951541 755749 614649
1890 614649 606733 333583 146791 325751 573767 508308 834662 892401 629563 437705
1880 437705 652010 299609 -113009 -256538 227956 383622 257565 49676 -41002 -30872
$$ packed form
1951A941332l24136N7385m42479J22584J79578L5492k3690O3963N2041j61821
1941A500249j51807m5160j20288P7761j72155Q8968N9971O6571o2294k36341j10845
1930H94630k34597N7811O57635k42978j48876m82005M74552Q7958R5309j33991
1920A025448l49319r2302R4798M14994j62414l67115J45540M90237l67952N4368
1910H86283l10398j73090K65824J66830k16116j02938l44456L49070L966j93539
1900C31436P2440J75305L57746k74478l26414J2536K11218L91752j95792j41100
1890F14649p916k73150j86792J78960K48016o5459L26354N7739k62838j91858
1880D37705K14305l52401m12618j43529M84494J55666j26057k07889r0678J0130
$$ plain form
1870 -30872 112167 351657 300655 550076 652627 1081836 771976 126924 286240 428267
1860 428267 667667 579491 677993 887466 648471 604066 335836 312143 244285 457567 808462
1849 808462 608059 531444 355376 254987 476848 568070 497306 543548 629362 393605 417722
1838 417722 479218 403408 515884 115853 275703 265055 342256 417673 540238 1447077 1358897
1827 1358897 843756 1074777 1461683 1556207 1355306 1052825 1355967 1105807 877700 737544
1817 737544 567611 55996 339295 497556 1009725 599917 441075 640875 621181 663413
1807 663413 867948 341931 122518 220570 76410 746146 467802 527796 305726 630811
1797 630811 546739 -54373 259851 472193 111630 326451 414200 88355 288654 23688
$$ packed form
1870c0872J43039K39490n1002K49421J02551M29209l09860o45052J59316J42027
1860D28267K39400q8176R8502K09473k38995m4405k68230k3693o7858K13282L50895
1849H08462k00403p6615j76068j00389K21861R1222p0764M6242Q5814k35757K4117
1838D17722O1496p5810J12476m00031J59850j0648P7201P5417J22565R06839q8180
1827A358897n15141K31021L86906R4524k00901l02481L03142k50160k28107j40156
1817G37544j69933n11615K83299J58261N12169m09808j58842J99800j9694M2232
1807F63413K04535n26017k19413R8052j44160O69736k78344N9994k22070L25085
1797F30811q4072o01112L14224K12342l60563K14821Q7749l25845K00299k64966
$$ plain form
1787 23688 279290 726671 389870 135801 240849 242824 430263 157725 28968 -209932
1777 -209932 107078 199835 -392103 -1582 313542 342808 441728 331703 291156 -291848
1767 -291848 -605088 -270654 -22008 380810 247384 86150 -40229 -78022 295265 362848
1757 362848 -87793 -142688 54474 -513671 23758 -10208 -63033 25361 200416 508209
1747 508209 237550 647882 576950 266001 342756 543517 386260 176064 131 297855
1737 297855 369476 226039 -124699 -40542 -97596 412080 -233222 -395058 65333 139385
1727 139385 302129 179313 -49403 117526 -218893 -416563 70137 4591 -82670 13092
1717 13092 6167 -98523 148766 151620 179526 -176762 247965 162968 -173378 315635 -11323
$$ packed form
1787B3688K55602M47381l36801k54069J05048J975J87439k72538j28757k38900
1777b09932L17010R2757n91938L90521L15124K9266R8920j10025m0547n83004
1767b91848l13240L34434K48646M02818j33426j61234j26379l7793L73287O7583
1757C62848m50641n4895J97162n68145N37429l3966n2825Q8394J75055L07793
1747E08209k70659M10332p0932l10949P6755K00761j57257k10196j75933K97724
1737B97855P1621j43437l50738Q4157n7054N09676o45302j61836M60391P4052
1727A39385J62744j22816k28716J66929l36419j97670M86700o5546q7261R5762
1717A3092o925j04690K47289K854K7906l56288M24727q4997l36346M89013l26958
$$ plain form
1706 -11323 -263146 -166243 189099 -342150 -62227 15652 -194972 -52124 -81828 591522
1696 591522 336360 -136393 -97145 300695 -35324 -394790 -62112 -292638 -286398 -966380
1686 -966380 -768424 -321301 -73593 135564 352177 129007 201345 416738 255500 53197
1676 53197 -374060 593011 202145 -23162 212292 -113749 -96790 -245616 -235673 -406504
1666 -406504 -346699 -420935 -509466 -151710 -168589 -27934 -22295 -106009 -258633 202027 -92691
1655 -92691 -287587 -524743 -492886 -316238 -211506 27471 -77433 -87064 83592 60774 340937
1644 340937 300891 -14678 -2043 -119370 -225656 -397895 -242661 -111727 218282 56531
1634 56531 33411 49327 280951 403560 766244 568464 266393 165864 256551 -159066
$$ packed form
1706a1323k51823R6903L55342n31249K79923P7879k10624J42848k9704O73350
1696E91522k55162m72753L9248L97840l36019l59466L32678k30526O240o79982
1686i66380J97956M47123K47708K09157K16613k23170P2338K15393j61238k02303
1676E3197m27257R67071l90866k25307K35454l26041J6959j48826R943j70831
1666d06504N9805p4236q8531L57756j6879J40655N639q3714j52624M60660k94718
1655i2691j94896k37156L1857J76648J04732K38977j04904r631J70656k2818K80163
1644C40937m0046l15569J2635j17327j06286j72239J55234J30934L30009j61751
1634E6531k3120J5916K31624J22609L62684j97780l02071j00529R0687m15617
$$ plain form
1624 -159066 -27363 171001 -187743 -86915 262978 -288516 -134241 -53707 -127292 -75659
1614 -75659 -325570 79755 -64923 263409 -127097 -213773 -197122 5094 55031 71514 -496567
1603 -496567 -220949 -285563 -365436 -101968 -192576 51635 100861 282051 300407 375744 139497
1592 139497 24146 385060 565642 388709 129358 41849 -405888 -882824 -762383 -77072
1582 -77072 90466 -79118 78574 317256 309048 338095 86330 -112200 189969 -14791
1572 -14791 183319 18344 42492 -16737 -366668 -151436 180073 181388 212968 161914 -425724
1561 -425724 -200234 87521 -241486 -88260 -382787 -144824 375982 427670 -292040 -203172
1551 -203172 -136162 310498 112349 -56108 -58714 -141869 -126176 -454482 5336 -159009 232286
$$ packed form
1624a59066J31703J98364l58744J00828L49893n51494J54275Q0534p3585N1633
1614g5659k49911M05325j44678L28332l90506q6676J6651K02216M9937J6483n68081
1603d96567K75618o4614p9873K63468r0608K44211M9226J81190J8356P5337k36247
1592A39497j15351L60914J80582j76933k59351q7509m47737m76936J20441O85311
1582g7072J67538j69584J57692K38682q208K9047k51765j98530L02169k04760
1572a4791J98110j64975K4148n9229l49931K15232L31509J315L1580n1054n87638
1561d25724K25490K87755l29007J53226k94527K37963N20806N1688p19710Q8868
1551b03172O7010M46660j98149j68457k606q3155J5693l28306M59818j64345L91295
$$ plain form
1540 232286 236160 -3448 -191087 -340193 -288627 -54991 -55472 -300106 -399399 370778 353705
1529 353705 239549 14942 -507047 -559429 -365675 -539888 -147756 -522954 -277501 -206769
1519 -206769 -514196 -504313 -634064 -542724 -526662 -197862 -338417 -523723 -385471 -159560
1509 -159560 -273981 -61018 49378 -324559 -526537 -79661 -241122 -435703 -393088 -36806
1499 -36806 -142473 -14833 363903 -7701 58371 -359916 -80515 -232218 -358004 -97703
1489 -97703 -333700 -205837 -34553 191220 75841 -316869 -601735 -470962 -176000 281124
1479 281124 23639 28110 107638 -161249 -313049 -215268 -14886 -12829 -274113 -35465 80101
1468 80101 16530 195193 93448 21974 62686 -553007 -170845 176107 43761 -199490
$$ packed form
1540B32286L874k39608j87639j49106N1566K33636m81k44634r9293P70177j7073
1529C53705j14156k24607n21989n2382J93754j74213L92132l75198K45453P0732
1519b06769l07427R883j29751R1340J6062L28800j40555j85306J38252K25911
1509a59560j14421K12963J10396l73937k01978M46876j61461j94581M2615L56282
1499c6806j05667J27640L78736l71604O6072m18287K79401j51703j25786K60301
1489i7703k35997J27863J71284K25773j15379l92710k84866J30773K94962M57124
1479B81124k57485M471P9528k68887j51800R7781K00382K057k61284K38648J15566
1468H0101o3571J78663j01745p1474M0712o15693L82162L46952j32346k43251
$$ plain form
1458 -199490 -349352 -214931 -469337 -193800 125353 128222 -57121 -132497 -226338 -434727
1448 -434727 -420876 -153063 38247 -393033 -180645 -39934 -371502 -267220 -170986 -311453
1438 -311453 -252404 72899 451711 354562 -166962 -556707 -708782 -618395 -105913 86758
1428 86758 39838 19856 -221282 -175852 -314290 -244156 -29774 21305 186831 -81647 -17445
1417 -17445 215911 104246 58076 -274711 -365486 85687 304774 79719 107347 138236 -370283
1406 -370283 -153754 10610 -69348 -10308 -52540 -222734 -215491 -219461 -85719 -7192 -200373
1395 -200373 -159625 -199942 -562436 -215422 174424 109430 64852 310960 -46198 -583058
1385 -583058 -613814 -732502 -250369 -411969 -350347 -213587 -34806 -619102 -535160 33571
$$ packed form
1458a99490j49862J34421k54406K75537L19153K869j85343p5376r3841k08389
1448d34727J3851K67813J91310m31280K12388J40711l31568J04282R6234j40467
1438c11453N9049L25303L78812r7149n21524l89745j52075R0387N12482J92671
1428H6758m6920j9982k41138M5430j38438P0134K14382N1079J65526k68478O4202
1417a7445K33356j11665m6170l32787r0775M51173K19087k25055K7628L0889n08519
1406c70283K16529J64364p9958N9040m2232j70194P243l970J33742P8527j93181
1395b00373M0748m0317l62494L47014L89846o4994m4578K46108l57158n36860
1385e83058l0756j18688M82133j61600O1622J36760J78781n84296Q3942N68731
$$ plain form
1375 33571 -299065 -310774 -133100 -7404 -294743 -371355 -474596 -506245 -500250 -117776 213470
1364 213470 -81283 197395 40119 -400802 17966 8459 42857 -132112 -298930 223792
1354 223792 234616 42235 -15020 -10359 226182 382605 -143068 4989 -122094 516474
1344 516474 120957 25257 590470 360255 227451 -114942 -446468 -57548 -211587 -162239
1334 -162239 81162 -315203 -245553 -110112 -376268 -283602 38528 -280784 89443 253879
1324 253879 -32534 5866 -265323 -401973 -664592 -278462 95909 -337355 266787 180137
1314 180137 -194663 -128131 -104426 -276339 -478323 -543353 -235353 -263619 -514995 -436113 -540672
1303 -540672 13315 -12214 -365868 -311006 -29880 182959 40073 -194774 -229017 -66310
$$ packed form
1375C3571l32636j1709J77674J25696k87339p6612j03241l1649N995L82474L31246
1364B13470k94753K78678j57276m40921M18768r507L4398j74969j66818N22722
1354B23792J0824j92381n7255M661K36541J56423n25673J48057j27083O38568
1344E16474l95517r5700N65213k30215j32804l42393l31526L88920j54039M9348
1334a62239K43401l96365O9650J35441k66156R2666L22130l19312L70227J64436
1324B53879k86413L8400k71189j36650k62619L86130L74371m33264O04142q6650
1314A80137l74800O6532K3705j71913k01984o5030L08000k8266k51376P8882j04559
1303e40672N53987k5529l53654N4862K81126K12839j42886k34847l4243J62707
$$ plain form
1293 -66310 -30284 525343 202048 -121034 260246 -86622 -236070 250237 520033 -161444
1283 -161444 -363956 84720 -43047 74853 527241 -18760 -610345 -358751 -411699 -149264
1273 -149264 271867 597510 61057 -462066 -329556 -188321 -46897 124270 -167999 -44018
1263 -44018 129002 -797819 -809433 100999 24503 295882 186602 -349534 -421405 -368815 -141538
1252 -141538 16524 -71138 -434235 -164264 239150 -9909 12505 -71736 170319 200042
1242 200042 -25219 23687 217960 332224 -165386 94361 -7620 -181403 -236659 -223232
1232 -223232 -150079 121467 58747 -193872 -296309 -459594 -511067 30526 -92140 -698773
1222 -698773 -844417 -407930 -451908 -23511 91218 -394455 -479147 -198313 -99615 -372225
$$ packed form
1293f6310L6026N55627l23295l23082L81280l46868j49448M86307K69796o81477
1283a61444k02512M48676j27767J17900M52388n46001n91585K51594n2948K62435
1273a49264M21131L25643n36453n23123J32510J41235J41424J71167k92269J23981
1263d4018J73020r26821j1614R10432p6496K71379j09280n36136p1871N2590K27277
1252a41538J58062q7662l63097K69971M03414k49059K2414q4241K42055K9723
1242B00042k25261M8906J94273J14264m97610K59747j01981j73783n5256J3427
1232b23232P3153K71546o2720k52619j02437j63285n1473N41593j22666o06633
1222f98773j45644M36487m3978M28397J14729m85673q4692K80834R8698k72610
$$ plain form
1212 -372225 214995 116993 521641 257257 54360 82045 -220593 -608517 -266136 -223250
1202 -223250 -353443 -164243 246851 126778 -194990 312776 105990 -270530 -175771 -301659
1192 -301659 -617041 70824 440465 -260522 -281253 -689617 -683877 12776 -63377 150840
1182 150840 -224287 -190129 -326670 -477712 -375934 -347198 -144141 -425681 -61555 -288356
1172 -288356 -379930 -96663 154517 422085 463245 220969 149879 213016 112734 130069 362405
1161 362405 315675 572971 491119 531945 414939 485712 -210622 137979 59178 48143 410366
1150 410366 106160 195751 -26140 39377 -62712 624429 211890 37976 -61822 302999
1140 302999 526310 300452 376167 159685 -95675 -142006 -234312 -19474 1531 -543838
$$ packed form
1212c72225N87220r8002M04648k64384k02897K7685l02638l87924L42381M2886
1202b23250j30193J89200M11094j20073l21768N07766k06786l76520R4759j25888
1192c01659l15382O87865L69641p00987k0731m08364N740O96653p6153K14217
1182A50840l75127L4158j36541j51042J01778K8736K03057k81540L64126k26801
1172b88356r1574K83267K51180K67568M1160k42276p1090O3137j00282J7335K32336
1161C62405m6730K57296q1852M0826j17006P0773o96334L48601p8801j1035L62223
1150D10366l04206Q9591k21891O5517j02089O87141m12539j73914r9798L64821
1140C02999K23311k25858P5715k16482k55360m6331r2306K14838K1005n45369
$$ plain form
1130 -543838 -503405 -320075 -234076 -264594 -186426 63660 120560 321158 -204372 58278 432478
1119 432478 499907 193075 97618 99377 24123 314618 144157 -122974 294135 600435 46566
1108 46566 385816 316961 216867 445369 413405 -1236 -288634 56350 -378794 -316741
1098 -316741 -334160 -140262 -420583 -231450 -23688 445789 252823 -106317 -48421 74006
1088 74006 -128271 -45092 153569 -477927 -331104 279216 162430 472638 343441 239736
1078 239736 -161219 -240194 142996 -107981 114644 420479 30955 -1009059 -757687 -446451
1068 -446451 -110051 85360 -303070 -296601 -20721 -109135 -296610 -307477 -630259 -469871
1058 -469871 -869267 -945924 -536798 -298799 -292244 -524676 -239323 -305629 159485 371649
$$ packed form
1130e43838M0433J83330Q5999l0518P8168K50086N6900K00598n25530K62650L74200
1119D32478O7429l06832r5457J759p5254K90495j70461k67131M17109L06300n53869
1108D6566L39250o8855j00094K28502l1964m14641k87398L44984m35144O2053
1098c16741j7419J93898k80321J89133K07762M69477j92966l59140N7896J22427
1088G4006k02277Q3179J98661o31496J46823O10320j16786L10208j29197j03705
1078B39736m00955p8975L83190k50977K22625L05835l89524j040014K51372L11236
1068d46451L36400J95411l88430O469K75880q8414j87475j0867l22782J60388
1058d69871l99396p6657M09126K37999O555k32432K85353o6306M65114K12164
$$ plain form
1048 371649 444636 37841 18444 -84896 117310 -250072 -794870 -541225 -107068 -275152
1038 -275152 -161919 -108222 -3789 125077 -314031 -391814 -294563 -193774 8508 -364778
1028 -364778 26760 -55361 -210369 -9933 -212343 20855 186626 33021 12364 116797
1018 116797 -418980 -361146 63800 -160593 -339663 -310432 -36565 -8504 49471 341092
1008 341092 232830 -69545 -350992 -211277 -175488 179466 15563 -171343 -395504 -391614
998 -391614 -442100 -220997 189029 -269919 -59329 -515427 -486187 -283796 -143228 306598
988 306598 422998 440374 40926 171852 100862 121421 153172 227778 179275 -58438 395595
977 395595 656363 -12556 -528011 -138296 -556593 -162114 -123204 -716861 -442689 138252
$$ packed form
1048C71649P2987m06795j9397j03340K02206l67382n44798K53645M34157j68084
1038b75152J13233N3697J04433J28866m39108p7783R7251J00789K02282l73286
1028c64778L91538q2121j55008K00436k02410K33198J65771j53605k0657J04433
1018A16797n35777N7834M24946k24393j79070K9231K73867K8061N7975K91621
1008C41092j08262l02375k81447J39715L5789L54954j63903j86906k24161L890
998c91614n0486K21103M10026m58948K10590m56098K9240K02391J40568M49826
988C06598J16400J7376l99448J30926p0990K0559L1751P4606m8503k37713M54033
977C95595K60768o68919n15455L89715m18297L94479L8910n93657K74172N80941
$$ plain form
967 138252 394807 183442 -158116 125365 159761 101710 231617 55814 -138852 -87473
957 -87473 -586136 -867168 -887833 -672411 -327953 -269140 -4033 299728 180287 218393 94224
946 94224 -140813 -330925 -209405 -74997 -154085 2743 159243 -314322 -109325 66179
936 66179 -328282 -260844 -281426 -266725 -272994 -98354 -118075 -51633 201362 810013 262633
925 262633 -125030 -287710 81760 -32438 -62344 -119470 -151503 -261871 -342222 -524315 -383188
914 -383188 -211315 -404508 -465917 -36775 -161235 40093 -105343 -333370 -685673 -578199
904 -578199 -499194 -407871 -82186 -168194 -48455 32134 74401 210507 373682 66569 262124
893 262124 -70147 -270180 -74953 -19196 43845 -276796 -329511 -133490 -147675 -338387 -403633
$$ packed form
967A38252K56555k11365l41558K83481L4396n8051J29907j75803j94666N1379
957h7473m98663k81032k0665K15422L44458N8813K65107L03761j19441L8106j24169
946I4224k35037j90112J21520J34408p9088J56828J56500m73565K04997J75504
936F6179l94461O7438k0582J4701o269J74640j9721O6442K52995O08651n47380
925B62633l87663j62680L69470j14198k9906n7126l2033j10368q0351j82093J41127
914c83188J71873j93193o1409M29142j24460K01328j45436k28027l52303J07474
904e78199P9005R1323L25685q6008J19739Q0589M2267J36106J63175l07113J95555
893B62124l32271k00033J95227N5757O3041l20641n2715J96021j4185j90712o5246
$$ plain form
882 -403633 104058 355936 -338533 -185567 -412674 -268741 -72543 -315719 -138097 -34476
872 -34476 44038 329395 149753 -60485 295188 -23704 22877 52474 -380763 273937 588999
861 588999 619297 592564 328254 167390 -166991 -69705 -42459 113597 861 -216765 -115489
850 -115489 -98819 -420073 133973 76772 333951 138545 325711 -179755 -586812 -643933
840 -643933 -302044 -11414 67939 193496 67863 146862 291326 142674 209500 -66855
$$ packed form
882d03633N07691K51878o94469J52966k27107J43933J96198k43176J77622J03621
872c4476P8514K85357j79642k10238L55673l18892M6581K9597m33237O54700L15062
861E88999L0298k6733k64310j60864l34381R7286K7246J56056j12736k17626J01276
850a15489J6670l21254N54046n7201K57179j95406J87166n05466m07057n7121
840f43933L41889K90630P9353J25557j25633P8999J44464j48652O6826k76355
$$ [...]
##END NTUPLES=NMR SPECTRUM
##END=
