##TITLE=1H_EC-3259(III-2)
 CDCl3, 8 sc, 
 27.08.2021
##JCAMPDX= 6.0         $$ Bruker NMR JCAMP-DX V2.0
##DATA TYPE= NMR SPECTRUM
##DATA CLASS= NTUPLES
##ORIGIN= UXNMR, Bruker Analytische Messtechnik GmbH
##OWNER= root
$$ XWIN-NMR		Version 3.5
$$ Fri Aug 27 11:21:18 2021 Russian Standard Time (UT+4h)  she@DPX200
##.OBSERVE FREQUENCY= 200.131506
##.OBSERVE NUCLEUS= ^1H
##.ACQUISITION MODE= SIMULTANEOUS
##.ACQUISITION SCHEME= undefined
##.AVERAGES= 8
##.DIGITISER RES= 18
##SPECTROMETER/DATA SYSTEM= spect
##.PULSE SEQUENCE= zg30
##.SOLVENT NAME= D2O
##.SHIFT REFERENCE= (INTERNAL, D2O, 0, 17.4983)
##AUDIT TRAIL= $$ (NUMBER, WHEN, WHO, WHERE, WHAT)
$$ ##TITLE= Audit trail, XWIN-NMR		Version 3.5
$$ ##JCAMPDX= 5.01
$$ ##ORIGIN= Bruker BioSpin GmbH
$$ ##OWNER= she
$$ F:/spectra/data/she/nmr/H-F/1/pdata/1/auditp.txt
$$ ##AUDIT TRAIL=  $$ (NUMBER, WHEN, WHO, WHERE, WHAT)
(   1,<2021-08-27 11:19:56.29 +0400>,<she>,<DPX200>,
      <created by zg, POWCHK disabled, PULCHK disabled
       configuration hash MD5:
       00 E9 B6 7A A2 85 ED C7 34 08 36 98 17 FE 4E 26
       data hash MD5: 16K
       07 61 20 FD D6 4B 47 38 79 C5 CE 09 A2 E5 57 7B>)
(   2,<2021-08-27 11:19:58.96 +0400>,<she>,<DPX200>,
      <Start of raw data processing
       efp BC_mod = 2 LB = 0.24 FT_mod = 6 PKNL = 1 PHC0 = -13358.32 PHC1 = 13.00099 SI = 16K 
       data hash MD5: 16K
       0F C3 60 7A 73 8B 51 26 89 DD 39 EF D0 51 3E 34>)
(   3,<2021-08-27 11:20:21.45 +0400>,<she>,<DPX200>,
      <pk PHC0 = 2.397527 PHC1 = -3.2 
       data hash MD5: 16K
       2D 39 DD 0A C1 A4 15 FE 93 A3 44 A1 13 61 87 7E>)
(   4,<2021-08-27 11:20:24.79 +0400>,<she>,<DPX200>,
      <abs ABSG = 5 
       data hash MD5: 16K
       B5 12 C3 EC 7F 9D 08 D0 BF 96 A2 C8 F8 46 FA 1F>)
$$ ##END=
$$ 
$$ hash MD5
$$ 84 4B 6D 76 EE 37 EF A3 4A E2 88 81 35 F8 C1 49
##$RELAX= 
##$RELAX= 
##$RELAX= 
##$RELAX= 
##$RELAX= 
##$RELAX= 
$$ Bruker specific parameters
$$ --------------------------
##$DU= <F:/spectra>
##$EXPNO= 1
##$NAME= <H-F>
##$PROCNO= 1
##$TYPE= <nmr>
##$USER= <she>
##$AMP= (0..31)
100 100 100 100 100 100 100 100 100 100 100 100 100 100 100 100 100 100 
100 100 100 100 100 100 100 100 100 100 100 100 100 100 
##$AQSEQ= 0
##$AQ_mod= 1
##$AUNM= <au_zg>
##$AUTOPOS= <>
##$BF1= 200.13
##$BF2= 200.13
##$BF3= 200.13
##$BF4= 200.13
##$BF5= 200.13
##$BF6= 200.13
##$BF7= 200.13
##$BF8= 200.13
##$BYTORDA= 1
##$CFDGTYP= 0
##$CFRGTYP= 5
##$CHEMSTR= <none>
##$CNST= (0..31)
1 1 145 1 1 1 1 1 1 1 1 1 1 1 1 1 1 1 1 1 1 1 1 1 1 1 1 1 1 1 1 1 
##$CPDPRG= <>
##$CPDPRG1= <>
##$CPDPRG2= <>
##$CPDPRG3= <>
##$CPDPRG4= <mlev>
##$CPDPRG5= <mlev>
##$CPDPRG6= <mlev>
##$CPDPRG7= <mlev>
##$CPDPRG8= <mlev>
##$CPDPRGB= <>
##$CPDPRGT= <>
##$D= (0..31)
0 1.2 0 0 0 0 0 0 0 0.06 0 0.03 0 0 0 0 0.0002 0 0 0 0 0 0 0 0 0 0 0 0 
0 0 0 
##$DATE= 1630048795
##$DBL= (0..7)
120 120 120 120 120 120 120 120 
##$DBP= (0..7)
150 150 150 150 150 150 150 150 
##$DBP07= 0
##$DBPNAM0= <>
##$DBPNAM1= <>
##$DBPNAM2= <>
##$DBPNAM3= <>
##$DBPNAM4= <>
$$ [...]
##$SUBNAM3= <"">
##$SUBNAM4= <"">
##$SUBNAM5= <"">
##$SUBNAM6= <"">
##$SUBNAM7= <"">
##$SUBNAM8= <"">
##$SUBNAM9= <"">
##$SW= 20.0188882624521
##$SWIBOX= (0..15)
0 0 2 0 0 0 0 0 0 0 0 0 0 0 0 0 
##$SW_h= 4006.41025641026
##$TD= 16384
##$TD0= 1
##$TE= 0
##$TE2= 300
##$TE3= 300
##$TEG= 300
##$TL= (0..7)
0 120 120 120 120 120 120 120 
##$TP= (0..7)
150 150 150 150 150 150 150 150 
##$TP07= 0
##$TPNAME0= <>
##$TPNAME1= <>
##$TPNAME2= <>
##$TPNAME3= <>
##$TPNAME4= <>
##$TPNAME5= <>
##$TPNAME6= <>
##$TPNAME7= <>
##$TPOAL= (0..7)
0.5 0.5 0.5 0.5 0.5 0.5 0.5 0.5 
##$TPOFFS= (0..7)
0 0 0 0 0 0 0 0 
##$TUNHIN= 0
##$TUNHOUT= 0
##$TUNXOUT= 0
##$USERA1= <user>
##$USERA2= <user>
##$USERA3= <user>
##$USERA4= <user>
##$USERA5= <user>
##$V9= 5
##$VALIST= <valist>
##$VCLIST= <CCCCCCCCCCCCCCC>
##$VD= 0
##$VDLIST= <DDDDDDDDDDDDDDD>
##$VPLIST= <PPPPPPPPPPPPPPP>
##$VTLIST= <TTTTTTTTTTTTTTT>
##$WBST= 1024
##$WBSW= 4
##$XGAIN= (0..3)
0 0 0 0 
##$XL= 0
##$YL= 0
##$YMAX_a= 204568
##$YMIN_a= -302889
##$ZGOPTNS= <>
##$ZL1= 120
##$ZL2= 120
##$ZL3= 120
##$ZL4= 120
##$ABSF1= 17.52155
##$ABSF2= -2.49749
##$ABSG= 5
##$ABSL= 3
##$ALPHA= 0
##$AQORDER= 0
##$ASSFAC= 0
##$ASSFACI= 0
##$ASSFACX= 0
##$ASSWID= 0
##$AUNMP= <proc_1d>
##$AZFE= 0.1
##$AZFW= 0.1
##$BCFW= 0
##$BC_mod= 2
##$BYTORDP= 0
##$COROFFS= 0
##$CY= -3
##$DATMOD= 1
##$DC= 0
##$DFILT= <>
##$DTYPP= 0
##$F1P= 0
##$F2P= 0
##$FCOR= 1
##$FTSIZE= 16384
##$FT_mod= 6
##$GAMMA= 0
##$GB= 0
##$INTBC= 1
##$INTSCL= 1.334414e-10
##$ISEN= 128
##$LB= 0.24
##$LEV0= 0
##$LPBIN= 0
##$MAXI= 10000
##$MC2= 0
##$MEAN= 0
##$ME_mod= 0
##$MI= 1.114404
##$NCOEF= 0
##$NC_proc= -7
##$NLEV= 6
##$NOISF1= 3.799351
##$NOISF2= 2.8
##$NSP= 0
##$NTH_PI= 0
##$NZP= 0
##$OFFSET= 17.49833
##$PC= 1
##$PHC0= -13355.92
##$PHC1= 9.80099
##$PH_mod= 1
##$PKNL= yes
##$PPARMOD= 0
##$PSCAL= 0
##$PSIGN= 0
##$REVERSE= no
##$SF= 200.130007263891
##$SI= 16384
##$SIGF1= 3
##$SIGF2= 2
##$SINO= 5.538805
##$SIOLD= 16384
##$SREGLST= <1H.CDCl3>
##$SSB= 0
##$STSI= 16384
##$STSR= 0
##$SW_p= 4006.41025641026
##$SYMM= 0
##$S_DEV= 0
##$TDeff= 16384
##$TDoff= 0
##$TI= <>
##$TILT= no
##$TM1= 0
##$TM2= 0
##$TOPLEV= 0
##$USERP1= <user>
##$USERP2= <user>
##$USERP3= <user>
##$USERP4= <user>
##$USERP5= <user>
##$WDW= 1
##$XDIM= 16384
##$YMAX_p= 500660916
##$YMIN_p= -589441
$$ End of Bruker specific parameters
$$ ---------------------------------
##NTUPLES= NMR SPECTRUM
##VAR_NAME=  FREQUENCY,     SPECTRUM/REAL,   SPECTRUM/IMAG
##SYMBOL=    X,             R,               I
##VAR_TYPE=  INDEPENDENT,   DEPENDENT,       DEPENDENT
##VAR_FORM=  AFFN,          ASDF,            ASDF
##VAR_DIM=   16384,         16384,           16384
##UNITS=     HZ,            ARBITRARY UNITS, ARBITRARY UNITS
##FACTOR=    0.24454680195387, 1,            1
##FIRST=     3501.94074241662, 0,            0
##LAST=      -504.469513993635, 0,           0
##MIN=       -504.469513993635, -589441,     0
##MAX=       3501.94074241662, 500660916,    0
$$ Real data points
##PAGE= N=1
##DATA TABLE= (X++(R..R)), XYDATA
$$ [...]
6867C37753m54441L59515j31512k6964P9552j15052J18048O4071j13249n0724
6857F6997J14626l25909J96572r1532p1283L40353K07744m08176N4087J45245
6847B28724k28758P5242p7253m9737J16733k2927Q3990M1468l02907L6241j29745
6836b28929R3672k0199R0052J37418O9791j92541j80731J69423J77289j62422
6826d7177O7522r5436K5450r0282m2479j13024L5638K12160N3815L0892p6539
6815c9460M0022l6962j50390J33403o2181q138l2684J16780j03809m7951N4130
6804a37240J68937k56966J73579N8959O2874J14470Q7934l0757p1825j03781j47013
6793h0829K92617j7145r4479n3746j58868O4895K4984j50403K14648m4685L27
$$ plain form
6867 337753 -116688 242827 111315 84351 163903 48851 166899 230970 117721 66997
6857 66997 181623 -144286 52286 -39246 -110529 229824 437568 29392 83479 228724
6847 228724 -34 75208 -2045 -51782 64951 42024 126014 167482 -135425 -99184 -228929
6836 -228929 -135257 -155456 -65404 72014 141805 -50736 -231467 -62044 115245 -47177
6826 -47177 20345 -75091 -49641 -139923 -182402 -295426 -259788 -47628 6187 37079 -39460
6815 -39460 562 -36400 -186790 -53387 -115568 -123706 -156390 -39610 -143419 -191370 -137240
6804 -137240 31697 -225269 -51690 7269 70143 184613 272547 241790 169965 66184 -80829
6793 -80829 211788 194643 100164 46418 -112450 -47555 -22571 -172974 41674 -3011 -2684
6782b684K69509l1941j27644j72053J07709J93466j79461j50772J25685J04421
6772A36235P7104r1601q5901J51348o6929j06967J09647j52059q917l4952m2830
6761a15822L22904k74909l7023j06304J35206J01873k8427J66385L4056k16482
6751a8543K62480K14206j33516j19707J2774L070J8147k08105R4759J47934k38345
6740C5154P54L21789n8707j16750K50750k68225l9044K00510j67808Q3225J05678
6729C47326o6785J2794p9910k49446Q9870q1922k6452K0134J61379N0899J29076
6718C06963m3105M3430J19890j42480J0360J66988r4081l8608o06q6551K9177
6707B71377n8762J79793k0158L3929l04742L54438j11887k34247J85850j34627
$$ plain form
6782 -2684 266825 234884 107240 -64813 42896 236362 56901 -93871 31814 136235
6772 136235 213339 121738 35837 187185 120256 13289 122936 -29123 -38040 -72992 -115822
6761 -115822 207082 -67827 -104850 -211154 -75948 25925 -2502 163883 197939 -18543
6751 -18543 243937 458143 324627 204920 217694 220764 238911 30806 125565 273499 35154
6740 35154 35908 357697 298990 182240 432990 164765 125721 326231 158423 241648 347326
6729 347326 280541 293335 213425 -36021 53849 -28073 -54525 -34391 126988 177887 306963
6718 306963 263858 307288 427178 284698 295058 462046 367965 329357 328751 242200 271377
6707 271377 212615 392408 372250 406179 101437 455875 343988 109741 295591 160964
6697A60964l773L6473m1293J08312P4878l9229j33113J22810j2553j95414J62195
6686B40257j53594K18337j38882j2500K97043j72539L2760R9252J6533k7739o7793
6675C31135J01041K9568n4415n5666q0095L73544p1422j27370p0924j63509K66654
6664D78541M531p1308K95085J209k17248k3227J29630J84424o9576J87782j67874
6653G31969p0579R107J78993P3398O4648P7772n6804k11705J27986J15230q5238
6642I54777O8636k56120P0504K21120R96j20704P3618J12964o4116K1792p131
6631A076336k4617j34242j07196M10417J18213j04127j01885l7846Q5959l9531
6621A141481r690j12962j78330L54679J15349o8156J89696J88692j13657J47722
$$ plain form
6697 160964 157191 193664 152371 260683 335561 296332 163219 286029 273476 78062 240257
6686 240257 86663 305000 166118 153618 450661 278122 310882 410134 426667 398928 331135
6675 331135 432176 461744 407329 351663 271568 645112 573690 446320 375396 211887 478541
6664 478541 483072 411764 706849 708058 490810 467583 597213 781637 712061 899843 731969
6653 731969 661390 670497 849490 922888 987536 1065308 1008504 796799 924785 1040015 954777
6642 954777 1023413 767293 837797 1058917 1059913 939209 1012827 1125791 1061675 1083467 1076336
6631 1076336 1051719 917477 810281 1220698 1338911 1234784 1132899 1095053 1181012 1141481
6621 1141481 1131791 1018829 840499 1195178 1310527 1242371 1432067 1620759 1507102 1654824
6611A654824r665j48984J49042J7766o465J70608P1870J02338o7262l5345m0198
6600A858529J42099K00520L15920J0077o9272J22693L5024K69045K41229k32263
6590B893601K50656K64287P3451J95435j77345j3671j4454M01568Q483J64181
6580D046192L91712J07015J10771K13180J93750M3192K72042K34141o013M2111
6570E648093J63479J31715Q2962O4622J74793K13295L72769K50943L13950L41120
6560G757741L79985M19917N71274N41072N80270N36310N86841P83711O22100O82542
6550A3461763Q11516R44064O58559J098853J233506J563598J924721K170499K804293
6541B6671372L476874L825543M085775M704608N508314O137256P331860Q603370
$$ plain form
6611 1654824 1645159 1496175 1645217 1662983 1656518 1827126 1898996 2001334 1934072 1898727 1858529
6600 1858529 2000628 2201148 2517068 2527145 2457873 2580566 2615590 2884635 3125864 2893601
6590 2893601 3144257 3408544 3481995 3677430 3500085 3486414 3471960 3873528 3882011 4046192
6580 4046192 4437904 4544919 4655690 4868870 5062620 5105812 5377854 5611995 5605982 5648093
6570 5648093 5811572 5943287 6026249 6090871 6265664 6478959 6851728 7102671 7416621 7757741
6560 7757741 8137726 8557643 9128917 9669989 10250259 10786569 11373410 12157121 12779221 13461763
6550 13461763 14273279 15217343 15875902 16974755 18208261 19771859 21696580 23867079 26671372
6541 26671372 30148246 33973789 38059564 42764172 48272486 54409742 61741602 70344972
6533G0344972J0543525J3204170J6417949J9274715J7955090J1104676Q42953
6526A59688050j0984538j8849816k1250295k0210559j5712743j1552139q345474
6519E2782486o518013m884465l912385l674775l206640k691634k029709j899384
6511B3965481j577152j543498j576082j372574j333716j065359p79896p37012
6503A3980192n04845n97153n38976k79179m51483n51157j80187j88434n82913
6494A0105865m04924m23437l29220m74729m88594m53251k91454r8546n33150l38592
6484F269968k03695k29798l15804j13511k78532l61717J77796l13016j18116j26837
6474D386738j95904n2926m19078M4678N4459L2980l38815j40073n06j15585j93741
$$ plain form
6533 70344972 80888497 94092667 110510616 129785331 147740421 158845097 159688050
6526 159688050 148703512 129853696 108603401 88392842 72680099 61127960 52782486
6519 52782486 46264473 41380008 37467623 33792848 30586208 27894574 25864865 23965481
6511 23965481 22388329 20844831 19268749 17896175 16562459 15497100 14717204 13980192
6503 13980192 13475347 12878194 12339218 12060039 11608556 11057399 10877212 10688778 10105865
6494 10105865 9700941 9277504 8948284 8473555 7984961 7531710 7240256 7141710 6608560 6269968
6484 6269968 6066273 5836475 5520671 5407160 5128628 4766911 4944707 4631691 4513575 4386738
6474 4386738 4190834 4137908 3718830 3763508 3817967 3850947 3512132 3372059 3371553 3255968 3062227
6463C062227p6329j9909k05206J19782j83111q8236j843J8610J30755k13036Q0532
6452B624236r499l81476K53758j57628o9349l7632l21675n3174R4977n5805n6320
6441A830413K54499k97382j77507r3539l6038J86559o1741k44185j21948r7400
6431A141731j18139j08616K61445L8702j07380K9673K9188q3925J7972o5004K51759
6420A287406J06928m15939K8257J9011j34306j5279Q1968l46033q0565J05262
6410F36710J73448J82864o3284J3066P5133l92878k6881n2697Q4384M1274o0326
6399F10813q4380j5646K3190J7923O262m4025K08873j20307p0959J79910N985
6388G17639l1161K76326k64818j71419J94397m7711O2151K38414j56032J1046
$$ plain form
6463 3062227 2985898 2965989 2760783 2880565 2697454 2609218 2607375 2625985 2756740 2543704 2624236
6452 2624236 2614737 2233261 2487019 2329391 2260042 2222410 1900735 1847561 1942538 1886733 1830413
6441 1830413 2084912 1787530 1610023 1516484 1480446 1667005 1605264 1361079 1239131 1141731
6431 1141731 1023592 914976 1176421 1215123 1107743 1137416 1166604 1082679 1100651 1035647 1287406
6420 1287406 1394334 978395 1006652 1025663 891357 876078 958046 612013 531448 636710
6410 636710 810158 993022 929738 942804 1017937 625059 598178 545481 629865 671139 610813
6399 610813 526433 510787 533977 551900 558162 514137 723010 602703 531744 711654 717639
6388 717639 686478 962804 697986 526567 720964 673253 735404 973818 817786 828832
6378H28832J16119P0395R0910r9897J44911J38934J65408J12185J13156l5805
6368A645148J3220N6190j3315p6801j34148l8212l6957o1527k56519l1128Q2076
6357A148027l23507o1824J50651p625j34946m1760L6794J25948p1350l42610L8864
6346E16662o3183m3133N3442K935K956J30303j33531P155r9983M58L053j2215
6334C64919K22858j08552j04959j85397K32159q8460j75103J45042l3024Q2787
6324C52270O141o5401N6717j49962p8298J38551j4774J48043r7463q019M889k10107
6312H2587R0826K02951k31638r5550J16503J70671L7747q2865O0112j05991K14305
6301D59658p1563k21364k2521J06388P5741j42521l0790J13654j89111o7947K08732
$$ plain form
6378 828832 944951 1015346 1106256 1006359 1151270 1290204 1455612 1567797 1680953 1645148
6368 1645148 1658368 1714558 1701243 1624442 1490294 1452082 1415125 1353598 1097079 1065951 1148027
6357 1148027 824520 762696 913347 905722 770776 729016 765810 891758 820408 477798 516662
6346 516662 453479 410346 463788 466723 469679 599982 466451 473606 373623 374081 377134 364919
6334 364919 587777 479225 374266 188869 421028 332568 157465 302507 269483 352270
6324 352270 358411 293010 349727 199765 121467 260018 245244 393287 295824 287805 292694 82587
6312 82587 173413 376364 144726 49176 165679 336350 374097 291232 351344 245353 459658
6301 459658 388095 166731 144210 250598 326339 183818 153028 266682 77571 9624 218356
6290B18356J10014q2723l9869R7863L4192J34234M1243k79258J2780L00080j95867
6279C51045k46303j00651K03324O9181j90416n0083Q5334J73980L0102N5670k88634
6268I2549P6317j81138j65420J97581M8825j91833o9470K29812j21297K63584
6258A79510n5840R9095j05779q9897J08294k74291k244Q3922j10159R0090L40637
6247B63338j16168k20991R3328j42374j7942M2524K27948K53255j27925m7510
6237B07483j30298l1674m9049l7562N6891O3147n6619q0911J8141L40666o3768
6226B36447k68959p2267P7663J14499K1297N0398j68191J04018p0067l0116j16562
6215a21840Q3788K90970j43963j87026o3972j9659k19924K39231K65916j23434
$$ plain form
6290 218356 328370 245647 205778 303641 337833 472067 513310 234052 246832 546912 351045
6279 351045 104742 4091 207415 276596 86180 36097 121431 295411 325513 381183 92549
6268 92549 168866 -12272 -177692 19889 68714 -123119 -192589 37223 -84074 179510
6258 179510 123670 222765 116986 27089 135383 -138908 -141152 -57230 -167389 -77299 263338
6247 263338 147170 -73821 19507 -122867 -140809 -98285 129663 382918 254993 207483
6237 207483 77185 45511 -3538 -41100 15791 78938 22319 -58592 -40451 300215 236447
6226 236447 -32512 -104779 -27116 87383 108680 159078 -9113 94905 24838 -5278 -121840
6215 -121840 -38052 252918 108955 -78071 -142043 -161702 -381626 -142395 123521 87
6205H7K5944k9933k0405Q2280Q6984K8861l9940n1000q8759J66387j52446J23774
6193A31834r2454l00599J50535Q8809M9738k1207J1008j19930J07496r071p3732
6182g7573M6866P1381j48367J74975O7925J19564j59176J14006J17852j74593
6172A52860K58235J42350p9318j74039J69845N512N1338K01431J85675k23851
6162F90038j77609p7483k64109m1436M737j22r6994j46137J98530o3003j36440
6151a10028K95184J16621j64274J59385P0932k11571l30491o6538N3829L46278
6141A59327J33099j79836J6474J15678k34580n4501J72786j19816J297p7064P7750
6130A0614O1640j86685M380K20134j79892j33927m3841J23640J33601K4075N4106
$$ plain form
6205 87 26031 -3902 -24307 57973 144957 173818 133878 82878 -5881 160506 8060 131834
6193 131834 39380 -261219 -110684 -21875 27863 6656 17664 -102266 5230 -3841 -77573
6182 -77573 -30707 40674 -107693 67282 135207 254771 95595 209601 327453 152860
6172 152860 411095 553445 474127 300088 469933 475445 526783 728214 913889 690038
6162 690038 512429 434946 170837 129401 134138 134016 37022 -109115 89415 26412 -110028
6151 -110028 185156 301777 137503 296888 367820 156249 -174242 -240780 -186951 159327
6141 159327 292426 112590 129064 244742 10162 -44339 128447 8631 9928 -67136 10614
6130 10614 72254 -114431 -110051 110083 -69809 -203736 -247577 -123937 9664 33739 87845
6119H7845j92441r1919K01460m7592Q3883l3862J68379P3492j3963J08342k60364
6108H3260n2218J68758M0425j21756M4036j69865K1832j6345j32895L1915K78287
6097A75434o1609J9089l4608k71372K1509J44066j95450J07155Q4534M2321m089
6086B6980l58267O8935R6678r9197K95073J95171p0850L997l26635K24452j4453
6075D1884j38477j62038p2829K35312J26072J29149l02439q3871L96539k56143
6065h6841j40245M159o0695j8776J26290K17933p2477j42674J89458K84685j74294
6054A26523l27533L2324Q194L9534K3195j41998Q1825o2033J11448o5447J01999
6043g1969J50918k52170j01646J05264K30381p853r6415j15527Q9823L07482j75197
$$ plain form
6119 87845 -104596 -196515 4945 -42647 41236 7374 175753 249245 235282 343624 83260
6108 83260 31042 199800 240225 118469 162505 -7360 14472 -1873 -134768 -102853 175434
6097 175434 113825 132914 98306 -173066 -151557 -7491 -202941 -95786 -11252 31069 26980
6086 26980 -331287 -262352 -165674 -264871 30202 225373 154523 158520 -168115 56337 41884
6075 41884 -96593 -258631 -331460 -96148 29924 159073 -143366 -227237 169302 -86841
6065 -86841 -227086 -222927 -283622 -302398 -176108 41825 -30652 -173326 16132 300817 126523
6054 126523 -201010 -168686 -160492 -120958 -97763 -239761 -157936 -219969 -108521 -173968 -71969
6043 -71969 78949 -173221 -274867 -169603 60778 52925 -43490 -159017 -69194 238288 63091
6032F3091L7967p0039K7479K55474j0352l0369l1576K1374j57867q822j43208
6021d6848K50036O1078j62021r5259l1966j146K1128N823q3969k13226J9389K89573
6009A2592N1766r9435n8335J71664K190N0162Q7837k03661k59405J40043K41209
5998A36627Q1671k03118k59327j1451j3253J4913n9182J1321L7394m324K54303
5987a4426M2011M4212M5294J06114J6611j58218j03936K3168R3580o2326l9855
5976g771N8332o002J10364Q3881p6434J44359k7969k04380M2934p9100j31610
5965i3396M0301L36511J6365j71309j82347K9427J53405q5646k82111K7167J82222
5954b9411J40309p6069l5798K1746K2656p5968J14676j78435p2010L3363l5989
$$ plain form
6032 63091 101058 31019 58498 313972 303620 273251 241675 263049 105182 96360 -46848
6021 -46848 203188 264266 102245 6986 -24980 -26126 -4998 825 -83144 -296370 -276981 12592
6009 12592 64358 -35077 -93412 78252 80442 130604 218441 14780 -244625 -104582 136627
5998 136627 218298 15180 -244147 -255598 -268851 -253938 -313120 -301799 -264405 -268729 -14426
5987 -14426 27585 71797 117091 223205 239816 81598 -22338 830 94410 32084 -7771
5976 -7771 50561 44559 154923 238804 162370 306729 278760 74380 117314 38214 -93396
5965 -93396 -53095 283416 299781 128472 -53875 -24448 128957 43311 -238800 -211633 -29411
5954 -29411 110898 34829 -969 20777 43433 -32535 82141 -96294 -168304 -134941 -170930
5943a70930O1564j19238N6091J02797J23388p5718M2295p167p53j21080J92904
5932H4153L4867j64975r7233p290O6660L10559q1452j01868N7916M7642p0413
5921G8566q9572J02732j1253j24554l744p921q551j30106o893j178J38310J09134
5909D4970L0582O4095P4036o437j78016P6944p1080L5754M4666n0796n6102K16580
5897B25196j31584j83705J0204L04004K2006m18206j29732J67991M8258j15318
5887b00886J76074N0189J10295J37382o9917k29458O9990r4522j09664J35453
5877b5064N776j06954N4145L9842n4930J65451J97826k61628K3164J46880j39407
5866D5101J52241L1363J57408k01144k52897l0877K60167n2309j88962K48509
$$ plain form
5943 -170930 -109366 -228604 -172513 -69716 53672 -22046 20249 13082 12329 -108751 84153
5932 84153 119020 -45955 -143188 -150478 -83818 226741 145289 43421 101337 148979 78566
5921 78566 -11006 91726 80473 -44081 -47825 -55746 -64297 -194403 -201296 -202474 -64164 44970
5909 44970 75552 139647 213683 207246 29230 106174 35094 70848 115514 64718 8616 225196
5897 225196 93612 -90093 -79889 224115 246121 -172085 -301817 -133826 -85568 -200886
5887 -200886 -24812 25377 135672 273054 203137 -26321 43669 -50853 -160517 -25064
5877 -25064 -19288 -126242 -72097 -32255 -87185 78266 276092 14464 37628 184508 45101
5866 45101 197342 228705 386113 184969 -67928 -98805 161362 109053 -79909 168600
5856A68600j03857j12402J40877N6013r40L1871J5584j38149l1047N3914L0733
5845A11197K4930k10912J95389J38141j42643J00636k08722O1825j0550n2361
5835F930J12094k72701P3970J77386O9571j08822N5431J18514k13288o6206K16540
5824A69419l27766N2685K11534j6713P0090k8334J72924r5204k21368j623Q8757
5813G4401J21093K2870j33763Q0172K46699q3566L6252p4181j11865j66130J55287
5802A67269o8054j38096L27534k36862M5232O1981O4995k76078j2306J48526P0398
5791A54539j51128J23592j63563K0905p3751O6832L12364j23039j21561j47498
5781a02308J00777K2619J89443m9903k69378j2030J11469m0262J56979j0673J6147
$$ plain form
5856 168600 64743 -47659 93218 149231 148291 180162 195746 57597 26550 80464 111197
5845 111197 136127 -74785 120604 258745 116102 216738 8016 69841 59291 6930
5835 6930 119024 -153677 -79707 97679 167250 58428 113859 232373 19085 -47121 169419
5824 169419 -158347 -105662 105872 89159 159249 130915 303839 208635 -12733 -14356 74401
5813 74401 195494 218364 84601 164773 411472 327906 364158 289977 178112 11982 167269
5802 167269 99215 -38881 288653 51791 97023 159004 223999 -52079 -64385 84141 154539
5791 154539 3411 127003 -36560 -15655 -89406 -22574 289790 166751 45190 -102308
5781 -102308 -1531 21088 210531 160628 -108750 -120780 -9311 -49573 107406 96733 112880
5770A12880R4158j39345p5484j48919j7904K2671J04861Q2866J23655k5299j02450
5759C1690M369o4020l0912L6262K10086O2440J5581j76048k46046N7129Q1992
5748a7477J1181J28310k8540R8862N0847k0627r2298J67011j2617k05249K8679
5737A08082p5585q2667J05818J27867k7884k26969K71773L1846o7278M2488o2267
5726A45224P272J34209J32714k31610j20605k3893J64831K0254j98753J91648
5716B21291m4508j21214L3389n3027Q3217J06595j27127M188J41356k31710P3906
5705H6356K57508J184k2537N6882J55162l1661Q1691k35457O7842J92451l42870
5694B66551O5979J75638J95017k06510O5979P807N7290K9912k23303J58913K22702
$$ plain form
5770 112880 207038 67693 -7791 -156710 -174614 -151943 -47082 35784 159439 134140 31690
5759 31690 36059 -27961 -58873 -22611 187475 249915 265496 89448 -156598 -99469 -17477
5748 -17477 -6296 122014 93474 192336 243183 222556 130258 297269 284652 79403 108082
5737 108082 32497 -50170 55648 183515 155631 -71338 200435 232281 165003 207491 145224
5726 145224 152496 286705 419419 187809 67204 43311 208142 228396 29643 221291
5716 221291 176783 55569 88958 35931 119148 225743 98616 102804 244160 12450 86356
5705 86356 343864 345048 322511 379393 534555 502894 584585 349128 416970 609421 266551
5694 266551 332530 508168 703185 496675 562654 570461 627751 657663 434360 593273 815975
5683H15975j85600o6106l1015M0113L1418P0871O995k00754k31228K37083J41800
5672F29552p6601J34648K8566k5194K7377Q7588J05215K73442J9337N565k32667
5661I76828m4689k2265j76966P9905j52993n8065o0636R8886N2879n4515q3126
5650E55243m9674J42063M0202k80056J72710L8283j76687R8791o8816L42269j76409
5639F37919K45602q976m8163K5755k76488Q4051J13235J01056j95487k92185J06061
5628D92380j2237R1150j63412O5836R122J54289o2641j12020M8395k68225j09635
5617A33002K12869J35602K69575j50085l48286K52389k32647J87801m1043L1582
5607D50759K26769n3757j74465J93699O1636l7186J56779r3461k2028J31394O3230
$$ plain form
5683 815975 630375 564269 533254 573367 604785 675656 682651 481897 250669 487752 629552
5672 629552 552951 687599 716165 690971 718348 805936 911151 1184593 1203930 1209495 976828
5661 976828 932139 909874 732908 812813 659820 601755 541119 640005 692884 638369 555243
5650 555243 505569 647632 687834 407778 580488 618771 442084 540875 472059 814328 637919
5639 637919 883521 874545 826382 852137 575649 659700 772935 873991 678504 386319 492380
5628 492380 480143 571293 407881 473717 482839 637128 574487 462467 510862 242637 133002
5617 133002 345871 481473 751048 600963 252677 505066 272419 460220 419177 450759
5607 450759 677528 623771 449306 643005 704641 667455 824234 730773 708745 840139 903369
5596I03369k48408r4418J77243k10874M1844p2349J57211p7931N6644l7555L9596
5585F34372J97247p3653J19983J45881k45607k07772O7724K98563j5244o4061
5575H57433j6167q1355J90055j75170O8002Q3893j51082j45658Q7451M7589L6828
5564H01819j28143K30624p2497l992J76265k38885j63439R9230K77822J15213
5554A094017l0529O5214J4118j15277p8274J49142J12981l41365j00382J36449
5544I06094R2033J93835l0387q1244P6799J15718m7237k10316l07942K27282K45295
5533A179930l6023O2329k47043O0049Q1417K6481J44382K00985j04542J3885m4722
5522A337128J79745j6399N1651j53716l53828J91066J54499R8891n857j34342
$$ plain form
5596 903369 654961 560543 737786 526912 568756 496407 653618 575687 632331 594776 634372
5585 634372 831619 757966 877949 1023830 778223 570451 638175 936738 921494 857433
5575 857433 841266 759911 949966 774796 842798 926691 775609 629951 717402 764991 801819
5564 801819 673676 904300 831803 827811 1004076 765191 601752 700982 978804 1094017
5554 1094017 1063488 1128702 1142820 1027543 949269 1098411 1211392 870027 769645 906094
5544 906094 998127 1191962 1161575 1080331 1157130 1272848 1225611 1015295 707353 934635 1179930
5533 1179930 1143907 1206236 959193 1019242 1100659 1127140 1271522 1472507 1367965 1381850 1337128
5522 1337128 1516873 1500474 1552125 1398409 1044581 1235647 1390146 1489037 1483180 1348838
5512A348838J10610P7160M1840K9304M0878L12360l28953j32546J99202O2873
5502A761566k02757M69815K74352N6360r0961j02774j01988q4484J66914k8255
5492B117788n4894J64341L2158j37844N4107J86408J34002O0509j30908J10632
5482B536299J02582R2524j42712J38188K03839n1462Q376N0978q8159J22220K61315
5471C233988J8017r7759j28525J73331J64959J24437j07860L7816K82084n4894
5461C645594J02387K89673J9042O0011L8245K68782M0505J28076k1100K55654
5451D826869M4340j38123K53936J86680K76399L42870O8109J74956K80760R6459
5441F413255J59414L10401p303P8644L20469O17007K43651k8139M3040L19314
$$ plain form
5512 1348838 1459448 1536608 1578448 1607752 1648630 1960990 1632037 1499491 1698693 1761566
5502 1761566 1558809 2028624 2302976 2359336 2268375 2165601 2063613 1979129 2146043 2117788
5492 2117788 2062894 2227235 2259393 2121549 2175656 2362064 2496066 2556575 2425667 2536299
5482 2536299 2638881 2731405 2588693 2726881 2930720 2879258 2887634 2938612 2850453 2972673 3233988
5471 3233988 3252005 3154246 3025721 3199052 3364011 3488448 3380588 3418404 3700488 3645594
5461 3645594 3747981 4037654 4056696 4116707 4154952 4423734 4464239 4592315 4571215 4826869
5451 4826869 4871209 4733086 4987022 5173702 5450101 5792971 5861080 6036036 6316796 6413255
5441 6413255 6572669 6883070 6875767 6954411 7274880 7891887 8135538 8107399 8150439 8469753
5431H469753K07945M80893L76653K90578N23840O26920K06182N47165Q09200L97504
5421A2936633O26142O09209O24571O69600P42515P94152P36816Q32828J172395
5412A9744861J429900J646964J792852K215608K302781K305189K913002L126883
5404C7478040L519272M250801M825153N673782O908695Q347117R034370Q392994
5396H8430224M475664k56953m823168p683257q255649o608960n110091l533739
5388E6634071k322305j328354k15859M60502J409022K327318K796056L498666
5380F3259117M066600M627101N768751O473943P895806R645954J1879328J4404931
5372A28021531J6467358J5435542Q203664k697382j1839323j7749983j8697566
$$ plain form
5431 8469753 8677698 9158591 9535244 9825822 10349662 10976582 11182764 11729929 12539129 12936633
5421 12936633 13562775 14171984 14796555 15466155 16208670 17002822 17739638 18572466 19744861
5412 19744861 21174761 22821725 24614577 26830185 29132966 31438155 34351157 37478040
5404 37478040 40997312 45248113 50073266 55747048 62655743 71002860 80037230 88430224
5396 88430224 92905888 92648935 87825767 80142510 71886861 65277901 60167810 56634071
5388 56634071 54311766 52983412 52767553 53228055 54637077 56964395 59760451 63259117
5380 63259117 67325717 71952818 77721569 84195512 92091318 101737272 113616600 128021531
5372 128021531 144488889 159924431 168128095 165430713 153591390 135841407 117143841
5365A17143841j6273989j2633375r287930p046407n328031m014893k941459k385926
5357E7231831j478970n69567J97476J87062J061404J140175J885311K356114L319603
5348F5330439M447284N676366O610266O750255M188137p70426n021652q323822
5340G8886847r758967r170376p421048n656252m315509l833540l242180k859684
5332C2629291k569718k045327j579988j347600j157688j277347j252430j187674
5324B0211519r61902n66128o42543r41321m22933m67766m53626o33347l41439
5315A4780514n29179l55704j89875m9608m20901l40829l34737l32041n16422m38064
5305A1273154l28117r2923j90181m14374l60753J7708j73487k68844l98148j41320
$$ plain form
5365 117143841 100869852 88236477 78948547 71902140 66574109 62559216 59617757 57231831
5357 57231831 55752861 55183294 55380770 55567832 56629236 57769411 59654722 62010836 65330439
5348 65330439 69777723 75454089 82064355 88814610 93002747 92232321 87210669 78886847
5340 78886847 69127880 59957504 52536456 46880204 42564695 38731155 35488975 32629291
5332 32629291 30059573 28014246 26434258 25086658 23928970 22651623 21399193 20211519
5324 20211519 19249617 18683489 18040946 17099625 16676692 16208926 15755300 15121953 14780514
5315 14780514 14251335 13895631 13705756 13656148 13235247 12894418 12559681 12227640 11711218 11273154
5305 11273154 10945037 10852114 10661933 10247559 9886806 9904514 9731027 9462183 9064035 8922715
5295H922715k385p3243m5672k35535j24569o0105M0984J47327R1639J01172K6969
5284H789297j9141Q7090j31508m44598m60890k31791m60382j50036Q9363j74857
5274F892547l22459n40615l41134J6306n3880j17565j52238j15133k31752m6981
5264D987096J23628j12842N1628J56465J18950m3194k93385M7907j89531O1068
5254D907790o0284j62090j81764J16096J90465l5890k10883l72348q6644K18661
5244D323109j001q3488m4010J29556l8702m3263J4058L3374p0582K4346r3885
5233D149512K25143J17510Q8652m508N060J22234K71986K03236K08670L59563
5223E747058K69887K81805K91823L569L85912N13316O64827M94522L62727O42433
$$ plain form
5295 8922715 8920330 8847087 8801415 8565880 8441311 8381206 8422190 8569517 8661156 8762328 8789297
5284 8789297 8770156 8857246 8725738 8281140 7820250 7588459 7128077 6978041 7067404 6892547
5274 6892547 6570088 6029473 5688339 5704645 5650765 5533200 5380962 5265829 5034077 4987096
5264 4987096 5110724 4997882 5049510 5205975 5324925 5281731 4988346 5036253 4846722 4907790
5254 4907790 4847506 4685416 4503652 4619748 4810213 4774323 4563440 4191092 4104448 4323109
5244 4323109 4322108 4238620 4194610 4324166 4285464 4242201 4256259 4289633 4219051 4243397 4149512
5233 4149512 4374655 4492165 4580817 4576309 4581369 4703603 4975589 5178825 5387495 5747058
5223 5747058 6016945 6298750 6590573 6594142 6980054 7493370 8158197 8652719 9015446 9657879
5213I657879L10856J72836J46964l28438o70789m20854l70345j74586l64967m9980
5203G908576J67172J31262Q7058J33222M54928L38134N76234N17588R02311Q45691
5193A2062176P51526J083971J047790J207053Q58446R81406K57867o39672q04025
5184A6806538j499018j186155q92929p22618p36832m75280l21808n001J79406
5175A1146303K51361L92915N32898J036894R16961J414018R02907j49988m74513
5166A5969756m41528o03342m74520n77158k36938m06858n33179q90839q31256
5157A0974138o77640n05410m16258m88678j90758n9203m40419n95206j50901K0145
5147G469810k84403K3557L5589M5226l2975k14464k6919k60012n35529j65111
$$ plain form
5213 9657879 9968735 10141571 10288535 9960097 9289308 8868454 8498109 8323523 7958556 7908576
5203 7908576 8075748 8207010 8294068 8427290 8882218 9220352 9796586 10314174 11216485 12062176
5193 12062176 12813702 13897673 14945463 16152516 17010962 17992368 18250235 17610563 16806538
5184 16806538 15307520 14121365 13228436 12505818 11768986 11293706 10971898 10966897 11146303
5175 11146303 11397664 11790579 12323477 13360371 14277332 15691350 16594257 16444269 15969756
5166 15969756 15528228 14924886 14450366 13873208 13636270 13229412 12696233 11805394 10974138
5157 10974138 10296498 9791088 9374830 8886152 8695394 8636191 8195772 7600566 7449665 7469810
5147 7469810 7185407 7208964 7244553 7289779 7256804 7042340 7015421 6755409 6219880 6054769
5137F054769k62188j62351j51653J80499l8884j4328l06699j03827J64884j55541
5127E204681K07959J19154k20252J90720L21432k8517j41550n1247n7373J37891
5117E682898L9540O1443N0869J40817J16916j46439J20896Q5516j833j5767J13801
5106F248657M8674K82302K7997K23445N6908L09701L65776K24727J46072J09911
5096H044170L62556Q0442P6390K41656P583L84164M47997J52263L24235K26535
5086A0347991j54268P7773j9117J53493o642K28718K85860L70114M24883N3769
5076A1762574J46875M47680O59634N08426N03778J45464K53236P06388M16288
5067A5550343M64069P07268N13415P76321O42336P62513R62309R00840Q77159
$$ plain form
5137 6054769 5792581 5630230 5478577 5659076 5620192 5605864 5299165 5195338 5360222 5204681
5127 5204681 5412640 5531794 5311542 5502262 5823694 5795177 5653627 5602380 5545007 5682898
5117 5682898 5722438 5783881 5834750 5975567 6092483 5946044 6066940 6152456 6150623 6134856 6248657
5106 6248657 6297331 6579633 6607630 6831075 6887983 7197684 7563460 7788187 7934259 8044170
5096 8044170 8406726 8487168 8563558 8805214 8812797 9196961 9644958 9797221 10121456 10347991
5086 10347991 10193723 10271496 10252379 10405872 10399230 10627948 10913808 11283922 11708805 11762574
5076 11762574 11909449 12357129 13016763 13525189 14028967 14174431 14427667 15134055 15550343
5067 15550343 16014412 16721680 17235095 18011416 18653752 19416265 20378574 21279414 22156573
5058B2156573R46384O86774R55207J299127J407532J697390K019026K091532K508624
5049C5768169K772927K836220L429527L349615L602909M047660M584780N300839
5041F5692646N924895N392841M086608K172987K15950j513910k508699k613832
5033G6849486j830296j731517p46537m07811K58472R83705J664535K851882L719263
5024H1611182M295955M732041N101589N591572O067247O797292P753037Q796666
5016A30746581R221799Q221034M832954p57909o368406j0484331j2394054j1994011
5008A11023657r900894q297125o420761m909878l585158k587318k030182j129738
5000G2162603m80313N34811P70579J016511J704561J511863K432673K734408L063695
$$ plain form
5058 22156573 23102957 23789731 24744938 26044065 27451597 29148987 31168013 33259545 35768169
5049 35768169 38541096 41377316 44806843 48156458 51759367 55807027 60391807 65692646
5041 65692646 71617541 77010382 81096990 83269977 83485927 81972017 79463318 76849486
5033 76849486 75019190 73287673 72541136 72133325 72391797 73375502 75040037 77891919 81611182
5024 81611182 85907137 90639178 95740767 101332339 107399586 114196878 121949915 130746581
5016 130746581 139968380 148189414 153022368 152264459 145896053 135411722 123017668 111023657
5008 111023657 101122763 92825638 86404877 81494999 77909841 75322523 73292341 72162603
5000 72162603 71682290 72217101 72987680 74004191 75708752 77220615 79653288 82387696 85451391
4991H5451391L445816L828039K791702M05391k466139m802550o646784p409289
4983G4597577o758927n621187m464356l376083k699115k023710j896771j851011
4975D5906417j519538j398043j914832k190795k301412k347034k085976j744422
4967C0404365j589222j582212j228768p47499q67230o93095o08467l24718k57594
4958B2505560k94944j76553k67738k49334J78605K88885j91868J67673K11101
4949B2171387k06531p21862m94090r59701j302197j109578q85532p91144n55272
4940A5145480o72843m68921o66080l01727n35591l86934l47770m28949R0024k36874
4930A1189815l55353o0957M6959j68706k7514M606J7999p8788J19142l8154l15980
$$ plain form
4991 85451391 88897207 92725246 95516948 95922339 93456200 88653650 82006866 74597577
4983 74597577 67838650 62217463 57753107 54377024 51677909 49654199 47757428 45906417
4975 45906417 44386879 42988836 41074004 38883209 36581797 34234763 32148787 30404365
4967 30404365 28815143 27232931 26004163 25256664 24389434 23696339 23087872 22763154 22505560
4958 22505560 22210616 22034063 21766325 21516991 21695596 21984481 21792613 21960286 22171387
4949 22171387 21964856 21242994 20748904 19789203 18487006 17377428 16491896 15700752 15145480
4940 15145480 14472637 14003716 13337636 13035909 12500318 12113384 11765614 11336665 11426689 11189815
4930 11189815 10834462 10773505 10820464 10651758 10624244 10628850 10646849 10568061 10687203 10649049 10333069
4919A0333069l67859j57281k57197l28740r8316m8546k33324j52170n2908M3183
4909H679911m70401j79350n0695o7973j30571n1514m3527l29270q4823l26267
4899F945520k60510K54217R289k45378l01933J06551j01649J75817J52372L207
4889F737503M72870n6515L07063K06603m165L74422K59436J45949j57174l61662
4879G924330O3543j92475p6968j82875k54336J21267L60140M7906j27615Q2548
4869G765465J53386P6602M922l9446K9882K12217l4070p8938N9922n8636j32771
4858G958535K4394m3958l39747k04682q8887j5490J08450L1191k63649J34920
4848G301077O03866J86494J15552P5621J16050L9571l22857m4496j8230j51713
$$ plain form
4919 10333069 9965210 9807929 9550732 9221992 9123676 9075130 8841806 8689636 8636728 8679911
4909 8679911 8209510 8030160 7979465 7911492 7780921 7729407 7685880 7356610 7271787 6945520
4899 6945520 6685010 6939227 6948516 6703138 6401205 6507756 6406107 6581924 6734296 6737503
4889 6737503 7210373 7153858 7460921 7667524 7663359 8037781 8297217 8443166 8285992 7924330
4879 7924330 7987873 7795398 7718430 7535555 7281219 7402486 7762626 7810532 7682917 7765465
4869 7765465 7918851 7995453 8000375 7960929 7990811 8203028 8168958 8090020 8149942 8091306 7958535
4858 7958535 7982929 7938971 7599224 7394542 7305655 7290165 7398615 7429806 7166157 7301077
4848 7301077 7904943 8091437 8206989 8282610 8398660 8438231 8115374 8070878 8052648 7900935
4838G900935k3451J03959M954k64953j79834q2092k37330m94021k83248j17369
4828F327550m53470j48597l35829j34751K52215k67789J67167J55929j17293L3662
4818E478794J95801R1299Q195l08150k20804m0832P754J37796j73542m170l2805
4807E139336l01898k33246M2124l09279j88427k49709l43283J5978k41187k04695
4797C125714J18091K527j52661k52176K70185k71260j56400p5620j3207k8186
4787B567007j68693N5736J46661n6517j40407m5136M4136K03294k08513m7923
4777B349645p3494J16740k58301J20465j856l5319M3438k83090k35522P6857P5203
4766A894766O4370p0158k1083J62231j83693l6549l1297K47502J29221j2622r6843
$$ plain form
4838 7900935 7877484 7981443 7986397 7721444 7541610 7459518 7222188 6728167 6444919 6327550
4828 6327550 5874080 5725483 5389654 5254903 5507118 5239329 5406496 5562425 5445132 5478794
4818 5478794 5674595 5765894 5774089 5465939 5245135 5204303 5212057 5349853 5176311 5172141 5139336
4807 5139336 4837438 4604192 4646316 4337037 4148610 3898901 3555618 3571596 3330409 3125714
4797 3125714 3243805 3246332 3093671 2841495 3111680 2840420 2684020 2608400 2595193 2567007
4787 2567007 2398314 2454050 2600711 2544194 2403787 2358651 2402787 2606081 2397568 2349645
4777 2349645 2276151 2392891 2134590 2255055 2253199 2217880 2261318 1978228 1742706 1819563 1894766
4766 1894766 1959136 1888978 1867895 2030126 1846433 1809884 1778587 2026089 2155310 2142688 2045845
4755B045845k17843O501R4835l1471K0313J3770n4642j36728n7775J58487M0717
4744A882009K7252J94424p7188j02145k9486k33340L0657k1360m9478J14670J19761
4733A855776j49031k8919K35266k08123l1268K54766R6521j10533n7497j76314
4723A680644P082J21070m4511j4176k47526J4727P4153j58808n6428P9309O6980
4712A522516j12128j04541K2976j03887r5915K06545l830j12165J28023K87939
4702A635533p1890l85144j04750r71J61953n9860j93260J34607J54826j44361
4692A126683J3383J68124J18086k84990n8412R2531K50086m36422j60981J85984
4682A014072N0764j67860m4985J79704L5388p3363m4396K33531o9566k76267l0662
$$ plain form
4755 2045845 1828002 1834503 1929338 1897867 1918180 1931950 1877308 1740580 1682805 1841292 1882009
4744 1882009 1909261 2103685 2026497 1924352 1894866 1661526 1692183 1670823 1621345 1736015 1855776
4733 1855776 1706745 1677826 1913092 1704969 1673701 1928467 2024988 1914455 1856958 1680644
4723 1680644 1687726 1808796 1764285 1750109 1502583 1517310 1591463 1432655 1376227 1455536 1522516
4712 1522516 1410388 1305847 1328823 1224936 1129021 1335566 1331736 1219571 1347594 1635533
4702 1635533 1563643 1178499 1073749 1072778 1234731 1174871 981611 1116218 1271044 1126683
4692 1126683 1140066 1308190 1426276 1141286 1082874 1175405 1425491 989069 828088 1014072
4682 1014072 1064836 896976 851991 1031695 1067083 993720 949324 1182855 1113289 837022 806360
4671H06360N937J60737L1608m6064m7095J7981J89583k8785k61681K53678J05099
4660A187358k78142p6956k6206Q9448r0205O6774j56014R4922k2470j5279m995
4649G68235Q5988r6687r463J36981m2786j66586j36453J97601J34407j08626q9632
4638F72979Q6969j50236P9489n749j09907Q0700N38l6036L6892J44502j96789
4627F03352K03033P395l26363o8072J99011j02403J0694K8259J00932q734r4738
4616E52366K03183n2730M816N9150k04639Q3230j43028l2365K68936J29364j02794
4605G65489j38653K06313K667q6303K9338j23756M0107r048J7014l4586R3899
4594G62481j28275L6559J93482J8895l07218J8651K25583k81894j4516j24582
$$ plain form
4671 806360 812297 973034 1004642 958578 911483 929464 1119047 1090262 828581 1082259 1187358
4660 1187358 909216 832260 806054 895502 805297 872071 716057 810979 788509 773230 768235
4649 768235 854223 757536 748073 885054 842268 675682 539229 736830 871237 762611 672979
4638 672979 759948 609712 689201 683452 573545 654245 654783 618747 655639 800141 603352
4627 603352 806385 813780 487417 419345 618356 515953 526647 554906 655838 647104 552366
4616 552366 755549 702819 707635 766785 562146 645376 502348 469983 738919 868283 765489
4605 765489 626836 833149 835816 749513 778851 655095 695202 686154 703168 668582 762481
4594 762481 634206 670765 864247 883142 575924 594575 820158 538264 523748 399166
4584C99166J92389m4450j27096P9807L56178j56257q0000j02430j67438K10351
4574E60220K57906p3238J32648l1811k36296J03022P157L0911P6761k1873J69549
4563I74956Q5202k49352j47871J4126R4295j97952J89962Q1293j23170j08994
4553F12495J11251j95163R835K71176Q2061o6756r1404J2868O2558j59433J13666
4542G63154L63069j79276Q0364k4860j23479q441j44518K1998J95201j88123j68026
4531E87063K98164K4734J37626J22509R3097j82514q1918Q5316L63973j35687
4521A312363j42853j35391P0857O9517k36858J64833k06844J57913K4414R2927
4511A170878J67938k1644p6597K92778O1631J61111n2739j53145k68320K61779
$$ plain form
4584 399166 591555 547105 420009 499816 855994 699737 619737 517307 349869 560220
4574 560220 818126 744888 877536 845725 609429 712451 719608 750519 827280 805407 974956
4563 974956 1060158 810806 662935 677061 771356 573404 763366 844659 721489 612495
4553 612495 723746 528583 538418 809594 891655 824899 733495 746363 808921 649488 763154
4542 763154 1126223 946947 1027311 1002451 878972 870531 726013 748011 943212 755089 587063
4531 587063 885227 909961 1047587 1170096 1263193 1080679 998761 1084077 1448050 1312363
4521 1312363 1169510 1034119 1104976 1174493 937635 1102468 895624 1053537 1077951 1170878
4511 1170878 1338816 1317172 1240575 1533353 1594984 1756095 1703356 1550211 1281891 1543670
4501A543670K2825n0996l1313j06697Q0098K13697j57823j19583J24367o325J21739
4490A633659J04459J58511j00570J7493J48725J19655J17637l147n5403K17134
4480B358153k1932O7331J00506L5438J34046N4730J57876o03M03935L02152J05250
4469C696882L15544N20785M39480N37063O01496P37910O97156Q22198J252948
4460I621462J265917J472030J906234K657594K702573K223434Q79711r65555k739941
4451A9023459k971219k855011k143384j629496j093738p60626p51107o60405o11650
4442E546823j72439n14367k42131j53671k00712j62355l90619J0442l7211j65456
4432C518304k08358j51438J01941j23032m865M2231J12658J86142k24294q7644
$$ plain form
4501 1543670 1566495 1515499 1484186 1377489 1457587 1671284 1513461 1393878 1518245 1511920 1633659
4490 1633659 1738118 1896629 1796059 1813552 1962277 2081932 2199569 2196422 2141019 2358153
4480 2358153 2336221 2403552 2504058 2539496 2673542 2728272 2886148 2885545 3289480 3591632 3696882
4469 3696882 4012426 4533211 4972691 5509754 6111250 6849160 7546316 8368514 9621462
4460 9621462 10887379 12359409 14265643 16923237 19625810 21849244 22728955 21763400 19023459
4451 19023459 16052240 13197229 11053845 9424349 8330611 7569985 6818878 6158473 5546823
4442 5546823 5374384 4860017 4617886 4464215 4263503 4101148 3710529 3720971 3683760 3518304
4432 3518304 3309946 3158508 3260449 3137417 3132552 3174783 3287441 3473583 3249289 3161645
4422C161645l7423K01142J5603n6763L59296J40556J00902j64880J11225J98854
4412D030157J98361M27391M45812L4464M3540L94664P06829Q29709R28148J020755
4402I059830O75052J420984J591074K014454K639743K508487J481940P35634j038073
4393B1089125k373314k594916k584423k425707j755551j157607q78272p99041
4385F520294n16907o55015l60683j82754n13496j99831k20088Q4125k75037j91639
4375C488969j58049r4761k11669l15363n7259r3433l3927k5430k49503q7305K57992
4364B420262J98309k56385L6850k00437j27962Q9640p9449L2560n9625l0617k2113
4353B001033l9697K4194k10099j95769P52m0636j50598K26926R2444l28242K7186
$$ plain form
4422 3161645 3124222 3325364 3340967 3284204 3643500 3784056 3884958 3720078 3831303 4030157
4412 4030157 4228518 4655909 5101721 5136185 5179725 5574389 6281218 7110927 8039075 9059830
4402 9059830 9734882 11155866 12746940 14761394 17401137 19909624 21391564 22127198 21089125
4393 21089125 18715811 16120895 13536472 11110765 9355214 8197607 7319335 6520294
4385 6520294 6003387 5348372 4987689 4804935 4291439 4091608 3871520 3955645 3680608 3488969
4375 3488969 3330920 3236159 3024490 2709127 2651868 2558435 2524508 2499078 2249575 2162270 2420262
4364 2420262 2618571 2362186 2399036 2198599 2070637 2160277 2080828 2113388 2053763 2023146 2001033
4353 2001033 1961336 1985530 1775431 1579662 1580414 1539778 1389180 1616106 1708550 1380308 1407494
4342A407494N7002q6965L5095K50307J6937m2487p4307j93123j64031K03368J4659
4331A423949J12032R7274q8374l9450O052m033m9183R630o0788k3193m9335r1849
4319A242732J60023O431j97815q4341L6k1794K10385P3807N3860j31865l0121
4308A281338J55181M9435J6483k89961M9792k1027J88528j51151M7135o3191j93344
4297A069218n3267J36276L8075R1385M2035j24118l6237O667o3980L38064R791
4286A453909m12935o0275J73K43047n9485M9253k3110K5539O5329r0550L4790
4275A225685j05605l8757K19925Q0393P6241J34399P8339K2686j56323J02880
4265A639863q0768k97786N8579L87814K31878j30470m8339j48849r6294N9539
$$ plain form
4342 1407494 1464496 1377531 1412626 1662933 1679870 1637383 1563076 1369953 1205922 1409290 1423949
4331 1423949 1535981 1633255 1544881 1505431 1511483 1507450 1458267 1467897 1407109 1383916 1334581 1242732
4319 1242732 1402755 1409186 1211371 1127030 1127066 1105272 1315657 1389464 1443324 1311459 1281338
4308 1281338 1436519 1485954 1502437 1212476 1262268 1241241 1429769 1278618 1325753 1262562 1069218
4297 1069218 1015951 1152227 1190302 1281687 1323722 1199604 1163367 1170034 1106054 1444118 1453909
4286 1453909 1040974 980699 980872 1223919 1164434 1213687 1190577 1216116 1281445 1190895 1225685
4275 1225685 1120080 1081323 1301248 1381641 1457882 1592281 1670620 1693306 1536983 1639863
4265 1639863 1559095 1261309 1319888 1707702 1939580 1809110 1760771 1611922 1515628 1575167
4255A575167j03756p0636J43231j50778j37573k9179L8770K11673L3221M6926
4245A557066j1591r4165K18785n149l3524K8209K2080Q7840r3303L3340J33941
4234A843529j5657j48578l3961j15296j97108M3060K11689J305k1408N0245j05635
4223A512185n4953R0758J14070j10852j39213K6715K05202K6894R0727k3374K16025
4212A954184p3815j18480M7786L2047O0719l1630J96590j5860j39829o8767O6857
4201A909802j44171r493l3287P9821q7915L61084K22268j19627j09937j91198
4191A877347K51619J97251j08762j42l6245j34333J32540K32741j29752j38459
4181B143805L78019M722l2508M21714j03165j05932K29274K31721J68511O1575
$$ plain form
4255 1575167 1471411 1400775 1544006 1393228 1255655 1226476 1265246 1476919 1510140 1557066
4245 1557066 1545475 1451310 1670095 1664946 1631422 1659631 1681711 1769551 1676248 1709588 1843529
4234 1843529 1827872 1679294 1645333 1530037 1332929 1375989 1587678 1588983 1567575 1617820 1512185
4223 1512185 1457232 1547990 1662060 1551208 1411995 1438710 1643912 1670806 1761533 1738159 1954184
4212 1954184 1880369 1761889 1809675 1841722 1902441 1870811 2067401 2051541 1911712 1842945 1909802
4201 1909802 1765631 1756138 1722851 1802672 1714757 2075841 2298109 2178482 2068545 1877347
4191 1877347 2128966 2326217 2217455 2217313 2181068 2046735 2179275 2412016 2282264 2143805
4181 2143805 2521824 2526546 2494038 2915752 2812587 2706655 2935929 3167650 3336161 3397736
4171C397736J36372J73718M90994M37068J99408K71241j96765o18296m42850l25660
4161C522966k32492j45087J85967k10624m09726K22452k0705j13795j02934j21001
4151B575021P4125J53465O4605m1208p3228J22506k4419r2289R8315j32324J41161
4140B865730M7199q9762k08461j18025J63238J39568N3678M8922O516N7491P1836
4129C037930n7774o0164J49793J42893q3135N7685J46426M545l5227p9979R9543
4118C322536j6177j09199O7885J66981j7690L84618n8761j62909j13598j4670
4108C449016j87006r3800M3362J6822L04980J19522k464l26289K4057l4578j50596
4097C163026Q5783j4353K47010j19844K68378K52041J57898j56129k2200K69531
$$ plain form
4171 3397736 3534108 3707826 4198820 4635888 4835296 5106537 4909772 4291476 3848626 3522966
4161 3522966 3290474 3145387 3331354 3120730 2711004 2933456 2912751 2798956 2696022 2575021
4151 2575021 2649146 2802611 2867216 2826008 2752780 2875286 2850867 2758578 2856893 2724569 2865730
4140 2865730 2912929 2823167 2614706 2496681 2659919 2799487 2853165 2902087 2908603 2966094 3037930
4129 3037930 2980156 2919992 3069785 3212678 3129543 3187228 3333654 3338199 3302972 3222993 3322536
4118 3322536 3306359 3197160 3265045 3432026 3414336 3798954 3740193 3577284 3463686 3449016
4108 3449016 3262010 3168210 3211572 3228394 3533374 3652896 3650432 3324143 3348200 3313622 3163026
4097 3163026 3248809 3234456 3481466 3361622 3630000 3882041 4039939 3883810 3861610 4131141
4087D131141k13355P2752r6498l968j44217N7763J10269l2551L03905M8386k15573
4076D018054K36652O8356j50967l9633J47292P0525Q7772l8815J41361M0058N6713
4065D637368m1407K42525N6807N4145O9192J4334K2168K70539J50685J46917L8487
4054E661760j09972L9460O7194R4982K45787K39126J07411J39194L2477J65511
4044F682930K20406L36211K36581K08431O4921K79099J73220K87169J80594L81473
4034I051035K85301L00744L46373K80606M90488L45123M08302J04123L15145l8708
4024A1888532l0779J57132J55978M743n2609j6050J93690q482k22149o3235J79959
4013A2186730N2346M31318K07567K00303O00562K92778L22192L43402O70801M59605
$$ plain form
4087 4131141 3917786 3990538 3894040 3890072 3745855 3803618 3913887 3881336 4185241 4233627 4018054
4076 4018054 4254706 4323062 4172095 4132462 4279754 4350279 4438051 4399236 4540597 4580655 4637368
4065 4637368 4595961 4838486 4895293 4949438 5018630 5032964 5055132 5325671 5476356 5623273 5661760
4054 5661760 5551788 5591248 5658442 5753424 5999211 6238337 6345748 6484942 6517419 6682930
4044 6682930 6903336 7239547 7476128 7684559 7749480 8028579 8201799 8488968 8669562 9051035
4034 9051035 9336336 9637080 9983453 10264059 10754547 11099670 11507972 11612095 11927240 11888532
4024 11888532 11857753 12014885 12170863 12175606 12122997 12106947 12300637 12292155 12070006 12006771 12186730
4013 12186730 12239076 12670394 12877961 13078264 13678826 13971604 14293796 14637198 15307999 15767604
4003A5767604O61475P19796M68695L49040N75835J74189J93678J32054J94471
3994A9236837J26163j88898j68515n2282L4897r6868m6751j11768R8523K7711
3984A8859049m32863j64695j08794J8182p164q0805M39454K81042L12065O60080
3974A9775551K54083M89165K00867N11723P20821M18332N21534P72296N26680
3965B4191052P8410K45557K15134K6719o2695j07155O8314L95588m489K66733
3955B5313168L53730K53770Q2349m1141K13517L7408L17136N39879N54698M82986
3945B8107500M8155N33994R45497Q26209J276727J446151J485718J761106J518980
3936C7950037J764287J888839K014169K169553K389584K288468K584245K720499
$$ plain form
4003 15767604 16429079 17148875 17617570 17966610 18542445 18716634 18910312 19042366 19236837
3994 19236837 19363000 19174102 19005587 18953305 18988202 18891334 18844583 18732815 18831338 18859049
3984 18859049 18426186 18261491 18152697 18170879 18163715 18082910 18522364 18803406 19115471 19775551
3974 19775551 20029634 20518799 20719666 21231389 21952210 22370542 22892076 23664372 24191052
3965 24191052 24269462 24515019 24730153 24756872 24694177 24587022 24655336 25050924 25046435 25313168
3955 25313168 25666898 25920668 26003017 25961876 26175393 26212801 26529937 27069816 27624514 28107500
3945 28107500 28155655 28689649 29635146 30461355 31738082 33184233 34669951 36431057 37950037
3936 37950037 39714324 41603163 43617332 45786885 48176469 50464937 53049182 55769681
3928E5769681K842582L074377L716370M245876N481357O877476Q494273J0094924
3920A00596916J1339347J2212643J3851254J5675479J8492864K1621872K5157812
3913B18948187L0001259L6819579M7040496N8719063O2524245M1526897N081190
3906E00660916l4877211n9765482o8136853o1812698m5713151l3399169k4375962
3899A72580390j9042000j5263130j3126608j1100566r230500p114485n726030
3892I1977071n029000m678127m425693m167878l926323l375186k993567j989519
3884F1391778j444854j201466m87846j45209j23858Q0812M81921P44346Q45289
3875F0140913J448289K166399K204697K861487L751208M106865L561708K62564
$$ plain form
3928 55769681 58612263 61686640 65403010 69648886 75130243 82007719 90501992 100596916
3920 100596916 111936263 124148906 138000160 153675639 172168503 193790375 218948187
3913 218948187 248949446 285769025 332809521 391528584 454052829 495579726 500660916
3906 500660916 465783705 406018223 337881370 276068672 230355521 196956352 172580390
3899 172580390 153538390 138275260 125148652 114048086 104817586 97703101 91977071
3892 91977071 86948071 82269944 77844251 73676373 69750050 66374864 63381297 61391778
3884 61391778 59946924 58745458 58257612 58112403 57988545 58069357 58551278 59295624 60140913
3875 60140913 61589202 63755601 65960298 68821785 72572993 76679858 80241566 80504130
3867H0504130l081743n605308o894851n902852m555721l570655k947609k049816
3859D5895575j784699j486319j250474j103388r83570q04368q06321j007158j039081
3850C5630197j271207j513265j023609j320185j064294p51788q06311p24951n90905
3841B6563682m64300m34028o20471j06664L6716l00420j42806J90694j92842l45048
3831B4184513k54701m71271l1228j26564l26526P0082p212N044J95914L4770K4982
3820B3297803j50009M4288k95153n04184m11248p99289o63380l81343l34290l07715
3810A9495480k64847J74085j58642j13518m1091J71326o42k30022M09982L5330
3800A9477441L5061j36455J9351m5719J74801R0638J0859J03645L29751L12921
$$ plain form
3867 80504130 77422387 71817079 64922228 59019376 54463655 50893000 47945391 45895575
3859 45895575 44110876 42624557 41374083 40270695 39287125 38482757 37676436 36669278 35630197
3850 35630197 34358990 32845725 31822116 30501931 29437637 28685849 27879538 27154587 26563682
3841 26563682 26099382 25665354 25044883 24938219 24974935 24674515 24531709 24722403 24529561 24184513
3831 24184513 23929812 23458541 23427313 23300749 22974223 23044305 23037093 23042137 23238051 23272821 23297803
3820 23297803 23147794 23192082 22896929 22392745 21981497 21182208 20518828 20137485 19803195 19495480
3810 19495480 19230633 19404718 19246076 19132558 19091467 19262793 19262151 19032129 19442111 19477441
3800 19477441 19512502 19376047 19395398 19349679 19524480 19615118 19625977 19729622 20059373 20372294
3790B0372294K5679j18649K9979J52557m22584k89965Q7973J91770k4547P6004
3780B0080511k18656j84724K8073j06920l01649l00414o4757K97145L0560o4120
3770A9195049N8462J09613J18500K46594J9149J61657O02585M55040L61677M24657
3760B1752983j34262j95212n698j21723j66788k9571J12492K11808K09687J54248
3750B1787964N90764O99629M65529L28376R4939l0301J7403O40131O16247P07570
3740B5918251N68924L31451K36874n23357m88073l30541n0319p8384K61794L42875
3730B6189495N06109M75038N23838M00795L26104N72861M13913M09350P3301j55574
3720B9735230J46370K97377Q2526M10078P42809M65295R28577O90988L67465K83476
$$ plain form
3790 20372294 20397973 20279324 20309303 20461860 20039276 19749311 19837284 20029054 20004507 20080511
3780 20080511 19861855 19677131 19705204 19598284 19296635 18996221 18931464 19228609 19259169 19195049
3770 19195049 19253511 19363124 19481624 19728218 19747367 19909024 20511609 20966649 21328326 21752983
3760 21752983 21618721 21423509 21417811 21296088 21129300 21099729 21212221 21424029 21633716 21787964
3750 21787964 22378728 23078357 23543886 23872262 23967201 23936900 23954303 24594434 25210681 25918251
3740 25918251 26487175 26818626 27055500 26532143 26044070 25713529 25663210 25584826 25846620 26189495
3730 26189495 26695604 27170642 27694480 28095275 28421379 28994240 29408153 29817503 29890804 29735230
3720 29735230 29881600 30178977 30261503 30671581 31414390 31879685 32808262 33499250 33866715 34150191
3710C4150191J79244O73222N57442M30781Q59580J147659R67069P74433K42672
3701C9982293R2790l59717l27696l3738m26708n99780n16116o28548m61687p01881
3691C6019212p32061m01471k84706p47454p35855p30778o91099o24196o15338
3682C0456254o77777q57777l80140o95033j065001m78224l46672n23315m85876
3673B4946439o69346n28569j06404m38902l74066j1249l77002o19621k35249k03972
3663B1382059m43353j55928l96801j28967R6773j75085k2713j22011p0158K01564
3653B0165380k18465j49912O7944j19830R5523M12698L18990q5959N19j32395
3643B0354493m55059l93655m03017l93440m4102k59427r8628K10598k00223q1156
$$ plain form
3710 34150191 34329435 35002657 35560099 35990880 36850460 37998119 38965188 39739621 39982293
3701 39982293 40075083 39715366 39387670 39353932 38927224 38327444 37811328 37182780 36721093 36019212
3691 36019212 35287151 34885680 34600974 33853520 33117665 32386887 31695788 31071592 30456254
3682 30456254 29778477 28920700 28540560 27845527 26780526 26302302 25955630 25432315 24946439
3673 24946439 24277093 23748524 23642120 23203218 22829152 22817903 22440901 21821280 21586031 21382059
3663 21382059 20938706 20782778 20385977 20257010 20353783 20178698 20155985 20033974 19963816 20165380
3653 20165380 19946915 19797003 19864947 19745117 19840640 20253338 20572328 20486369 20486888 20354493
3643 20354493 19899434 19505779 19102762 18709322 18665220 18405793 18307165 18517763 18317540 18236384
3633A8236384q3957R4128j64396K4555J17328J14969J4232j10235Q4649L09338
3623A8636995K09381m0968j43929K13174L11750J7427K04807K75736K11288L80887
3613B0276548j13692L78872M44575K66522L22560N47742M18900M76502M24538
3604B3443067O92980R55706Q18610Q53376R71351J389997J288270J596733J123434
3595C3133524J497566J088744P22466K36351j93091k15632o12267j13600m46903
3586C5097158j52667K21738P02137J018108J007760J450610J448000J782967K008095
3577D4583906K504550K782162K770399L241432L783765M392725M659838M963984
3569G3682761M999103M378504M309092M092653L404457K317641K313374J939315
$$ plain form
3633 18236384 18152427 18246555 18082159 18106714 18224042 18339011 18353243 18243008 18327657 18636995
3623 18636995 18846376 18805408 18661479 18874653 19186403 19203830 19408637 19684373 19895661 20276548
3613 20276548 20162856 20541728 20986303 21252825 21575385 22123127 22542027 23018529 23443067
3604 23443067 24136047 25091753 25910363 26763739 27735090 29125087 30413357 32010090 33133524
3595 33133524 34631090 35719834 36442300 36678651 36485560 36269928 35657661 35544061 35097158
3586 35097158 34944491 35166229 35868366 36886474 37894234 39344844 40792844 42575811 44583906
3577 44583906 47088456 49870618 52641017 55882449 59666214 64058939 68718777 73682761
3569 73682761 78681864 83060368 87369460 91462113 94866570 97184211 99497585 101436900
3561A01436900J751544J619274J146042j79280k081207l358834m425969m351638
3553I1556832l716343k968911j838153r72168k77602K45243R29905J173497J636447
3544H5768747K372081K680671K833202K725829K584285K263290J736353O74208
3536A03638666k76030j245397k516769l089192l411078m380464m605168m488634
3528G9625934l728757l132848k494120j576244r82273n89108o32198M7718P5890
3519F6613994M71689J049188J154725J519874J803492J877395J944777J849803
3511G8284937J594196J179679M45177n79475k015979l139392l783790m570618
3503F7414735m861188m562488m019042l362309k759946k189438j667168j411946
$$ plain form
3561 101436900 103188444 104807718 105953760 105774480 103693273 100334439 95908470 91556832
3553 91556832 87840489 84871578 83033425 82061257 81783655 82028898 82958803 84132300 85768747
3544 85768747 88140828 90821499 93654701 96380530 98964815 101228105 102964458 103638666
3536 103638666 103362636 102117239 99600470 96511278 93100200 88719736 84114568 79625934
3528 79625934 75897177 72764329 70270209 68693965 67711692 67122584 66490386 66538104 66613994
3519 66613994 67085683 68134871 69289596 70809470 72612962 74490357 76435134 78284937
3511 78284937 79879133 81058812 81503989 80924514 78908535 75769143 71985353 67414735
3503 67414735 62553547 57991059 53972017 50609708 47849762 45660324 43993156 42581210
3495D2581210j254065r75689j016646n66494n44345l00112j57109k21051L4830
3486C7580529K71857R679K43160P3159k80620o92106j191987j578770j730283
3477C2704618j645986j784239j584496j358146j380309r00276q87896o91474m04588
3468B2067208n17726m13182o15141n91374l66589j25540j19887l05599k13007
3459A8799163k57423P7116K18212j24551j63881j12823K23403k41312q4959l2460
3449A8300485m8215k06644r2815J99760J42956n4202J59262Q141K16725J08721
3439A8734174K85045J15315K65785M79073L67654J87204K52887P79887O76667
3430B2143691O16432M78290P57623M53082P55776R31108O19301O72024O00501
$$ plain form
3495 42581210 41327145 40351456 39334810 38768316 38223971 37923859 37766750 37545699 37580529
3486 37580529 37852386 37862065 38105225 38178384 37897764 37205658 36013671 34434901 32704618
3477 32704618 31058632 29274393 27689897 26331751 24951442 24051166 23163270 22471796 22067208
3468 22067208 21549482 21136300 20521159 19929785 19563196 19437656 19317769 19012170 18799163
3459 18799163 18541740 18618856 18837068 18712517 18548636 18435813 18659216 18417904 18332945 18300485
3449 18300485 18252270 18045626 17952811 18152571 18295527 18241325 18400587 18408728 18625453 18734174
3439 18734174 19019219 19134534 19400319 19879392 20247046 20434250 20687137 21467024 22143691
3430 22143691 22760123 23238413 23996036 24449118 25204894 26136002 26755303 27427327 28027828
3421B8027828P04682O50850O28402Q11576L25076L64253L49419K08482L34110
3412C2404678N94515J022946O82654Q17176P80916Q6394K96684O66374P96339
3403C8148676Q82878J159983J716149J594288J642852J891874J919492K286750
3395E1242942J771278J681082J202634J127258R05854J001842P65670P91352P36575
3386F1226487J323732J800544J395908J122965R37241L37313l12314k89211n47737
3377F6994928o4770N59328O80020J388456J704114J626823J882673J843582J652362
3368G8267516J189173J415489J589954J474803J430537J679670J771781J988981
3360I0807904K322428K833575L004137K783867K288557J404233R10431p1300j113679
$$ plain form
3421 28027828 28732510 29383360 30011762 30823338 31148414 31512667 31862086 32070568 32404678
3412 32404678 32999193 34022139 34704793 35521969 36302885 36389279 36685963 37352337 38148676
3403 38148676 39031554 40191537 41907686 43501974 45144826 47036700 48956192 51242942
3395 51242942 53014220 54695302 55897936 57025194 57931048 58932890 59698560 60489912 61226487
3386 61226487 62550219 64350763 65746671 66869636 67806877 68144190 67831876 67542665 66994928
3377 66994928 66930158 67489486 68169506 69557962 71262076 72888899 74771572 76615154 78267516
3368 78267516 79456689 80872178 82462132 83936935 85367472 87047142 88818923 90807904
3360 90807904 93130332 95963907 98968044 101751911 104040468 105444701 106355132 106283832 105170153
3351A05170153j266588j471184j137483r64221o24303k52139j14350N5005M98210
3342I9893100N24944M63680R95058J487637J886760K590128L244933L899271M164332
3333A19149843M114951M143065L338767K099281J631734P70055N46766L92908
3325A36187370k81609j027198j052182j116079j127691r44013l33000R6320J08862
3316A30510780Q3173k27887m81328o87418n38720n7690K72675J54064o95491r85653
3306A27346505j230126j786506j821813j797517j890890k035617j592511j145345
3298A14046180j001836l53267L01127L35988P02987P20679L36528p15483j519014
3289A12853889k487993l456442l358051k526550j878797j609033j292908j500206
$$ plain form
3351 105170153 103903565 102432381 101294898 100330677 99706374 99454235 99339885 99394890 99893100
3342 99893100 100418044 100881724 101876782 103364419 105251179 107841307 111086240 114985511 119149843
3333 119149843 123264794 127407859 130746626 132845907 134477641 135247696 135794462 136187370
3325 136187370 135905761 134878563 133826381 132710302 131582611 130638598 130305598 130401918 130510780
3316 130510780 130593953 130366066 129884738 129197320 128658600 128600910 128873585 129027649 128332158 127346505
3306 127346505 126116379 124329873 122508060 120710543 118819653 116784036 115191525 114046180
3298 114046180 113044344 112691077 112992204 113328192 114031179 114751858 115088386 114372903 112853889
3289 112853889 110365896 106909454 103551403 101024853 99146056 97537023 96244115 94743909
3281I4743909k153735j594694j088026q61314k01090Q9982k19240M607N47779
3272H9268178P75891Q04613J287782J761832J739356J089691K96236l59851q37730
3263I5825998j818417j889631j983986k018401k362067k371113k174896k343482
3255G8864005j974381j343384q48624p13219l78189k05235k75830l3941j005992
3246G2085210j645291j760847j508174j486092j529872p43158q49777q82059p06675
3237F0973265r83621j113282q37076n01064p01342o27897j94893l13421o59669
3228E5041000j075439j251260j387775j498385j598065j687178k095405j855457
3220D2592036j694601j438085j179742r40781q14268m63487m11386l41064j88083
$$ plain form
3281 94743909 92590174 90995480 89907454 89046140 88845050 88935032 88715792 88720399 89268178
3272 89268178 90044069 90848682 92136464 93898296 95637652 96727343 97023579 96663728 95825998
3263 95825998 94007581 92117950 90133964 88115563 85753496 83382383 81207487 78864005
3255 78864005 76889624 75546240 74697616 73984397 73606208 73400973 73125143 73091202 72085210
3246 72085210 70439919 68679072 67170898 65684806 64154934 63411776 62561999 61679940 60973265
3237 60973265 59989644 58876362 58039286 57538222 56836880 56208983 56014090 55700669 55041000
3228 55041000 53965561 52714301 51326526 49828141 48230076 46542898 44447493 42592036
3220 42592036 40897435 39459350 38279608 37338827 36524559 36061072 35649686 35308622 35120539
3211C5120539l25335n30555m53823p56718q59951r05079j015768p59693m68801
3202B9044816o83418m91160n54134n67533l36126l01486m36100q30068o70094
3193B4174697n67802n29379p12995p27489o25418p69788m74819m22031l96265
3184A8948711m41442l65071n53275l37553k62763k23654m02073j11780j82612
3175A6068488m9209R490j85236j49312l75718m29407k70450j42420l25192m10475
3165A3740559k66573J1298l52070k02303k83046j85728j13314k17881j97219n9209
3155A1874514m9029m44891k42864j0255j24095j82754J60891R6047l37924k13358
3145A0526282K6700o7050p5616K3503k53486k43610l12209J24110k6506k4446
$$ plain form
3211 35120539 34795204 34264649 33810826 33054108 32194157 31289078 30273310 29513617 29044816
3202 29044816 28361398 27870238 27316104 26748571 26412445 26110959 25674859 24844791 24174697
3193 24174697 23606895 23077516 22364521 21637032 21011614 20241826 19767007 19344976 18948711
3184 18948711 18507269 18142198 17588923 17251370 16988607 16764953 16362880 16251100 16068488
3175 16068488 16019279 16028769 15843533 15694221 15318503 14889096 14618646 14476226 14151034 13740559
3165 13740559 13473986 13485284 13133214 12930911 12647865 12462137 12348823 12130942 11933723 11874514
3155 11874514 11825485 11380594 11137730 11127475 11003380 10820626 10981517 11077564 10739640 10526282
3145 10526282 10552982 10485932 10410316 10433819 10180333 9936723 9624514 9748624 9722118 9697672
3135I697672o607k55657k28917r5211O6086j6402j37386j56809j79919R1442M8008
3124H826300k0675j57378l577j53962L197P7387k9589J3766j18003j10126J6793
3113H344133J56750k41876O2783l7581j66704j5072P1630m6702k3717M0793j42850
3102H001587J71591j08751P4390J31153n3746p8479j25478p1449R3812J55303
3092H189933J13599R3408J04040k17771l21756p810J85574j12448q6955J39515
3082H079329J9647j520j13003j95535r0937k96881l01576k03643J30369j00743
3072F925507j64982R70k64923l03502k8751L22332l46558j63560J71181j20854
3062F026860j65365M3282m5195J55389J74990K87554J28000J79114M69019M22967
$$ plain form
3135 9697672 9691065 9435408 9206491 9111280 9177366 9160964 9023578 8866769 8686850 8778292 8826300
3124 8826300 8805625 8648247 8644670 8490708 8493905 8571292 8541703 8555469 8437466 8327340 8344133
3113 8344133 8500883 8259007 8321790 8284209 8117505 8102433 8174063 8127361 8103644 8144437 8001587
3102 8001587 8173178 8064427 8138817 8269970 8216224 8137745 8012267 7940818 8034630 8189933
3092 8189933 8303532 8396940 8500980 8283209 7961453 7953643 8139217 8026769 7939814 8079329
3082 8079329 8098976 8097456 7984453 7788918 7697981 7401100 7099524 6895881 7026250 6925507
3072 6925507 6760525 6761495 6496572 6193070 6164319 6486651 6140093 5976533 6147714 6026860
3062 6026860 5861495 5904777 5859582 6014971 6189961 6477515 6605515 6784629 7253648 7676615
3052G676615K7773q3560l78575m36735l26644l18160r2594q8911k01998j96708
3042E580503o9134k41106N7912j18940l8933j6721r0693J36386K1543l8695o1795
3031E120327m1229J49344J0607J06135J19153k5771L9217K76553n682k0134k49024
3020E479496k22817l0302r0661P9859j86133K93758j53474m83618P5570K09868
3010D971546j79107O193m6854R9618R9712L3238k39349j40287K48399o5165L830
2999D791774J9394j10942J6407j22630m093q046O3723r9163r0963k13169l0248
2988D212044n39J49727R151o5594O2858p278p0732j50130p2656r7133M0788k9996
2976C980510J1372K0330l2936q8843m3407O4534J5325Q5436j8883j84013J3527
$$ plain form
3052 7676615 7704388 7620828 7242253 6805518 6478874 6160714 6068120 5979209 5777211 5580503
3042 5580503 5511369 5270263 5328175 5209235 5170302 5153581 5062888 5199274 5220817 5182122 5120327
3031 5120327 5079098 5228442 5239049 5345184 5464337 5438566 5477783 5754336 5748654 5728520 5479496
3020 5479496 5256679 5226377 5135716 5215575 5029442 5323200 5169726 4686108 4761678 4971546
3010 4971546 4792439 4798632 4751778 4851396 4951108 4984346 4744997 4604710 4853109 4787944 4791774
2999 4791774 4811168 4700226 4716633 4594003 4589910 4581864 4645587 4546424 4455461 4242292 4212044
2988 4212044 4211505 4361232 4370383 4304789 4367647 4360369 4289637 4139507 4066851 3969718 4010506 3980510
2976 3980510 3991882 4012212 3979276 3890433 3847026 3911560 3926885 4012321 3993438 3809425 3822952
2965C822952M9177K0824k30396j80068J4061L5134Q8105j16885m932J42008l9438
2954C600542k09932j67051J29011j89912j04847K048K04176j82145O0147P4361
2944C216398p0813j54292K21822j15419J4978K03981j20928j49281K1845J59002
2934C227293q0823k17758m9115j76625j04463J15330J53285p6686n4571O8003
2924B803870q0534M8806j54342K8184j81893j46465K51833J10853p7264o8846
2914B534202m5158p1929q7529J72154K13954j21939l22209K2285L5830Q1083j46226
2903B264518q2406l2780J16209J58936j03320j10254J73589p5709j84509j258
2893B123016j05017P3156J03808j64143j15517r3904P321j5733j8226j54731J34870
$$ plain form
2965 3822952 3872129 3892953 3662557 3482489 3496550 3531684 3619789 3502904 3497972 3639980 3600542
2954 3600542 3390610 3223559 3352570 3162658 3057811 3059859 3264035 3081890 3142037 3216398
2944 3216398 3145585 2991293 3213115 3097696 3112674 3316655 3195727 3046446 3068291 3227293
2934 3227293 3146470 2928712 2879597 2702972 2598509 2713839 2867124 2790438 2735867 2803870
2924 2803870 2723336 2772142 2617800 2645984 2464091 2317626 2569459 2680312 2603048 2534202
2914 2534202 2489044 2417115 2329586 2501740 2715694 2593755 2271546 2293831 2329661 2410744 2264518
2903 2264518 2182112 2149332 2265541 2424477 2321157 2210903 2384492 2308783 2124274 2123016
2893 2123016 2017999 2091155 2194963 2030820 1915303 1821399 1828720 1812987 1794761 1640030 1774900
2882A774900J61041j10366p5210m8535q0332O60o5304O2467J21065O676r9727
2871A647335j67704O9755m099P6970j91724q794K25250m7764j82326K60026j55607
2860A521318j41457M00859k21055N0127L2895j38609L8705N1989L5534L9391p8924
2849A590773j02752o4773q948J92283J34357N4883j42852Q6388j17740J12300
2839A733919j26427O233k91880M1417K2638J05212J47838N5221r6845r3497j17272
2828A386557n8689R7371j89500N2341J24281o3129j13851R9028j6832m3440O8959
2817A343096p0556j60436J96450l5909M9667K30649j58448j57573N332J33889
2807A376161j65549N1705L2638p6159L9832l14592J17693n9514J97869j65864
$$ plain form
2882 1774900 1935941 1825575 1750365 1701830 1621498 1622158 1556854 1619321 1740386 1747062 1647335
2871 1647335 1479631 1549386 1545287 1622257 1430533 1421739 1646989 1599225 1416899 1676925 1521318
2860 1521318 1379861 1780720 1559665 1609792 1642687 1504078 1542783 1594772 1630306 1669697 1590773
2849 1590773 1488021 1423248 1414300 1606583 1740940 1795823 1652971 1739359 1621619 1733919
2839 1733919 1607492 1613725 1321845 1363262 1385900 1491112 1638950 1694171 1597326 1503829 1386557
2828 1386557 1327868 1425239 1235739 1288080 1412361 1349232 1235381 1334409 1317577 1274137 1343096
2817 1343096 1272540 1112104 1308554 1272645 1322312 1552961 1394513 1236940 1242272 1376161
2807 1376161 1210612 1262317 1294955 1218796 1258628 944036 1061729 1002215 1200084 1034220
2797A034220O0282J23960j55034n7935j66441j07395K88570J76422l8878k02866
2787I54905o993N4355k0261k5697l1115j00543L4967J3804m9829Q2035j49935
2776G55693Q4049O8615j4421o2921j06330J05185k04481J26223p9957J36725O2475
2765H70855m6796l7191j81735J04199k27082J86939J96134L0389j53284k30389
2755E12039K32787n8790R3966J05609J0995R8064j83157j552Q518j45894J84726
2744H57311O9238o7179m6834j013j08561m2796l0239k28240K326J72357J24579
2733G00949j42052P3873j24722K36565r4054l07187P2074J16418r4113m328q7244
2722C46179K13837l4512k15453J49148j609K5715L1620N1487k58287p397j5633
$$ plain form
2797 1034220 1094502 1218462 1063428 1005493 839052 731657 1020227 1196649 1157771 954905
2787 954905 947912 1002267 982006 956309 925194 824651 859618 873422 823593 905628 755693
2776 755693 839742 908357 893936 831015 724685 829870 625389 751612 671655 808380 870855
2765 870855 824059 786868 605133 709332 482250 669189 865323 895712 742428 512039
2755 512039 744826 686036 780002 885611 896606 994670 811513 809961 818479 672585 857311
2744 857311 926549 859370 812536 811523 702962 660166 629927 401687 404013 576370 700949
2733 700949 558897 632770 508048 744613 650559 343372 415446 531864 437751 433423 346179
2722 346179 560016 525504 310051 459199 457590 483305 514925 566412 308125 300728 285095
2711B85095r7660J70870p8327k50704J78854L36524j39225k11266p7977K15449
2701C31633L2616L8383p8661J50522P7347p4058l8083j62400O1180J37602J8973
2690D95054Q1181k55244j3744J27816n1911p7117j30174m4715q6774J15719J4442
2679A74533K13283k21914J46549J42900j78909j36679j54057o6461N7892O8479
2669D5616j08177r218j94304O3577K23926O1332k646J69634L1505m7021P1189
2658C05413l8256O4507J16258j78206n7920l30552J36279L14784J71306L0181
2648E33794j78172l16993q872J70522k07223J39541O5642J7484O1316j89812n2108
2637C5119K75918k16963o5238R4938j42772J34736K48688l1807q9370j03495K26170
$$ plain form
2711 285095 187435 358305 279978 29274 208128 544652 405427 194161 116184 331633
2701 331633 364249 402632 323971 474493 551840 477782 439699 277299 338479 476081 495054
2690 495054 576235 320991 307247 435063 383152 306035 175861 131146 44372 160091 174533
2679 174533 387816 165902 312451 455351 276442 139763 -14294 -80755 -22863 45616
2669 45616 -62561 -71779 -266083 -202506 21420 82752 80106 249740 281245 234224 305413
2658 305413 267157 331664 447922 269716 211796 -118756 17523 332307 503613 533794
2648 533794 355622 38629 29757 200279 -6944 132597 198239 215723 277039 87227 35119
2637 35119 311037 94074 28836 123774 -18998 115738 364426 332619 243249 139754 365924
2626C65924j78753l6567l0416k05212J49639l1J89333j8691l23020M2783K71286
2615B26275j63532J33940R4250j46658j01204q5968n9986N2435J01082j23886
2605g3252p7953K8441K15174k42180R3771K07277j30966j75783j20633J76738
2595i9366j37927J77749J83043j1614j54847r265J79721j43033j84124J25018
2585g4645O1107j79313K73974R1116j3379k23600R5639p0210l658J02144K401
2574F1576m3870j19874K77521j34146Q0415j11831l4272L2329P0399k0850j5998
2563D1399J71406r4787K00322j01528n8339J07702l09168l06603J70760J81386
2553B550J03624j26427k6644r298P0390K222N550K8595K0003J77219j1235k17924
$$ plain form
2626 365924 187171 150604 120188 -85024 64615 64584 253917 235226 -87794 -45011 226275
2615 226275 62743 196683 290933 144275 43071 -42897 -102883 -50448 50634 -73252
2605 -73252 -151205 -122764 92410 -149770 -55999 151278 20312 -155471 -276104 -99366
2595 -99366 -237293 -59544 123499 111885 -42962 -52227 127494 -15539 -199663 -74645
2585 -74645 -13538 -192851 81123 172239 158860 -64740 30899 -39311 -42969 59175 61576
2574 61576 17706 -102168 175353 41207 121622 9791 -24481 7848 78247 57397 41399
2563 41399 212805 118018 318340 216812 158473 266175 -42993 -349596 -178836 2550
2553 2550 106174 -20253 -46897 -56195 14195 16417 21967 50562 70565 247784 236549 18625
2541A8625M3110J68513J76926K5532k77496j07232M629J2082J30200m0205j4509
2530A40175o8018J73767j25775j58239N4577j11368O8132J99571n2420j37472
2520a7070Q1495r88J44679k3603K7271j13278r0696R4544J8006j7368Q0886n7840
2508A26038J40294O2068l02252J06093J10194k32964J71407J84582j41136L7010
2498B61334K6155k79138K137K00654J1454j18061o7538Q1560k00393l7017K18364
2487I9511o5314K84036J32456j33474k10309M080Q1635O5678l57439R4473P8638
2476G3971K17328R1387j65165j11810j38087l1822L40858m9463k04564K2263l727
2465D1169K4287j82841J771J63715R704r8383O7672Q9255K11082l54751J69037
$$ plain form
2541 18625 61735 230248 407174 432706 155210 47978 52607 64689 194889 154684 140175
2530 140175 72157 245924 120149 -38090 16487 -94881 -26749 172822 120402 -17070
2520 -17070 64425 63437 208116 184513 211784 98506 7810 102354 120360 102992 183878 126038
2508 126038 266332 328400 26148 132241 242435 9471 180878 365460 224324 261334
2498 261334 287489 8351 10488 211142 222596 104535 36997 118557 -81836 -118853 99511
2487 99511 34197 318233 450689 317215 106906 110986 192621 258299 -99140 -4667 73971
2476 73971 291299 382686 217521 105711 -32376 -64198 276660 227197 22633 44896 41169
2465 41169 65456 -117385 -115614 48101 57805 -40578 27094 116349 327431 -27320 141717
2454A41717N1122j20679J36885j81787M2489J06268O676m2318J329n1231k11069
2443a20598M0439K27542J28728k62682J89596Q1240j17764k73600q1611L17104
2433A28394O5177k68094J28529K09220m42015Q3201p6321K45109P5950R9843L1068
2422B80061j30354O7709m5988Q307j94163M7689J71037k59947J51030p0463r8029
2411g3111L22955j60028k699j48521M46m0261p5430L670p2987R7249K06646m5629
2399A2300J35961j82319J46593J275j86265R2890q7201j24838J04516J25816n9588
2388b0860l9032n505M1695M5026J4235q2664j42868j0271J83128J11034K3311
2377A17229J69006j61641j14262M5444m7047j35162K35096o497j83136J80067
$$ plain form
2454 141717 192839 72160 209045 27258 69747 176015 182691 140373 141702 90471 -120598
2443 -120598 -80159 147383 276111 13429 203025 284265 166501 -107099 -188710 128394
2433 128394 193571 -74523 54006 263226 -178789 -95588 -171909 73200 149150 248993 280061
2422 280061 149707 217416 171428 179735 -14428 33261 204298 -55649 95381 24918 -73111
2411 -73111 249844 89816 87117 -61404 -60958 -101219 -176649 -172979 -245966 -148717 57929 12300
2399 12300 148261 -34058 112535 113810 -72455 20435 -66766 -191604 -87088 38728 -20860
2388 -20860 -59892 -65397 -23702 21324 35559 -47105 -189973 -200244 -17116 93918 117229
2377 117229 286235 124594 10332 55776 8729 -126433 108663 102166 -80970 99097
2367I9097j12982o136j30416j12341J95455L1086q425K4888J9439O7807r0642
2356b3170K6145Q9731P3394j29696j00352K88356q2864j22601l0670q8215N4975
2345d4967l0738K04272j7549j65942K02970k16291J93695J14817j29531p9420
2335C1316q8322Q8025J13076p1305J03060J44658j86611l6567p8714j21612M1892
2324f1104L14406j37638m4791r1799j88P8558J85028l8790J73688p8685r263L0019
2312C19441P7777k56224M3647K96856R2199M0380O7867J43633l0687K8092j92553
2301F30428k58672r845j07215j71896L2199J88529m0254q7788J2638p7920R8799
2290B09003j79293J3238J09507o9392j55459R0807K13820p3410j21943K39833
$$ plain form
2367 99097 -13885 -20021 -150437 -262778 -67323 -36237 -44662 -19774 -335 67472 -23170
2356 -23170 2975 92706 166100 36404 -63948 224408 141544 18943 -11727 -99942 -44967
2345 -44967 -75705 128567 111018 -54924 148046 -68245 125450 240267 110736 31316
2335 31316 -57006 31019 144095 72790 175850 320508 133897 97330 18616 -102996 -61104
2324 -61104 253302 115664 70873 -20926 -21114 57444 242472 203682 377370 298685 289422 319441
2312 319441 397218 140994 184641 481497 573696 614076 681943 825576 794889 822981 630428
2301 630428 371756 361911 254696 82800 114999 303528 263274 175486 188124 110204 209003
2290 209003 29710 42948 152455 83063 -72396 18411 232231 158821 36878 276711
2280B76711P755q2873k35852l1030K29384n1223R993K71193j25821k76356o0266
2269f8385J10973k1654N6074M8331j1161l537K4038O808K0908j5440j48573K4886
2257B3268j25604j24430O5030K954L09459J8977r71J12380j158j86398j532P7047
2245A69022j12840j73941J16081J06670j94029K38250J63241J5280m00q0660M7251
2234B93925n2273j46770k7759j7633J56039P5810m4404J7556l382j84488J40324
2223B06945q2643k33214P2928O3985R0024J88880o423q7662j55032K33739J42352
2212D33879R2537R649Q9427l711J85108k69618q4111p839M6655L2894j76910l5393
2200C12567j1709p7162J3102o3191m1676R6800J68500Q2186J79455J30037j72239
$$ plain form
2280 276711 284466 201593 -34259 -65289 164095 112872 122865 394058 268237 -8119 -68385
2269 -68385 42588 20934 77008 125339 114178 110641 134679 141487 162395 146955 -1618 23268
2257 23268 -102336 -226766 -161736 -158782 150677 169654 168683 281063 279905 93507 91975 169022
2245 169022 56182 -117759 -1678 104992 -89037 149213 312454 327734 327334 246674 293925
2234 293925 241652 94882 67123 49490 205529 281339 236935 254491 251109 66621 206945
2223 206945 124302 -108912 -35984 28001 118025 306905 300482 212820 57788 291527 433879
2212 433879 526416 536065 625492 621781 806889 537271 453160 445321 491976 524870 347960 312567
2200 312567 300858 223696 236798 173607 131931 228731 397231 479417 658872 788909 616670
2189F16670k69110J6033L32024R4096o4614o6834j0853j4578J18981j29651l6605
2178E85559J77394J18878J78740J06962l56427N915L3947j36359J49709m1852
2168H22466m8653K69889n1130j36122k6497J61118j85632K20392k70864K55132
2158A010099j66469J86312J27535k58086j00085J03449K56561J12259N0711j72867
2148A149419J55116L1768p6560J43168N1790N4730Q5215j7622p4409J27348J93677
2137A823640n1170K4708Q2332J45122J57070L41796K51622j35591r9787k68899
2127B270843K25669J61813J36035m989M1525J15150O5037L70048k47909K92928
2117C426150J37100K7193p039K22563Q4377K53989K03505k3033L52394J96471
$$ plain form
2189 616670 347560 363593 695617 789713 725099 658265 647412 632834 751815 622164 585559
2178 585559 762953 881831 1060571 1167533 811106 817021 850968 714609 864318 822466
2168 822466 773813 1043702 992572 856450 829953 991071 805439 1025831 754967 1010099
2158 1010099 843630 1029942 1157477 899391 799306 902755 1159316 1271575 1322286 1149419
2148 1149419 1304535 1336303 1259743 1402911 1454701 1509431 1594646 1577024 1502615 1629963 1823640
2137 1823640 1772470 1797178 1879510 2024632 2181702 2523498 2775120 2639529 2539742 2270843
2127 2270843 2496512 2658325 2794360 2789371 2830896 2946046 3011083 3381131 3133222 3426150
2117 3426150 3563250 3590443 3583404 3805967 3890344 4144333 4347838 4324805 4677199 4873670
2107D873670k06067l6184R3866j12443J20579K01706K70425Q5148K31981L13905
2097E836586L18903N11586N51476M37380N41206L92339L66357K77108O11101O53780
2087A0497822R07250O99812N25137O63027Q82359J147432J105444J645580K145375
2078B0219238K717428K642514K820816K973744L076620L437533M674381N559071
2070D8121345O602231P456965R396258J2782642J6991338K3364831K2511202l220669
2062A44006143j2540596j9050660k6349340j8050923j2423431q249792o453422
2055D0887979m276660l920867k801903k499930j462069j532310j848746j661503
2047B0883991j498335j773170j211678j369119j201075j050979o51820o92842
$$ plain form
2107 4873670 4667603 4631419 4725285 4612842 4733421 4935127 5205552 5290700 5522681 5836586
2097 5836586 6155489 6667075 7218551 7655931 8197137 8589476 8955833 9232941 9844042 10497822
2087 10497822 11405072 12104884 12630021 13293048 14175407 15322839 16428283 18073863 20219238
2078 20219238 22936666 25579180 28399996 31373740 34450360 37887893 42562274 48121345
2070 48121345 54723576 62180541 71576799 84359441 101350779 124715610 147226812 144006143
2062 144006143 131465547 112414887 86065547 68014624 55591193 47341401 40887979
2055 40887979 36611319 32690452 29888549 27388619 25926550 24394240 22545494 20883991
2047 20883991 19385656 17612486 16400808 15031689 13830614 12779635 12127815 11434973
2039A1434973m70695n15397k34630m94203k09508l52397k59870j22676k84940
2030H490657k94355m34670k48844m44920n09758k69643m61762k31078N4856j35200
2020E515283n17723m7711l42743j50266l62859j62607K4389l7247l8314p9741
2010C800461j15902M084k05663j73554J4700j30881k85903p1856q2400j18147
2000B634939Q9731m8590k66585L9739J7438p2627j8560R7356J07912k63419J48978
1989B466312j40012j04315k6398l36947q7509l3739l6729j12575o9531K1522k40912
1978A299167O5795o2508J23738q1450l9203N6273q2397p5586J25617j83734j3026
1967A132686j72199k7741k90428K87528J55216l15357J00131R5182o3089O2942
$$ plain form
2039 11434973 10964278 10448881 10214251 9720048 9510540 9158143 8898273 8775597 8490657
2030 8490657 8196302 7761632 7512788 7067868 6558110 6288467 5826705 5595627 5650483 5515283
2020 5515283 4997560 4949849 4607106 4456840 4093981 3931374 3955763 3918516 3880202 3800461
2010 3800461 3684559 3688643 3482980 3309426 3324126 3193245 2907342 2835486 2753086 2634939
2000 2634939 2724670 2676080 2409495 2449234 2466672 2394045 2375485 2472841 2580753 2317334 2466312
1989 2466312 2326300 2221985 2195587 1858640 1771131 1737392 1700663 1588088 1518557 1540079 1299167
1978 1299167 1364962 1302454 1426192 1344742 1305539 1361812 1279415 1203829 1329446 1145712 1132686
1967 1132686 960487 932746 642318 929846 1085062 769705 869836 965018 901929 964871
1957I64871j3911K014j04750j10582K9704m0084k0287J43479M9941k13206n7489
1946F29700O8970k3421o7250R7917q9787j77364K33702L8313K0697o8058l0842
1935F32577J22796j67047R0991j09668j05302k40358J31521L3449j1908J2089
1925C89140p1455J7531l3227K92514O8448k75762r5274P5858m2161L6375m4602
1914C17385j47265q4367n1479J99072O7566l7900p3674j78424J35892M43315J9186
1903F09307j97652j53585Q6852j69512J8370J27123o019j34040j18236q221Q5856
1892A40243J10447J73120J04571k43695r3967j58220K43536j9697p5678k7186
1882A53474R1648J9031j00352p6957M3524N0544p6472n9328K2931k6364L3408
$$ plain form
1957 964871 950960 952974 848224 737642 767346 727262 706975 850454 900395 687189 629700
1946 629700 698670 675249 607999 705916 616129 438765 672467 710780 731477 663419 632577
1935 632577 755373 588326 679317 569649 464347 223989 355510 388959 377051 389140
1925 389140 317685 335216 301989 594503 662951 387189 291915 367773 325612 361987 317385
1914 317385 170120 85753 34274 233346 300912 263012 189338 10914 146806 590121 609307
1903 609307 411655 258070 344922 175410 193780 320903 314884 180844 62608 54387 140243
1892 140243 250690 423810 528381 284686 190719 32499 276035 256338 180660 153474
1882 153474 245122 264153 163801 86844 130368 180912 104440 45112 68043 41679 75087
1871G5087J23173R9884p8643j2007Q4556r745j62432j35200L00284j58221o9533
1860E7203j14970j0977K15221J76392r8563l48492j14791J25945J30441Q5116
1850A02525n133j41651J38996k2083K15156K7231q9415j5950k3188J47571j47654
1839A86405l83766K32666K58895k6222P5872j64969L1637J39954j42453j49310
1829E8709K04155L5495m7149j20875K63824J67103L56129Q8124P8952j94993k49281
1818F40193o7888k37406L7813k6516J59558l835k51803j54383q5592j77560J28011
1807c9408j05810K20053J25951J5298k62714j77068L32306J05580j20474K8203
1797A21917j50543K43565l5002M7829K5293k50897j15283n7863J13682K78859
$$ plain form
1871 75087 198260 298144 219501 207494 292050 282305 119873 -15327 284957 126736 57203
1860 57203 -57767 -68744 146477 322869 224306 -124186 -238977 -113032 17409 102525
1850 102525 97392 -44259 94737 72654 287810 315041 225626 209676 186488 334059 186405
1839 186405 -197361 35305 294200 267978 343850 178881 210518 350472 208019 58709
1829 58709 262864 298359 251210 130335 394159 561262 917391 1005515 1084467 889474 640193
1818 640193 572305 334899 372712 346196 505754 501919 250116 95733 10141 -167419 -39408
1807 -39408 -145218 74835 200786 216084 -46630 -223698 108608 214188 93714 121917
1797 121917 -28626 214939 179937 227766 253059 2162 -113121 -170984 -57302 221557
1787B21557J22999k65212Q1157k57305J43113L0071l40271J44479L92496M8851
1777C21935l22123m9064J8291J49423j4015q3831J5654m180K14185k47530Q6421
1766H5166q9906o8333O5008l1298n5160M1832J79112m5410j51582j26231l11183
1755e07985M1730K51610P2980n7923J90299j6648o1857j74830r8118J41949o7663
1744b86456L8126J13169Q250J26828o6531j29622J0835J69001j86765q9399M41990
1733A49426r880l32680J76627j0685M0007J3357j65461j5271P9778R5367q4671
1722f4086j13859k6297K17443j08271j6638l3790J2644k34618r3820K44651j25391
1711c42032J50726Q6916K9605K8704j59017J04613j58926Q2761r1128K76909n9500
$$ plain form
1787 221557 344556 79344 160501 -96804 46309 76380 -263891 -119412 273084 321935
1777 321935 -188 -49252 -30961 118462 104447 20616 36270 32090 246275 -1255 85166
1766 85166 -4740 -73073 -8065 -39363 -94523 -52691 126421 81011 -70571 -196802 -507985
1755 -507985 -466255 -214645 -141665 -199588 -9289 -25937 -87794 -262624 -360742 -218793 -286456
1744 -286456 -248330 -135161 -126911 -83 -66614 -196236 -185401 -16400 -203165 -292564 149426
1733 149426 139546 -193134 -16507 -27192 12815 26172 -139289 -154560 -74782 20585 -64086
1722 -64086 -177945 -204242 13201 -95070 -111708 -145498 -132854 -367472 -461292 -216641 -342032
1711 -342032 -191306 -104390 -74785 -46081 -205098 -100485 -259411 -176650 -267778 9131 -50369
1700e0369j91404J25609J63972j8445k6735r4391r7546N9248K2531j44619L11443
1689E9294l4874j2109J75389r6783o4806N8581n176k04338m390J47442k74887
1678b56657J53922K41549j43315j03001j02615J4660J02117J67613P4621j18093
1668C0801j55895J83451j95808p5575J53889o243N9102k08377J50346P5440r4488
1657h3357p5940j11768J17169K7425J7550J47136N5734j44667K120M1497M454
1646b647m1275k4556o5231N101j37570J22474K01256k75080p5280J69667J55377
1635C2236M8966J06665j69934j5816l4973m2088j25597j68948J53644J6026O6128
1624a33691j08505J99532l48375J16005J68918j82559j82333R4726N66643P7475
$$ plain form
1700 -50369 -241773 -116164 47808 29363 2628 -91763 -189309 -130061 -107530 -252149 59294
1689 59294 24420 12311 187700 90917 26111 84692 79516 -124822 -129212 18230 -256657
1678 -256657 -102735 138814 -4501 -107502 -210117 -195457 -93340 74273 148894 30801
1668 30801 -125094 58357 -137451 -213026 -59137 -65380 -6278 -214655 -64309 11131 -83357
1657 -83357 -159297 -271065 -153896 -126471 -108921 38215 93949 -50718 -48598 -7101 -2647
1646 -2647 -43922 -68478 -133709 -128608 -266178 -143704 57552 -217528 -292808 -123141 32236
1635 32236 81202 187867 17933 2117 -32856 -74944 -200541 -369489 -215845 -199819 -133691
1624 -133691 -242196 -42664 -391039 -275034 -106116 -288675 -471008 -376282 190361 267836
1614B67836o9399p2538J44577j51698q2837N3827k35059J19935j01512O6091k89398
1603c50175J3885J50650O6440k3063J4493k035p6689R1337n0298m3833K24771
1592A5483p5732N4735Q1065M0394J23916o4338k15832j00798m6534P8732J00567
1581h342k65245j06457K70240L5179j40340J02390L7342k1760o9589q2955J25078
1570a24459m99L55979n9728o7048N451L3379N626k68574L7791L4572j46466K52146
1558E8170O5506j03445K10159k22998j08266m6957j6519N6193N6572q3576K25525
1547I0364M1118j42864j11597R1761j27609Q6275m2888J82537O13k02442R2495
1536d2237L4867j39714J04614j46327N9787M6345j13653L3324J13981M4231p414
$$ plain form
1614 267836 198437 125899 270476 118778 35941 89768 -145291 -25356 -126868 -60777 -350175
1603 -350175 -336290 -185640 -119200 -142263 -127770 -129805 -206494 -115157 -165455 -209288 15483
1592 15483 -60249 -5514 75551 115945 239861 175523 -40309 -141107 -187641 -108909 -8342
1581 -8342 -273587 -380044 -109804 -74625 -214965 -112575 -75233 -96993 -166582 -249537 -124459
1570 -124459 -124958 231021 171293 104245 109696 143075 148701 -119873 -82082 -47510 -193976 58170
1558 58170 123676 20231 230390 7392 -100874 -147831 -164350 -108157 -51585 -135161 90364
1547 90364 131482 -11382 -122979 -31218 -158827 -72552 -115440 67097 67710 -134732 -42237
1536 -42237 -7370 -147084 -42470 -188797 -129010 -82665 -196318 -162994 -49013 -4782 -12196
1525a2196q6644J34505K20891j39769q7695j29881j3408Q5270K2213j37047J18341
1514b5420P7674O9979N6515j24600k71898n4066K43894J048n3080k4962L05167
1503B00251p4401R6909K0113k99021M837p0183J87146q4634O2683m8441j60315
1492a65056J49009n5083J60771J6075j9441k61612Q3287J03723j50783R2923J24997
1481G8810O0859J17929J9557j67579l04102k45258R9963J13915q1340K29713J16612
1470C9079P9088o1883M3950j32469k67421k2437Q5576j83710R8343J59990n5473
1459b17367K04452k844m7230J09549O0420r910r6385j83079p2781K34886l8327
1448e8616J2321Q8125l52568J40553K72323K8010P4294K46749m11048J3663k24720
$$ plain form
1525 -12196 -98840 35665 256556 116787 29092 -100789 -114197 -28927 -6714 -143761 -25420
1514 -25420 52254 122233 178748 54148 -217750 -271816 -27922 -26874 -79954 -104916 200251
1503 200251 125850 222759 242872 -56149 -51312 -121495 65651 -18983 43700 -4741 -165056
1492 -165056 -16047 -71130 89641 105716 86275 -175337 -92050 11673 -139110 -46187 78810
1481 78810 139669 257598 277155 109576 -194526 -439784 -339821 -225906 -307246 -77533 39079
1470 39079 118167 56284 100234 -32235 -299656 -322093 -236517 -420227 -321884 -161894 -217367
1459 -217367 -12915 -15759 -62989 46560 106980 97070 685 -182394 -255175 -20289 -58616
1448 -58616 -46295 41830 -310738 -170185 102138 130148 204442 451191 40143 53806 -170914
1437a70914L0932P4395J42057j06743L8514K8881j35339j86961q1370R1662K25446
1426d9440O4316q1299q1215n354l0892K9538J07795J45183J60426k69402j43948
1415a54292Q0504K14122M582k32229k8473j22793J16962J07039j47651N5093k8230
1404a35366Q6890m3375k16255J61131l2604k1141L5227J66799J5246K5517l4957
1393G112l2801P96o1357J36572O302r6887J1647k15194j84930K42737n058O9430
1381a21631j52140L5002J10279J66605K30015p5565p1426J08482k47735m14675
1371d32789K69576K39462n0132n4412n0999J3687L4126J87382j4997m9183Q2183
1360A73904m8298o8439k8564O4824k2574Q7499j04652r5944j09835J5107K64679
$$ plain form
1437 -170914 -139982 -65587 76470 -30273 8241 37122 -98217 -285178 -366548 -274886 -49440
1426 -49440 14876 -66423 -147638 -152992 -183884 -154346 -46551 98632 259058 -10344 -154292
1415 -154292 -73788 140334 144916 -87313 -115786 -238579 -121617 -14578 -162229 -107136 -135366
1404 -135366 -48476 -91851 -308106 -146975 -179579 -200720 -165493 1306 16552 42069 7112
1393 7112 -25689 -24893 -86250 50322 56624 -40263 -28616 -243810 -428740 -186003 -191061 -121631
1381 -121631 -273771 -238769 -128490 38115 268130 192565 121139 229621 -18114 -432789
1371 -432789 -163213 76249 26117 -28295 -79294 -65607 -31481 155901 140904 91721 173904
1360 173904 125606 57167 28603 93427 70853 158352 53700 -42244 -152079 -136972 127707
1349A27707J31865j18567k40756M9503N3997J10976r7005m2762q7098q0247K21057
1338B8670m6850K9012K3058k91798M6853J62346k883j32077K59092r8229j9407
1327d2213O6243k9503j62232j16088Q5319J33565j02905K40877j20585o6240N3815
1316e9947j05214O7127J35115l4089j75443k073J05782Q5782Q3878l10661l9993
1305b49736J24122O3128k9132J14265J31397j04204k55473J52240j1420J9744
1295d5069j00620N0757O6958r9089k4113j58691P8314o0386J91850O9050K17357
1284A86318J2947O1741N1630R4621r6621j39819j70851j97766k5047R7422l3194
1273a58619j35141j45260L11633k6306J7963K28415k38111K8365J35413L28L4442
$$ plain form
1349 127707 259572 141005 -99751 -50248 3749 114725 17720 -25042 -112140 -192387 28670
1338 28670 -18180 10832 33890 -257908 -211055 -48709 -51592 -183669 75423 -22806 -42213
1327 -42213 24030 -5473 -167705 -283793 -198474 -64909 -167814 73063 -47522 -113762 -59947
1316 -59947 -165161 -98034 37081 2992 -172451 -174524 -68742 17040 100918 -209743 -249736
1305 -249736 -125614 -62486 -91618 22647 154044 49840 -205633 -53393 -64813 -45069
1295 -45069 -145689 -94932 -27974 -127063 -151176 -309867 -231553 -291939 -100089 -31039 186318
1284 186318 199265 261006 312636 407257 310636 170817 -34 -197800 -222847 -125425 -158619
1273 -158619 -293760 -439020 -127387 -153693 -135730 92685 -145426 -117061 18352 18680 53122
1262E3122k837k6651J22110Q8032j82423j61722Q4499J99904r4808l18049o7964
1251c06787k6308P9133L00143O8623J51476J231j86523k98919J26071Q9364J33295
1240A30799O2672p4858j06060k8473J02919j0862k56898M3732K47633j41363j66005
1229a96764L27039j45354K3401r9227L4309J35570J08932J23402k35239j59791
1219h3722l7385M4753J10386r3487K0787r1742N2189Q1406j60895M03772j19359
1208A26703j31880j61282R6463J09927q498p0791n6226J18829l1931L2992k09663
1197a85357k2655J14941k880p4918J82210J5665n745k95518o8348J97721k1441
1186a66325J82948r4758N1521j9944J06595o465q7020j24362L0258K92131J48433
$$ plain form
1262 53122 50285 23634 145744 233776 51353 -110369 -25870 174034 79226 -238823 -306787
1251 -306787 -333095 -253962 46181 114804 266280 267511 80988 -217931 -91860 -2496 130799
1240 130799 193471 118613 12553 -15920 86999 76137 -180761 -137029 110604 -30759 -196764
1229 -196764 130275 -15079 8322 -90905 -56596 78974 187906 311308 76069 -83722
1219 -83722 -121107 -76354 34032 -59455 -38668 -130410 -78221 3185 -157710 246062 126703
1208 126703 -5177 -166459 -69996 39931 31433 -39358 -95584 23245 -8686 24306 -185357
1197 -185357 -208012 -93071 -95951 -170869 11341 27006 21261 -274257 -342605 -144884 -166325
1186 -166325 16623 -78135 -26614 -46558 60037 53572 -33448 -157810 -127552 164579 313012
1175C13012m40113M7728j15928J7792K40629j6387K5957M3054j13393K43173k23689
1164B1835j78831J66206p9656j666p4110Q2004j10317J66699K53471k36044O6199
1153G5790K5486k04162Q202p2931N5727n1060M2703k2268J93909Q3261k23842
1142h9185j31412J80717J58547M11J06166R3243l06094J41791k11758j55889J630
1131b11833R3316O1134j52254J70322r8139N2696k1960m550k68440L27806K4014
1120b7888m8137J52201J370q9961k75483k03334K01727M29450K58134j59174q4637
1109A54268j01342j78041N16J98128l0272j31321J49219K6159k77994N5799J51593
1098A6712q1500k9357L3306R5644j16678r985R1925p2950q1196P5644n9935J1592
$$ plain form
1175 313012 -127101 -79373 -195301 -177509 63120 46733 72690 115744 2351 245524 21835
1164 21835 -156996 9210 -70446 -72112 -146222 -64218 -174535 -7836 245635 9591 75790
1153 75790 101276 -102886 -94684 -167615 -111888 -162948 -120245 -142513 51396 134657 -89185
1142 -89185 -220597 -39880 118667 119078 225244 318487 12393 154184 -57574 -213463 -211833
1131 -211833 -118517 -57383 -209637 -39315 -137454 -84758 -106718 -111268 -379708 -51902 -27888
1120 -27888 -76025 76176 77546 -12415 -287898 -491232 -289505 139945 398079 238905 154268
1109 154268 52926 -125115 -124599 73529 43257 -88064 61155 87314 -190680 -134881 16712
1098 16712 -64788 -94145 -60839 34805 -81873 -91858 67 -72883 -154079 -78435 -138370 -126778
1086a26778K77733j19161j36484O3782o2473K53377R6778k04907j69378R7952
1076b9559P9953J89993K6454j94932n0126j11619L4789p5155K8771J00758Q5571
1065H4898N3035o7382k2880j01333J31642k6004J61640q4981o795j9896l36467
1054b34523k6427m6435J45750m577R3723K87188J1449j91265j15189K74945R4632
1043B89271l62201J44768K21101j96876k6390o8924j46777k157P8338L4339K66174
1032B30666k8602k85984j2472J20736k0737p154j44329Q9214r4939Q6084l4272
1021a01789J66757M4479j78097l1568J99866l1188j06345j17266K65788j68067
1011e7430j51540M7122N0620K03298l5926k7009q3280q5965K38300o6187k86937
$$ plain form
1086 -126778 150955 31794 -104690 -40908 -103381 149996 246774 41867 -127511 -29559
1076 -29559 50394 240387 266841 71909 21783 -89836 -55047 -130202 -101431 -673 84898
1065 84898 137933 70551 47671 -53662 77980 51976 213616 128635 121840 101944 -234523
1054 -234523 -260950 -307385 -161635 -166212 -72489 214699 226148 34883 -80306 194639 289271
1043 289271 -72930 71838 292939 96063 69673 749 -146028 -148185 -69847 -35508 230666
1032 230666 202064 -83920 -96392 24344 3607 -3547 -147876 -58662 -153601 -67517 -101789
1021 -101789 64968 109447 -68650 -100218 99648 68460 -37885 -155151 110637 -57430
1011 -57430 -208970 -161848 -111228 92070 56144 29135 -54145 -140110 98190 32003 -254934
1000b54934O706m3418J42869k24365K54999J25063J7713N7664j57583j07667K4409
989a58544k21538K33002J07569R7720o6257k7640K06517o8558J21498K5512j54911
978I4370o4114j80922J01473J56545j36401P4264N7029p9401J83334k50871k34477
967b79171K34712j00860Q2441r0625J52210j51644K1792J53713j9143k5128j57520
956a79223m1275k4955K83466q6616m2344j62160L83942r4780K94220K6403k20633
945A36045L7901o1462o7794N5234K0493m3732k4854n6971Q130K1398J07018J35326
933B66732j87406l39010N7640O6895J7748j38856L60911r0589j63196J94771j10409
922f4769r0759J32120L9733J11240n4323K5808O0589l24556P9448M403K3168N1835
$$ plain form
1000 -254934 -248228 -291646 -148777 -373142 -118143 6920 24633 82297 -75286 -182953 -158544
989 -158544 -380082 -147080 -39511 58209 -8048 -35688 170829 102271 223769 249281 94370
978 94370 30256 -150666 -49193 107352 -29049 45215 102244 22843 206177 -44694 -279171
967 -279171 -44459 -145319 -62878 -153503 -1293 -152937 -131145 22568 3425 -21703 -179223
956 -179223 -220498 -245453 38013 -48603 -90947 -253107 130835 36055 330275 356678 136045
945 136045 173946 112484 44690 99924 120417 76685 51831 -5140 2990 24388 131406 266732
933 266732 79326 -259684 -202044 -135149 -117401 -256257 104654 14065 -149131 45640 -64769
922 -64769 -155528 -23408 16325 127565 73242 99050 159639 -164917 -85469 -81066 -57898 -6063
$$ [...]
##END NTUPLES=NMR SPECTRUM
##END=
