##TITLE=1H_EC-3259(III-1)
 CDCl3, 8 sc, 
 27.08.2021
##JCAMPDX= 6.0         $$ Bruker NMR JCAMP-DX V2.0
##DATA TYPE= NMR SPECTRUM
##DATA CLASS= NTUPLES
##ORIGIN= UXNMR, Bruker Analytische Messtechnik GmbH
##OWNER= root
$$ XWIN-NMR		Version 3.5
$$ Fri Aug 27 11:28:17 2021 Russian Standard Time (UT+4h)  she@DPX200
##.OBSERVE FREQUENCY= 200.131506
##.OBSERVE NUCLEUS= ^1H
##.ACQUISITION MODE= SIMULTANEOUS
##.ACQUISITION SCHEME= undefined
##.AVERAGES= 8
##.DIGITISER RES= 18
##SPECTROMETER/DATA SYSTEM= spect
##.PULSE SEQUENCE= zg30
##.SOLVENT NAME= D2O
##.SHIFT REFERENCE= (INTERNAL, D2O, 0, 17.4983)
##AUDIT TRAIL= $$ (NUMBER, WHEN, WHO, WHERE, WHAT)
$$ ##TITLE= Audit trail, XWIN-NMR		Version 3.5
$$ ##JCAMPDX= 5.01
$$ ##ORIGIN= Bruker BioSpin GmbH
$$ ##OWNER= she
$$ F:/spectra/data/she/nmr/H-F/1/pdata/1/auditp.txt
$$ ##AUDIT TRAIL=  $$ (NUMBER, WHEN, WHO, WHERE, WHAT)
(   1,<2021-08-27 11:26:46.68 +0400>,<she>,<DPX200>,
      <created by zg, POWCHK disabled, PULCHK disabled
       configuration hash MD5:
       00 E9 B6 7A A2 85 ED C7 34 08 36 98 17 FE 4E 26
       data hash MD5: 16K
       20 3B 89 80 9F 21 32 D9 E2 90 98 7F 8E F0 86 3E>)
(   2,<2021-08-27 11:26:52.93 +0400>,<she>,<DPX200>,
      <Start of raw data processing
       efp BC_mod = 2 LB = 0.24 FT_mod = 6 PKNL = 1 PHC0 = -13355.92 PHC1 = 9.800989 SI = 16K 
       data hash MD5: 16K
       AA 69 11 85 7E 2E F5 A9 F6 A2 74 3C 2F 36 5F 77>)
(   3,<2021-08-27 11:27:11.28 +0400>,<she>,<DPX200>,
      <pk PHC0 = -1.368393 PHC1 = 0.8000002 
       data hash MD5: 16K
       C5 D2 F2 99 B2 D1 15 92 9E E7 DF C9 9A D5 28 00>)
(   4,<2021-08-27 11:27:14.37 +0400>,<she>,<DPX200>,
      <abs ABSG = 5 
       data hash MD5: 16K
       32 3C A8 D7 73 05 D1 CF 0B DF 7B 74 9B 02 ED 62>)
$$ ##END=
$$ 
$$ hash MD5
$$ DF 2A 4F E2 A3 D7 E9 1B B4 C0 37 0B 5E 61 01 35
##$RELAX= 
##$RELAX= 
##$RELAX= 
##$RELAX= 
##$RELAX= 
##$RELAX= 
$$ Bruker specific parameters
$$ --------------------------
##$DU= <F:/spectra>
##$EXPNO= 1
##$NAME= <H-F>
##$PROCNO= 1
##$TYPE= <nmr>
##$USER= <she>
##$AMP= (0..31)
100 100 100 100 100 100 100 100 100 100 100 100 100 100 100 100 100 100 
100 100 100 100 100 100 100 100 100 100 100 100 100 100 
##$AQSEQ= 0
##$AQ_mod= 1
##$AUNM= <au_zg>
##$AUTOPOS= <>
##$BF1= 200.13
##$BF2= 200.13
##$BF3= 200.13
##$BF4= 200.13
##$BF5= 200.13
##$BF6= 200.13
##$BF7= 200.13
##$BF8= 200.13
##$BYTORDA= 1
##$CFDGTYP= 0
##$CFRGTYP= 5
##$CHEMSTR= <none>
##$CNST= (0..31)
1 1 145 1 1 1 1 1 1 1 1 1 1 1 1 1 1 1 1 1 1 1 1 1 1 1 1 1 1 1 1 1 
##$CPDPRG= <>
##$CPDPRG1= <>
##$CPDPRG2= <>
##$CPDPRG3= <>
##$CPDPRG4= <mlev>
##$CPDPRG5= <mlev>
##$CPDPRG6= <mlev>
##$CPDPRG7= <mlev>
##$CPDPRG8= <mlev>
##$CPDPRGB= <>
##$CPDPRGT= <>
##$D= (0..31)
0 1.2 0 0 0 0 0 0 0 0.06 0 0.03 0 0 0 0 0.0002 0 0 0 0 0 0 0 0 0 0 0 0 
0 0 0 
##$DATE= 1630049206
##$DBL= (0..7)
120 120 120 120 120 120 120 120 
##$DBP= (0..7)
150 150 150 150 150 150 150 150 
##$DBP07= 0
##$DBPNAM0= <>
##$DBPNAM1= <>
##$DBPNAM2= <>
##$DBPNAM3= <>
##$DBPNAM4= <>
$$ [...]
##$SUBNAM3= <"">
##$SUBNAM4= <"">
##$SUBNAM5= <"">
##$SUBNAM6= <"">
##$SUBNAM7= <"">
##$SUBNAM8= <"">
##$SUBNAM9= <"">
##$SW= 20.0188882624521
##$SWIBOX= (0..15)
0 0 2 0 0 0 0 0 0 0 0 0 0 0 0 0 
##$SW_h= 4006.41025641026
##$TD= 16384
##$TD0= 1
##$TE= 0
##$TE2= 300
##$TE3= 300
##$TEG= 300
##$TL= (0..7)
0 120 120 120 120 120 120 120 
##$TP= (0..7)
150 150 150 150 150 150 150 150 
##$TP07= 0
##$TPNAME0= <>
##$TPNAME1= <>
##$TPNAME2= <>
##$TPNAME3= <>
##$TPNAME4= <>
##$TPNAME5= <>
##$TPNAME6= <>
##$TPNAME7= <>
##$TPOAL= (0..7)
0.5 0.5 0.5 0.5 0.5 0.5 0.5 0.5 
##$TPOFFS= (0..7)
0 0 0 0 0 0 0 0 
##$TUNHIN= 0
##$TUNHOUT= 0
##$TUNXOUT= 0
##$USERA1= <user>
##$USERA2= <user>
##$USERA3= <user>
##$USERA4= <user>
##$USERA5= <user>
##$V9= 5
##$VALIST= <valist>
##$VCLIST= <CCCCCCCCCCCCCCC>
##$VD= 0
##$VDLIST= <DDDDDDDDDDDDDDD>
##$VPLIST= <PPPPPPPPPPPPPPP>
##$VTLIST= <TTTTTTTTTTTTTTT>
##$WBST= 1024
##$WBSW= 4
##$XGAIN= (0..3)
0 0 0 0 
##$XL= 0
##$YL= 0
##$YMAX_a= 266045
##$YMIN_a= -419896
##$ZGOPTNS= <>
##$ZL1= 120
##$ZL2= 120
##$ZL3= 120
##$ZL4= 120
##$ABSF1= 17.49833
##$ABSF2= -2.520708
##$ABSG= 5
##$ABSL= 3
##$ALPHA= 0
##$AQORDER= 0
##$ASSFAC= 0
##$ASSFACI= 0
##$ASSFACX= 0
##$ASSWID= 0
##$AUNMP= <proc_1d>
##$AZFE= 0.1
##$AZFW= 0.1
##$BCFW= 0
##$BC_mod= 2
##$BYTORDP= 0
##$COROFFS= 0
##$CY= -3
##$DATMOD= 1
##$DC= 0
##$DFILT= <>
##$DTYPP= 0
##$F1P= 0
##$F2P= 0
##$FCOR= 1
##$FTSIZE= 16384
##$FT_mod= 6
##$GAMMA= 0
##$GB= 0
##$INTBC= 1
##$INTSCL= 1.334414e-10
##$ISEN= 128
##$LB= 0.24
##$LEV0= 0
##$LPBIN= 0
##$MAXI= 10000
##$MC2= 0
##$MEAN= 0
##$ME_mod= 0
##$MI= 1.114404
##$NCOEF= 0
##$NC_proc= -6
##$NLEV= 6
##$NOISF1= 3.799351
##$NOISF2= 2.8
##$NSP= 0
##$NTH_PI= 0
##$NZP= 0
##$OFFSET= 17.49833
##$PC= 1
##$PHC0= -13357.29
##$PHC1= 10.60099
##$PH_mod= 1
##$PKNL= yes
##$PPARMOD= 0
##$PSCAL= 0
##$PSIGN= 0
##$REVERSE= no
##$SF= 200.130007263637
##$SI= 16384
##$SIGF1= 3
##$SIGF2= 2
##$SINO= 5.538805
##$SIOLD= 16384
##$SREGLST= <1H.CDCl3>
##$SSB= 0
##$STSI= 16384
##$STSR= 0
##$SW_p= 4006.41025641026
##$SYMM= 0
##$S_DEV= 0
##$TDeff= 16384
##$TDoff= 0
##$TI= <>
##$TILT= no
##$TM1= 0
##$TM2= 0
##$TOPLEV= 0
##$USERP1= <user>
##$USERP2= <user>
##$USERP3= <user>
##$USERP4= <user>
##$USERP5= <user>
##$WDW= 1
##$XDIM= 16384
##$YMAX_p= 433714060
##$YMIN_p= -294568
$$ End of Bruker specific parameters
$$ ---------------------------------
##NTUPLES= NMR SPECTRUM
##VAR_NAME=  FREQUENCY,     SPECTRUM/REAL,   SPECTRUM/IMAG
##SYMBOL=    X,             R,               I
##VAR_TYPE=  INDEPENDENT,   DEPENDENT,       DEPENDENT
##VAR_FORM=  AFFN,          ASDF,            ASDF
##VAR_DIM=   16384,         16384,           16384
##UNITS=     HZ,            ARBITRARY UNITS, ARBITRARY UNITS
##FACTOR=    0.24454680195387, 1,            1
##FIRST=     3501.94074241218, 0,            0
##LAST=      -504.46951399808, 0,            0
##MIN=       -504.46951399808, -294568,      0
##MAX=       3501.94074241218, 433714060,    0
$$ Real data points
##PAGE= N=1
##DATA TABLE= (X++(R..R)), XYDATA
$$ [...]
9322 89925 6909 -3430 62709 75512 111318 32739 -3770 64754 61706 71791 83134 120733
9310 120733 21732 19239 7615 -30973 34185 -33451 -283 -4845 -41077 -136942 -66280 -71655
9298 -71655 -169867 -7890 -156289 -132450 -5250 50453 12668 70422 -30048 37066 127436
9287 127436 67213 123016 -13170 -4193 -41505 -57232 -30760 -10215 98089 154463 154171 30887
9275 30887 -35688 29825 -54519 88703 93375 16599 85416 76273 163838 125517 8403 -61282
9263 -61282 103545 2851 11638 109969 79087 143388 69433 -9641 -19962 -109760 -101579 -93543
9251 -93543 -59395 -60329 -59162 -8926 116051 199812 81790 177040 162738 100956 14806 101691
9239 101691 43021 60298 50921 157260 232191 244419 215654 259781 220248 169225 190247 292508
9227 292508 212147 189792 152513 211774 247573 186761 221979 168512 61585 86772 208460
9216 208460 146846 51305 114242 55666 26545 47938 34239 66618 158672 179538 67895
9205 67895 -32735 -17273 9871 24014 -36814 -91136 -14015 -18272 -8495 24267 99246 141507
9193 141507 65759 131911 235384 142445 -46395 25114 125370 74522 77213 8087 -22340
9182 -22340 10284 59807 -40198 41734 121131 29492 27209 89046 104159 147734 147070 12092
9170 12092 36384 40035 2804 -10400 -10568 83187 132769 189575 148705 50932 -4830 22501
9158 22501 98686 122401 87938 187702 68388 32714 24313 66782 -42497 29430 -74724
9147 -74724 -5529 -60993 -61023 13292 21923 -24183 25009 -12196 -157844 -151568 -34094 33299
9135 33299 2934 61160 87582 52620 130844 115362 28113 63017 142204 80550 33536 57194
9123 57194 32945 55862 -176 -36121 -21478 72814 13331 -76265 -29818 72325 32988 50146
9111 50146 128261 39510 -35276 61860 109712 -98 29164 128139 162249 184729 31415
9100 31415 74787 9395 152719 87553 35515 -72895 -74940 8823 -32549 -48936 42075 2750
9088 2750 -69236 -48746 22349 105630 67967 3989 1064 16317 3180 115716 47300 121771
9076 121771 174409 97447 1477 55076 103427 40533 27820 120852 95695 110675 154802 79608
9064 79608 39251 -20247 39182 41673 -31467 -80865 -121199 -19695 -100575 -68308 -29927 25655
9052 25655 71349 17336 -32223 47649 130163 11203 64186 60117 60009 22034 65377 104728
9040 104728 72961 20663 38646 30447 181442 86212 -12143 39961 -35913 -50555 74301
9029 74301 94998 223137 188144 170198 82417 76424 97718 100160 104202 52471 155039 203392
9017 203392 92882 62146 23360 -28611 30953 42424 1550 70749 147136 76778 84863 108240
9005 108240 72934 40590 -3494 34450 124213 117852 117241 114626 68969 99933 199638 253817
8993 253817 211110 13028 -29839 -27259 101797 35066 17282 -41382 -59947 -83018 41074
8982 41074 117561 142192 140157 133685 136463 -4469 -27896 59818 -29272 -23842 -1061 -789 -15364
8969 -15364 13932 -11204 -48405 56263 23219 -33162 13502 121142 115825 78086 69198 105089
8957 105089 49617 24824 23011 155506 105878 152488 149620 147325 102275 77910 81919 104328
8945 104328 183363 200024 109806 86078 2384 52575 149471 145954 223222 73911 176917
8934 176917 124765 194949 159866 61791 27227 6012 29144 56136 67921 74936 126145 383
8922 383 -28010 -4852 123170 231343 203752 200188 101702 198556 172017 139124 200421 232356
8910 232356 101397 131131 97177 21338 -25312 53049 70797 125023 192639 155046 179678
8899 179678 123444 192317 178066 234414 188728 201367 299040 76647 101593 177103 183171 145450
8887 145450 99575 50462 139224 149656 192219 199971 60082 194337 166289 124184 160557
8876 160557 145783 129533 195724 183607 115445 -5545 57291 57438 -32086 104659 142993 67220
8864 67220 107050 168740 292776 311133 312521 270857 148774 31715 125983 77500 132315
8853 132315 185991 123073 126138 83078 110214 119229 10766 53463 -39969 -56922 95536 35703
8841 35703 63466 95445 140650 171021 105842 23129 175552 155079 88062 113152 192404 252327
8829 252327 247948 255184 81584 67249 57309 132577 48988 63083 201576 150630 90715 153362
8817 153362 91800 188100 89699 29623 129939 52971 9925 183670 165481 145677 151044
8806 151044 86009 30714 50847 102901 160687 205935 201812 322376 272184 126398 75126
8795 75126 98793 140776 127628 225887 202869 212863 136119 62429 52842 202495 252334 242088
8783 242088 200441 155636 265874 55619 2144 61088 120270 133832 97526 110562 215268
8772 215268 171666 273540 273649 243875 196588 208046 172435 185075 44433 166436 215903
8761 215903 252412 278674 243005 276218 143467 299637 370579 204244 184754 97728 141834
8750 141834 203642 180361 240517 136960 130373 172866 139695 288854 293732 159803 146268
8739 146268 229367 307484 298697 275669 230140 213519 279142 263233 229352 218503 180905 189548
8727 189548 261514 178493 154631 201146 251333 197573 195279 258174 283692 295269 406704 354545
8715 354545 310709 362734 346649 358165 396896 332658 276473 415097 511949 503867 546513 579475
8703 579475 447940 498888 636823 588912 475813 508658 713150 714896 602476 646647 658318
8692 658318 631990 678990 715611 595890 750915 679900 681620 641973 649757 663687 616930 615645
8680 615645 713618 593390 552290 637404 555495 549271 548893 520362 484014 492516 455749 564223
8668 564223 666299 585119 616478 640113 654842 651902 761586 767385 684470 764986 854740 874044
8656 874044 840332 878162 938571 955202 779223 892398 881878 845103 736816 665851 723318
8645 723318 784763 786893 778514 656829 590474 552573 663912 626076 562957 653686 568688 691921
8633 691921 678516 593666 659194 535174 509678 460786 332250 498967 474212 534580 463198
8622 463198 494561 532369 488143 536734 532823 546833 597298 640943 605823 547784 456266 448783
8610 448783 537038 662396 662573 569021 468522 516277 562566 621287 655883 741326 781585 761667
8598 761667 704651 766042 822176 666197 785501 747886 790694 814661 741328 670664 625988
8587 625988 860330 732955 857301 1042079 1011491 1009189 916662 1119365 1122724 1191051 1107406
8576 1107406 1123304 1140336 1157558 1166727 1162184 1286566 1313739 1467726 1392567 1465285 1630283
8565 1630283 1535436 1624999 1707274 1759211 1901515 1901895 1932779 1959050 1894897 1971383 2019078 2021538
8553 2021538 1993884 1975280 1984666 2036964 2138887 2025352 2058537 2324496 2123066 1949564 2025761
8542 2025761 2265766 2362659 2196311 2043849 2164560 2241617 2294431 2279216 2404491 2582881
8532 2582881 2577094 2765201 2826806 2892808 2959467 3023577 3029339 3009947 3115403 3147973 2975330
8521 2975330 2954403 3001617 2953665 2901506 2952665 2833851 2872205 2881008 2825434 2910179 2835444
8510 2835444 2901275 2917939 2819655 2838850 2765043 2699652 2658987 2667930 2751156 2774631 2738329 2884388
8498 2884388 2876079 2836658 2846216 2917022 2872666 2953606 3090954 3068474 3046833 3158031 3105311
8487 3105311 3068733 3120879 3080595 3091636 2980265 3037967 3063194 3134577 3138945 3180804 3186300 3099009
8475 3099009 3137324 3161999 3128057 3175139 3270540 3327714 3371727 3200399 3229791 3290876 3499457
8464 3499457 3394655 3391092 3528098 3591948 3562698 3574335 3639292 3550078 3492889 3542934 3566619
8453 3566619 3563003 3673691 3583073 3678382 3705046 3745218 3859122 3844389 4035187 4109666 4169607
8442 4169607 4185767 4364068 4456940 4621151 4878924 4948527 4992432 5042286 5154648 5115759 5108816
8431 5108816 5111537 5150379 5251296 5401935 5515573 5470606 5570520 5730099 5770581 5763061 5742952
8420 5742952 5800637 5982494 6080746 6051592 6225045 6379438 6449916 6562604 6817605 6938505
8410 6938505 7072446 7228809 7414145 7602975 7769114 7975932 8084512 8188256 8447059 8651595
8400 8651595 8803010 9134863 9361175 9517779 9882561 10104426 10393362 10632702 10900976 11183566
8390 11183566 11590691 11919207 12284067 12805465 13332105 13717840 14309149 14965633 15643037
8381 15643037 16322878 17077100 17871125 18790704 19933283 21119460 22333326 23728446 25458123
8372 25458123 27253944 29248360 31565156 34406137 38231988 42607787 47480296 52006391
8364 52006391 56704430 62479831 69660022 76814153 80998334 82550124 83707009 86390934
8356 86390934 91475055 95142214 94772325 89985213 81686588 73206950 65983691 60872716
8348 60872716 57751476 56050541 54483918 52299998 49836930 47898121 46460221 45974104
8340 45974104 46193309 46930777 48486853 50861322 53885487 57879388 63138110 69313715
8332 69313715 75450025 81774445 87874805 92448965 96193849 100742284 107523580 114009852
8324 114009852 116770822 117410702 116367055 113992538 108931416 98679964 85937533 73627829
8316 73627829 63226573 55035489 49128180 44790974 41416674 39015797 36869277 34343562
8308 34343562 31726877 29092906 26979872 25291939 23675889 22362858 21253944 20238477
8300 20238477 19302873 18595684 18020757 17460078 16922717 16563865 16182459 15574568 15129527
8291 15129527 14676975 14132187 13547028 12931651 12372920 11866119 11446736 10996497 10609184
8282 10609184 10207274 9922269 9641738 9410987 9057614 8801611 8559706 8324725 8112459
8273 8112459 7894186 7708839 7711396 7526593 7305291 7234920 7183199 6961637 6765370 6770141 6708981
8262 6708981 6534594 6392683 6364945 6214516 6037332 6015723 5992785 5893587 5609206 5589973
8252 5589973 5511307 5410719 5389067 5513272 5496507 5419834 5312341 5283200 5367503 5257718 5095703
8241 5095703 5013044 5135210 5137203 4878804 4892313 4853444 4663916 4604223 4611782 4607930 4643228
8230 4643228 4704990 4649731 4658386 4561229 4592374 4606492 4675372 4704335 4716708 4777278 4762699 4789746
8218 4789746 4855141 4885045 4893845 4840426 4871068 4869265 5026894 5102866 5098626 5138462 5214447 5222949
8206 5222949 5347693 5281948 5459249 5524828 5719500 5683624 5742343 5806455 5894598 6053350 6118620
8195 6118620 6142704 6332591 6169623 5590539 6534788 7034370 7135890 7110236 7255157 7470688
8185 7470688 7578123 7725404 7976520 8108983 8276535 8533085 8525681 8830017 9083662 9276098
8175 9276098 9501988 9651743 9823983 10172617 10350554 10667115 10947068 11258986 11596329 11985489
8165 11985489 12387374 12796126 13361108 13995690 14529113 15184837 15669697 16327714 17117616
8156 17117616 17931199 18797475 19683539 20779114 22052073 23542303 25181797 27136498 29370736
8147 29370736 31947954 34854486 38040009 40845284 43535321 46928016 51264667 55601642
8139 55601642 58719533 61219985 63479569 64186135 61982586 57815329 53299472 49702061
8131 49702061 47410566 46558814 46657046 46349976 45228499 43871968 42960048 42429937 42600299
8122 42600299 43414575 44756176 46851183 49417726 52629840 56459034 60242497 64132574
8114 64132574 68673535 74144126 80725368 87789537 95506869 103083156 109309882 114317085
8106 114317085 115907914 113067524 106090947 97554446 90250050 85209645 81450978 75931039
8098 75931039 69349721 62994058 57578045 53191028 49780374 46963604 44805790 43387682
8090 43387682 42309260 41674169 41681752 42189420 43047512 44308861 46122441 48509927 51678831
8081 51678831 55441391 58789793 60829685 62412772 64457890 67252840 70403362 73221428
8073 73221428 73557890 70924687 65667190 58243637 51076719 44965888 40303706 36833903
8065 36833903 34543440 32896046 31136775 29253488 27414165 25669218 24277532 23031366
8057 23031366 22068968 21325010 20747141 19905139 19269891 18831438 18445683 18077057 17709533
8048 17709533 17388028 17336297 17081747 16942186 16822293 16670384 16408650 16332975 16396880 16338060
8038 16338060 16380939 16541848 16847335 16966113 17179640 17694765 18149311 18725463 19131449 19476580
8028 19476580 19882999 20481238 21151831 22141614 23340493 24894123 26644374 28452409 30617581
8019 30617581 33339428 36681716 40699039 45280038 51079835 58665882 68564536 82047901
8011 82047901 98976075 102810779 91865293 78657071 65189411 55616567 49538401 46223533
8003 46223533 44290708 43387224 43338896 44275750 46128494 48611588 50036743 50537857 51256615
7994 51256615 52475275 54644654 55362598 52974688 49755439 46726316 44896221 43437663
7986 43437663 40829515 37797229 35049856 32786816 31174856 29889503 29001684 28501787
7978 28501787 28392495 28672569 29281507 29971510 30978719 32471826 34652569 37399823 39599503
7969 39599503 41035942 42507940 44348446 46931773 50667728 54690383 57529933 58569684
7961 58569684 56980009 52436744 46547476 41045269 36763649 33838203 31934662 30707374
7953 30707374 29177462 27103080 24982719 23101912 21619746 20566627 19827775 19239462
7945 19239462 18750266 18543381 18538707 18609129 18869376 19683848 20881802 22232616 23095596 23443370
7935 23443370 23605107 24003044 24845122 25195093 24042376 22388256 20728857 19533831 18517466
7926 18517466 16970287 15327828 13808255 12487455 11316661 10634684 9985875 9345628 8882195
7917 8882195 8444240 8103082 7698598 7296696 6952924 6602790 6420601 6035121 5884242 5754572
7907 5754572 5624858 5366373 5154231 4909244 4838034 4693730 4577786 4446277 4307267 4229064
7897 4229064 4120976 3996528 3872733 3727356 3594909 3472045 3444036 3369096 3219256 3076631
7887 3076631 3051107 3061827 3009937 2862338 2855294 2772394 2691384 2558520 2375232 2270707 2166487
7876 2166487 2138369 2145670 2087827 2071543 1921548 1962233 1928607 1826553 1864332 1808260 1810899
7865 1810899 1751689 1766043 1671760 1686525 1714673 1609081 1538590 1577182 1549337 1464324 1428130
7854 1428130 1469179 1497512 1487699 1441753 1340666 1252288 1255307 1171178 1129133 1126198 1165908 1154831
7842 1154831 1171700 1106448 1107349 1126540 1061833 1114227 1069161 1041792 1066996 1134693 1085979 1028971
7830 1028971 1023582 1061953 928925 994432 1082309 956848 1071318 1022727 1057397 1073998 1020945
7819 1020945 1048349 1071189 1004113 999691 1041068 944811 997628 1027732 1001183 1085324 1107110 1088121
7807 1088121 1098989 1089136 1130318 1111174 995829 916017 890826 995267 901618 889039 981137
7796 981137 905753 828045 818073 908342 837323 853292 840516 893198 893609 851973 902916 917697
7784 917697 939867 872006 906291 987407 960548 912209 990190 971010 993369 1033425 933272
7773 933272 1009955 943293 979354 837614 842356 950943 836426 903164 913706 779591 590992
7762 590992 594915 586505 601770 615411 647487 569531 499379 597785 538458 542922 527272 646996
7750 646996 669236 572956 619052 582020 568564 536903 540712 527927 496396 545651 520806 567847
7738 567847 615320 561397 515851 433311 364203 391233 438993 482896 453017 324264 413387
7727 413387 367236 291553 301545 280278 264123 380383 296152 229350 190044 183156 139983 179060
7715 179060 149912 188601 312954 313996 276827 327838 293121 285840 169161 178618 211753 173831
7703 173831 279198 203843 226206 283849 243116 223267 298104 277290 256130 230882 225828 246884
7691 246884 252506 304101 328940 251551 228937 185005 115313 159505 138855 154128 156732 189198
7679 189198 192302 173668 117333 175111 304451 310765 261238 354989 354864 358769 428557 247152
7667 247152 249386 319153 246645 201073 175890 182766 285125 218974 188536 269087 275985 111791
7655 111791 83281 188737 220513 325828 229568 208110 279189 329034 294431 233266 245000
7644 245000 212783 207422 187628 312378 265112 319617 462277 432088 369199 465069 432312
7633 432312 343697 307605 350289 285792 242833 176385 131653 195413 178976 167413 132687 54754
7621 54754 -5712 37331 203391 235891 223069 231789 172832 178219 231733 224290 162212 253889
7609 253889 276465 160319 23699 203893 248384 106324 134730 193554 329629 198189
7599 198189 185666 155801 170250 142318 28813 7012 76223 158761 42333 117943 156434
7588 156434 46412 52908 95833 188868 140641 248767 311733 408194 477261 430049 323784
7577 323784 243941 158106 177071 137987 98152 115638 73527 110483 153587 -91464 -73424
7566 -73424 -57762 -58361 19053 -22569 -89132 -19614 80100 62383 62259 -25131 -90441 -73269 -16528
7553 -16528 -19007 111452 97774 192913 167786 -46874 -86735 -28491 -50965 34372 27919 67689
7541 67689 20040 -70358 -103462 -75083 -24724 -24449 147611 57541 -10238 23019 23473 31771 -5337
7528 -5337 22676 -46467 -47407 -53993 78213 9498 -52082 -82045 -138190 -142120 -93373 -4756 -2591
7515 -2591 -89240 -27916 -49296 4722 -135398 19665 48084 33548 -130439 -61431 13637
7504 13637 -102820 -104257 6886 61634 36422 -119315 -185525 -84939 -71903 -8450 -99664
7493 -99664 -47993 1391 -26529 -98136 -70901 -70443 -93901 -40040 71675 42316 6396 -48568
7481 -48568 -30282 -9528 -35325 -119708 -52516 -135495 -96773 -103783 -135051 -131506 -186709 -166425
7469 -166425 36748 98720 6050 -60108 -81418 -25582 -43214 -59785 -248870 -158881 -97119
7458 -97119 -46806 34565 137378 18492 -12494 -86512 -165162 -150129 3942 109915 36236
7447 36236 -46173 -79918 1898 -52780 -3713 -33563 -62069 -153059 -115359 -105567 -32268 -12220
7435 -12220 -94351 -140371 -43637 32265 -45058 -70082 -7532 -17784 -90121 -42481 -107269 -50809
7423 -50809 35808 -75188 -99043 -155940 -88960 -159700 -41201 36799 30599 -113913 -233481
7412 -233481 -108994 60308 54223 -15791 -133228 -120989 -88193 -81759 -61730 -34384 7983
7401 7983 -75329 -125347 -42912 -34551 18298 -10148 -41600 -58042 -73399 2654 -163008 -265674
7389 -265674 -108144 -130565 -78352 -25024 -132577 -174582 -173534 -147425 -87649 -225210 -179854
7378 -179854 -155891 -107588 -49744 -123851 -32331 -141331 -38836 24627 -150704 -131545 -112247
7367 -112247 -54212 -18867 -102997 -218427 -159153 -169290 -147131 -205589 -210407 -68140 -24193
7356 -24193 -116497 -153854 -160103 -108961 -30749 -70732 8708 -49868 -53456 -247647 -176613 -207815
7344 -207815 -245956 -274691 -207676 -75760 56521 -37202 -86195 -113806 -67171 -164980 -152960
7333 -152960 -149633 -79411 -59868 -29191 -197215 -145662 -146379 -247454 -133398 8893 -80182
7322 -80182 -83446 8720 -107218 -70770 -95631 -112939 -25242 57049 38122 73039 14939 47695
7310 47695 76022 64551 -9579 -66193 59614 23379 -215570 -73300 -205089 -167751 -117560
7299 -117560 -73502 -102684 -57526 -18649 466 -40443 -30078 -95478 -141209 -197289 -197579 -65006
7287 -65006 -65315 -4926 -61767 -51381 -74800 -98300 -103440 -144231 -100432 -98236 -163331 -122533 -81886
7274 -81886 -104911 -188019 -188770 -138134 -134503 -140835 -176424 -68656 -137243 -136661 -3698 38894 -66364
7261 -66364 -74491 -27482 -114317 -96609 -182130 -15554 -34215 -82186 -66218 -13819 -49825 -39880
7249 -39880 13914 -50085 -33384 3186 -88030 -95801 -103639 -146796 -185942 -213528 -25345 33021
7237 33021 -60616 -96982 -54740 -139084 -201980 -171727 -133355 -86381 -64918 -24679 -61149 -187124
7225 -187124 -219449 -94458 -165890 -154396 -25032 -149064 -253845 -123466 -45545 -93036 -115852
7214 -115852 -29536 -4772 -35928 -73093 -100665 -55044 -8288 -23016 24547 9352 -39395 -108660
7202 -108660 -35588 25293 -26219 -63902 -148694 -182231 -197936 -145309 -167548 -190666 -135618 -216880
7190 -216880 -144434 -116109 -68827 -138959 -145434 -131952 -118056 -65304 -18174 75063 -92841 -59723
7178 -59723 -224399 -183473 -94383 -106698 -114646 -119833 -111274 -49809 -105039 -92117 -117947 -145892
7166 -145892 -160636 -53615 -88942 -114153 -223727 -171391 -172052 -137737 -117614 -186323 -156473 -140739
7154 -140739 -75363 -101931 -70607 -150977 -53996 -31998 -163330 -141741 -67210 -79943 -182867
7143 -182867 -121353 -150138 -169633 -138744 -79866 -99828 -173362 -239965 -73539 -15057 -117038
7132 -117038 -156725 -41244 -126144 -213798 -42125 -131573 -132524 -20415 -11036 -108412 -189692 -106898
7120 -106898 -51016 -91738 -44571 -119930 -100642 -103116 -112287 -164330 -205064 -157273 -144461 -120502
7108 -120502 29005 -32652 -95209 -199434 -75191 -74339 -99295 -41564 -83838 -118308 -26150
7097 -26150 -126919 -143906 -130708 -187997 -85764 -118775 -181748 -133495 -136375 -137647 -5630 -178690
7085 -178690 -189789 -173645 -34676 10405 -30978 87006 -92750 -29596 -32654 11788 40627
7074 40627 93073 38070 -63631 -61069 -10958 37086 76305 -39265 -51560 -37926 -83820 -143715
7062 -143715 -93749 82749 -24849 -43016 -77333 4458 -157026 -106336 -126044 -247107 -165765
7051 -165765 -112783 -113277 -173072 -155405 -107262 -150928 -135099 -26563 -21712 17012 -133181 -140202
7039 -140202 -120816 -267025 -161946 -78367 -58314 -81477 -211186 -145509 -127577 -197782 -109887
7028 -109887 -9287 -81840 12716 723 -31319 -16154 -55105 -23865 -125994 -164505 -103258
7017 -103258 -69095 -44403 -102211 -129746 24412 64453 -2267 -18512 -76993 -100831 -137349
7006 -137349 -168349 -150082 -118720 -167978 -56147 -66442 -84536 -83952 -151325 -115291 -133726 -24196
6994 -24196 28593 -78417 -57401 -69792 -41501 31572 -31603 12159 -55184 133044 20838
6983 20838 -33086 -2484 -190435 -31305 -34458 -67237 -63856 -140244 -178914 -51829 -129978 -130525
6971 -130525 -6414 -154965 -98174 -99546 -179921 -68478 42900 -20855 -14927 -103443 -80337
6960 -80337 -81023 -143101 -113571 -52705 -90702 21611 135989 79603 33994 -134370 -104922 72288
6948 72288 110730 119795 1145 -40481 65486 29294 -115698 -69871 -59573 61643 19743
6937 19743 -11770 -3654 12690 8647 -4332 20192 -94378 15396 -6739 -50112 60451 165908
6925 165908 137795 71496 26867 -64445 7946 69431 118771 82155 9450 -8214 31710 58882
6913 58882 123800 54588 -15125 -75634 -54189 -110058 -131927 -97663 1212 119132 111884 86310
6901 86310 69883 151416 157634 140119 18158 233400 256972 391621 500466 521561 534665
6890 534665 409333 453782 523900 537500 513429 426929 377704 447632 437362 291471 253611
6879 253611 197100 128034 20255 106029 174196 73990 110569 153116 140842 75062 50499
6868 50499 46393 -18027 47626 24541 -43537 -96846 -28034 -76482 36320 112163 8136 47587
6856 47587 30182 -50010 -56777 -104806 -94698 13207 17547 14488 29356 91600 98390 162147
6844 162147 28991 -24767 91809 201779 88831 -42098 1394 -38739 52130 38766 -71626
6833 -71626 -93245 44749 65802 103184 -57085 -33187 -24791 14215 170971 176542 8229
6822 8229 -109543 -615 62284 80211 152477 151029 200353 87901 54638 71098 -22086 8664
6810 8664 -104158 -61275 -37639 -102881 -93080 -69942 -60935 -77603 -49906 28845 22747 66144
6798 66144 -5794 -107230 15972 90458 -81090 59650 30288 -32991 -70238 -21230 22360
6787 22360 30326 -45659 -116095 -78228 -24389 104180 101660 -50988 24554 51476 146999 5627
6775 5627 27997 26942 73945 233013 109420 135624 79750 1537 37747 41509 103899 170096
6763 170096 100625 50283 35794 112604 92429 182681 242315 262362 234533 158741 160719 162595
6751 162595 280028 193570 124582 267268 203650 151439 190794 237470 170556 126630 107845
6740 107845 200531 160189 165902 282450 229018 146852 141548 171495 232644 203603 74044 146082
6728 146082 196411 164758 209498 234194 215213 167151 241076 383014 216312 283532 291129
6717 291129 260494 366762 343388 424106 302848 339911 355441 269889 390932 445617 416557
6706 416557 494123 462524 522982 390419 392985 428807 354969 417680 476427 473354 457231 452037
6694 452037 375526 434642 536152 554511 523560 478519 431890 588984 596053 537992 591322
6683 591322 620000 573654 643640 639752 608552 587415 597771 601377 699043 719425 628710 596217
6671 596217 627025 750116 840216 786468 758505 786489 786636 819702 803822 760711 797697 755456
6659 755456 687171 748917 814532 877015 923583 841484 937403 922370 1028397 1124378 1125265 1103811
6647 1103811 1048501 1071949 1048679 1038435 1066592 1185232 1212666 1238483 1250104 1257934 1248655 1272098
6635 1272098 1344386 1372910 1404182 1467749 1400023 1496759 1419753 1382166 1414771 1505431 1549418
6624 1549418 1619085 1553451 1646985 1704000 1733971 1782817 1880081 1938419 1877256 1858966 1956938
6613 1956938 2033048 2034262 2059282 2108535 2267800 2466613 2532889 2616474 2742202 2703536 2787873
6602 2787873 2926854 2870710 2970155 3063550 3101125 3223468 3553175 3660522 3604679 3828317
6592 3828317 3912651 3981518 3947743 4107962 4101027 4141916 4379812 4553330 4779151 4816876 4914930
6581 4914930 5119277 5091250 5201712 5263524 5405613 5590522 5644938 5756432 5789560 6016465
6571 6016465 6291187 6409130 6675036 6839800 6956409 7387978 7773162 7993446 8291072 8650576
6561 8650576 8960915 9340883 9805860 10332609 10987765 11568851 12186292 12927611 13969150
6552 13969150 14897240 15818126 16968857 18166653 19258371 20565543 22298528 24517783
6544 24517783 27118700 30301402 34039762 38409807 43449912 49224068 55710905 62447185
6536 62447185 69614801 77982033 88597011 101832312 116525270 127822722 130955372 123772046
6528 123772046 108595658 91009485 74507826 61083076 51047504 43815096 38510236
6521 38510236 34194891 30648378 27648463 25043561 22884193 20995207 19297970 17755103
6513 17755103 16311060 14991916 13736544 12737731 11950691 11413728 10851708 10407250 10021461
6504 10021461 9587749 9124897 8759812 8309389 7874592 7500214 7052046 6742617 6507672
6495 6507672 6229619 6007970 5731906 5414469 5164846 4876950 4696018 4555586 4356618 4166547
6485 4166547 4078824 3837301 3760546 3648199 3581053 3546520 3342292 3149746 3158623 3125544 2947473
6474 2947473 2936401 2926338 2888830 2774700 2724278 2628404 2599037 2532494 2453656 2460388 2390867
6463 2390867 2388593 2327749 2314578 2308619 2389791 2443750 2357418 2288442 2177021 2141918 2118514 2155795
6451 2155795 2089157 1921886 1885549 1812523 1774667 1708652 1641446 1534918 1420276 1393953 1346599
6440 1346599 1263598 1088039 990858 1162362 1127304 1038530 999070 983704 873363 827142 842042
6429 842042 818044 841727 721973 733526 703945 768522 720059 669979 708311 651282 643835 602971
6417 602971 527052 509136 615890 615444 649101 624456 644269 605994 561591 485183 470983 569637
6405 569637 551004 593005 553821 475900 456602 479456 383320 375579 332567 383064 406855 435089
6393 435089 406521 453624 500973 543620 541142 475849 346105 436306 468467 404964 256720
6382 256720 320974 415137 453707 306442 120624 165476 196091 265661 257649 496704 462829
6371 462829 403090 332863 249815 322219 343711 187855 209529 291428 234435 191940 281367
6360 281367 309260 253082 182039 104024 83353 167694 265255 271206 314503 266102 235734 211372
6348 211372 278542 265551 334175 380493 225406 129579 140041 226919 216100 203404 170178
6337 170178 209846 244982 279586 214143 231051 180502 92095 82931 42151 16985 177211 272661
6325 272661 258253 200271 111786 78604 85627 56119 38634 170505 173336 -8983 72564 127649
6313 127649 138469 173116 29891 137542 203970 112172 173997 289619 147699 147095 22237
6302 22237 -39018 24605 130395 134332 174749 194697 70590 -6887 -638 10423 -41682 -5762
6290 -5762 75913 121436 143119 76586 79029 285080 190807 216968 231738 192843 200731 140154
6278 140154 123562 146492 118888 112574 114681 175223 162198 199999 190819 169843 71854 32189
6266 32189 20720 -117852 -42236 53036 106853 149596 62430 -6578 -22557 86215 100579
6255 100579 52417 53488 145486 163433 123635 142248 44049 65558 76755 96172 88190 165996
6243 165996 249815 120140 29922 159218 222730 98586 98913 57429 31426 89194 84605 32471
6231 32471 79642 182404 145612 207587 198588 245376 186043 70503 -34118 182267 214696
6220 214696 143984 215472 216913 185417 160392 153434 94965 105444 106559 191689 189648 84188
6208 84188 37208 82272 62665 113593 227611 187198 117088 43112 107743 256027 161517
6197 161517 56272 87083 131763 35099 107909 -9665 -5217 51785 145604 186598 296151
6186 296151 266808 167777 116196 63215 110821 187495 175261 191056 192328 233226 444485 453442
6174 453442 533934 511618 471745 578720 629955 687742 701781 610930 529894 472853 464243 297476
6162 297476 218596 184743 277468 208129 243291 94061 133376 110146 111844 154307 21994
6151 21994 59355 99638 123709 154851 73948 170337 115711 77658 87534 19270 32928 95820
6139 95820 167855 93066 88592 -1091 128202 285560 123306 92821 99161 -56689 -10111
6128 -10111 66443 131292 69470 27323 -22497 17567 110760 24787 -36986 36478 -43056 -4329
6116 -4329 34190 27294 -606 -1279 -8174 -71566 -26560 -43010 36010 -33042 7398 74625 79434
6103 79434 23128 -135162 -108918 -21594 -8428 -14210 14891 16206 127587 33813 25343 34464
6091 34464 -70085 -28996 41713 100009 60049 37780 113225 118089 92869 139403 29728 32813
6079 32813 61698 -13804 -44701 984 -70901 -172965 -108294 56068 -20847 -178532 2483
6068 2483 47540 -85855 -176443 -102173 -44080 3378 109620 98814 202462 143689 -60307
6057 -60307 -91758 -105907 34630 70678 3867 -24982 -16724 -59644 -16357 -71299 -53756 8159
6045 8159 85684 134189 48148 -49413 -129161 -192520 -67293 -46142 -59724 -6388 12943 -89894
6033 -89894 -102884 -5823 -50162 16957 -45111 -18744 51114 -43824 81390 4551 -33719 14418
6021 14418 45250 -7580 -40493 -84002 -75118 -101330 -55704 -56373 -152931 -110380 -39126 38843
6009 38843 -43909 -17807 29788 45680 58177 109943 9412 -39093 -99779 -137900 -133515 -54456
5997 -54456 71403 5270 -35432 -46397 15747 111765 -13585 -7117 1975 -1164 14229 114767
5985 114767 62670 16230 28414 -50496 9677 53089 -41334 41440 -24862 37771 127191 96160
5973 96160 68832 147031 76153 -23174 -18367 -104031 -71512 -25975 -17601 -80882 -147348 -81500
5961 -81500 -41265 -43903 -38889 -26893 -43447 -39368 83728 43018 155756 118442 67575 -57567
5949 -57567 -131438 -357 -27609 82390 83382 10093 -43451 52406 27757 16139 44476 73982
5937 73982 76057 37467 93534 154245 93951 87329 94192 184377 136425 27257 184782 72546
5925 72546 83769 46393 4788 26777 -65537 53354 15014 33679 -24926 3214 21016 94268
5913 94268 168051 814 -65687 -46629 13269 33633 -31432 -51116 53036 -1577 40024
5902 40024 -22233 105100 134203 90100 35939 78897 61935 32408 150081 81620 36247
5891 36247 122937 140471 99346 57099 45800 70401 22639 157522 100132 45102 16770 21089
5879 21089 71829 184276 154155 88690 59114 148243 148573 57951 103271 145952 168124 -20940
5867 -20940 -12966 32658 65678 114452 101011 -11705 56742 52897 39709 79137 50568 42577
5855 42577 34923 47255 50203 -32091 26950 71552 146735 181529 178591 182742 116192 39275 102142
5842 102142 113578 182023 36012 66689 134611 172279 159417 177875 154260 112826 129236
5831 129236 85479 132230 69371 120350 145488 188391 201332 273389 204438 65206 107023
5820 107023 182123 194526 156548 133793 178659 219377 191611 205509 158370 142038 235705 174569
5808 174569 121609 256716 300920 335599 272315 135181 213284 331671 392508 409081 364919
5797 364919 344132 351454 319661 301441 271168 219767 219802 273230 391046 428827 467936 449710
5785 449710 283253 305466 321787 224237 166136 275976 220246 316413 255335 132189 113229
5774 113229 232077 261195 159625 149771 236523 211104 263728 210044 232791 279139 204560
5763 204560 265638 185086 35435 5057 58928 138289 155519 200194 184168 233805 182961
5752 182961 232272 98470 80857 141417 56027 119432 64116 175168 254992 214683 268100
5741 268100 293627 242058 225568 201905 151579 107022 154011 172643 114899 218077 164528
5730 164528 79715 67800 44881 90307 209737 156559 193429 276006 298284 270663 340688
5719 340688 364865 308949 429893 361479 352506 229898 286097 303738 252120 236628 299857
5708 299857 395520 294250 275996 324209 431512 469752 376796 428303 473612 523329 563195
5697 563195 411381 426062 515817 462469 497055 588550 766084 562128 488436 552433 598333
5686 598333 562897 600467 537270 585304 658322 524480 567073 625847 608901 635803 605616
5675 605616 702966 680032 627439 609463 665278 684436 738371 814045 873377 1009554 1127432
5664 1127432 1086046 1137514 1164210 1064581 782713 754939 822978 776406 839077 710087 789641
5653 789641 696764 759132 830999 771245 734632 694417 772323 702925 614134 651627 661520 728642
5641 728642 877605 894664 905125 941575 930904 966315 936174 922920 867577 818471 879663
5630 879663 893586 792447 691031 773593 758809 795047 767058 729530 892173 787058 769959
5619 769959 739574 744472 715705 636806 678579 775729 863261 941338 771932 699480 679125 691767
5607 691767 726683 793241 777506 654608 585220 646660 673587 668508 799155 856682 805361
5596 805361 729838 723956 800947 812526 808512 854461 812080 851778 792901 797828 847085 859455
5584 859455 822670 780915 842751 827282 836235 901978 927262 879417 795020 805969 911708 919434
5572 919434 913602 1019819 977421 961679 1076622 1070934 1028577 1105233 1033621 971533 937224 951636
5560 951636 1047349 1196966 1106862 1096764 1167917 1053058 1203045 1219579 1231346 1157575 1132430
5549 1132430 1172716 1176805 1149180 1245297 1228072 1214595 1242899 1271237 1372658 1448384 1361425
5538 1361425 1340024 1338042 1457696 1626670 1554186 1557895 1370273 1397186 1444512 1445095 1388641 1439364
5526 1439364 1534164 1654989 1762442 1721615 1759933 1855232 1831603 1787572 1840843 1920087 1923338
5515 1923338 1823797 1950718 1934417 1997555 2166843 2255915 2179567 2152695 2220012 2214273 2160223
5504 2160223 2172128 2164968 2270917 2380859 2420306 2510352 2546330 2495056 2664578 2733569 2617040
5493 2617040 2718527 2841938 2728744 2750300 2865790 2979416 3135371 3215028 3104336 3088241
5483 3088241 3222150 3229429 3430983 3440031 3571163 3570879 3768321 3845972 3864596 3880459 4016956
5472 4016956 4145373 4149974 4236894 4285166 4448040 4620645 4610658 4688213 4759370 4841111 5045149
5461 5045149 5181803 5297705 5417604 5497367 5555967 5718403 5832529 6129854 6307057 6404524
5451 6404524 6520390 6612890 6804937 7006712 7244434 7448092 7551149 7681700 7927800 8243988
5441 8243988 8481390 8638773 9049412 9182408 9401086 9783090 10023498 10318866 10701981 11107190
5431 11107190 11322450 11717949 12117957 12702777 13166257 13687733 14438165 14961837 15668631
5422 15668631 16443801 17259506 18160405 19050076 20079198 21270835 22719499 24470635 26276011
5413 26276011 28175855 29915870 31087872 31832041 32333062 32827185 33541521 34592213 36138713
5404 36138713 38215515 40848804 44127941 48060561 52790650 58586724 65645552 73466831
5396 73466831 80433132 83761680 82437469 78220816 73583753 69786117 67343995 65925360
5388 65925360 65471702 65787496 66071232 65581547 64068534 62460952 61067836 60580307 60897631
5379 60897631 62157967 64536907 68051155 72801973 78819843 86351993 95945442 108008555
5371 108008555 122198358 135819931 142470254 138102423 125583410 110307171 95929921
5364 95929921 84688031 76508829 70636719 66533845 63133989 60039725 56912691 53935033
5356 53935033 51201065 49100841 47687900 46899790 46789645 47169691 48371561 50086455 52698080
5347 52698080 56478993 61272763 66880687 72655393 76205821 74999373 69309836 61364671
5339 61364671 53139550 46069546 40334121 35907086 32360307 29443293 27076140 24946964
5331 24946964 23192656 21574419 20260273 19200117 18175165 17403978 16488968 15766885 15124461
5322 15124461 14624010 14269245 13858342 13343171 12936547 12504341 12066921 11572815 11140768
5313 11140768 10782042 10297199 9988147 9623598 9281377 8971436 8614412 8305231 8075630
5304 8075630 7849274 7738781 7515842 7407352 7238931 7162685 7105829 6990336 7025082 7007693
5294 7007693 6933466 6735219 6575191 6425110 6135266 6040009 5986212 5691870 5415174 5187576
5284 5187576 5078713 5005154 4882145 4686910 4449529 4362377 4256380 4115811 4164529 4152496
5274 4152496 4068325 3944404 3903057 3815492 3829114 3829297 3754452 3670122 3611589 3567785 3592300 3548526
5262 3548526 3384064 3349653 3196796 3126164 3068485 3096282 3109861 3014653 2923270 2954970 2958696
5251 2958696 2893588 2834371 2751163 2630118 2616350 2549523 2467697 2553147 2571895 2487963 2536978
5240 2536978 2589079 2560993 2551131 2549388 2514764 2570804 2501530 2512751 2471232 2487819 2579569 2621527
5228 2621527 2652237 2697588 2723462 2881494 2917521 3008321 3160888 3157773 3091989 3044740 3179343
5217 3179343 3177489 3189570 3161232 3067837 3043340 2970404 2899201 2794337 2903421 2946621 2917835
5206 2917835 2950334 2885658 2881099 2979748 3163852 3309411 3344929 3470797 3578993 3769220 3963949
5195 3963949 4050633 4005861 4027419 4113627 4038690 3906786 3779355 3646449 3683470 3554827 3531756
5184 3531756 3455544 3332339 3360487 3369549 3440357 3423821 3531468 3609156 3679346 3845194 4024299
5173 4024299 4163461 4319084 4501285 4828924 4990376 5387038 5740651 6335685 7132002 7532237
5163 7532237 7459100 6880146 6083250 5360555 4751378 4289620 4045211 3873925 3617215 3610941
5153 3610941 3479240 3327355 3200143 3235931 3249402 3205930 3136789 3057457 3164557 3114478 3027980
5142 3027980 3079583 3099424 2979672 3128461 3138702 3029019 3172256 3104361 3077669 3160457 3110055
5131 3110055 3095858 3161822 3280735 3327685 3293085 3340496 3337548 3415610 3380408 3389756 3409924 3519710
5119 3519710 3601950 3520302 3606000 3692117 3842762 3961019 4016505 4039465 3953176 4080070 4198638
5108 4198638 4245286 4267536 4391150 4485298 4649599 4822035 4966549 4878263 5011066 5049128
5098 5049128 5148666 5319603 5293561 5414040 5426105 5544936 5623144 5680191 5845758 6011693
5088 6011693 6219818 6284879 6311982 6564536 6721465 6768997 6901665 7120220 7210311 7402082
5078 7402082 7570756 7627605 7702386 7878856 8224168 8426765 8686390 8948504 9140247 9296926
5068 9296926 9370051 9609354 9743140 9944743 10205465 10560483 10673354 11014096 11482368 11752196
5058 11752196 12208082 12738708 13057715 13545708 14035692 14600711 15266679 16001545 16557949
5049 16557949 17317433 17957551 18792026 19804321 20852925 22110617 23342641 24810127 26401012
5040 26401012 28018043 30091510 32392392 34919818 37687195 40746626 43965102 47225051
5032 47225051 50381810 52980451 54813161 55884725 56032155 55484910 54658830 53798024 52868133
5023 52868133 52135457 51711183 51650718 51941946 52486393 53609074 55359563 57582813 60196116
5014 60196116 63194654 66806025 70839118 75224550 80160108 85258147 90037177 94155475
5006 94155475 96755496 97028320 95013058 90857683 85367161 79459015 73603392 68240193
4998 68240193 63444491 59285768 55995524 53213173 51033439 49273140 48084148 47244925
4990 47244925 46940837 47084584 47572682 48486888 49915107 51385924 53140426 54944617 56670056
4981 56670056 57942132 58163512 57083304 54803095 51629591 47944725 44072980 40443933
4973 40443933 37109540 34103162 31593092 29193028 27123700 25451189 23727378 22254286
4965 22254286 20977083 19695630 18604656 17640067 16750055 15919601 15147511 14435247 13886790
4956 13886790 13310977 12832827 12521656 12203736 11761711 11457592 11201334 10916840 10699611
4947 10699611 10440689 10122845 9749917 9618647 9444220 9211013 8904015 8561731 8226234
4938 8226234 7992863 7747412 7499349 7248817 6990872 6683120 6556731 6401476 6215221 6094793
4928 6094793 6035729 5930987 5770653 5702015 5590297 5471775 5404687 5276766 5035481 5007187
4918 5007187 4857632 4716614 4725552 4693092 4545865 4388804 4188873 4085434 4022776 3875622
4908 3875622 3798969 3711104 3654146 3578916 3484708 3393841 3335297 3328228 3152813 3162897 3078522
4897 3078522 3167478 3077087 3063918 3059344 2856560 2949597 2911306 2856295 2828808 2874316 2795933
4886 2795933 2815448 2738741 2696656 2775474 2734261 2939891 2915865 2838574 2901588 2857207 2975152
4875 2975152 3051895 3019332 3049732 3070791 3206688 3230476 3419850 3594005 3736096 3683381 3658618
4864 3658618 3640888 3642720 3704045 3831536 3727871 3670432 3746831 3550620 3515343 3468774 3341327
4853 3341327 3224947 3163133 3225204 3340159 3380412 3477880 3602863 3768065 3871265 4066920
4843 4066920 4139392 4158982 4214453 4348557 4163132 4000007 3801374 3695067 3754673 3578596
4833 3578596 3462841 3368979 3206398 3036777 2888304 2785262 2734436 2670306 2595260 2485933
4823 2485933 2528004 2487224 2543842 2598931 2544550 2516025 2602982 2575933 2519581 2554373 2493925
4812 2493925 2391444 2426966 2314827 2300090 2224469 2229927 2124580 1941909 1850683 1724347 1580956
4801 1580956 1462077 1518446 1595938 1561966 1427250 1422509 1265789 1233237 1320580 1279274 1298164
4790 1298164 1132443 1121386 1102976 969431 1057024 1028944 1124856 1060544 934902 974536 1019528
4779 1019528 980576 943359 984935 859556 771449 822829 863211 848791 806416 887611 842310
4768 842310 674565 786832 850865 827397 753657 722055 674266 737531 837729 725576 783568
4757 783568 819989 788000 613365 684431 706282 611529 638383 809255 839577 809210 721981
4746 721981 846200 755446 780948 763174 775774 873197 871061 934428 976339 885472 882133 722584
4734 722584 629141 784976 751475 677271 757248 866026 799469 718006 727412 924687 816443
4723 816443 720615 819391 877127 1088974 1076985 990765 971871 1000727 963688 831694 889928
4712 889928 912315 841434 777409 789109 752348 737256 710145 649747 540770 556378 632288
4701 632288 708484 666195 565014 605867 708074 609250 629090 700925 645091 632075 561485
4690 561485 535022 559164 630755 615297 500418 562558 548052 605056 573317 676972 589640
4679 589640 550284 481082 464477 470422 507290 410509 434919 490597 377604 420047 384732 376250
4667 376250 406841 328722 333389 371180 420705 383095 280691 347246 382414 370900 318151 235766
4655 235766 195146 220576 260299 222701 242739 241581 277142 239510 238473 270239 279969 183109
4643 183109 219759 293955 300673 435777 336291 279450 258910 240403 240036 354489 158452 56085
4631 56085 108520 75991 151453 132347 118107 163667 185208 215387 200023 306976 323749 182613
4619 182613 60346 156146 229156 150121 84027 178127 257281 223802 200302 161824 147181
4608 147181 228284 147889 210993 235115 169461 86670 156233 134865 142263 258701 242561 360472
4596 360472 304685 287327 210291 206593 242042 121766 185797 154791 110888 259249 212165
4585 212165 111370 257670 236676 100975 60456 127727 51441 93170 122236 103297 133924
4574 133924 141054 29279 130800 246840 271507 300416 205616 148247 60537 117626 210983
4563 210983 251710 306383 225727 142243 194673 286585 274778 276840 327841 307832 184349 105817
4551 105817 134622 121175 228686 189710 151257 165321 260652 279053 194649 168956 155144
4540 155144 71847 78700 150068 277703 290831 196304 76975 121810 134218 246031 313459
4529 313459 228236 203962 121140 33290 134046 108048 101796 141809 209129 219214 180956 197761
4517 197761 76780 176214 228164 203821 101466 150620 295354 322564 189508 112835 186044
4506 186044 165688 280001 215433 249195 241281 157997 141508 198482 112014 133228 87651 -48044
4494 -48044 57380 19848 -22882 73738 143853 139975 158741 205748 197095 181520 166183 192792
4482 192792 113960 182889 155023 255713 213626 108146 102355 119254 253612 167542 166255
4471 166255 137081 235762 166528 103442 186092 314631 191798 202678 198017 390443 430909
4460 430909 277335 257476 232655 239422 211065 192769 175773 245170 244664 218926 300043 269009
4448 269009 311935 214348 83467 81406 56222 -189 116068 -23175 -43662 160591 117809
4437 117809 108219 -13798 47486 169095 83349 165159 180692 182131 180830 211890 148142 179565
4425 179565 328424 187305 192927 112149 114281 154676 261954 351544 228536 191144 220618
4414 220618 129172 38866 136939 255068 265360 186256 139735 241842 301531 227444 166190
4403 166190 225833 236421 328343 202964 250293 210731 179227 228939 268957 215021 157770
4392 157770 88570 101892 164576 189321 107013 -40598 58957 60920 111014 122785 159630 317052
4380 317052 337282 300499 251932 185174 187073 165621 259240 285832 346640 293429 281841 138715
4368 138715 148372 271800 254048 193042 121250 92888 197471 228505 342937 263671 139405
4357 139405 187883 236471 171180 67883 135179 286715 206904 241775 351833 355273 207955
4346 207955 217866 289738 401785 497471 332644 340926 278349 327547 294241 296896 321534 268771
4334 268771 284344 368511 366893 319324 360560 310665 366979 371664 200879 330233 334820 201768
4322 201768 272599 283537 285929 327093 319116 361632 457927 450384 339652 332414 332082 366175 329728
4309 329728 341802 292670 346526 171927 226972 276958 288884 320625 307568 279267 281682 246187
4297 246187 241721 284431 306412 273724 250123 337290 296383 320402 285098 313576 397047 411852
4285 411852 479369 354758 260877 363407 209311 183894 335896 327168 263779 376725 364941
4274 364941 354056 364847 379961 289028 264416 406457 399093 391620 344492 402655 393097 340639
4262 340639 311275 343245 357553 364668 302381 293964 235735 224813 313404 305275 348806 312864
4250 312864 366994 421875 518144 484055 474859 516838 495218 535338 510328 519865 643136 545773
4238 545773 452629 399669 540176 546197 555385 615702 497130 486097 566064 647053 593345 593900
4226 593900 562812 613943 670802 685545 738975 652636 711177 717319 561015 612078 629924 648068
4214 648068 599465 622387 557612 610368 598244 585877 695859 668196 761681 733256 736417 743054
4202 743054 748788 724051 794370 863270 904293 831404 877823 835884 889676 1046695 1006363 934334
4190 934334 1062125 1162481 1156740 1096805 1225461 1279915 1321558 1375834 1451316 1550590 1705549
4179 1705549 1898504 2186415 2499593 2763681 3056823 3229429 3041181 2661303 2398530 2056682
4169 2056682 1918547 1843906 1611262 1577355 1487460 1441526 1414774 1404979 1370322 1232103 1378448
4158 1378448 1356734 1338788 1307505 1218545 1092041 1091434 1204315 1214737 1171062 1282510 1322053
4147 1322053 1359648 1319822 1345145 1383055 1405235 1436001 1435155 1366812 1345363 1452071 1431236 1297567
4135 1297567 1244531 1498590 1518211 1399864 1370505 1345854 1265418 1301704 1365899 1313555 1386827
4124 1386827 1433514 1404117 1355750 1443279 1372842 1333705 1319420 1389272 1319189 1333958 1375125
4113 1375125 1303406 1433744 1527522 1569062 1461784 1514543 1640197 1559723 1632585 1730278 1747614
4102 1747614 1720000 1608423 1590509 1808048 1837903 1787137 1800513 1964480 1988654 2115029 2177394
4091 2177394 2075982 2165698 2147486 2175775 2114894 2109976 2164916 2148894 2204976 2289833 2322286
4080 2322286 2349686 2323161 2333194 2334231 2351109 2350290 2310493 2351064 2467292 2537949 2633570 2697484
4068 2697484 2809260 3012664 2972688 2937529 2956738 2915916 2919237 2948079 2867484 3009450 3110130
4057 3110130 3144076 3299581 3359138 3399461 3541870 3581450 3661691 3551517 3483966 3596490 3723960
4046 3723960 3762816 3925314 4041346 4018170 3973209 4165892 4414573 4584988 4675819 4817380
4036 4817380 5042099 5078379 5156790 5145461 5229414 5363320 5484558 5436073 5613209 5702078 5849623
4025 5849623 6004127 6043936 6149007 6166210 6280972 6446291 6481075 6584569 6639835 6801430
4015 6801430 6968522 7122932 7167373 7296095 7532945 7899742 8085177 8320057 8566825 8880411
4005 8880411 9215103 9526768 9930651 10384788 10732260 10657932 10511860 10259015 10080485 9971127
3995 9971127 10087644 10166326 10220724 10460219 10530779 10713128 10934994 11221831 11348181 11737541
3985 11737541 12036662 12304984 12628259 12882791 13216574 13375977 13661175 14003951 14226818
3976 14226818 14682273 15032750 15232309 15585752 15902774 16299916 16701409 17111855 17504327
3967 17504327 17519562 17791720 18049782 18287501 18584294 18908624 19300450 19706362 20163676 20637825
3957 20637825 21227868 21827930 22369303 22955436 23541685 24261031 25186428 26077315 26979999
3948 26979999 28005751 28831753 29716112 30954318 32202040 33731594 35425051 37492846
3940 37492846 39562128 41910033 44703923 47640183 50568831 53393460 56088197 59270466
3932 59270466 62961737 67586028 73400839 80634765 89007137 98236586 108482566 120675453
3924 120675453 135515718 153529547 174948973 200626529 232838515 274030936 326251789
3917 326251789 385263507 428428172 433714060 397369171 337949405 277655360 226357502
3910 226357502 187944809 160041132 139313612 123168269 110187760 99267382 90089877
3903 90089877 82642853 76515593 71207367 66283760 61674529 57227367 52990877 49319285
3895 49319285 46179638 43973071 42308825 40840660 39553872 38533021 37442820 36514675
3887 36514675 35700831 34945988 34191064 33580466 33236593 33092827 32898079 32521256 31783421
3878 31783421 30708875 29290477 27972602 26761507 25820687 24855245 24036665 23356678 22736789
3869 22736789 22163985 21723579 21549327 21139356 20652925 20304852 20066434 19871464 19952127 20137584
3859 20137584 20063492 19914756 20058644 20099231 20112425 20133071 20235153 20316368 20479801 20702354
3849 20702354 20908222 21086749 21249273 21375250 21810324 22241375 22575518 22871521 23156043
3840 23156043 23431864 23726709 24094113 24705529 25031801 25356822 25724165 26115901 26498778
3831 26498778 27162258 27827686 28448808 28920968 29445274 30265895 30937876 31680110 32487463
3822 32487463 33351880 34238311 35087616 35881941 36776883 37610689 38446795 39176190 39849755
3813 39849755 40519180 41175767 41799147 42404433 42895680 43147979 43324300 43449276 43375026 43266510
3803 43266510 42982216 42590130 42226184 41772830 41150281 40479000 39752454 38995358 38153800
3794 38153800 37319609 36509533 35703359 34778053 33879548 32855112 31860455 30835778 29921623
3785 29921623 28952569 28026994 27116302 26340165 25522177 24790224 24049701 23456334 22843072
3776 22843072 22311991 21760790 21206219 20784704 20205438 19598995 19266905 18799603 18356139
3767 18356139 18099034 17837193 17519193 17136117 16800109 16554997 16394402 16382004 16233652 16156703
3757 16156703 16004236 15896514 15966281 15800141 15819651 15842058 16026573 16327445 16673487 17073294
3747 17073294 17508236 18118348 18445944 18591577 18437354 18320661 18361034 18572017 19085471 19562396
3737 19562396 19891147 19887389 19615485 19525446 19679171 20129310 20759143 21837943 23327682 25181989
3727 25181989 27499041 30141270 33449726 37265488 42248291 47233240 48023419 43772363
3719 43772363 37722201 31538645 26634142 22847611 20337656 18506356 17215759 16087289
3711 16087289 15130907 14370066 13731548 13276084 12897430 12521222 12216851 11821486 11630060
3702 11630060 11413667 11300293 11379151 11472190 11826072 12331905 12921688 13239099 12834011 12225867
3692 12225867 11519196 10862643 10467169 10074537 9659777 9217223 8851308 8513514 8315891
3683 8315891 8207754 7986942 7855057 7704722 7619976 7478680 7389135 7353095 7279485 7330418
3673 7330418 7281843 7341653 7316894 7259549 7284484 7299778 7287525 7330485 7427940 7534611 7552843
3662 7552843 7653782 7709282 7738807 7967658 8202037 8471717 8836934 9162479 9284850 9146898
3652 9146898 8882681 8613600 8326733 8149211 8016661 7945355 7878085 7809705 7806804 7912866
3642 7912866 7951902 7955053 7982850 8106378 8351433 8360708 8472836 8720966 8866802 8827864 8881997
3631 8881997 8765876 8633287 8722974 8706228 8761024 8903350 8999254 9033728 9284542 9437622
3621 9437622 9594951 9910501 10016628 10229846 10497665 10783715 11038108 11245701 11439777 11733350
3611 11733350 11820251 12157143 12430478 12709706 12973276 13305960 13614467 14078038 14450210 14798773
3601 14798773 15388190 16142723 16845423 17592866 18545165 19674576 20900517 22398043 23724018
3592 23724018 24983023 25999435 26595602 26781375 26715429 26505457 26126167 25732564 25601306
3583 25601306 25625664 25682185 25857290 26093983 26613052 27245323 27981133 29012032 30387705
3574 30387705 31834474 33417274 35302720 37483061 40051863 42951145 45860173 48811280
3566 48811280 51678347 54249254 56360587 57680258 58119722 57844886 57112512 55966839 54657686
3557 54657686 53693062 52638097 51550120 50617539 49784226 49168427 48953078 48950720 49358319
3548 49358319 50096782 51062613 52226115 53628768 55220868 57294942 59608132 62082491
3540 62082491 64830230 67811947 70588139 73053873 75322873 76966934 77695043 77438069
3532 77438069 76152715 74352819 72069026 69380390 66320973 62972535 59735141 57077688
3524 57077688 54923008 53211276 51849449 50872759 50134212 49666500 49383796 49354571 49860549
3515 49860549 50632354 51797779 53128377 54649183 56147928 57871992 59509521 60726493
3507 60726493 61606789 61900199 61185664 59348909 56624825 53217477 49496326 45838504 42519949
3498 42519949 39640777 37333395 35568924 33993729 32684038 31520775 30488305 29714153
3490 29714153 29038601 28687030 28477443 28292950 28220344 28182694 28319347 28606115 28778856 29097427
3480 29097427 29132877 28891506 28477099 27581322 26391123 25063802 23774859 22763808 21768237
3471 21768237 21109678 20542950 20103026 19727383 19361894 18913859 18819079 18619794 18339081 18236158
3461 18236158 17842071 17438801 17073392 16944354 16685260 16462057 16369759 16309863 16171475 16012610
3451 16012610 15967249 15943077 16095690 16217567 16191415 16426850 16652413 16890393 17182938 17523446
3441 17523446 17782818 17877872 18152651 18448615 18543934 18793490 19044839 19209112 19385938 19374492
3431 19374492 19303887 19333603 19233725 19172508 19185474 19272621 19172901 19334649 19433639 19538105 19847719
3420 19847719 20103972 20568134 21188090 21798951 22542133 23377225 23986472 24584948 24948888
3411 24948888 25144672 25501844 25995096 26917549 27750790 28374436 28889492 29182086 29025547
3402 29025547 28597506 28235491 27844885 27724308 28067226 28460410 28913794 29511928 30439172
3393 30439172 31609031 32667354 33967475 35214051 36380912 37573180 38560652 39418500
3385 39418500 40433383 41409747 42308870 43442504 44561292 45854750 47079036 48132701
3377 48132701 48841411 48844496 48376375 47725708 46937673 46422066 46288557 46371004 46936960 47898875
3367 47898875 48949213 49888473 50629151 51576783 52501784 53458693 54800565 56163353 57772643
3358 57772643 59386567 61063891 62819013 64854201 67184631 69882866 72614258 74843342
3350 74843342 76487307 77309774 77462647 76703618 75536551 74380444 73222285 72438332 71889848
3341 71889848 71598181 71360730 71197954 71271225 71701856 72323351 73049879 74045382 75623091
3332 75623091 78006548 80896156 84355415 88336271 92296849 95888689 98639310 100304537
3324 100304537 101311078 102124003 103112891 103847217 103885836 103124867 101770984 100325814 99229600
3315 99229600 98682742 98616973 98810544 99166541 99282397 98983483 98349001 97627461 97126456 96293706
3305 96293706 95158007 93914896 92814944 91974549 91207545 90318165 89028839 87051524 85093899
3296 85093899 83548412 82589539 82300321 82190436 82466065 83193085 83832523 84118477 83604256
3287 83604256 82280817 80172662 77363747 74414120 71977795 70042186 68518180 66938323
3279 66938323 65005130 63119035 61324951 60070271 59355641 59010939 58697195 58373351 58097843
3270 58097843 57993092 58271429 58789733 59579180 60638651 61731829 62462352 62589506 61933025
3261 61933025 60551968 58845954 57141304 55495618 53769335 51595329 49299841 47281847
3253 47281847 45572169 44170451 43090751 42462661 42140690 42059600 42027710 42124438 42097113 41636229
3243 41636229 40579104 39255837 37924472 36690424 35732475 35102293 34567469 33825623 33168248
3234 33168248 32281632 31538203 30813905 30124238 29891577 29956703 30036916 29938950 29584782 29116710
3224 29116710 28582367 28060937 27339006 26234368 25103868 23825019 22509729 21352345 20370208
3215 20370208 19507062 18853193 18395058 18005940 17647618 17385269 17175909 16906766 16524305
3206 16524305 16009633 15469842 14908330 14392804 13994530 13627176 13267398 13123500 13282474
3197 13282474 13277949 13233357 13301287 13053845 12531232 12112711 11446062 10916770 10500606 10277985
3187 10277985 10042113 9718100 9572365 9284537 9093872 8842199 8769239 8588847 8401082 8158057
3177 8158057 8036272 7944610 7793927 7639057 7409629 7420003 7291347 7243502 7228165 7152030
3167 7152030 7029057 7021332 6939323 6813039 6758392 6746136 6539953 6381576 6300724 6334145 6268467
3156 6268467 6256261 6193964 6166676 6225798 6182411 6063725 6018846 6013698 5917236 5956285 6110650
3145 6110650 6060423 5943006 5861222 5704500 5734850 5658965 5655716 5596888 5495225 5471111 5324459
3134 5324459 5382942 5524215 5462511 5423776 5429413 5463193 5361085 5421644 5434853 5532761 5617143
3123 5617143 5535078 5559166 5511722 5580695 5577703 5672993 5642586 5650603 5725569 5757824 5760825 5902986
3111 5902986 5959297 5967205 5983260 5950173 6156249 6175126 6342878 6475006 6585677 6700286 6840929
3100 6840929 6946396 7348888 7602470 7787877 8014016 8341073 8682683 8974023 9285757 9466234
3090 9466234 9562484 9533822 9347680 8838004 8387970 7804627 7448625 7098027 6712905 6513613
3080 6513613 6240392 5934811 5785769 5574769 5369266 5329589 5099563 4876798 4787796 4655716
3070 4655716 4500005 4419542 4263023 4195535 4044392 3950978 3867567 3822777 3813251 3688600 3649241
3059 3649241 3735345 3644389 3491652 3418052 3527832 3418253 3503725 3382065 3424671 3576679
3049 3576679 3469870 3427567 3510264 3423834 3334918 3235778 3052657 3010199 3036828 2968806 2869940
3038 2869940 2895058 2903435 2847756 2657634 2592774 2632803 2682148 2677569 2701311 2617897 2624912 2499911
3026 2499911 2509017 2534901 2571632 2633959 2659757 2634385 2810849 2821403 2773222 2702069 2578001
3015 2578001 2474427 2467229 2420524 2502483 2433478 2454227 2449894 2433430 2415979 2381697 2413240 2231930
3003 2231930 2102745 2039644 2145590 2178989 2187397 2099523 2210150 2278210 2225298 2209520 2142608
2992 2142608 2191873 2185595 2137990 1965158 1835813 1811857 1993176 2005223 1926735 1911109 1902323
2981 1902323 1968144 2067804 2043918 2061969 1896663 1882562 1984643 2009438 2125669 2034766 1822272
2970 1822272 1876694 2028328 1915908 1847669 1815895 1783077 1859844 1860881 1772121 1892672 1792665
2959 1792665 1747462 1854529 1848791 1747727 1656460 1579491 1593873 1652544 1589915 1585702 1715506
2948 1715506 1678190 1759799 1693879 1821455 1823899 1632164 1700677 1686177 1805743 1685203 1701075
2937 1701075 1727844 1718462 1740307 1702302 1662476 1557346 1558008 1607864 1632567 1610239 1614613 1698960
2925 1698960 1789286 1724417 1675447 1633012 1609914 1609711 1652839 1595643 1515088 1576667 1736641 1721743
2913 1721743 1685704 1723171 1768456 1694487 1615903 1667483 1652971 1648042 1578662 1641357 1615767 1612082
2901 1612082 1612241 1645106 1769722 1754472 1828688 1776673 1723075 1647323 1711223 1725229 1758726 1880034
2889 1880034 1914418 1959193 1951711 1935801 1986469 1939626 2032834 2081344 2183478 2359068 2408288
2878 2408288 2453439 2513733 2511347 2667143 2759634 2667710 2650766 2622674 2607762 2487043 2446283
2867 2446283 2539553 2466591 2366629 2389393 2268653 2226267 2238541 2303445 2245721 2353248 2465848
2856 2465848 2415288 2524423 2514407 2643228 2827277 2838671 2889629 3159118 3467402 3530227
2846 3530227 3772491 4142862 4270388 4349089 4264919 4143720 4008670 3810207 3720694 3556516
2836 3556516 3456678 3427936 3389902 3421681 3289513 3083331 2893175 2731738 2578445 2577974 2560445
2825 2560445 2524707 2442528 2452947 2589170 2485708 2575319 2769871 2853349 2947800 3102363 3150304
2814 3150304 3250056 3314377 3362498 3307681 3371406 3404528 3317113 3239600 3165494 3041164 3018584
2803 3018584 2899204 2829857 2805879 2724852 2643400 2414046 2348545 2321727 2226036 2196564 2178192
2792 2178192 2078941 2173065 2208153 2177643 2307600 2245029 2245992 2267370 2298655 2357899 2388688 2329472
2780 2329472 2180998 2040881 1953683 1864555 1884389 1827470 1754563 1687503 1673841 1678331 1639532
2769 1639532 1717622 1675515 1715210 1674149 1567669 1584436 1592293 1540735 1476928 1586744 1599469
2758 1599469 1566419 1571466 1559534 1608394 1572909 1397552 1377889 1348835 1316117 1296544 1187261
2747 1187261 1281546 1214548 1161855 1224269 1234364 1114452 1206819 1171206 1084508 1132551 1034733
2736 1034733 946778 968977 828900 806019 906264 908083 937035 836469 768451 685357 728870
2725 728870 742774 761944 788837 663263 604597 682946 563615 510636 524787 560013 606876
2714 606876 448135 550894 365222 383429 471822 319355 275724 330526 431316 485377 421956
2703 421956 375764 351174 348817 315771 268153 286991 248380 268240 269063 319680 312885 304514 434606
2690 434606 318021 321136 242118 270283 304212 234519 233209 235000 365392 422319 376784 287024
2678 287024 325568 303693 263780 206137 276164 226752 178132 209252 157480 97600 139326 202190
2666 202190 229493 269300 145987 190461 262486 221763 339723 337848 182949 180026 227066
2655 227066 108219 129255 252705 260941 218608 181735 159435 178167 174082 247090 209445 -78595
2643 -78595 -24202 103176 105666 108471 107183 16297 88943 60933 96307 71562 98909 205951
2631 205951 181352 112258 159070 78681 -114505 -20834 11375 26343 53010 61376 175449
2620 175449 196204 240311 205308 61833 69037 64955 178646 123070 150874 120640 170740 112658
2608 112658 50074 86205 62698 44800 52522 50082 188950 131839 128819 188375 318725 159854
2596 159854 78833 129245 155140 219745 111785 230740 202296 133343 261131 226969 116377
2585 116377 121368 144248 164757 115910 63704 136398 124593 184880 104276 75632 191227 208689
2573 208689 279591 319875 232528 252077 348566 297039 212011 306924 297956 395592 418311 391863
2561 391863 482570 514457 412976 504309 589306 490508 537950 517133 645373 644554 618944 567707
2549 567707 540305 585083 613808 753601 674423 608988 654719 781110 761460 666275 756228
2538 756228 824884 875319 771815 765489 801237 897062 926458 982009 955801 938882 1012403 1093772
2526 1093772 991476 1051425 1053045 1037849 1022020 1097457 1081739 1086676 1011778 1092502 1054458 958511
2514 958511 950691 959426 976229 1023359 1017020 1138744 1189485 1216319 1165870 1303124 1430039 1386104
2502 1386104 1278516 1252772 1222170 1131849 1206906 1099567 1028367 1057887 1113199 1201196 1084597
2491 1084597 990929 1077748 1006533 1013246 1101265 902604 972922 1166429 1080109 1073110 1040757
2480 1040757 1075268 889583 888405 937581 1042647 989158 1108626 1061828 1036990 1065777 1082173
2469 1082173 997745 961548 1035126 993015 907904 778435 625686 523883 558529 610886 615384
2458 615384 624067 560760 638269 664305 642505 576502 551754 580595 546232 405090 397975 481768
2446 481768 456784 363987 340846 408460 301971 318653 372460 330078 329059 441462 420490
2435 420490 314930 366681 294476 171260 263141 224168 182919 10321 2960 71513 -21636
2424 -21636 21245 161563 275495 167097 128766 81563 53657 176946 100029 28686 -48249
2413 -48249 3801 8152 5595 -17629 105119 15009 -126964 -62726 -13341 21329 42289 58193
2401 58193 4863 -57341 -12644 19683 -112872 -97942 -22808 -22048 -44573 14272 8568 91924
2389 91924 18002 140540 188978 135109 31068 51000 110278 77521 1530 9274 143531
2378 143531 52464 -34126 -51361 -70398 -35118 16794 51170 96701 98195 142171 145824 46575
2366 46575 38821 -877 -93304 -146366 -85703 -44408 -69288 -97637 -117774 -66057 -164899 -17571
2354 -17571 -116894 -98127 5965 -72310 -41844 -183183 -124178 -77188 -51515 -37502 53602
2343 53602 -18398 -92911 -80254 -17779 70496 14578 20320 -13688 -2550 1032 -65408 -71782
2331 -71782 48834 122492 85302 17168 24967 19864 43690 6196 -53420 59075 3904 44057
2319 44057 193997 187022 151787 47332 51830 62330 193334 127678 124972 94622 116070 71907
2307 71907 98867 209505 270402 364542 432764 382325 203497 174665 113262 159567 82279
2296 82279 -21508 4595 54898 120313 171595 158351 179524 86143 110641 130990 10635
2285 10635 -40575 55361 96398 140663 137342 8208 -88848 10945 104602 124110 32109 -48057
2273 -48057 88649 68585 68156 109640 -53663 -92235 72055 66047 26960 -14778 58112 26032
2261 26032 15091 -16508 505 118530 191303 74884 76611 -14319 87205 101894 101066 144535
2249 144535 141667 162800 237621 116632 6026 117776 33943 180786 222745 328993 328259
2238 328259 253514 200614 125058 132910 142162 123850 88330 156886 167111 131010 180149 116227
2226 116227 131538 222143 172223 160373 148065 105517 177467 173403 220822 145024 194670 298925
2214 298925 295830 240191 212066 214518 363058 348598 160017 89686 142817 229404 289714 292553
2202 292553 274994 366068 387273 365543 432918 455057 303411 209314 169646 165872 228192 297893
2190 297893 279383 296557 391935 307408 340380 375363 393287 409764 391006 402837 342710 457110
2178 457110 400369 434766 502672 504886 604133 438482 452301 540891 415566 415547 504874 452242
2166 452242 539396 566353 684756 726135 618644 572902 648275 561752 532034 576349 527740
2155 527740 706148 704502 757123 958479 935417 934184 942885 759809 808905 925163 865150
2144 865150 783759 706457 794539 916626 1004232 1077379 1118597 1243126 1224032 1202448 1146240
2133 1146240 1235404 1306223 1252264 1402629 1381831 1457963 1471842 1479816 1526198 1539725 1602072
2122 1602072 1642833 1833898 1842163 1897785 1994386 2067711 2188196 2256018 2306324 2287023 2342455
2111 2342455 2342611 2347565 2398636 2369510 2520516 2639467 2736193 2759581 2831270 2873086 2941488 3171581
2099 3171581 3244685 3259237 3343481 3545911 3722931 3893139 4046804 4178241 4293431 4646110
2089 4646110 4915593 5205276 5516711 5887571 6370643 6861294 7387196 7785175 8282476 8733638
2079 8733638 9392583 10223716 11361404 12484296 13538125 14712009 15841599 17462828 19629492
2070 19629492 22362931 25585527 29426088 34345381 40737109 49325662 61685598 74111326
2062 74111326 72579629 62062117 50453334 39124589 31315977 25895829 22048444 19120741
2054 19120741 17092899 15345164 14148354 12991039 12138180 11360748 10458689 9552406 8639523
2045 8639523 7686768 7080551 6381220 5859871 5571363 5256645 5035900 4839217 4606831 4435664
2035 4435664 4242790 4121327 3799674 3649233 3411363 3212786 2998983 3034273 3016115 2906026
2025 2906026 2676327 2553452 2450181 2299759 2265140 2064604 1905230 1874041 1890733 1910938
2015 1910938 1859420 1786193 1726089 1528490 1415018 1454883 1456802 1500592 1549885 1486278 1286006
2004 1286006 1189707 1283060 1298228 1188563 1126712 1189195 1239686 1245764 1124154 1146441 1120113
1993 1120113 1249676 1182141 1118707 962139 947591 1050572 965825 907895 768654 880983
1983 880983 845310 774901 703069 808277 797872 659441 520326 523094 532617 654252 635362
1972 635362 490183 448428 495871 468417 363333 467421 339908 373517 466763 435731 306777
1961 306777 352543 313577 287765 306786 310654 267694 314208 295286 317624 380031 286231 296538
1949 296538 269681 316292 359763 291025 240992 319184 344126 371413 414997 293644 188222
1938 188222 115326 290851 355757 321759 241633 182106 132186 163302 268900 325268 182294
1927 182294 177232 203945 170298 177879 157329 161277 100735 189035 143985 196456 273833 343094
1915 343094 303484 202407 86163 27718 8794 169208 53562 55410 3454 9645 173497
1904 173497 285853 144082 -3485 155023 185092 158512 100202 97869 39463 109470 95424
1893 95424 146302 116355 158225 145316 102509 -22139 -32810 16729 107211 179517 193459 107983
1881 107983 209941 140095 145904 348036 78174 20815 140326 212400 165947 47738 -111598
1870 -111598 59827 150255 154699 135948 59846 80366 51522 -15050 -30522 12804 -39322 -8991
1858 -8991 25976 7854 75257 100446 65506 107125 142188 59360 56710 33978 88190 108265
1846 108265 38083 54635 52612 -4545 54370 190936 104568 93510 105686 151419 169402 13862
1834 13862 -4876 -41681 12488 158337 72411 91241 117465 82034 171938 207975 186186 233502
1822 233502 191314 335944 351986 336425 361312 258367 340773 341388 373912 259416 133633
1811 133633 217100 103347 130626 107459 41893 107498 57644 141670 116871 94202 80502
1800 80502 8651 132117 206686 116299 -13853 13091 52022 126586 45216 -86381 32133
1789 32133 -27314 17981 -27731 16120 148877 88518 -76130 -80536 -63210 -63011 -4165 -51221
1777 -51221 -89737 46975 50272 4736 -38030 7018 -58027 -59097 3978 -72690 -36306 -62646
1765 -62646 -24533 2510 -812 -113961 -113903 -29417 54505 27348 22773 -17654 21719 -45837 -73294
1752 -73294 -22647 72286 -32011 -46474 -144833 -100571 -101523 -106573 -52882 40756 71647 -80745
1740 -80745 5366 32329 70134 -51078 -68047 -23295 -27794 -87075 -92310 -127752 -213326 -76743
1728 -76743 77241 -25818 80802 114950 133974 -3926 -23468 -70035 -45245 -32392 -30614
1717 -30614 -3398 -33467 51635 -66887 -95168 -91271 -111494 -168523 -54489 -13138 -84172 103020
1705 103020 89674 -45938 -25677 27758 -1606 6763 -42730 -32798 -23169 7666 31206 -50834
1693 -50834 -56365 -21835 -68324 -47940 28549 -60528 -87875 -90397 -164512 -230973 -127310 -83496
1681 -83496 -37001 -128476 -137173 -11500 -106564 -47178 -53115 -151855 -66886 32912 -50077 -112569
1669 -112569 -162552 -68527 -8775 -182674 -107485 76390 18033 -9523 -10185 -11186 36501 25170
1657 25170 -24149 14332 -67814 -98728 -17866 2364 64840 -21983 -100558 -3425 111518 -51515
1645 -51515 24579 -12171 3957 64131 -96219 -62111 -102586 -130008 -115528 -151507 -125799 -99466
1633 -99466 -57942 -69570 8402 -97640 -118061 -160719 -126224 -166615 -165162 -141408 -154979 -140668
1621 -140668 -145653 -60198 -24730 -88507 -32025 100654 -34084 -162104 -125984 -47531 -72977
1610 -72977 -15777 -92486 -28293 -55806 98306 140858 63723 92693 34652 85689 -8508 -57428
1598 -57428 -72774 -12749 -81004 -85835 -138374 -271894 -175870 -172826 -80430 -10369 -57310 -153262
1586 -153262 -154568 -107295 -95218 -83557 -79239 12011 -121948 -157387 -54615 -6206 -96180 11529
1574 11529 54393 -1279 -16442 48020 62788 -37543 -74136 -45343 -11110 -93004 -105839 -124820
1562 -124820 4928 22890 -22636 4925 104482 63638 149668 56755 78060 131637 -46210
1551 -46210 -46414 -11921 83218 45956 -30941 -7379 12153 -63749 -19316 -64413 -40463 -26493
1539 -26493 -101861 -100477 -42085 -28832 -208504 -122762 20583 -39422 -57232 -123465 -113662 -85109
1527 -85109 -141549 -100996 -90806 -156625 -172767 7024 -32913 44292 68624 22767 36359 15808
1515 15808 -144710 -171453 -55526 -101114 -119001 -44504 -50815 -56463 -86747 -42879 2867 43228
1503 43228 131928 86311 40556 44169 12102 -24710 -36428 -76863 -118159 -123617 -121525 -109812
1491 -109812 29967 42871 60961 21579 -114473 -74222 -48674 -57984 -71796 -120142 -20056
1480 -20056 -68407 -114817 -147673 -90687 -107033 -145386 27370 78149 118751 23516 -37198 19703
1468 19703 -60850 -6804 77969 70276 -22008 -54350 -57825 -33427 -37733 -73062 -71666 -60202 52713
1455 52713 5681 -11490 33574 -20554 -48331 -77911 -55930 61319 142221 112082 63361 -156441
1443 -156441 -85123 -55586 -124094 -83251 -24165 48220 -12829 -13559 62274 116756 87658 114431
1431 114431 179109 169011 123530 -10067 16062 42206 -64350 -141756 -234355 -144589 -146900
1420 -146900 -71587 18571 -98004 -174907 -53139 -59448 -43111 51045 7414 20354 -17037
1409 -17037 82193 32051 -6775 -16711 -5239 139223 -5647 -69074 -68807 19309 -356 -16252
1397 -16252 -34327 -35837 5878 -45622 -15748 -14217 -56505 -48179 40608 19740 48585 -402
1385 -402 68885 -3825 -184443 -131521 -127977 -65745 -119635 -156401 -115030 -123033 -139952 -105385
1373 -105385 47074 105817 39873 7855 -73844 -12004 56815 -136911 -92997 -52887 -23807
1362 -23807 36528 72192 118516 34216 -26871 -65951 -95752 -32284 -31742 -78656 -78858 -93471 -49396
1349 -49396 -67957 -120007 -129522 -80743 -13030 -29930 -9359 12656 2469 -673 67243 7378
1337 7378 -50830 -127201 -49482 4187 71 1857 13232 83112 36167 1185 97574 -85449
1325 -85449 -20063 -5194 -127448 -97697 -75401 26519 33765 -38552 54103 75951 27837 -6387
1313 -6387 -10140 -107485 -184367 -43486 -181489 -194095 -235134 -131894 -158100 -93769 36275
1302 36275 17691 -19507 13384 7925 85034 79677 53860 -2511 -34061 -137938 28364 55448
1290 55448 36151 -64004 -75728 -25030 -26862 -88160 -119523 -108756 -136189 -62522 20465 38612
1278 38612 37332 19885 -35437 15848 -30230 4897 12128 -102233 -66609 -56756 -75084 10999
1266 10999 83603 40893 -6473 -9017 80281 -21602 -39783 48583 -21250 -39840 -130979 -165956
1254 -165956 -43481 -26847 -31525 120968 71331 29940 -11136 43793 -3060 9250 -49825
1243 -49825 -26260 -103866 -149010 -162169 -79588 -40340 -59821 -40251 -21548 50501 -27876 -31033
1231 -31033 8840 -55386 -91420 -121821 -46979 -18877 1357 -73549 -62368 -55272 -52165 -84731
1219 -84731 -54108 -76957 -63718 71865 -11743 -50842 -13694 -53039 -135157 -116770 -14587
1208 -14587 -43993 -47958 82 -50776 -31568 -109164 -150575 -149949 -253569 -204473 -98206 -40831
1196 -40831 29255 82880 17396 -23534 -20297 -59720 -103740 -194127 -80350 25528 44634 62245
1184 62245 56247 12898 -65952 -57113 -54987 -127368 -38111 25784 31500 47668 -8901 -41202 -5990
1171 -5990 -100621 -106872 -141011 -100225 123101 53434 -54541 -82962 -23021 22450 65652 43216
1159 43216 20798 90947 16435 -17366 -16207 -95899 -15840 40595 15998 -84408 -86323 -44807
1147 -44807 8271 -79465 -123219 -65373 -17766 -70181 -109978 -78097 -56111 -36021 27971 76215
1135 76215 -78486 -70057 -31676 24581 28734 124283 -14472 -110099 -85846 -125215 -46479 58635
1123 58635 -31147 -113213 -63161 -69739 -61241 -36500 -57189 -216 768 53631 86878 157044 207402
1110 207402 53239 111649 142288 108718 42883 37137 27260 -25985 59823 -15277 -4906 10111
1098 10111 8450 -43019 -128340 -116316 -65692 -42468 5741 -69466 -52893 17127 -18760 -48739
1086 -48739 -73231 10490 -156275 -30526 17474 -57977 -31366 -50959 23757 -55796 58375
1075 58375 6959 -5125 -79538 -80233 17821 18949 -19681 78574 27430 -28848 -43562 -31673
1063 -31673 17875 73672 1775 -89265 -103523 -4505 12606 -72195 -104360 -99327 -83254 -90236
1051 -90236 1496 -2380 -11556 31902 57192 -112050 -184977 -117319 8572 -93742 -97400 -79571
1039 -79571 15856 690 54910 29920 75257 36318 10782 -113465 -135565 -68112 -5246 -16515
1027 -16515 -70574 -74695 -97673 -119712 -75954 51520 -34627 -148276 -112385 -36258 22535 20079
1015 20079 -21716 -32262 -7612 -76330 -109986 -18534 -6985 -39018 -33896 -37231 -63353 30176
1003 30176 80614 42054 97731 20004 45646 -37463 -106045 55218 36011 -38878 -70086 -53604
991 -53604 -85622 -132443 -74119 -15753 -66748 132758 92699 32389 27912 -76774 -128056 -49155
979 -49155 -25632 20475 -10967 1385 -53420 65420 112606 76495 14270 -63625 -95220 -51777
967 -51777 -74389 -61620 -106700 -90241 1747 -70888 13193 16153 118322 78221 -175 -27166
955 -27166 -43767 -38271 51300 37142 116089 10834 -8284 14524 18646 12811 19973 51788 124100
942 124100 7888 -93217 -34636 50910 5348 -90312 -128284 -67096 -89045 -195915 -136668
931 -136668 -89774 -84691 -103266 -183201 -63476 -87625 -104242 -12868 48475 -22489 -56290 -74051
919 -74051 -99355 -52196 -114493 50649 -8476 46880 28581 60027 15766 91341 19659 36526
907 36526 76731 17524 29682 42102 -28268 -72353 -127270 -100546 10586 -5365 6783 46169
895 46169 7932 -89539 -103884 -34959 16851 64676 -11426 20348 76477 101888 133725 68463
883 68463 26507 89542 101068 18916 42452 -58043 -117033 -74074 38513 -34228 -103109 -88272
871 -88272 -34340 27124 -19242 151893 113460 106451 151723 71326 64543 2833 -28710 -7789
859 -7789 -73274 60219 146261 15280 -84518 -8395 -7988 -61848 -9463 1239 18709 53596
847 53596 51327 -6163 49252 69163 46860 4928 85538 54277 41005 66038 114131 46233
835 46233 -93583 -148664 -45813 -26312 42848 20763 15931 -32081 -52737 -57389 -162946 -36696
823 -36696 61308 63166 126144 106245 49458 1884 -49121 13967 -37809 -20708 -34739 -16505
811 -16505 6902 -53448 -147730 -143222 19637 -98677 -62724 -92367 -130665 -45960 -29506 -112441
799 -112441 64624 93859 100488 74619 -26129 149159 49254 39921 85207 -15860 -59628
788 -59628 40968 104297 125358 141922 96908 58598 -41957 -61938 8575 -34904 31892 -5017
776 -5017 20981 -5735 53358 31356 -86450 2444 -21527 24631 8721 32059 -45972 -128641
764 -128641 33711 -55323 -99583 -25233 -21673 40752 -69055 -52961 -12980 -45979 -73042 -105857
752 -105857 -56267 -5851 14915 19500 59654 99432 133499 -2697 -75615 -33881 -80311 -43315
740 -43315 -18191 85505 52543 -45707 -52803 -49907 79507 -28047 -65174 37264 64618 76915
728 76915 35425 -9178 25418 73233 -59912 -1232 24076 -39619 24778 -5798 -1854 -18512
716 -18512 17023 46454 42407 -58797 -27229 -11525 -86509 -33643 64315 164100 74394 -24944
704 -24944 23327 75283 78307 107235 103705 -62990 -15248 -36671 -1162 -13031 -87346 -21072
692 -21072 -68063 -29891 -3890 6136 -29439 727 39441 -803 75004 31115 -18669 -107799
680 -107799 -6700 -12434 56259 34893 -12211 6084 -48164 -5839 -53579 311 73704 32330
668 32330 -29901 -6204 -62837 20583 106700 -27532 106010 80905 34209 -40635 3009 68247
656 68247 -10005 48268 19115 155186 35991 16037 -40950 -12453 45565 112261 46073 13391
644 13391 -7041 52941 69187 -78794 -37107 -43936 -112481 -100964 -3028 -28594 -84699 -75807
632 -75807 -56320 55891 83681 30801 -16905 40689 -93746 -6071 57483 -15133 111969
621 111969 107170 68937 80116 -17843 38794 43820 79052 68036 5604 37812 26889 73946
609 73946 75637 -3528 65542 154539 118501 151075 64196 613 -121697 -1878 -52208 -7464
597 -7464 39974 -153905 -63069 -24877 -31865 -37363 3543 -60735 -126855 -35889 68119 126254
585 126254 108919 153805 242356 193106 -2690 -95732 -59898 79790 -4162 24386 -83321
574 -83321 -76930 -17230 -4197 176165 135335 8719 111696 236327 147077 127477 132415 126195
562 126195 47523 66690 113491 201098 194409 24849 48369 47936 17546 48983 20158 80274
550 80274 134445 -57976 -61164 43373 30828 15094 -4350 19427 57516 -16204 76976 -10520
538 -10520 -66262 -22413 90410 35085 -60173 22787 162997 160177 -5377 27842 64549 95111
526 95111 42395 72671 237178 219772 146199 63463 -54273 75643 20554 54294 66737
515 66737 35311 88496 73738 75172 85676 18011 75498 144340 106848 -20637 77887 74663
503 74663 103651 42181 40776 17191 -16892 23261 2409 26144 -39457 -44827 -38839 -4682 2566
490 2566 70923 94218 137611 -520 99650 21435 -167 22283 23661 56990 -14450 121443
478 121443 36505 44010 53310 -12515 -36284 41576 82190 52999 -30335 56891 107497 136948
466 136948 78714 110926 153745 105123 29542 -44408 -86673 -61373 41377 79400 133580 83227
454 83227 -4613 -12809 113234 13329 4201 112537 75792 58072 -46456 29694 80894 11874
442 11874 -20114 74567 131374 68487 90577 155164 87144 7973 12762 51568 94383 -92166
430 -92166 -94928 -26789 107818 123580 192596 77187 22972 104550 62566 59690 54814 26148
418 26148 53852 83255 27717 -45757 8389 -54684 -143255 15115 15131 15554 95539 30214 159700
405 159700 116911 95326 45949 44332 -16147 -29379 116737 233649 220150 125890 -44722
394 -44722 -51923 113049 99558 92621 -3635 11081 68091 40447 29985 -6806 -56416 -3972
382 -3972 128872 117301 -19731 -16645 115670 105215 115266 85401 -26578 90726 100750
371 100750 107099 -36004 -118905 -146609 -50056 83462 156852 86404 -9031 -72685 39354
360 39354 123746 123717 94760 42658 21392 50833 78230 85825 84615 173790 124974 127191 158231
347 158231 183229 111419 149987 213701 13606 21779 96282 57430 -56036 -8775 -46003 -9317
335 -9317 16525 -42643 -90663 -63442 -1373 12992 75249 77680 11460 -1350 36551 23390
323 23390 65783 156049 187803 162240 27639 56999 119047 10388 113564 46177 -14374
312 -14374 120521 303637 199480 136781 117760 132474 81402 -35741 49282 69762 49934
301 49934 60192 5910 72447 132082 86261 73947 92042 97972 91679 156256 138790 199727
289 199727 163036 -14677 -28458 92027 106412 153636 92150 157634 61986 152080 155519 96890
277 96890 159342 185372 193768 117988 57227 56086 24635 40502 27648 36030 89980 -12485
265 -12485 73564 67910 -48199 28778 -4252 97102 84166 83180 39046 53470 91104 45100
253 45100 21785 57976 174721 66683 15972 7796 -45146 39066 155420 116850 172180 87793
241 87793 143205 168933 100369 16062 156439 221295 238501 181134 52680 -13277 -70144 -115687
229 -115687 -22689 87810 142672 128536 125554 167871 100015 55113 7841 37314 -75187 -115728
217 -115728 22313 84235 10454 41448 -18961 29717 54230 -58898 -54378 -33545 29604 158842
205 158842 120056 34953 117255 111781 52879 -4208 18642 27397 68322 172061 114459 117692
193 117692 126916 144101 218819 134982 77058 148163 6506 -1513 110341 113071 118224 117858 157452
180 157452 172629 88208 101583 117466 85051 69278 26869 34628 61453 133628 142121 24031
168 24031 24166 -12352 62848 167267 99253 79869 111998 87618 136816 155698 156756 79704
156 79704 108178 222901 152477 105757 68640 149598 166893 112132 46527 12054 74287 73101
144 73101 76230 133294 122583 126407 18133 -4966 -1188 54916 58037 187106 139539 129903 46445
131 46445 -28549 51904 47415 141601 180023 65106 33782 98577 67239 5614 105959 102986
119 102986 26289 59452 134509 90154 92455 78776 -41528 7010 60692 118475 184791 205568
107 205568 175664 131744 128845 236666 158514 167517 175710 71261 108345 42503 140969 145857
95 145857 123459 197845 180021 120893 90841 155909 150220 101183 703 71151 183763 201549
83 201549 196006 108525 66765 105848 111092 158254 135674 101583 35874 169286 159174 155836
71 155836 169112 -9864 21119 7192 71162 135063 56430 113756 117584 53199 113484 55252
59 55252 314 81883 64110 12557 -23666 36053 37086 25108 31306 99798 71471 77445 15307
46 15307 31292 88730 179007 214013 236591 124661 77759 119531 100064 111674 107117 103186
34 103186 74923 46998 29956 43160 113967 200024 95283 57201 117423 165451 99600 197237
22 197237 190858 167757 84010 104259 181202 157472 64136 21365 52387 44762 61947 159251
10 159251 138771 142825 213570 125802 190486 165488 104249 101065 79819 22952
0 22952
$$ Imaginary data points
##PAGE= N=2
##DATA TABLE= (X++(I..I)), XYDATA
16383 -1256677 -1335402 -1298916 -1324750 -1283600 -1179382 -1193580 -1119810 -1177756 -1111127 -1086564 -1085518
16372 -1085518 -1095245 -1065402 -1016819 -994119 -990879 -972359 -904753 -878353 -850692 -871719 -939123 -873392
16360 -873392 -792112 -728544 -712809 -747389 -710514 -763101 -734824 -718712 -709296 -634615 -630583 -673595
16348 -673595 -653911 -614978 -547927 -502911 -489826 -428197 -497749 -473721 -467294 -421877 -425296 -366292
16336 -366292 -308384 -274274 -204419 -213142 -148095 -124806 -182069 -177969 -116254 -55673 -119595 -80843
16324 -80843 -50902 -98917 -33499 -71803 -48438 22720 65637 9692 23908 114996 119493 153660
16312 153660 146146 141002 133409 215851 266818 338351 395492 359755 342846 357794 416540 382891
16300 382891 459017 563002 497766 391772 437298 475300 484080 475911 476876 577375 566482 629948
16288 629948 669250 651216 674690 527504 676298 729704 735627 705758 657774 663001 741967
16277 741967 775985 908043 880002 837410 826081 737394 831737 936604 875526 991806 994339
16266 994339 843413 921770 994898 999933 1006604 1053719 1003250 959241 1007101 1032403 1068294 1050974
16254 1050974 1054821 1176397 1282122 1247032 1242078 1155831 1095681 1223460 1086541 1182387 1202737
16243 1202737 1199539 1228715 1271187 1220215 1305994 1339634 1207372 1213288 1237197 1303492 1252898
16232 1252898 1260863 1278624 1253136 1392433 1391126 1350759 1383077 1429999 1446604 1338540 1376755
16221 1376755 1383415 1354588 1358099 1335437 1449711 1434830 1500458 1470240 1453255 1454529 1655678
16210 1655678 1616005 1546166 1516190 1517623 1630138 1683202 1687925 1746468 1690520 1649757 1684143
16199 1684143 1755195 1766546 1634119 1578972 1616455 1601221 1602824 1582658 1541907 1648379 1648369 1709629
16187 1709629 1748526 1813499 1841339 1814722 1837007 1938874 1860419 1817092 1782800 1765011 1724353
16176 1724353 1771081 1909143 1913783 1902437 1858686 1853315 1900736 1919683 1811233 1773700 1915218
16165 1915218 1880098 1895444 1936630 2005655 1978700 1908822 1902219 1923555 1871768 1975652 2065343
16154 2065343 2012955 1942909 1991343 1944067 1930286 1930562 1961443 2031653 1974577 2002709 2113714
16143 2113714 2036084 1949341 2038722 2056837 2046625 2090944 2078506 2118679 2122833 2020967 2085162
16132 2085162 2085894 2033194 1996431 2019460 2019866 2058302 1989566 2004253 1990045 1989001 2110908 2108588
16120 2108588 2175641 2120986 2114137 2157792 2113025 2115827 2110805 2041571 2142600 2154927 2144023 2131434
16108 2131434 2218758 2266711 2107009 2071745 2088694 2118972 2120959 2013115 2037761 2156755 2152774
16097 2152774 2123732 2120651 2106598 2163814 2192337 2164389 2100784 2049860 1976522 2085827 2064678
16086 2064678 2073515 2040100 2070151 2079834 2122876 2207166 2219837 2241570 2146801 2232970 2130986
16075 2130986 2204226 2139563 2137042 2108141 2218814 2270704 2273492 2254823 2093102 2102712 2160291
16064 2160291 2129934 2081450 2102380 2085588 2216567 2188742 2233632 2192750 2096967 2225630 2331191
16053 2331191 2277440 2191048 2171757 2174150 2103773 2161169 2126839 2056113 2195037 2227573 2185222
16042 2185222 2138104 2159521 2180431 2267270 2246565 2280284 2261464 2207534 2174182 2185074 2125216
16031 2125216 2100753 2049971 2101740 2103766 2172535 2170048 2204899 2274077 2351706 2287663 2217320 2235341
16019 2235341 2218834 2247212 2144451 2052481 2152341 2090019 2098468 2146419 2132533 2202570 2168655
16008 2168655 2194351 2207462 2168033 2167768 2071546 2169929 2093145 2094975 2154359 2197498 2184384 2156810
15996 2156810 2284283 2226564 2278360 2220565 2191661 2174007 2274735 2160585 2067800 2192038
15986 2192038 2209127 2179629 2169234 2159484 2133713 2121228 2120194 2219039 2256203 2130416 2171783
15975 2171783 2043716 2090437 2126092 2112214 2226145 2090089 2092980 2140613 2182341 2291416 2200119
15964 2200119 2215078 2231741 2195154 2185330 2090779 2074069 2256222 2149807 2128012 2085145 2183141
15953 2183141 2094289 2145675 2241679 2276909 2240609 2132318 2180277 2209037 2199372 2211464 2135235
15942 2135235 2162567 2154095 2119316 2214967 2233133 2195834 2204152 2200329 2128768 2120322 2159611 2199470
15930 2199470 2218845 2242891 2246941 2191775 2172742 2238796 2259742 2276230 2172998 2115710 2105914
15919 2105914 2115644 2060783 2080044 2056624 2063897 2140860 2186802 2241333 2152043 2153791 2226375 2224291
15907 2224291 2258976 2253856 2250652 2197535 2166827 2127389 2240640 2239938 2234271 2252559 2314240 2181246
15895 2181246 2114962 2130934 2146567 2192000 2232132 2076827 2108923 2151692 2145019 2250135 2245260
15884 2245260 2224161 2201628 2193118 2129324 2150451 2191301 2178878 2122716 2192061 2213228 2136683
15873 2136683 2244470 2238025 2193796 2213503 2275615 2223286 2213596 2244339 2128901 2133399 2258078
15862 2258078 2259300 2250068 2244745 2149641 2227495 2191426 2164097 2228272 2299309 2246398 2381937 2337291
15850 2337291 2277868 2351602 2347779 2222723 2167309 2193688 2275873 2305963 2214351 2238536 2188019
15839 2188019 2146929 2087882 2080815 2177322 2289434 2218585 2188833 2209188 2331434 2142510 2165946
15828 2165946 2210889 2065924 2140384 2240713 2256639 2234991 2249538 2224782 2296317 2300275 2317745
15817 2317745 2217898 2104697 2111927 2093521 2095961 2147135 2188563 2269447 2295445 2320069 2251258
15806 2251258 2223903 2192011 2135404 2246231 2270393 2257199 2243353 2139795 2251360 2261875 2263417
15795 2263417 2303503 2347722 2267381 2128800 1986955 2135639 2161155 2156075 2313125 2243046 2193395
15784 2193395 2139240 2112174 2139745 2242347 2099214 2158367 2230167 2294097 2337224 2354580 2253105
15773 2253105 2249435 2300569 2211625 2221721 2132793 2047888 2046316 2135165 2154369 2253045 2329679 2208849
15761 2208849 2206432 2205804 2271225 2284414 2235176 2163511 2244744 2161568 2134684 2260602 2335245 2324163
15749 2324163 2283451 2283244 2232121 2209439 2099183 2169900 2187507 2200008 2222663 2210944 2265782
15738 2265782 2234114 2203771 2177704 2224667 2253604 2209469 2239086 2107048 2199003 2221501 2049780
15727 2049780 2148514 2202008 2209785 2272384 2213120 2175308 2146234 2181129 2205468 2246182 2252931 2307444
15715 2307444 2377168 2338910 2216037 2114818 2191602 2227345 2207721 2222989 2195630 2178403 2250317
15704 2250317 2246718 2221898 2277831 2187363 2188098 2196956 2192176 2249909 2257005 2177033 2209592 2143372
15692 2143372 2249944 2251805 2107854 2192085 2343527 2299071 2155952 2131487 2112230 2166112 2233989
15681 2233989 2265480 2257717 2269735 2334783 2250753 2343065 2425024 2304109 2176059 2131280 2159670
15670 2159670 2228026 2392906 2296445 2264263 2344192 2377527 2323352 2259508 2342324 2237969 2311442
15659 2311442 2345036 2243528 2201715 2173148 2250061 2223288 2195045 2208552 2260988 2175150 2200440
15648 2200440 2157307 2202419 2325910 2370149 2411922 2371304 2278801 2390637 2316869 2382912 2357471
15637 2357471 2380053 2240289 2292616 2378377 2305845 2284784 2284404 2252916 2333455 2426356 2300843
15626 2300843 2250212 2243247 2293499 2207276 2204070 2245932 2269581 2261492 2224413 2167900 2256659 2275649
15614 2275649 2350271 2265855 2289953 2319127 2191622 2279153 2219659 2246503 2217177 2246349 2286116
15603 2286116 2226530 2267678 2260154 2188736 2182472 2240295 2289975 2276724 2210599 2295323 2371712 2359126
15591 2359126 2326460 2247512 2395859 2295796 2176079 2166239 2230430 2258927 2289592 2297756 2323950
15580 2323950 2334681 2284542 2321496 2265837 2248076 2273469 2346021 2269796 2252461 2210539 2247132
15569 2247132 2284635 2255282 2298459 2297754 2320559 2318500 2285388 2382267 2331966 2342945 2311435 2355787
15557 2355787 2331901 2338620 2316762 2325850 2298797 2170890 2094109 2256766 2178003 2167243 2178590
15546 2178590 2151420 2251130 2268203 2200196 2285975 2233667 2231619 2291341 2277074 2226201 2240614
15535 2240614 2319806 2401725 2428990 2370425 2330366 2292299 2378570 2367603 2402860 2374208 2346244
15524 2346244 2368491 2371304 2301405 2328183 2332492 2312080 2378262 2391187 2374537 2281544 2194241 2304452
15512 2304452 2243571 2296485 2276509 2324475 2398200 2276843 2209842 2254484 2334539 2297169 2296017
15501 2296017 2241927 2238092 2268510 2232672 2123555 2177784 2208608 2219907 2346635 2355983 2414953
15490 2414953 2324417 2282112 2239275 2378095 2217307 2216427 2335511 2406476 2352827 2224148 2240407
15479 2240407 2220132 2243826 2271939 2319372 2341653 2402111 2408448 2324778 2200430 2182654 2243140
15468 2243140 2319503 2387757 2314935 2184380 2308355 2337283 2316669 2191742 2186189 2201378 2294652
15457 2294652 2349160 2262235 2364798 2257838 2240866 2300986 2312141 2193271 2248392 2352549
15447 2352549 2296260 2333442 2328819 2358548 2326434 2361142 2426630 2383196 2225260 2309816 2293484
15436 2293484 2226111 2275539 2339891 2367638 2418504 2448168 2434999 2403980 2378611 2401612 2381693
15425 2381693 2416068 2418078 2393706 2300623 2232794 2286250 2308155 2348082 2287218 2299480 2433006
15414 2433006 2361733 2361245 2353766 2378889 2315714 2229291 2260706 2363130 2344330 2264043 2319594 2325790
15402 2325790 2401290 2367544 2219616 2274317 2320596 2364603 2334709 2371839 2390275 2334314 2481145
15391 2481145 2437200 2413110 2345390 2252621 2267324 2262489 2353076 2250566 2296117 2286585 2300628
15380 2300628 2291362 2238422 2247082 2255167 2310523 2330487 2237984 2183129 2312712 2249194 2247248 2382716
15368 2382716 2425342 2403401 2416743 2470338 2377803 2365822 2356074 2275204 2324655 2452653 2408056
15357 2408056 2400524 2436026 2315936 2331386 2258030 2209342 2356745 2299711 2298884 2328301 2378739
15346 2378739 2310342 2294294 2325592 2293180 2396400 2321624 2301648 2146902 2244885 2318141 2419139
15335 2419139 2434402 2262605 2427365 2346107 2334928 2337927 2205902 2277897 2261979 2328062 2238716
15324 2238716 2336087 2324867 2254291 2389961 2406238 2306307 2308670 2330966 2350397 2311571 2415103
15313 2415103 2414038 2341721 2318621 2428704 2345221 2290508 2342161 2251606 2202630 2242961 2312580
15302 2312580 2322633 2441097 2517457 2454178 2310045 2342755 2363067 2356814 2396397 2422870 2320268
15291 2320268 2418509 2427213 2420866 2378763 2403196 2426256 2288154 2287666 2295385 2266240 2344631 2437876
15279 2437876 2496743 2404649 2292228 2332556 2352877 2418882 2446194 2407533 2381151 2368074 2354352
15268 2354352 2326176 2405645 2425029 2378751 2382123 2403778 2330180 2304120 2398768 2326769 2330314 2282489
15256 2282489 2179390 2253670 2371052 2448239 2506756 2448652 2277232 2313794 2310884 2223950 2174112
15245 2174112 2268646 2275659 2343124 2358730 2490945 2408777 2319021 2324655 2392386 2389926 2357411 2401348
15233 2401348 2317973 2372874 2336460 2313415 2300712 2271677 2249253 2315843 2388906 2385598 2287620
15222 2287620 2380093 2466542 2477508 2343821 2324586 2441873 2373865 2244435 2294969 2349419 2307486
15211 2307486 2410942 2444733 2381180 2425907 2319197 2270664 2375097 2414084 2317640 2233815 2276677
15200 2276677 2338554 2364980 2260929 2246926 2371448 2533672 2446394 2529061 2504355 2425536 2438476
15189 2438476 2403335 2416004 2384745 2407175 2345602 2307303 2314084 2426506 2381664 2250549 2273188
15178 2273188 2342089 2411914 2379967 2436929 2427521 2308527 2300599 2300128 2337987 2419375 2327279 2351526
15166 2351526 2238112 2256758 2413269 2443332 2488990 2397479 2391722 2395857 2301950 2301223 2360924 2369092
15154 2369092 2390326 2399743 2387673 2412071 2371245 2300550 2336135 2370587 2411712 2386394 2449481
15143 2449481 2400097 2425651 2371696 2300018 2293180 2311632 2305250 2324739 2432959 2372608 2354309
15132 2354309 2373167 2364445 2318310 2245855 2314089 2273340 2307954 2266804 2332201 2364786 2380793
15121 2380793 2344816 2359714 2342861 2437769 2482266 2357926 2501902 2413434 2374220 2450165 2401495
15110 2401495 2322048 2329673 2362553 2380500 2255856 2214039 2304042 2360692 2340394 2393261 2392580 2339176
15098 2339176 2339834 2385977 2418736 2518259 2448743 2446481 2601422 2487694 2390275 2508993 2487516
15087 2487516 2374275 2480654 2469669 2381389 2364229 2315836 2435295 2480887 2425430 2447749 2397478
15076 2397478 2326633 2303570 2362041 2369925 2260480 2161357 2233379 2300063 2405528 2513577 2481547
15065 2481547 2419010 2432121 2367838 2405940 2465632 2484921 2397536 2371029 2408614 2446251 2477506
15054 2477506 2491826 2385123 2375488 2332271 2341183 2348888 2328733 2531263 2456632 2340872 2336189
15043 2336189 2486638 2455267 2497433 2546454 2448235 2394196 2312139 2394469 2478258 2371424 2287530
15032 2287530 2318282 2320632 2232994 2417772 2398709 2434849 2436660 2488125 2572293 2394053 2442121
15021 2442121 2458494 2382736 2297759 2348702 2380759 2452215 2443537 2308159 2342598 2312446 2404570
15010 2404570 2415079 2588691 2486039 2371513 2511615 2506331 2540910 2584183 2430661 2386036
15000 2386036 2355153 2429273 2519801 2457459 2437634 2423677 2364921 2484259 2513580 2372082 2270530
14989 2270530 2267767 2339586 2407793 2362648 2436235 2495135 2350782 2388947 2454836 2390558 2412582
14978 2412582 2412535 2404627 2510152 2446501 2468554 2426508 2403183 2401609 2448458 2387991 2370155 2428933
14966 2428933 2517175 2505664 2450605 2335073 2387831 2518525 2515101 2306897 2401975 2507741 2352887
14955 2352887 2332923 2352159 2320849 2292526 2337146 2418033 2359865 2430313 2477091 2478877 2558605
14944 2558605 2555636 2539325 2486015 2382706 2419200 2377824 2351569 2440955 2338057 2331316 2433956
14933 2433956 2429638 2442691 2326637 2409165 2523593 2419463 2470109 2455524 2364984 2375854 2348763
14922 2348763 2348356 2501025 2429011 2369392 2459015 2405583 2417767 2413498 2449408 2490469 2392488 2404035
14910 2404035 2537426 2489801 2358098 2480485 2516935 2431613 2393226 2418799 2439004 2459967 2592054
14899 2592054 2466172 2492757 2491929 2529645 2474781 2399744 2413114 2405429 2457133 2407844 2428682 2410299
14887 2410299 2417745 2446491 2454107 2426557 2412254 2405944 2420921 2418059 2453387 2391592 2366443 2377514
14875 2377514 2416388 2495332 2558736 2452017 2414563 2360338 2391495 2445910 2403867 2401378 2479487
14864 2479487 2447648 2389752 2472004 2557795 2535650 2660613 2604017 2500509 2515514 2371758 2414259
14853 2414259 2333345 2363713 2467295 2476179 2543507 2496358 2474684 2403677 2379177 2420336 2471407
14842 2471407 2457288 2522691 2467697 2467452 2536885 2536357 2450361 2427540 2469252 2531679 2473337 2465990
14830 2465990 2533449 2492090 2354128 2360402 2448346 2374666 2515953 2598785 2557094 2485046 2449223
14819 2449223 2455405 2425887 2434877 2363694 2527123 2613218 2526155 2516219 2482906 2459922 2471239 2507429
$$ [...]
##END NTUPLES=NMR SPECTRUM
##END=
