##TITLE=1H_EC-3257(II-42)
 CDCl3, 8 sc, 
 6.08.2021
##JCAMPDX= 6.0         $$ Bruker NMR JCAMP-DX V2.0
##DATA TYPE= NMR SPECTRUM
##DATA CLASS= NTUPLES
##ORIGIN= UXNMR, Bruker Analytische Messtechnik GmbH
##OWNER= root
$$ XWIN-NMR		Version 3.5
$$ Fri Aug  6 10:26:53 2021 Russian Standard Time (UT+4h)  she@DPX200
##.OBSERVE FREQUENCY= 200.131506
##.OBSERVE NUCLEUS= ^1H
##.ACQUISITION MODE= SIMULTANEOUS
##.ACQUISITION SCHEME= undefined
##.AVERAGES= 8
##.DIGITISER RES= 18
##SPECTROMETER/DATA SYSTEM= spect
##.PULSE SEQUENCE= zg30
##.SOLVENT NAME= CDCl3
##.SHIFT REFERENCE= (INTERNAL, CDCl3, 0, 17.5069)
##AUDIT TRAIL= $$ (NUMBER, WHEN, WHO, WHERE, WHAT)
$$ ##TITLE= Audit trail, XWIN-NMR		Version 3.5
$$ ##JCAMPDX= 5.01
$$ ##ORIGIN= Bruker BioSpin GmbH
$$ ##OWNER= she
$$ F:/spectra/data/she/nmr/H-F/1/pdata/1/auditp.txt
$$ ##AUDIT TRAIL=  $$ (NUMBER, WHEN, WHO, WHERE, WHAT)
(   1,<2021-08-06 10:25:44.21 +0400>,<she>,<DPX200>,
      <created by zg, POWCHK disabled, PULCHK disabled
       configuration hash MD5:
       00 E9 B6 7A A2 85 ED C7 34 08 36 98 17 FE 4E 26
       data hash MD5: 16K
       A4 6C D0 D9 3B 1D AE E7 80 44 DE A9 F3 83 0E 5B>)
(   2,<2021-08-06 10:25:46.60 +0400>,<she>,<DPX200>,
      <Start of raw data processing
       efp BC_mod = 2 LB = 0.24 FT_mod = 6 PKNL = 1 PHC0 = -13356.34 PHC1 = 11.40099 SI = 16K 
       data hash MD5: 16K
       0B 2E 43 1D B5 45 03 54 73 E3 54 BD F1 2E 86 90>)
(   3,<2021-08-06 10:26:02.53 +0400>,<she>,<DPX200>,
      <pk PHC0 = 0.2065059 PHC1 = 0 
       data hash MD5: 16K
       03 D8 FE 6D 8A 77 E8 F8 16 1F 8D 24 4C 60 9E E3>)
(   4,<2021-08-06 10:26:05.78 +0400>,<she>,<DPX200>,
      <abs ABSG = 5 
       data hash MD5: 16K
       46 75 B8 2D 09 50 9D EF 2F C9 0F 3D 37 93 AA 37>)
$$ ##END=
$$ 
$$ hash MD5
$$ 56 E3 AE 6C 34 37 48 BC 4A 88 08 40 1B 4D CD 28
##$RELAX= 
##$RELAX= 
##$RELAX= 
##$RELAX= 
##$RELAX= 
##$RELAX= 
$$ Bruker specific parameters
$$ --------------------------
##$DU= <F:/spectra>
##$EXPNO= 1
##$NAME= <H-F>
##$PROCNO= 1
##$TYPE= <nmr>
##$USER= <she>
##$AMP= (0..31)
100 100 100 100 100 100 100 100 100 100 100 100 100 100 100 100 100 100 
100 100 100 100 100 100 100 100 100 100 100 100 100 100 
##$AQSEQ= 0
##$AQ_mod= 1
##$AUNM= <au_zg>
##$AUTOPOS= <>
##$BF1= 200.13
##$BF2= 200.13
##$BF3= 200.13
##$BF4= 200.13
##$BF5= 200.13
##$BF6= 200.13
##$BF7= 200.13
##$BF8= 200.13
##$BYTORDA= 1
##$CFDGTYP= 0
##$CFRGTYP= 5
##$CHEMSTR= <none>
##$CNST= (0..31)
1 1 145 1 1 1 1 1 1 1 1 1 1 1 1 1 1 1 1 1 1 1 1 1 1 1 1 1 1 1 1 1 
##$CPDPRG= <>
##$CPDPRG1= <>
##$CPDPRG2= <>
##$CPDPRG3= <>
##$CPDPRG4= <mlev>
##$CPDPRG5= <mlev>
##$CPDPRG6= <mlev>
##$CPDPRG7= <mlev>
##$CPDPRG8= <mlev>
##$CPDPRGB= <>
##$CPDPRGT= <>
##$D= (0..31)
0 1.2 0 0 0 0 0 0 0 0.06 0 0.03 0 0 0 0 0.0002 0 0 0 0 0 0 0 0 0 0 0 0 
0 0 0 
##$DATE= 1628231143
##$DBL= (0..7)
120 120 120 120 120 120 120 120 
##$DBP= (0..7)
150 150 150 150 150 150 150 150 
##$DBP07= 0
##$DBPNAM0= <>
##$DBPNAM1= <>
##$DBPNAM2= <>
##$DBPNAM3= <>
##$DBPNAM4= <>
$$ [...]
##$SUBNAM3= <"">
##$SUBNAM4= <"">
##$SUBNAM5= <"">
##$SUBNAM6= <"">
##$SUBNAM7= <"">
##$SUBNAM8= <"">
##$SUBNAM9= <"">
##$SW= 20.0188882624521
##$SWIBOX= (0..15)
0 0 2 0 0 0 0 0 0 0 0 0 0 0 0 0 
##$SW_h= 4006.41025641026
##$TD= 16384
##$TD0= 1
##$TE= 0
##$TE2= 300
##$TE3= 300
##$TEG= 300
##$TL= (0..7)
0 120 120 120 120 120 120 120 
##$TP= (0..7)
150 150 150 150 150 150 150 150 
##$TP07= 0
##$TPNAME0= <>
##$TPNAME1= <>
##$TPNAME2= <>
##$TPNAME3= <>
##$TPNAME4= <>
##$TPNAME5= <>
##$TPNAME6= <>
##$TPNAME7= <>
##$TPOAL= (0..7)
0.5 0.5 0.5 0.5 0.5 0.5 0.5 0.5 
##$TPOFFS= (0..7)
0 0 0 0 0 0 0 0 
##$TUNHIN= 0
##$TUNHOUT= 0
##$TUNXOUT= 0
##$USERA1= <user>
##$USERA2= <user>
##$USERA3= <user>
##$USERA4= <user>
##$USERA5= <user>
##$V9= 5
##$VALIST= <valist>
##$VCLIST= <CCCCCCCCCCCCCCC>
##$VD= 0
##$VDLIST= <DDDDDDDDDDDDDDD>
##$VPLIST= <PPPPPPPPPPPPPPP>
##$VTLIST= <TTTTTTTTTTTTTTT>
##$WBST= 1024
##$WBSW= 4
##$XGAIN= (0..3)
0 0 0 0 
##$XL= 0
##$YL= 0
##$YMAX_a= 330907
##$YMIN_a= -513356
##$ZGOPTNS= <>
##$ZL1= 120
##$ZL2= 120
##$ZL3= 120
##$ZL4= 120
##$ABSF1= 17.4971
##$ABSF2= -2.521936
##$ABSG= 5
##$ABSL= 3
##$ALPHA= 0
##$AQORDER= 0
##$ASSFAC= 0
##$ASSFACI= 0
##$ASSFACX= 0
##$ASSWID= 0
##$AUNMP= <proc_1d>
##$AZFE= 0.1
##$AZFW= 0.1
##$BCFW= 0
##$BC_mod= 2
##$BYTORDP= 0
##$COROFFS= 0
##$CY= -3
##$DATMOD= 1
##$DC= 0
##$DFILT= <>
##$DTYPP= 0
##$F1P= 0
##$F2P= 0
##$FCOR= 1
##$FTSIZE= 16384
##$FT_mod= 6
##$GAMMA= 0
##$GB= 0
##$INTBC= 1
##$INTSCL= 1.334414e-10
##$ISEN= 128
##$LB= 0.24
##$LEV0= 0
##$LPBIN= 0
##$MAXI= 10000
##$MC2= 0
##$MEAN= 0
##$ME_mod= 0
##$MI= 1.114404
##$NCOEF= 0
##$NC_proc= -7
##$NLEV= 6
##$NOISF1= 3.799351
##$NOISF2= 2.8
##$NSP= 0
##$NTH_PI= 0
##$NZP= 0
##$OFFSET= 17.50688
##$PC= 1
##$PHC0= -13356.13
##$PHC1= 11.40099
##$PH_mod= 1
##$PKNL= yes
##$PPARMOD= 0
##$PSCAL= 0
##$PSIGN= 0
##$REVERSE= no
##$SF= 200.130005551753
##$SI= 16384
##$SIGF1= 3
##$SIGF2= 2
##$SINO= 5.538805
##$SIOLD= 16384
##$SREGLST= <1H.CDCl3>
##$SSB= 0
##$STSI= 16384
##$STSR= 0
##$SW_p= 4006.41025641026
##$SYMM= 0
##$S_DEV= 0
##$TDeff= 16384
##$TDoff= 0
##$TI= <>
##$TILT= no
##$TM1= 0
##$TM2= 0
##$TOPLEV= 0
##$USERP1= <user>
##$USERP2= <user>
##$USERP3= <user>
##$USERP4= <user>
##$USERP5= <user>
##$WDW= 1
##$XDIM= 16384
##$YMAX_p= 440742109
##$YMIN_p= -597516
$$ End of Bruker specific parameters
$$ ---------------------------------
##NTUPLES= NMR SPECTRUM
##VAR_NAME=  FREQUENCY,     SPECTRUM/REAL,   SPECTRUM/IMAG
##SYMBOL=    X,             R,               I
##VAR_TYPE=  INDEPENDENT,   DEPENDENT,       DEPENDENT
##VAR_FORM=  AFFN,          ASDF,            ASDF
##VAR_DIM=   16384,         16384,           16384
##UNITS=     HZ,            ARBITRARY UNITS, ARBITRARY UNITS
##FACTOR=    0.24454680195387, 1,            1
##FIRST=     3503.65195287243, 0,            0
##LAST=      -502.758303537829, 0,           0
##MIN=       -502.758303537829, -597516,     0
##MAX=       3503.65195287243, 440742109,    0
$$ Real data points
##PAGE= N=1
##DATA TABLE= (X++(R..R)), XYDATA
$$ [...]
6745G93008j14638m0171Q630K12898l4042k8018R0153K354k53498N3122o8868
6734F20930J15003J0698j2165P9358r0607j30497L3762J96143o3730P8369O4052
6723I01316j42773r7743p9521N0983K51799j38327k3642J4266j68178j35336K95537
6712G28381r2362Q9280J36926k33578P0361J00910M2356R6329L4350j97028J14610
6701H90535L66752k4489O4661q0517j44125l1799L5240J68032j36596j55627J27012
6690A079079m4671L1343J34307J7197l1503j98598J71454J67424K141J8508k48013
6679A098668q538k4066j17426P1115K09843J98334k06322j71207N8785J35628
6669A244814J12878j10113n0743l5531m55L9320q5767J57775r7788J03838l6154
$$ plain form
6745 793008 678370 638199 646829 859727 825685 797667 887820 890174 636676 689798 620930
6734 620930 735933 746631 734466 813824 723217 592720 626482 822625 758895 837264 901316
6723 901316 758543 660800 581279 632262 884061 745734 722092 736358 568180 432844 728381
6712 728381 636019 725299 862225 628647 699008 799918 842274 938603 972953 775925 890535
6701 890535 1257287 1232798 1297459 1216942 1072817 1041018 1076258 1244290 1107694 952067 1079079
6690 1079079 1034408 1065751 1200058 1217255 1185752 987154 1158608 1326032 1328173 1346681 1098668
6679 1098668 1090130 1066064 948638 1019753 1229596 1427930 1221608 1050401 1109186 1244814
6669 1244814 1357692 1247579 1196836 1161305 1160850 1200170 1114403 1272178 1174390 1278228 1242074
6658A242074J6217p3844O9022J66574K31244j24498j13887J16804l1897j180j13790
6647A382839J13018J96605l202J24638k1217m5153K06185r2693J53820J52592
6637B167432j89729r0463r1501n1248R7091J25326Q4729O7515J86812O8071l081
6626B370954M6712K0182P9507J09256r823J36259k48682M5304J06177l1152J72853
6615B797547J58476N3470J15585L6115J64682q9238j6634J91393K02395O8896
6605C682687K51204J21127k2696l52J17098J24888P0664N1465Q549L5368J77488
6594D617490j0151J47466r4580O9974J60323J92353P2133K45070L19456q7196
6584E632338j6516j37104N4443J77034L10799J47580K00449l2670q4402J44145
$$ plain form
6658 1242074 1258291 1184447 1253469 1420043 1651287 1526789 1412902 1529706 1497809 1496629 1382839
6647 1382839 1495857 1692462 1689260 1813898 1792681 1747528 1953713 1861020 2014840 2167432
6637 2167432 1977703 1887240 1795739 1744491 1841582 1966908 2051637 2119152 2305964 2374035 2370954
6626 2370954 2417666 2437848 2517355 2626611 2616788 2753047 2504365 2549669 2655846 2624694 2797547
6615 2797547 2956023 3009493 3125078 3161193 3325875 3236637 3220003 3411396 3613791 3682687
6605 3682687 3933891 4055018 4032322 4031970 4149068 4273956 4344620 4396085 4404634 4440002 4617490
6594 4617490 4607339 4754805 4660225 4730199 4890522 5082875 5155008 5400078 5719534 5632338
6584 5632338 5615822 5478718 5533161 5710195 6020994 6168574 6369023 6336353 6251951 6396096
6574F396096J64001M8391J65502K00661M09767K05404k9237M25009L42241L1508
6564H359343K97357J38591K35247L61901K90897M35617O04597K49402M98224O90401
6554A2161577L77099M83297P03271O66507Q30514N32189R55937J039215P72527
6545A8522133J301808J200230J369724J726637J894229K046243K238518K533488
6537C2833010K920012L713973M153301M755390N237271N219415M751550M122392
6529F7706314L205937K734505L145978M034827N186420N644839N338552M601033
6521A01598405K593866j296501n456187q577624r976606r295899q404284o832097
6513E4353073n010074m392931l454487k896732k750576k428122k503975k022160
$$ plain form
6574 6396096 6560097 6608488 6773990 6974651 7384418 7589822 7560585 7985594 8327835 8359343
6564 8359343 8656700 8795291 9030538 9392439 9683336 10118953 10723550 10972952 11471176 12161577
6554 12161577 12538676 13021973 13725244 14391751 15222265 15754454 16710391 17749606 18522133
6545 18522133 19823941 21024171 22393895 24120532 26014761 28061004 30299522 32833010
6537 32833010 35753022 39466995 43620296 48375686 53612957 58832372 63583922 67706314
6529 67706314 70912251 73646756 76792734 80827561 86013981 91658820 96997372 101598405
6521 101598405 104192271 102895770 97439583 88861959 78885353 69589454 61185170 54353073
6513 54353073 49342999 44950068 41495581 38598849 35848273 33420151 30916176 28894016
6505B8894016j811944j793692j560135j235597r62480r39733r41267r62069n13862
6496A8173237l87973j55826J2029j42698n8955q4265R1548J03130k32689j04031
6486A7213507j53545j53564k28896o24797p04616p25970q00897l34744n22377
6477A2964101n81977k35230l82374l43282j81681j61325k13756q0863j58994n5245
6467A0569374k3187K87434J68996l7247K83689L24545L88553L76226P78048P77431
6457A3893862Q00715Q05756J236929J297857J154923J594710J607243J458747
6449B3850742Q13344Q1299m72483j097645j742947j739137j896810j833871j270572
6440A4691920r83637p55501q51303n57091o57793n87570k36069m15954l23299
$$ plain form
6505 28894016 27082072 25288380 23728245 22492648 21530168 20590435 19649168 18687099 18173237
6496 18173237 17785264 17629438 17641467 17498769 17439814 17355549 17447097 17550227 17317538 17213507
6486 17213507 17059962 16906398 16677502 16052705 15348089 14622119 13821222 13486478 12964101
6477 12964101 12382124 12146894 11764520 11421238 11239557 11078232 10864476 10783613 10624619 10569374
6467 10569374 10546187 10833621 11002617 10965370 11249059 11573604 11962157 12338383 13116431 13893862
6457 13893862 14694577 15500333 16737262 18035119 19190042 20784752 22391995 23850742
6449 23850742 24664086 24745385 24272902 23175257 21432310 19693173 17796363 15962492 14691920
6440 14691920 13708283 12952782 12101479 11544388 10886595 10299025 10062956 9647002 9323703
6431I323703k26934k03829n7641m80301j90794r5058j43189j01344r6408p1343
6421G656862r8986j20437n0238r1730K8281n0896k60002K96743K13283Q1390n8486
6410G545784R0516J48156L02961K10425P915J29619J44536J66695J30633K39026
6400I116266L07038K40939L28990K27065L00839L29134M27533M61892J56166L67325
6390A2263187M73400M89629M42435L10143M79497M13246L93115L12154K69785
6381A5846591M86516K71920K15770L52442r7407J01193L06605r3965n7312J2681
6371A7345034J66411r0537j00826K64763k12074j57444J1371o17511m23146k53000
6361A5933041k36865k38806l99216m43560m97431n79407l21510l49858n86438
$$ plain form
6431 9323703 9096769 8892940 8835299 8354998 8164204 8069146 7925957 7824613 7728205 7656862
6421 7656862 7557876 7437439 7387201 7295471 7323752 7272856 7012854 7309597 7522880 7604270 7545784
6410 7545784 7636300 7784456 8087417 8297842 8305757 8435376 8579912 8746607 8877240 9116266
6400 9116266 9423304 9664243 9993233 10220298 10521137 10850271 11277804 11739696 11895862 12263187
6390 12263187 12736587 13226216 13668651 13978794 14458291 14871537 15264652 15576806 15846591
6381 15846591 16333107 16605027 16820797 17173239 17075832 17177025 17483630 17389665 17332353 17345034
6371 17345034 17511445 17420908 17320082 17584845 17372771 17215327 17226698 16609187 16186041 15933041
6361 15933041 15696176 15457370 15058154 14614594 14117163 13537756 13216246 12866388 12279950
6352A2279950l42602n62015m38305m34758n05875j03681k95519n15182m51709
6343H630304j70706k36033m71697m04444j39147o2629l71179k66466k34200l29277
6333E944526k41928j12255k48116j27441o1859j81150k34549k27701j44317j45188
6323D220022L8020k05654j65349k8946m9096o7273M3405j00633J1659k06989o2649
6312C426517j05055k07355k39909q2417n7674q7130p7312q1987o6019L83590j34642
6301B670607k04660J42182k65940J73376k6703J1573l00961J58909j14998n1631
6291B191754j09524n7552L8238O5488j64296k39142J50534k25019J17949o7146
6281A701284L6903K44469k13787k17626N9226L4116j45155K03276J1460j4609
$$ plain form
6352 12279950 11937348 11375333 10937028 10502270 9996395 9892714 9597195 9082013 8630304
6343 8630304 8459598 8223565 7751868 7347424 7208277 7145648 6774469 6508003 6273803 5944526
6333 5944526 5702598 5590343 5342227 5214786 5152927 4971777 4737228 4509527 4365210 4220022
6323 4220022 4258042 4052388 3887039 3858093 3808997 3741724 3785129 3684496 3696155 3489166 3426517
6312 3426517 3321462 3114107 2874198 2791781 2734107 2646977 2569665 2487678 2421659 2805249 2670607
6301 2670607 2465947 2608129 2342189 2515565 2488862 2500435 2199474 2358383 2243385 2191754
6291 2191754 2082230 2024678 2062916 2128404 1964108 1724966 1875500 1650481 1768430 1701284
6281 1701284 1738187 1982656 1768869 1551243 1610469 1644585 1499430 1702706 1714166 1699557
6271A699557J51454j05394K6118k8391J6481M0455k3421J49685L6068k70328m454
6260A687830P3925J6060k12941l96763J00673J89307N4340k78886J26952m8028
6250A312469J57179j76646M1613J85860o307j43945j88518L31497j50523k07289
6240A155390N2290q6485n9267J16783k49972J90239J87768j02180m6787m3290
6230A114489J19922J56194n9692J011J01841l08601j18624q4965J4229J60029
6220A095833J0936j32243J78643l2887r8855Q2807n2025j26123K25577J20803
6210A272466j28465j45295k41581L54149K2661j48942J11802j28096j23434N3522
6200H98787J82706K07466j99110l4510j5556o5029j19319l0846J89673L2699j54425
$$ plain form
6271 1699557 1851011 1745617 1771735 1743344 1759825 1800280 1776859 1926544 1962612 1692284 1687830
6260 1687830 1761755 1777815 1564874 1168111 1268784 1458091 1512431 1233545 1360497 1312469
6250 1312469 1469648 1293002 1334615 1520475 1514168 1370223 1181705 1513202 1362679 1155390
6240 1155390 1207680 1121195 1061928 1178711 928739 1118978 1306746 1204566 1157779 1114489
6230 1114489 1234411 1390605 1330913 1331924 1433765 1125164 1006540 921575 935804 1095833
6220 1095833 1106769 974526 1153169 1120282 1021427 1104234 1052209 926086 1151663 1272466
6210 1272466 1144001 998706 757125 1111274 1133935 984993 1096795 968699 845265 898787
6200 898787 1081493 1288959 1089849 1055339 1039783 974754 855435 824589 1014262 1046961 892536
6189H92536K653P7608J54833k44234N8930M310k5000j23522J17771K38616r650
6178A144851P3682P4359Q4044q9136l7379L5566k9322J25553p2076k17193K41110
6167A334059O0319J62806m5843L515K32469l8506q8842l3141j8115j33213l2501
6156A403007r9042P1088j04785L006J22139j83303M5015Q2318j30367J14910J5992
6145A339978P4638K7785Q9898J30921j33920r4736K2688J67257m7004r0350O6004
6134A553159j96407j71898o8425J9442r9421n09P2139k2147j28606J92042N5700
6123A205069M5329j79751K2625L5838J06933k28842j90086J07505J84422J18761
6113A227803j46407R0137n4102P4093n8374j54224j03733J03040q182J93095K88
$$ plain form
6189 892536 895189 972797 1127630 883396 942326 946636 921636 798114 915885 1154501 1144851
6178 1144851 1218533 1292892 1376936 1287800 1250421 1285987 1256665 1382218 1310142 1092949 1334059
6167 1334059 1394378 1557184 1511341 1514856 1747325 1708819 1619977 1586836 1568721 1435508 1403007
6156 1403007 1303965 1375053 1270268 1273274 1395413 1212110 1257125 1339443 1209076 1323986 1339978
6145 1339978 1414616 1442401 1532299 1663220 1529300 1434564 1457252 1624509 1577505 1487155 1553159
6134 1553159 1356752 1184854 1116429 1135871 1036450 1035941 1108080 1085933 957327 1149369 1205069
6123 1205069 1250398 1070647 1093272 1129110 1236043 1007201 817115 924620 1109042 1227803
6113 1227803 1081396 1171533 1117431 1191524 1133150 978926 875193 978233 970051 1163146 1163434
6102A163434p0552j5411J9479l4835Q1108k34753n0352J91587J87654r694j42426
6091A085239r565r491j96630L8082j04624P9827J35874l2930J80878l7893k53215
6080H75552P5234j86461q3184L0863P0766Q2571j18387n3962K54635o5291K54801
6069A137137j49392j3254j06301O7565k4657o2232m5683K3705L19993j86745j94236
6058G65900L0250J81058r1209l2736O1835o0008n4384N8582K10573j43293l2771
6047H93797J13783m9341L4296j68234M657N5349N2664L4542M7975O497J31844
6036A157829j32258O8218k34593j44836k4125R5386K67005J37775k19433j81674
6026G89294j64035J70543R5818j06238J48868L1900k06985k1632q7925J14307
$$ plain form
6102 1163434 1092882 1077471 1096950 1062115 1143223 908470 858118 1049705 1237359 1227665 1085239
6091 1085239 1075674 1066183 869553 907635 803011 882838 1018712 985782 1166660 1128767 875552
6080 875552 950786 764325 681141 712004 782770 865341 746954 692992 947627 882336 1137137
6069 1137137 987745 974491 868190 935755 911098 848866 803183 826888 1146881 960136 765900
6058 765900 796150 977208 885999 853263 915098 855090 800706 859288 1069861 926568 893797
6047 893797 1007580 958239 992535 824301 828958 884307 936971 971513 1019488 1025985 1157829
6036 1157829 1025571 1093789 859196 714360 690235 785621 1052626 1190401 970968 789294
6026 789294 625259 795802 891620 785382 934250 966150 759165 737533 649608 763915
6016G63915K03434R1752q589r510k05224J45783K298j31895r0115Q5563Q2863
6005I30275n0800l884j70451J99048J7593Q5222o694l07171p1091L43751M8254
5994A014052j23493J45466P7289J965j76444O8352J42347j83660m6626N8607Q7644
5983A065499O3025j169J17109k20851o6125J65417j64038Q7416q3848m515M742
5972I62662J92156r4419j07667p242K3624J0142J0049J00943l5189K7584j22933
5961I59710P5951n6935j10866j14693K05359J27616P848R0539j41719j76625K455
5950H68640K09449j33836m1811j0611n4455j66051p7144J71725R9131j04431j4309
5939G46297J94345L7217J69427r0199j75785Q6013r7544J24106l6121O5376o1799
$$ plain form
6016 763915 967349 1059101 1050512 1041002 835778 981561 983859 851964 761849 847412 930275
6005 930275 879475 875591 705140 904188 921781 1007003 1000309 693138 622047 965798 1014052
5994 1014052 890559 1036025 1113314 1115279 938835 1007187 1149534 965874 919248 977855 1065499
5983 1065499 1128524 1127355 1244464 1023613 957488 1122905 958867 1046283 962435 957920 962662
5972 962662 1154818 1060399 952732 945490 969114 979256 989305 1090248 1055059 1082643 959710
5961 959710 1035661 978726 867860 753167 958526 1086142 1093990 1184529 1042810 866185 868640
5950 868640 1078089 944253 902442 891831 837376 671325 594181 765906 865037 760606 746297
5939 746297 940642 977859 1147286 1057087 881302 967315 869771 993877 957756 1023132 961333
5928I61333j38604K56950j29928k525l043P4384q1115K38827j75465r3323K72863
5917A180354q0491Q2566k58068O167J29073l703p643J6331Q1345j64829p1937
5906I09165l6872l0622J01521J5427M7078p0671Q2125n238J88954q4115l23784
5895G92968n4276L98184J50233k91694J60463L2500j56676K37363p8600j15036
5885A075429J19646k85555J77933N0044L0241R2746r6260j41907q0466k31319
5875G10532R6064L2722J83806M3376J69445p7481j32187j35239J14868Q881l35866
5864F78921J96826J80354j75376K75127J09674M5869n2108j51442L4357m4718
5854A097484p9847m3150K37768P9594O6682k81753J38059k0319j82218q7228J05558
$$ plain form
5928 961333 822729 1079679 949751 947226 944183 1018567 937452 1176279 1000814 907491 1180354
5917 1180354 1099863 1182429 924361 930528 1059601 1055898 1048255 1064586 1145931 981102 909165
5906 909165 872293 841671 943192 958619 1005697 935026 1017151 1011913 1200867 1116752 792968
5895 792968 738692 1136876 1287109 995415 1155878 1188378 1031702 1269065 1190465 1075429
5885 1075429 1195075 909520 1087453 1137497 1167738 1260484 1164224 1022317 941851 710532
5875 710532 806596 839318 1023124 1066500 1235945 1158464 1026277 891038 1005906 1014787 678921
5864 678921 875747 1056101 880725 1155852 1265526 1311395 1259287 1107845 1142202 1097484
5854 1097484 1017637 974487 1212255 1291849 1358531 1076778 1214837 1194518 1012300 925072 1030630
5843A030630J10289J18353j40246r5966m597k32474n13K16686K9577P838Q3332
5832A122909J81751O2150r6125P8514J18470j89213J89130j72156J73380p1258
5822A397552J73179j58636k91237J11664j85164N9247J66684Q9001J0889q6852
5812A286327j48579K20175K59951j89486j31271N9835J42206l23460q240j34272
5802A033186K30255M6808J28000J23278j88029P4797J34770m8515o8971j39233
5792A326346N3683l59430K11305R3369l6576O6899j28470K97188l28235O4562
5782A260641p8731J95020L1635j32502j63626J2169J8549k6139L5838M4118j402
5771A195570L25514k28214l4605j39219P6299L3658J39518j71355j25374k6560
$$ plain form
5843 1030630 1140919 1259272 1119026 1023060 1018463 785989 785476 1002162 1031739 1039577 1122909
5832 1122909 1304660 1366810 1270685 1349199 1467669 1278456 1467586 1295430 1468810 1397552
5822 1397552 1570731 1412095 1120858 1232522 1047358 1106605 1273289 1362290 1373179 1286327
5812 1286327 1137748 1357923 1617874 1428388 1297117 1356952 1499158 1175698 1167458 1033186
5802 1033186 1263441 1310249 1438249 1561527 1373498 1448295 1583065 1534550 1465579 1326346
5792 1326346 1380029 1020599 1231904 1325273 1288697 1355596 1227126 1524314 1196079 1260641
5782 1260641 1181910 1376930 1408565 1276063 1112437 1124606 1143155 1117016 1152854 1196972 1195570
5771 1195570 1521084 1292870 1258265 1119046 1195345 1229003 1368521 1197166 1071792 1045232
5761A045232N0175L01986M608k48794o0031P8383o8783O6356J63914j17150J26763
5750A342659N1213o9130l3034j2206l43960J99441K28530j87006R0058n8919J08640
5739A316286J92487j36077J8909J71988J07751j49227j24363p4768K26635j61202
5729A388419p6010O4377R0972j07814j41308J55646k4703r9934m3746K01911M1394
5718A449204K27187q0680J61789j77446J3775j9215Q7009j14633O9277J08215
5708A724482k14373J69734N7188J38419j03459J11590r3662j507K36212k63018
5698A761606j54852N4869p779J50221K1646N8213J42247K29829q1592k93571M9114
5687A929951J08345o5207J52516k30556k04264L36471K5190Q4748j71630k51286
$$ plain form
5761 1045232 1095407 1397393 1402001 1153207 1093176 1171559 1102776 1169132 1333046 1215896 1342659
5750 1342659 1393872 1324742 1291708 1279502 935542 1134983 1363513 1176507 1266565 1207646 1316286
5739 1316286 1508773 1372696 1391605 1563593 1671344 1522117 1397754 1322986 1549621 1388419
5729 1388419 1312409 1376786 1467758 1359944 1218636 1374282 1349579 1249645 1205899 1407810 1449204
5718 1449204 1676391 1595711 1757500 1580054 1593829 1574614 1661623 1546990 1616267 1724482
5708 1724482 1510109 1679843 1737031 1875450 1771991 1883581 1789919 1788412 2024624 1761606
5698 1761606 1606754 1661623 1653844 1804065 1825711 1883924 2026171 2256000 2174408 1880837 1929951
5687 1929951 2038296 1973089 2125605 1895049 1690785 2027256 2052446 2137194 1965564 1714278
5677A714278l6065J4697j3084J54075m4464J09607J42935J92293k3755N5582N8045
5666B324144j09158j56088q3770P7839K3780p763J22457J36631P6807p7935j27233
5655B199711j31817p7765k73605L19327J03736J93479q8972P8782l5605n2489
5645B234782l0294L4365N9343k16292K20216O2695j61212k50560K7112Q6088K0186
5634B086429m8619J70649J55325J32603j92969k46839J94470M4492k49642j27010
5624A918889K69083R7376m9474q5783j21185K88158M8495r4401K0098L492j42703
5613B152045o7035J75722k15142J64224O8528j5265J45496J80606J49955j72514
5603B566620K076R5256K8771l88912k6470M970R7965n2259K0894j5493M7064N6182
$$ plain form
5677 1714278 1678213 1692910 1679826 1833901 1789437 1899044 2041979 2234272 2210517 2266099 2324144
5666 2324144 2214986 2058898 1975128 2052967 2076747 2068984 2191441 2328072 2404879 2326944 2199711
5655 2199711 2067894 1990129 1716524 2035851 2139587 2333066 2244094 2322876 2287271 2234782
5645 2234782 2204488 2238853 2298196 2081904 2302120 2364815 2203603 1953043 1980155 2066243 2086429
5634 2086429 2037810 2208459 2363784 2496387 2303418 2056579 2251049 2295541 2045899 1918889
5624 1918889 2187972 2285348 2235874 2150091 2028906 2317064 2365559 2271158 2291256 2294748 2152045
5613 2152045 2085010 2260732 2045590 2209814 2278342 2263077 2408573 2589179 2739134 2566620
5603 2566620 2568696 2663952 2692723 2303811 2277341 2282311 2380276 2328017 2348911 2333418 2380482 2436664
5591B436664k8122K39589j60964j31359K63376j17027J93759O2519J12379k14716
5581B656098q1451Q2335O3302J22694n4148j78Q2907K17955j57367j14550r7863
5570B719734j92011J85922M3953J63248j5160R200K1998J09970J04337j07686
5560C043505K2240l0102Q7921j19749J47024o6144J07765Q2107k05988M1885J49126
5549C259590K42525o7182l6829J95516N9823l7593J51635Q0385k955R1694j29493
5538C807116n8374J21855J10306J65206j57222l6959J9681j29238J50445J68807
5528D161623Q0052j17764J84868p7407j66619J60313n4412L1379K3711M5317K03251
5517D474312m9289J42221l6849R183J19052K01722L3648j7147O8566L364p4896
$$ plain form
5591 2436664 2408542 2648131 2487167 2355808 2619184 2502157 2695916 2758435 2870814 2656098
5581 2656098 2574647 2656982 2720284 2842978 2788830 2788652 2871559 3089514 2932147 2817597 2719734
5570 2719734 2527723 2713645 2757598 2920846 2905686 2914886 2936884 3046854 3151191 3043505
5560 3043505 3065745 3035643 3123564 3003815 3150839 3084695 3192460 3274567 3068579 3110464 3259590
5549 3259590 3502115 3434933 3398104 3593620 3653443 3615850 3767485 3847870 3844915 3936609 3807116
5538 3807116 3748742 3870597 3980903 4146109 3988887 3951928 3971609 3842371 3992816 4161623
5528 4161623 4241675 4123911 4308779 4231372 4064753 4225066 4170654 4202033 4225744 4271061 4474312
5517 4474312 4425023 4567244 4530395 4539578 4658630 4860352 4894000 4876853 4945419 4948783 4873887
5506D873887J29596q1474J63616L32142J39110k04082J48192k6110k2937k2008
5496E429932j67010J54970M2019O5563K63237N9445R784O3611J6390J05237o69
5485F042509K50653J92562J06730m3173K73823k00507J56425J73884J10930K24970
5475G288806K56338K00707k7373J39593J91582K36543N6533J62347K2542L09790
5465H837408K10031j70766L32791M2583M10392N91192k69n8059J51523M51175
5455A0798001K43684R1877L83215K49845R1001K33078K94447M7037L80625L82956
5445A3195766K03854M2516K89609L69571O14079N62460L28952K78694M88299L86855
5435A6760655L26583N09473O79748O67839O47561N40382P32692O61079J115581
$$ plain form
5506 4873887 5003483 4922009 5085625 5417767 5556877 5352795 5500987 5474877 5451940 5429932
5496 5429932 5262922 5417892 5459911 5525474 5788711 5848156 5857940 5921551 5937941 6043178 6042509
5485 6042509 6293162 6485724 6592454 6549281 6823104 6622597 6779022 6952906 7063836 7288806
5475 7288806 7545144 7745851 7718478 7858071 8049653 8286196 8342729 8505076 8527618 8837408
5465 8837408 9047439 8876673 9209464 9252047 9662439 10253631 10253362 10195303 10346826 10798001
5455 10798001 11041685 11133562 11516777 11766622 11857623 12090701 12385148 12432185 12812810 13195766
5445 13195766 13399620 13442136 13731745 14101316 14715395 15277855 15606807 15885501 16373800 16760655
5435 16760655 17087238 17596711 18276459 18944298 19591859 20132241 20864933 21526012 22641593
5426B2641593J090965Q90953R37060J460913J347103J110481J657000J639786
5418C2775854J575666J363936J394254R24967P17910P77373R31185P30443J168390
5409D2359978R42944J595444J962707K358315K204395K961640L236284L453647
5401F1075354L669355L889531L908020L813067L466858L337761K652669K307967
5393H8120582J909368J462028R95153R063j37038J13116M51514P55628J765245
5384I5444659K091899K572174K776575K006465O7844n31697j18962Q98638K332490
5375A07540085K740953K904069K691389K369492J525722Q1007j289202k705210
5367A15858305l933056m239287m388700m227984l657671l522358k893744k806118
$$ plain form
5426 22641593 23732558 24623511 25560571 27021484 28368587 29479068 31136068 32775854
5418 32775854 34351520 35715456 37109710 38034677 38752587 39529960 40461145 41191588 42359978
5409 42359978 43302922 44898366 46861073 49219388 51423783 54385423 57621707 61075354
5401 61075354 64744709 68634240 72542260 76355327 79822185 83159946 85812615 88120582
5393 88120582 90029950 91491978 92487131 92496194 92359156 92472272 92923786 93679414 95444659
5384 95444659 97536558 100108732 102885307 104891772 104959616 104427919 104308957 105207595 107540085
5375 107540085 110281038 113185107 115876496 118245988 119771710 119852717 118563515 115858305
5367 115858305 111925249 107685962 103297262 99069278 95411607 91889249 88995505 86189387
5359H6189387k722702k409880j914988j753225j622709r82150m19254l55928K35628
5350G4244179M33789K14828L88190L49455j63823p65396j367120k084577k553210
5341F8696315k617298k953502k611970k448148k300862j901127j712040j924241
5333E0227127j687672j673167j718605j664484j848881j530093j271133j168976
5325C7664116j104491p67963j040040o20577m64671p88354m24318o49766m52673
5316C1351263J9039l05138m68920k72867n07576k80409j79044o76026k9142k64157
5306B8387023p6013k66565k21660l86173n87824m65422o80189n00256m36856n15893
5296B4250172k61870k14530j08948n57308n21807l24287p3958j53240j67132n1873
$$ plain form
5359 86189387 83466685 81056805 79141817 77388592 75765883 74783733 74364479 74008551 74244179
5350 74244179 74677968 74892796 75280986 75630441 75466618 74701222 73334102 71249525 68696315
5341 68696315 66079017 63125515 60513545 58065397 55764535 53863408 52151368 50227127
5333 50227127 48539455 46866288 45147683 43483199 41634318 40104225 38833092 37664116
5325 37664116 36559625 35791662 34751622 34131045 33666374 32878020 32453702 31803936 31351263
5316 31351263 31370302 31065164 30596244 30323377 29815801 29535392 29356348 28680322 28651180 28387023
5306 28387023 28311010 28044445 27822785 27436612 26848788 26383366 25703177 25202921 24766065 24250172
5296 24250172 23988302 23773772 23664824 23107516 22585709 22261422 22187464 22034224 21867092 21815219
5286B1815219l04171o2533K6191J53540k52131o8241M6821K04269Q2846n6008
5276B1585802j05889L04613J46831J20985J58419K32341K19610K98026L86757
5267B3347495O21173P16242P65700Q31760O96395J020374P96971Q08024M51345
5258C0055479N45897J94387L01520L46323m1261K64703P7953L74406J07908L17763
5248C2545078K87290N61152M14812Q61213Q36868R65253J587050J212933J358218
5239D0629867J321175J324296J050342J096989P64254L9955k12396p33900j124628
5230D4155954j397133j416315j548511j293984j073752p62760q32799p24568k98118
5221C4808014m92215p1863j20707J52476N2879j25867K15728K97863L52891l701
$$ plain form
5286 21815219 21511048 21448515 21474706 21628246 21376115 21307874 21354695 21558964 21641810 21585802
5276 21585802 21479913 21784526 21931357 22052342 22210761 22443102 22662712 22960738 23347495
5267 23347495 23968668 24684910 25450610 26282370 26978765 27999139 28796110 29604134 30055479
5258 30055479 30601376 30795763 31097283 31443606 31402345 31667048 31745001 32119407 32227315 32545078
5248 32545078 32832368 33393520 33808332 34669545 35506413 36471666 38058716 39271649 40629867
5239 40629867 41951042 43275338 44325680 45422669 46186923 46226878 46014482 45280582 44155954
5230 44155954 42758821 41342506 39793995 38500011 37426259 36663499 35830700 35106132 34808014
5221 34808014 34315799 34243936 34123229 34275705 34328584 34202717 34418445 34716308 35069199 35065498
5211C5065498o4880L672p28027o51997q96962j055292j093666r43201r44697j079467
5201B7610981p77655p05361o09913o96301p62029q95665m47312o89870l69026
5192B1657849k40794l13324m38632l08943k9298l34912k45865l22887j75424o3527
5182A9184243j52078l54633m43477k25135k2793K8268M1125j43491M7530J36009
5172A8095568m9531J91348J44125J75397K59683L95172P04039O28705J006621
5163B1551127Q14133J027685J510813J913902K118546L000955L300774L157094
5155C8395029K856980L046653K288358q69128m429591n887245m722772l699449
5147B6978835k952470j767304j334495r68787p98062p11944n48521n71837l80997
$$ plain form
5211 35065498 35000618 35004290 34276263 33624266 32727304 31672012 30578346 29635145 28690448 27610981
5201 27610981 26833326 26127965 25518052 24821751 24059722 23164057 22716745 22026875 21657849
5192 21657849 21417055 21103731 20665099 20356156 20326858 19991946 19746081 19423194 19247770 19184243
5182 19184243 19032165 18677532 18234055 18008920 17986127 18014395 18055520 17912029 17959559 18095568
5172 18095568 18046037 18237385 18381510 18556907 18816590 19211762 19915801 20544506 21551127
5163 21551127 22365260 23392945 24903758 26817660 28936206 31937161 35237935 38395029
5155 38395029 41252009 44298662 46587020 45717892 41288301 35401056 30678284 26978835
5147 26978835 24026365 22259061 20924566 19955779 19157717 18445773 17897252 17325415 16944418
5138A6944418j86671l12977j85173J15031o7912J36121R1358K23872J95028K59649
5128A7212744J3970m83726n38435n36340l29277j16905k71904l31970l08278o3562
5118A4246317q2336p2849k20343k71P7258l85523N0978J20865o4873j66265O2420
5107A3565378K87192Q6348j57555K53568J9674J08903J20813P0339P6383L25787
5097A4756830J69517o6550L44208J05005L75150J57868L02179J94224J14202L0916
5087A6483549N6417M36623N70487J08609L5590K34354J00875j837L04620N65398
5077A8894685L11613P0648M19513M12336K68795K71598M47097N57152j4130L56654
5067B1995961Q01712N85273L56164Q00618N14154M90013R71119M68774P53911
$$ plain form
5138 16944418 16757747 16444770 16259597 16374628 16306716 16442837 16534195 16758067 16953095 17212744
5128 17212744 17226714 16742988 16204553 15668213 15338936 15222031 14950127 14618157 14309879 14246317
5118 14246317 14163981 14091132 13870789 13870518 13947776 13562253 13613231 13734096 13669223 13502958 13565378
5107 13565378 13852570 13938918 13781363 14034931 14054605 14163508 14284321 14354660 14431043 14756830
5097 14756830 14926347 14859797 15204005 15309010 15684160 15842028 16144207 16338431 16452633 16483549
5087 16483549 16539966 16976589 17547076 17655685 17691275 17925629 18026504 18024667 18329287 18894685
5077 18894685 19206298 19276946 19696459 20108795 20377590 20649188 21096285 21653437 21639307 21995961
5067 21995961 22797673 23382946 23739110 24539728 25053882 25543895 26515014 26983788 27737699
5058B7737699N57452O09194Q62563O78290K73218Q42589O75171M93677J185630
5049C3915483P57224R11165J221608J257959J540038J564986J592987J794741
5041D4556191J708871J830830K121626J762616J770907J975085J727400J765948
5033E9219474J426874J360347Q66606O18874P14845Q06097N91164O79276N11592
5024F6795149Q56514J146551J072441J352686J561106J841093J720867K035305
5016G8381712K104488K309582K126022K249315J811638J636452J585100J531688
5008I3735997Q39037L90966K72891j07749p08683q50385r97812j274985r94088
4999I0305189r40488p62777p46344p45680q38770m88893n64171p16183p05116
$$ plain form
5058 27737699 28295151 28904345 29766908 30445198 30718416 31561005 32236176 32729853 33915483
5049 33915483 34672707 35583872 36805480 38063439 39603477 41168463 42761450 44556191
5041 44556191 46265062 48095892 50217518 51980134 53751041 55726126 57453526 59219474
5033 59219474 60646348 62006695 62873301 63492175 64207020 65013117 65604281 66283557 66795149
5024 66795149 67651663 68798214 69870655 71223341 72784447 74625540 76346407 78381712
5016 78381712 80486200 82795782 84921804 87171119 88982757 90619209 92204309 93735997
5008 93735997 94575034 94966000 95238891 95131142 94422459 93572074 92574262 91299277 90305189
4999 90305189 89364701 88601924 87855580 87109900 86271130 85782237 85218066 84501883 83796767
4990H3796767p26299o77749p81720p32989l60637r85597j111652p94489r92966
4981G6632669j126038j549119j374938j611395j843010j625086j503834j459698
4973F4539551j465681j207376j239338j182591j036783p84612r85241o99956r34383
4964E5003590p00771p38070o76090n70602l62805j82739m87467k78110k99632
4955E0707304k92108k37124j34623k19032j97185j26367L4062j42006l21718L2842
4945D9104045j79123m1710K72402J67262L56388J89686K71975M29441L29501L25148
4935E1225015j8618M65896O47131M83197R4426J39068K63338O4796K93749J207
4925E3659205j64477K4936L9749M2681P6067j22866L35358K84957N49414R3861
$$ plain form
4990 83796767 83070468 82392719 81610999 80878010 80517373 79531776 78420124 77625635 76632669
4981 76632669 75506631 73957512 72582574 70971179 69128169 67503083 65999249 64539551
4973 64539551 63073870 61866494 60627156 59444565 58407782 57623170 56637929 55937973 55003590
4964 55003590 54302819 53564749 52888659 52318057 51955252 51772513 51285046 51006936 50707304
4955 50707304 50415196 50178072 50043449 49824417 49627232 49500865 49534927 49392921 49071203 49104045
4945 49104045 48924922 48883212 49155614 49322876 49679264 49868950 50140925 50570366 50899867 51225015
4935 51225015 51206397 51672293 52319424 52802621 52897047 53036115 53299453 53364249 53657998 53659205
4925 53659205 53494728 53519664 53559413 53602094 53678161 53555295 53890653 54175610 54725024 54818885
4915E4818885L31325L72617M20170L40190O05831N68883N59524O06520L94378
4906E9018323K43189l30759o22212r10981r72801j099968j103449p64073k82644
4897E3174625l07199j68256m54506J8723L30916P4047K94391R67960P60029P28764
4887E5419494J064127J102537J504925J498002J276519J061548O51068L49344
4879F3927564k67211r51945j222298j478368j420246l96734j92894p8791K0849
4870E7939926J25227M3516k55158J39733j49827l76532j83592j93168Q1602K75492
4860E7447219M77513N58675N08906M75655L71029J44794j00372n54183p6764k14719
4850E9037753k28155p3246j74428l08678r41747j082351j532283j642573j401414
$$ plain form
4915 54818885 55150210 55522827 55942997 56283187 56889018 57457901 58017425 58623945 59018323
4906 59018323 59261512 58930753 58308541 57397560 56424759 55324791 54221342 53457269 53174625
4897 53174625 52867426 52699170 52244664 52263387 52594303 52668350 52962741 53930701 54690730 55419494
4887 55419494 56483621 57586158 59091083 60589085 61865604 62927152 63578220 63927564
4879 63927564 63660353 62708408 61486110 60007742 58587496 58190762 57997868 57919077 57939926
4870 57939926 58065153 58108669 57853511 57993244 57843417 57466885 57283293 57090125 57171727 57447219
4860 57447219 57924732 58483407 58992313 59467968 59838997 59983791 59883419 59329236 59252472 59037753
4850 59037753 58809598 58736352 58561924 58253246 57311499 56229148 54696865 53054292 51652878
4841E1652878j200887j058454p50746q73685o89850n30834m50199k55624p73255
4832D5069344k29581j86845k80966l99974n47748m45452q67817o20187n78831
4823D0911943p53934j045504j043946p74442p01725j104940j007681r64493o94655
4814C2820623n62667m34096n04630n06970m25744k90835o50471q04375k54839
4805B8385996n52729m93490p27327k87754k95464m13672k29746j90771j36670
4796B5058373l26160k62302k00968k45595k05656j94572j61699R8502j78337k38043
4786B3143543m66535m42970j70900k17459j27199r6604j27255l37678m14918J7776
4776B0759801j74638P1760j15743k60538k5297J97519m43267o306l3259K57439
$$ plain form
4841 51652878 50451991 49393537 48642791 47769106 47079256 46548422 46098223 45842599 45069344
4832 45069344 44839763 44652918 44371952 43971978 43424230 42978778 42110961 41490774 40911943
4823 40911943 40158009 39112505 38068559 37294117 36592392 35487452 34479771 33515278 32820623
4814 32820623 32257956 31823860 31319230 30812260 30386516 30095681 29445210 28640835 28385996
4805 28385996 27833267 27339777 26612450 26324696 26029232 25615560 25385814 25195043 25058373
4796 25058373 24732213 24469911 24268943 24023348 23817692 23623120 23461421 23559923 23381586 23143543
4786 23143543 22677008 22234038 22063138 21845679 21718480 21621876 21494621 21156943 20742025 20759801
4776 20759801 20585163 20656923 20541180 20280642 20255345 20452864 20009597 20003291 19970032 20227471
4766B0227471K63286K5478q7077Q015J0352J31950j59280l48966M5137j59957
4756A9956409J27478j35383j27400J5048Q4080m03118l42140o9484k8142k25341
4746A8852007m10237l07658L52197j45661k66238K41743k44537J91147J52428
4737A8415191o7427o5018r3553J29568R0840J16683j53461M3426J5209j87983
4727A8243475l20593m50314k93654p4772j52511j31056n0531l01428j38916j41738
4717A6187962j85935J51340j00250P5150r215J2103k31811l3982k8472K0233J8025
4706A5875148j13526k9529k7369j17860j39651r5323k00154J23732j46598j73354
4696A4955516J12846k76580j96674J4418j17062L1150r6333k6569r6056l32924
$$ plain form
4766 20227471 20490757 20516235 20429158 20437173 20447525 20579475 20420195 20071229 20116366 19956409
4756 19956409 20083887 19948504 19821104 19836152 19920232 19517114 19174974 19105490 19077348 18852007
4746 18852007 18441770 18134112 18486309 18340648 18074410 18316153 18071616 18262763 18415191
4737 18415191 18347764 18282746 18189193 18318761 18409601 18526284 18372823 18416249 18431458 18243475
4727 18243475 17922882 17472568 17178914 17104142 16951631 16820575 16770044 16468616 16329700 16187962
4717 16187962 16002027 16153367 16053117 16128267 16119052 16131155 15899344 15865362 15836890 15857123 15875148
4706 15875148 15761622 15732093 15704724 15586864 15447213 15351890 15151736 15275468 15128870 14955516
4696 14955516 15068362 14791782 14595108 14609526 14492464 14523614 14427281 14400712 14304656 13971732
4686A3971732N3562r926j64591j09742n2671l5752J77033n4952K0260K3893r1361
4675A3727485l85128q2386j35803j06307R6429J38494m7639j31009j91960r4031
4665A2788145o9903J22276J91442l2024j5315J62156J14143l75681R9075j0155
4655A2974159j12948K33242q1035k44382j79208m98873j62957l67618l16739j29533
4645A1114108m50657k10472j89082k23631l42036m97141k25207p4613j59328p4567
4635H667374k3265l50413l16886k83525j0684n2539j66283l00977n2985J18142
4625G227959k38443j58612p2339M1035p7225k62840J53881k729J0775l31062k00003
4614F090397q380J2445k91282j89850o1482p4179J8076J6084k24536p8973q0531
$$ plain form
4686 13971732 14025294 14015368 13850777 13741035 13688364 13652612 13829645 13774693 13794953 13818846 13727485
4675 13727485 13342357 13259971 13124168 13017861 13114290 13252784 13205145 13074136 12882176 12788145
4665 12788145 12718242 12840518 13031960 12999936 12984621 13146777 13260920 12885239 12984314 12974159
4655 12974159 12861211 13094453 13013418 12769036 12589828 12090955 11927998 11560380 11243641 11114108
4645 11114108 10663451 10452979 10263897 10040266 9698230 9201089 8975882 8901269 8741941 8667374
4635 8667374 8644109 8293696 7976810 7693285 7682601 7630062 7463779 7162802 7109817 7227959
4625 7227959 6989516 6830904 6758565 6799600 6722375 6459535 6613416 6610687 6621462 6290400 6090397
4614 6090397 6082017 6094462 5803180 5613330 5551848 5477669 5495745 5511829 5287293 5208320 5127789
4603E127789o3690K90441k20994k1444p7550j47675J69202L09840O5465l24490
4593E106894l81553J06365M9048L6835K36293j59329r5897J36213J4208r5773
4583D953304k89046J00371J2024k99935J00363K8665o7315r1827M0951R8201l8497
4572D547259O804R604l08364n7732J59757J49503m71630Q0782J08226r7094J4236
4561D141351L4811M7841o1808j65981o269J14150j2886M3977m1107m5020j17168
4550C931891P2417N1640k332j97632J47019j17692L9489O5128m6633j24661J11942
4539C930576n9184J52802k47814k91487j24032N8021R0967l2935Q0667R3351J50798
4528C801730k5510J7176j07822M1026o0596J21230k3735k1945m5527j01012J22159
$$ plain form
4603 5127789 5064099 5354540 5133546 5112102 5034552 4886877 5056079 5365919 5431384 5106894
4593 5106894 4725341 4831706 4880754 4917589 5153882 4994553 4898656 5034869 5049077 4953304
4583 4953304 4664258 4764629 4776653 4476718 4577081 4605746 4538431 4446604 4487555 4585756 4547259
4572 4547259 4554063 4563667 4255303 4197571 4357328 4506831 4035201 4115983 4224209 4127115 4141351
4561 4141351 4176162 4224003 4162195 3996214 3989945 4104095 4091209 4135186 4094079 4049059 3931891
4550 3931891 4004308 4055948 4053616 3855984 4003003 3885311 3924800 3989928 3943295 3818634 3930576
4539 3930576 3871392 4024194 3776380 3484893 3360861 3418882 3509849 3476914 3557581 3650932 3801730
4528 3801730 3776220 3793396 3685574 3726600 3666004 3787234 3763499 3741554 3696027 3595015 3717174
4517C717174j6462j20857k7322j54419L8981K34133Q0525j22853J8121j2237r6791
4506C537993J00579j00815j76988o7040R4231J02128q4627J69542j98710k18621
4496C157672J02157N5244Q9494M9484M7204l1760q2787M4813Q2085j88091P3759
4485C399274J35561j2404k8412j46977R1954j60720J81966k3314j1949K18296
4475C643275o0566j76821N1508J19467K8318q054J6855j86642M2936M3089P6375
4464C589740N6839p8581P8889l7847j13099o562q8122j52696J33828J04525P6757
4453C563671n520K36020p5419P7350M8168J44949J8656m9272k61460m8139j23659
4442C525345L07065K40479Q0833j28949J62387j14010N5292K84130l3620J36119
$$ plain form
4517 3717174 3700712 3579855 3552533 3398114 3437095 3671228 3751753 3628900 3647021 3634784 3537993
4506 3537993 3638572 3537757 3360769 3293729 3387960 3490088 3405461 3575003 3376293 3157672
4496 3157672 3259829 3315073 3404567 3454051 3501255 3469495 3386708 3431521 3513606 3325515 3399274
4485 3399274 3534835 3522431 3494019 3347042 3438996 3278276 3460242 3436928 3424979 3643275
4475 3643275 3582709 3405888 3457396 3576863 3605181 3597127 3613982 3427340 3470276 3513365 3589740
4464 3589740 3646579 3567998 3646887 3609040 3495941 3489379 3401257 3248561 3382389 3486914 3563671
4453 3563671 3558151 3794171 3718752 3796102 3844270 3989219 4007875 3958603 3697143 3649004 3525345
4442 3525345 3832410 4072889 4153722 4024773 4187160 4073150 4128442 4412572 4378952 4515071
4432D515071J19493P5410J10329L71239K46313j67272K09516K79331Q392K79233
4422F047055P1942J84354J22915l53954l29357j48258k57642m46811K7416J04707
4412E022367j52005j81434j8967k8361l94786r963N0715q1459J05344N837k05255
4401D112033o0206J12161j05283r7766J5450K23384j08784l55145J15826J35533
4391C987203m7660j32100K81324r6692Q1500l7305j23276N206N3441L4172j23650
4380C882163J04919J84423K12685J35691n7123J47283L00115j0870k1533M86067
4370E363820J42856J18182J52530J72007N2306n394J641j35414j37586k73743
4360E451205l91052r4980P7638j15787k33931m0819r4053j98997k75910J56013
$$ plain form
4432 4515071 4634564 4709974 4820303 5191542 5437855 5270583 5480099 5759430 5767822 6047055
4422 6047055 6118997 6303351 6426266 6072312 5742955 5594697 5337055 4890244 4917660 5022367
4412 5022367 4870362 4688928 4669961 4641600 4246814 4236851 4287566 4206107 4311451 4317288 4112033
4401 4112033 4051827 4163988 4058705 3960939 3976389 4199773 4090989 3735844 3851670 3987203
4391 3987203 3939543 3807443 4088767 3992075 4073575 4036270 3912994 3918200 3971641 4005813 3882163
4380 3882163 3987082 4171505 4384190 4519881 4462758 4610041 4910156 4899286 4877753 5363820
4370 5363820 5506676 5624858 5777388 5949395 6001701 5996307 5997948 5862534 5724948 5451205
4360 5451205 5060153 4965173 5042811 4927024 4693093 4652274 4558221 4359224 4083314 4239327
4350D239327J4048j5200j6332k73530k82890P8514j4480N3028R502k87332R0701
4339C595356R3987j087l1212j42266k7464k42673J90865J74935o3474r8082o478
4328C442407O5626j29467j68652k9145J36601J28699p6824o4122j1529p2834J82044
4317C402804K69657j30823k11963m0848n493P0381L2574J57138j56257q0348J67453
4306C474275M220O0083O3456p9113M3829l1033r4822k34095L18641K061Q5626
4295C613128J45932M0339j38879p7874k25569j37242m5245J57739L14703j72068
4285C474964J0183K64443R5725j01173J29829r898J02291n0901j14865j05637
4275C694961K61473J68057j89097k03876L5707K21456k94937n4708K13969n4204
$$ plain form
4350 4239327 4253375 4238175 4221843 3948313 3665423 3743937 3729457 3782485 3791987 3504655 3595356
4339 3595356 3689343 3688256 3657044 3514778 3487314 3244641 3435506 3610441 3546967 3448885 3442407
4328 3442407 3508033 3378566 3209914 3180769 3317370 3446069 3369245 3305123 3293594 3220760 3402804
4317 3402804 3672461 3541638 3329675 3288827 3283334 3353715 3386289 3543427 3387170 3306822 3474275
4306 3474275 3478495 3538578 3602034 3522921 3566750 3535717 3440895 3206800 3525441 3527502 3613128
4295 3613128 3759060 3799399 3660520 3582646 3357077 3219835 3174590 3332329 3647032 3474964
4285 3474964 3485147 3749590 3845315 3744142 3873971 3864073 3966364 3915463 3800598 3694961
4275 3694961 3956434 4124491 3935394 3731518 3767225 3988681 3693744 3639036 3853005 3798801
4265C798801j84681J47457O3937j02420j12216J27694J35086o2254O5628J16158
4255C993190k69125Q6259J68643j43820j82619N0635p6822J63855K7460J0469
4245C828125l4275k56574L6380J07472J4454R3831j23185K0355L26901J8422k74221
4234C757685l4785j21986L3276L2471J37883Q8977L9069o6558K9451P4961l5986
4223C934458N0815l5184o2873J47851K2227l03492O6432J09308J3009J02228j40930
4212C903849j2646O9079O0442J05270p1923M4532M7479j49161l1753O8001p8418
4201C954751K88967k6464m8793r0296J9592m9598J01209m7494j10467J64084J70814
4190D326305r9565K3927K22295M7716m1106J57600M8049j9226l295j45652J0616
$$ plain form
4265 3798801 3614120 3761577 3825514 3723094 3610878 3738572 3873658 3811404 3877032 3993190
4255 3993190 3724065 3810324 3978967 3835147 3652528 3703163 3626341 3790196 3817656 3828125
4245 3828125 3793850 3537276 3573656 3681128 3695582 3789413 3666228 3686583 4013484 4031906 3757685
4234 3757685 3722900 3600914 3634190 3666661 3804544 3893521 3932590 3866032 3895483 3970444 3934458
4223 3934458 3985273 3950089 3887216 4035067 4057294 3753802 3820234 3929542 3942551 4044779 3903849
4212 3903849 3891203 3960282 4020724 4125994 4054071 4098603 4146082 3996921 3965168 4033169 3954751
4201 3954751 4243718 4217254 4168461 4078165 4097757 4048159 4149368 4101874 3991407 4155491 4326305
4190 4326305 4226740 4250667 4472962 4520678 4479572 4637172 4685221 4665995 4662700 4517048 4527664
4179D527664l112k4306K9212J66964N3957N7893j9720O5399J14895o0573K72449
4168E180722J86043L14778k9551j62256K63966K19362J18631K95188L08869K79381
4158F975133K00600R4205k14745q4696l17889J91138j9915j00222k87090l04045
4148F132474J73385K14207k04460J29367K22678j0046O1915j9649q2281l9906
4138F577684R4441J0407K19035j3348Q7107K4474J47326k26740P7518J61778o423
4127G153259l40980q6392L53749J3208O8959j6108q2484j84708K3488j00585j95330
4116F606076j68145K42238K14059j20312p2229p3569j34053N4704J78292k3255
4106F703806j01204l20809M7055K33743Q966j28973N9872J93058J42943j96461
$$ plain form
4179 4527664 4524552 4500246 4529458 4696422 4750379 4808272 4788552 4853951 4968846 4908273 5180722
4168 5180722 5366765 5681543 5651992 5489736 5753702 5973064 6091695 6386883 6695752 6975133
4158 6975133 7175733 7269938 7055193 6970497 6652608 6843746 6823831 6723609 6436519 6132474
4148 6132474 6305859 6520066 6315606 6444973 6667651 6657605 6719520 6699871 6617590 6577684
4138 6577684 6672125 6682532 6901567 6888219 6975326 6999800 7147126 6920386 6997904 7159682 7153259
4127 7153259 6812279 6725887 7079636 7092844 7161803 7145695 7063211 6878503 6901991 6801406 6606076
4116 6606076 6437931 6680169 6894228 6773916 6701687 6628118 6494065 6548769 6727061 6703806
4106 6703806 6602602 6281793 6328848 6562591 6571557 6442584 6502456 6695514 6838457 6641996
4096F641996j0071M0310O8517O2268L29806K30009o7204J28957R2592J190J9619
4085G537989J43337p0552l6248N9582K7858K86434K88805k54089K78351J3213
4075H274680J2773L10131j40885M01k28136L65355J15764r9192J07791L15235
4065I033917K17978K06689J72799J05649J9522J63541L8283J62629r341n6050
4055A0055616r150J01423L77779J74312K62336r6681J21039j67857K44048L39020
4045A1401885L05384o04p3301K30394J60573K55368P2106K94282L27997K20091
4035A3194175J98658K99417K48507L47814J64958J31831M5373L64405J47403J45973
4025A5288514O3883M12973L75883L9589K02600L11680K58307N98625K18255j14679
$$ plain form
4096 6641996 6631925 6672235 6740752 6803020 7132826 7362835 7295631 7424588 7517180 7518370 7537989
4085 7537989 7681326 7610774 7574526 7634108 7661966 7948400 8237205 7983116 8261467 8274680
4075 8274680 8287453 8597584 8456699 8457100 8228964 8594319 8710083 8610891 8718682 9033917
4065 9033917 9251895 9458584 9631383 9737032 9756554 9920095 9958378 10121007 10111666 10055616
4055 10055616 10046466 10147889 10525668 10699980 10962316 10865635 10986674 10818817 11062865 11401885
4045 11401885 11707269 11706665 11633364 11863758 12024331 12279699 12351805 12646087 12974084 13194175
4035 13194175 13392833 13692250 13940757 14288571 14453529 14585360 14630733 14995138 15142541 15288514
4025 15288514 15352397 15765370 16141253 16180842 16383442 16695122 16953429 17552054 17770309 17655630
4015A7655630L21191K22684K69878K34785K30655L59090K25709K91303K31336
4006B0042261K8872K77101N3048L51112L36675L56345M31441N6910J74024J98037
3996B2305826J97526K21104K17544M92218J29948L90201M86517M71050J61339
3987B5073273M20041L32151K98574N76652L14105L25275N59467K69728M26944
3978B8596210M18535M43673M39232K85818J38420L95661M14181L0625K51119L30173
3968C1743647N01137K8870O10058L62255L15278M51635M10758O41299M29521M24800
3958C5919258M51919M88394N55084M63152M29911N62384N02800O38877Q11612
3949D0823391M12976M99495N11228L44365P85309O52574O46428M07793Q92644
$$ plain form
4015 17655630 17976821 18199505 18469383 18704168 18934823 19293913 19519622 19810925 20042261
4006 20042261 20071133 20348234 20401282 20752394 21089069 21445414 21876855 21933765 22107789 22305826
3996 22305826 22503352 22724456 22942000 23434218 23564166 23954367 24440884 24911934 25073273
3987 25073273 25493314 25825465 26124039 26700691 27014796 27340071 27899538 28169266 28596210
3978 28596210 29014745 29458418 29897650 30183468 30321888 30717549 31131730 31162355 31413474 31743647
3968 31743647 32244784 32273654 32883712 33245967 33561245 34012880 34423638 35064937 35494458 35919258
3958 35919258 36371177 36859571 37414655 37877807 38307718 38870102 39372902 40011779 40823391
3949 40823391 41236367 41735862 42247090 42591455 43376764 44029338 44675766 45083559 45976203
3940D5976203R77667J127201J094199J363578J089474J521966J529912J155661
3932E5835861J662082J840942K030633J951671K387191K577540K180681K270064
3924G2736665K831476L049481K986790K957763L435464L581445L854495M303468
3916I9737047M886249N676807O934241P579448Q943005J0426464J1841406J3924069
3908A69948736J5784080J8055995K0994743K4362505K7563337L1572759L4468546
3901C42750701L4745578L1624954K3295225Q325651j2636071l0257307l7727631
3894C60121100l5336925k7825963k0154321j4308889r905362p571210p059487
3887B37958943q055577j0271333j2240580j2882029j2264463j0907566r289559
$$ plain form
3940 45976203 46953870 48081071 49175270 50538848 51628322 53150288 54680200 55835861
3932 55835861 57497943 59338885 61369518 63321189 65708380 68285920 70466601 72736665
3924 72736665 75568141 78617622 81604412 84562175 87997639 91579084 95433579 99737047
3916 99737047 104623296 110300103 117234344 124813792 133756797 144183261 156024667 169948736
3908 169948736 185732816 203788811 224783554 249146059 276709396 308282155 342750701
3901 342750701 377496279 409121233 432416458 440742109 428106038 397848731 360121100
3894 360121100 324784175 296958212 276803891 262495002 252589640 245018430 237958943
3887 237958943 229903366 219632033 207391453 194509424 182244961 171337395 162047836
3880A62047836q114638p042153o452992o093483n691603m845635l723099k825077
3872A17259156k147348j540265o00177j42327L48408N92279Q15298J296211J559615
3863A17440850J660500J536258J779636J499080J515642N38866n44100j288392
3855A24138340k002158k795181l468696l717793m316554m116529l504172l526476
3847I6690781l153468k768450k715196k489090k054710k027383j670887j233431
3839G8578166r51173o69836q95174l33387k34555l59570l47396j44482m02828
3830G4239765m67460n67327m35424n29916n11310j61121r4720P9709M81387R80756
3820G3014339J007466J676058J851537J479538J092986L87227m28058j752424
$$ plain form
3880 162047836 153933198 146891045 140438053 134344570 128652967 123807332 120084233 117259156
3872 117259156 115111808 113571543 112971366 112829039 113177447 113769726 114585024 115881235 117440850
3863 117440850 119101350 120637608 122417244 123916324 125431966 125970832 125426732 124138340
3855 124138340 122136182 119341001 115872305 112154512 107837958 103721429 100217257 96690781
3847 96690781 93537313 90768863 88053667 85564577 83509867 81482484 79811597 78578166
3839 78578166 77626993 76957157 76061983 75728596 75494041 75134471 74787075 74642593 74239765
3830 74239765 73772305 73204978 72769554 72239638 71728328 71567207 71472487 71552196 72033583 73014339
3820 73014339 74021805 75697863 77549400 79028938 80121924 80509151 80081093 78328669
3812G8328669k221157k673744k945187k315901j856762j559089j093098q96241
3804F2767490q03471l44949m10408m96909J50162K5413n8108K59614M3166k8146
3794F1103854L43857J83188K54513M86845N10022N19750J001700J178699Q02441
3785F6384869J184797J170376J357399J462941J451072J488975J719147J730952
3777G7950528J800320J806365J787576J764145J881836J537332J131896P17019
3769I0377017M6740J0931r94552j652075j812533k009409j905992k096466j714958
3760G8248703j671883j723824j140848j086725j035665l51294l04655j44781K99462
3751G1088490L58722O07838Q36317P86482Q38865O57880Q50879J174834J175826
$$ plain form
3812 78328669 76107512 73433768 70488581 68172680 66315918 64756829 63663731 62767490
3804 62767490 61964019 61619070 61208662 60711753 60861915 60887328 60829220 61088834 61132000 61103854
3794 61103854 61447711 61630899 61885412 62372257 62882279 63402029 64403729 65582428 66384869
3785 66384869 67569666 68740042 70097441 71560382 73011454 74500429 76219576 77950528
3777 77950528 79750848 81557213 83344789 85108934 86990770 88528102 89659998 90377017
3769 90377017 90423757 90434688 89440136 87788061 85975528 83966119 82060127 79963661 78248703
3760 78248703 76576820 74852996 73712148 72625423 71589758 71238464 70933809 70789028 71088490
3751 71088490 71447212 72055050 72891367 73677849 74516714 75174594 76025473 77200307 78376133
3742G8376133Q54165P36596L21175k32362o11004o01982j135039j142453j261342
3733G5303887r11565o68816l14727k35020o15939j45123j25881L87374J76403
3724G2850593L97943R65314J047720J298714J328341J039413O76453M34808K80527
3715H0319826K44172Q35922J552614K353089K847684L051544L249683K862900
3707I7317434J953858o52832k690485l282054l139180k125504j330087n11664
3699H5539486o28077l28749n07616q06271r50958q85295q36496p84711n78469
3690G9232844k40987k74512j04778P82462J065380J353088K021644K338574K666970
3681H8840685K236800J583921J009395J023763J622824K519231L452974L989482
$$ plain form
3742 78376133 79230298 79966894 80288069 80055707 79444703 78842721 77707682 76565229 75303887
3733 75303887 74392322 73723506 73408779 73173759 72557820 72412697 72286816 72674190 72850593
3724 72850593 73248536 74213850 75261570 76560284 77888625 78928038 79604491 80039299 80319826
3715 80319826 80563998 81399920 82952534 85305623 88153307 91204851 94454534 97317434
3707 97317434 99271292 98618460 95927975 92645921 89506741 87381237 86051150 85539486
3699 85539486 84911409 84582660 84075044 83268773 82317815 81432520 80596024 79811313 79232844
3690 79232844 78991857 78717345 78612567 79395029 80460409 81813497 83835141 86173715 88840685
3681 88840685 91077485 92661406 93670801 94694564 96317388 98836619 102289593 106279075
3673A06279075M431001M638078L763720K497968o94443n581970q205973q367675
3665I8759781p204400n737568m930268l973807l637035l309372l011924k828152
3657F4127255k574033k178831j938790j425364j561874j289052r01712j111196
3649E1146403p50644o77023m62112k59160o20264r02299k08555j05032j32588
3640D7028726k63077J08442O1702k2112l8290k38708j85487M5545m6713j04647
3630D6345381J36469L03006J76628L26805M39964O92878L79937N92374O67702
3621E0061144O06000L12484N06054N60077J50482J65857K71422L08214N8781J76483
3611E3176998K53082L12225M39236K27251M77194P91646J293785R58389J246032
$$ plain form
3673 106279075 110710076 115348154 119111874 121609842 120915399 115333429 107127456 98759781
3665 98759781 91555381 85817813 80887545 76913738 73276703 69967331 66955407 64127255
3657 64127255 61553222 59374391 57435601 56010237 54448363 53159311 52257599 51146403
3649 51146403 50395759 49718736 49256624 48997464 48377200 47474901 47266346 47161314 47028726
3640 47028726 46765649 46874091 46935793 46913681 46875391 46636683 46451196 46496741 46450028 46345381
3630 46345381 46481850 46784856 46961484 47288289 47728253 48421131 48801068 49393442 50061144
3621 50061144 50667144 50979628 51485682 52045759 52196241 52362098 52633520 52941734 53000515 53176998
3611 53176998 53430080 53742305 54181541 54408792 54885986 55677632 56971417 57929806 59175838
3602E9175838J320540J345930J522432J430079J732231J620200J088913J385459
3594G0621622J063176O67093L59274L69824N99622M22049K74599q1360j15384
3585G4180515K63767j03515O1926K97585J93096N79243M41914N72634M27647P49165
3575G7663977R22354J025740Q11035R67725O35419R46155R91661P88153M45315
3566H5197534P02286N77229L07435O4202K52444J17303J71404n032j41763j1479
3556H7231563m08434k68514m45285p00018p84449j144445o16355o84590r76767
3547H1202706p31135p47090l85781k90563j07024k58681N1235M77340J26946J99374
3537G9537327J05095o2443j42741l01901o24252o30149r57266j280450j293752
$$ plain form
3602 59175838 60496378 61842308 63364740 64794819 66527050 68147250 69236163 70621622
3594 70621622 71684798 72351891 72711165 73080989 73680611 74102660 74377259 74295899 74180515
3585 74180515 74444282 74340767 74402693 74700278 74893374 75472617 75914531 76487165 76914812 77663977
3575 77663977 78586331 79612071 80423106 81390831 82026250 82972405 83964066 84752219 85197534
3566 85197534 85899820 86477049 86784484 86848686 87101130 87218433 87389837 87384805 87243042 87231563
3556 87231563 86823129 86554615 86109330 85409312 84624863 83480418 82864063 82179473 81202706
3547 81202706 80471571 79724481 79338700 79048137 78941113 78682432 78733667 79211007 79337953 79537327
3537 79537327 79642422 79579979 79437238 79135337 78511085 77880936 76923670 75643220 74349468
3528G4349468j776508j505115j554249j439620j656435j412559j015268j118605
3520F2871109j160851r75298o69245n43774o71506l75538q4345l8379q5151k40438
3510E8026584K8793j12664n6589m33017p00721k67230m06355p43071n25091m22421
3500E4388218n19645p48104o06405q15770p63752m76137n34103m7856l12624j32241
3490D9431581j39982j4082K29182K63204L41141L50872M62082L44797M89980K54526
3480E2013301L14891M65982K83206J1275K03871J94820o3463l39614j19590M8282
3470E3012961K04617K99908K87951K38122L02826N09543P05745R00833Q79707
3461E7342213P03899R85103J036889J140466Q24325P71779J142890R79845J266772
$$ plain form
3528 74349468 72572960 71067845 69513596 68073976 66417541 65004982 63989714 62871109
3520 62871109 61710258 60734960 60065715 59521941 58850435 58474897 58390552 58352173 58267022 58026584
3510 58026584 58055377 57942713 57886124 57453107 56752386 56485156 56078801 55335730 54810639 54388218
3500 54388218 53868573 53120469 52514064 51698294 50934542 50458405 49924302 49876446 49563822 49431581
3490 49431581 49291599 49277517 49506699 49769903 50111044 50461916 50923998 51268795 51758775 52013301
3480 52013301 52328192 52794174 53077380 53088655 53292526 53487346 53423883 53084269 52964679 53012961
3470 53012961 53217578 53517486 53805437 54043559 54346385 54855928 55561673 56462506 57342213
3461 57342213 58046112 59031215 60068104 61208570 62032895 62804674 63947564 64927409 66194181
3452F6194181J030519R03641J177242Q95610P41638P27192P73094N55764R16623
3443G3915504O32718L96445M07223O22635O39555P33020O91066R04936J118878
3434H0061980J000922J361997J384605J552723J551557J743041J450425J782101
3426I1889351J609813J852731J450298J097430J259446J195026R65145Q32961
3418A02152201M43072M65703K89518O51630O60175P17004M73822J278255J258981
3409A08390361J157517J437075J577450J798291J751277J387132J465776J758086
3401A20722965J633863J658705J531352J642282J443331J364973J522770J003216
3393A32523457N62717O0877l09350O8582N0964j77000k54783j87114l61420k67791
$$ plain form
3452 66194181 67224700 68128341 69305583 70201193 70942831 71670023 72443117 72998881 73915504
3443 73915504 74548222 74944667 75351890 75974525 76614080 77347100 78038166 78943102 80061980
3434 80061980 81062902 82424899 83809504 85362227 86913784 88656825 90107250 91889351
3426 91889351 93499164 95351895 96802193 97899623 99159069 100354095 101319240 102152201
3418 102152201 102595273 103060976 103350494 104002124 104662299 105379303 105853125 107131380 108390361
3409 108390361 109547878 110984953 112562403 114360694 116111971 117499103 118964879 120722965
3401 120722965 122356828 124015533 125546885 127189167 128632498 129997471 131520241 132523457
3393 132523457 133086174 133147051 132837701 132906283 132957247 132780247 132525464 132338350 131976930 131709139
3383A31709139m54908j092268r36388m76751n96262q82080r54930n00509n68174
3374A25246869m35189p64767o56230p30922q86772j263924j294866j258587j483825
3365A16471787j627464j540147j541205j459439j380239j655654j645343j632731
3357A03989565j816218j718242j361387j141590j290869j254734j213087j282861
3349I2910577q79526r01123r42728r72149q39339r33762j046416q50894j060344
3340H4484296q65161r14682q93837p75576o38367p79720r79313p45305q53969
3331G7038366j034356r65712q08972o45624p81127q28816o54865o31640q13721
3322F9873533n22846p17188n78617p73423j011553p80271o66136q65670o04251
$$ plain form
3383 131709139 131254231 130161963 129225575 128748824 128152562 127270482 126315552 125815043 125246869
3374 125246869 124811680 124046913 123390683 122659761 121772989 120509065 119214199 117955612 116471787
3365 116471787 114844323 113304176 111762971 110303532 108923293 107267639 105622296 103989565
3357 103989565 102173347 100455105 99093718 97952128 96661259 95406525 94193438 92910577
3349 92910577 92031051 91129928 90187200 89215051 88375712 87441950 86395534 85544640 84484296
3340 84484296 83619135 82704453 81810616 81035040 80396673 79616953 78637640 77892335 77038366
3331 77038366 76004010 75038298 74229326 73583702 72802575 71973759 71318894 70687254 69873533
3322 69873533 69350687 68633499 68054882 67281459 66269906 65489635 64823499 63957829 63353578
3313F3353578p15535o26998n68755p97804o05715p46079m21513n12180n36440
3304E7822559r03606m90387o47021n82329n79398p66663m35193n25741n91714
3295E2300507q87145n04381n31915n67411o78412n88492m66010m94465m27993
3286D7154283n34167n54700m72039m14735l39322m21140l17477m70839n00520
3277D3129344l46927m38679m89621j78146n07685m69727k90104r9269m30873l60264
3267C9518049m4291j11431j30297j89759j78172j12920k9038j38690j35836r9615
3257C8348000J02977L3574P4544j82854j03350p6403m25655j01001l0284l4043
3247C7605505p757j15225k6997m5946L5489k66370J26627k9857R781J48856J64770
$$ plain form
3313 63353578 62638043 62011045 61442290 60644486 60038771 59292692 58871179 58358999 57822559
3304 57822559 56918953 56428566 55781545 55199216 54619818 53853155 53417962 52892221 52300507
3295 52300507 51413362 50908981 50377066 49809655 49131243 48542751 48076741 47582276 47154283
3286 47154283 46620116 46065416 45593377 45178642 44839320 44418180 44100703 43629864 43129344
3277 43129344 42782417 42343738 41854117 41675971 41168286 40698559 40408455 40309186 39878313 39518049
3267 39518049 39473758 39362327 39232030 39042271 38864099 38751179 38722141 38583451 38447615 38348000
3257 38348000 38450977 38484551 38559095 38376241 38272891 38196488 37770833 37669832 37639548 37605505
3247 37605505 37597748 37482523 37455526 37409580 37445069 37178699 37305326 37275469 37285250 37434106 37598876
3236C7598876K19179K64723L1892K2453J75165J96661N4074J03628J38819J87484
3226C8992954K02286K42156J20899J09437j96796k70025m6452J26935k3349J81508
3216C9439553p9615L7925n0619O1760R7061m7837L94125J80187P2049L65476K46054
3205D0716119R8119J00238M29696J52216J30298K76848J74366J85666K48896L23866
3195D2836328J70278K2330J28840K36784J54030K93613P3320J8551J90372J03004
3185D4227450K1596J05189K41069J59917q2817n9720o2696q9333l48655n0325
3175D4061675K04146q9961l16111J43413k61486R578k32326l20217r8905l5901
3165D3063905k33068r2395r695k02412j78573j56912l03099j72251k46352k81828
$$ plain form
3236 37598876 37818055 38082778 38114670 38137123 38312288 38508949 38563023 38666651 38805470 38992954
3226 38992954 39195240 39437396 39558295 39667732 39470936 39200911 39154459 39281394 39258045 39439553
3216 39439553 39359938 39397863 39347244 39409004 39506065 39458228 39852353 40032540 40104589 40470065 40716119
3205 40716119 40814238 40914476 41344172 41496388 41626686 41903534 42077900 42263566 42512462 42836328
3195 42836328 43006606 43028936 43157776 43394560 43548590 43842203 43915523 43934074 44124446 44227450
3185 44227450 44249046 44354235 44595304 44755221 44672404 44612684 44549988 44460655 44112000 44061675
3175 44061675 44265821 44175860 43859749 44003162 43741676 43751254 43518928 43198711 43099806 43063905
3165 43063905 42830837 42738442 42728747 42526335 42347762 42190850 41887751 41715500 41469148 41187320
3155D1187320j66289l04066m94677k78903k11466l38444m48907l60009k38669
3146C8345890M1698j25224m13339j29008j03128k51340k70559j16223k46625M9156
3136C6781298l5910j44264m7000j13764k72442o6186j82665j55791n14309l35743
3126C4913224l69365n14157l59586o26073n5054o49290l50112l36101k55877k75136
3116C1122473o28351k56040m87169n93485o99464l59243k60776j89053n81274
3107B7067618k64474j47335k43677k90764k53555k19018l74718k44673k66457
3098B4762947k08247p6926n1988j56437q7603j2924j74129k96328j66677P5738
3088B3607426k9822j26649j25436r1786l23613l84661j14495j96203k5316j91721
$$ plain form
3155 41187320 41021031 40716965 40222288 39943385 39731919 39393475 38944568 38584559 38345890
3146 38345890 38387588 38262364 37849025 37720017 37616889 37365549 37094990 36978767 36732142 36781298
3136 36781298 36745388 36601124 36554124 36440360 36167918 36101732 35919067 35763276 35248967 34913224
3126 34913224 34543859 34029702 33670116 33044043 32988989 32339699 31989587 31653486 31397609 31122473
3116 31122473 30494122 30238082 29750913 29157428 28457964 28098721 27837945 27648892 27067618
3107 27067618 26803144 26655809 26412132 26121368 25867813 25648795 25274077 25029404 24762947
3098 24762947 24554700 24477774 24425786 24269349 24181746 24168822 23994693 23698365 23531688 23607426
3088 23607426 23577604 23450955 23325519 23233733 22910120 22525459 22410964 22214761 22189445 21997724
3078B1997724m69437J1051j50857j01369j22118q0103n4054j19142m1218K2398
3068B0892875k45054j86179n9778J22072l7375J64174J4553J5653L55855R3847
3058B1130643o007L01787K34800p8722l6945l0249j34804k82566p7865o71353
3048B0348719j62976j88313m07525j04079j68175r5256Q754K3047K38407k2248
3038A9470355Q7833J40014M48502K42432K05474L30745L33734M35666P82010L98969
3028B2875734K20182l6248K31236J38374k17123l76817n45857q13764p63649k47856
3018B0464212l95248m42557l52987Q6961j06581p2357M9624j01117L766L59852
3008A9493568L78722K7589L19331M52753N63882P87005N32286O34219L03501j10023
$$ plain form
3078 21997724 21528287 21539338 21388481 21287112 21164994 21084891 21030837 20911695 20870477 20892875
3068 20892875 20647821 20461642 20401864 20523936 20486561 20650735 20665288 20680941 21036796 21130643
3058 21130643 21124636 21426423 21661223 21582501 21545556 21515307 21380503 21097937 21020072 20348719
3048 20348719 20185743 19997430 19589905 19485826 19317651 19222395 19231149 19254196 19492603 19470355
3038 19470355 19558188 19698202 20146704 20389136 20594610 20925355 21259089 21694755 22476765 22875734
3028 22875734 23095916 23059668 23290904 23429278 23212155 22835338 22289481 21475717 20712068 20464212
3018 20464212 20068964 19626407 19273420 19360381 19253800 19181443 19231067 19129950 19133716 19493568
3008 19493568 19872290 19899879 20219210 20671963 21235845 22022850 22555136 23189355 23492856 23382833
2998B3382833j74832n43862n53616l64139l39678l67852k90763j26900j35673
2989B0485518j54993l81909k12019j32529k23459J94294J89484l0906L3136J4699
2979A9781316N3030L40926M81408K04282k79296q8433l96155n98613m79655m78990
2969A8539820k62686m31324k17820l72350k13041l05228l21775k29610m6495k50860
2959A5888631l40329m26617j39974q9806p1076k95236l4823o3776k95275r3239
2949A4038480j32501j31626O0448l4620N9839k67352r6971J7535L38774p3728
2939A3778278q2456J12105j00888Q7810j12421J88068n562j15297j25955m61626
2929A3162056l12351l45108k62265j1704m23099l87671l26326r9614J84820j53213
$$ plain form
2998 23382833 23208001 22664139 22110523 21746384 21406706 21038854 20748091 20621191 20485518
2989 20485518 20330525 19948616 19736597 19604068 19380609 19574903 19764387 19733481 19766617 19781316
2979 19781316 19834346 20175272 20656680 20860962 20581666 20493233 20097078 19498465 19018810 18539820
2969 18539820 18277134 17845810 17627990 17255640 17042599 16737371 16415596 16185986 16139491 15888631
2959 15888631 15548302 15121685 14981711 14891905 14820829 14525593 14490770 14426994 14131719 14038480
2949 14038480 13905979 13774353 13834801 13800181 13860020 13592668 13495697 13513232 13852006 13778278
2939 13778278 13695822 13807927 13707039 13794849 13682428 13870496 13864934 13749637 13623682 13162056
2929 13162056 12849705 12504597 12242332 12230628 11807529 11419858 11093532 10993918 11178738 11025525
2919A1025525j55498j06690R1328j82313q994j08908k05344J42558R6338j06971
2909A0481031k3649Q5144k46695p7702k4496l42057k48712k20712m29117j10331
2899H842704j97377j71633l02302l36465J20185l0672l53286o6936l26914o9116
2889G108188l36143k24138L02298K15890k10965k47775k06361j75941j04353l701
2879F116999N5999J34184k15341j66752o9550j30941k0791k61290j9176N2969
2869E476310r3150j8229q7347j1335k26310n0850k31713j786j30567k25373J60454
2858D560104J31263j28216k750n1192m9530l23512R5315K59674j79051J8558r1027
2847D239636l04679N7855o0482k29178J42892L44015j38968k28788j23239k83295
$$ plain form
2919 11025525 10870027 10763337 10854665 10672352 10663358 10554450 10349106 10491664 10588002 10481031
2909 10481031 10457382 10542526 10295831 10218129 10193633 9851576 9602864 9382152 8953035 8842704
2899 8842704 8645327 8473694 8171392 7834927 7955112 7924440 7571154 7504218 7177304 7108188
2889 7108188 6772045 6547907 6850205 7066095 6855130 6607355 6400994 6225053 6120700 6116999
2879 6116999 6172998 6307182 6091841 5925089 5855539 5724598 5703807 5442517 5423341 5476310
2869 5476310 5383160 5364931 5277584 5266249 5039939 4989089 4757376 4755590 4625023 4399650 4560104
2858 4560104 4691367 4563151 4560401 4509209 4459679 4136167 4231482 4491156 4312105 4330663 4239636
2847 4239636 3934957 3992812 3932330 3703152 3846044 4190059 4051091 3822303 3699064 3415769
2837C415769J23310l2535K59370j13120q2735j5439R8971N8938j51176o6491j47861
2826C347001m4430n6424J21959J97028P9517p3222m2401m38197K59681J38456
2816C488968k65810R6894J46342j32009j04319p2654j30976J2112K3584J74157
2806C236289p562k23588K57731K8501j51665j23290j10290J93933m4971J52448
2796C207536j17941l7977r1715L10765n1000l48896J70734M3826l71874j9865
2786B693593J38715M6990j84277n237J08987N2849J9905J0480o0133j62771m4383
2775B614718R5617k3990j13396J60486m4894q7892j98787j52053K04999M9550
2765B504358J88206j5265q2294k94651K37077J89029k98006P7732K02806O6255
$$ plain form
2837 3415769 3539079 3506544 3765914 3652794 3570059 3554620 3653591 3712529 3561353 3494862 3347001
2826 3347001 3302571 3246147 3368106 3565134 3644651 3571429 3529028 3090831 3350512 3488968
2816 3488968 3223158 3320052 3466394 3334385 3230066 3157412 3026436 3038548 3062132 3236289
2806 3236289 3228727 3005139 3262870 3291371 3139706 3016416 2906126 3100059 3055088 3207536
2796 3207536 3089595 3051618 2959903 3270668 3219668 2870772 3041506 3085332 2713458 2693593
2786 2693593 2832308 2879298 2695021 2689784 2798771 2851620 2871525 2882005 2821872 2659101 2614718
2775 2614718 2710335 2686345 2572949 2733435 2688541 2600649 2401862 2249809 2454808 2504358
2765 2504358 2692564 2677299 2595005 2300354 2537431 2726460 2428454 2506186 2708992 2775247
2755B775247L3479j98668m0399j19385J971K62168k05992o9130K5777q2913Q976
2744B391131K52652K7503j72990J06174O7986j68121J06063P687n6768J9093l8434
2733B541976k2481j53031J26762R475j5724j09073j28723J06132j7382J1954J08239
2722B458124K1365j64388j00961J23987Q6690l19585J2907N8449M785r0568J10191
2711B200996q951m8181M0764n7674J24567K7757p9756R0617o9367m09266q1831
2700A729675J26525P3801j27133J09589p1661l2659Q9105j25471j61691J9304
2690A629384J18473L9817j6312j96629J27164N190k88308R3200J85456n167j08904
2679A583364p1786J26109K53803j13839l06332r9721j33108J05650j79189J36225
$$ plain form
2755 2775247 2808726 2610058 2569659 2450274 2452245 2714413 2508421 2439291 2465068 2382155 2391131
2744 2391131 2643783 2671286 2498296 2604470 2672456 2504335 2610398 2618085 2561317 2580410 2541976
2733 2541976 2519495 2366464 2493226 2502701 2486977 2377904 2249181 2355313 2337931 2349885 2458124
2722 2458124 2479489 2315101 2214140 2338127 2424817 2105232 2118139 2176588 2181373 2090805 2200996
2711 2200996 2192045 2143864 2184628 2126954 2251521 2279278 2199522 2290139 2220772 1811506 1729675
2700 1729675 1856200 1930001 1802868 1912457 1840796 1808137 1897242 1771771 1610080 1629384
2690 1629384 1747857 1787674 1771362 1574733 1701897 1707087 1418779 1511979 1697435 1692268 1583364
2679 1583364 1511578 1637687 1891490 1777651 1471319 1371598 1238490 1344140 1164951 1301176
2669A301176K87486l08207J19875j42462M2983j21709k73793J37371p8279k07726
2659G56715K5821K16613L24750Q1632k0540j18705j94403j12255k6309L7955R203
2648I80477J58301o6697R4590N8241j02211J09157N3672j13429J1132j77682j7611
2637I87940k57438j25643o3315q9849J77087K51800j1655k30093J17664P9491
2627H35989j97515j03332K2127J79053j81171J16797o7080k5753J2873J98447
2617G90435n2209j14502J52633q4194o9752m9219q302J24363j70024j51894l6261
2606C31074R2335K10347q0343j55947K8369N5475J77428J19584j58906k34821
2596C84595j23066J1152j46642J64497L21295O7204r0065M8732j02086j26418
$$ plain form
2669 1301176 1588662 1280455 1400330 1257868 1300851 1179142 905349 1042720 964441 756715
2659 756715 782536 999149 1323899 1405531 1384991 1266286 1071883 959628 933319 971274 980477
2648 980477 1138778 1072081 1166671 1224912 1122701 1231858 1285530 1172101 1183233 1005551 987940
2637 987940 730502 604859 541544 451695 628782 880582 868927 638834 756498 835989
2627 835989 638474 535142 557269 736322 555151 671948 604868 579115 591988 790435
2617 790435 738226 623724 776357 692163 622411 573192 564890 689253 519229 367335 331074
2606 331074 423409 633756 553413 397466 425835 481310 658738 778322 619416 384595
2596 384595 261529 272681 126039 290536 611831 679035 588970 637702 535616 409198
2586D09198k5894J90322N0903j7836j16331R6366q4426j6340K23822j36378l1164
2575E42242p3287m0848j18191J31399J05959p5593r8743n357o5257j9255J48277
2564D31346j78586L7878J72060j19470l39925l2891K18428J83412k807r1173j76194
2553A02078K41991K26046j53368j63851k60121J05145k41064N4863L84618R6503
2543C92840j39104j02491J52522M2180m1462q3954K86360j95828j49503j19000
2533D2560k9208M7690J30529n9043r92M1700K15490O3252n0712n8342q4695J36409
2521C94638k2164r02j29224j4100K03887J0625j37769j95095J25471P290j1203
2510B31454l2043N802p0233R2049J69554j82446j80055J72325M7478j86714j94181
$$ plain form
2586 409198 383304 573626 624529 606693 490362 586728 502302 485962 709784 573406 542242
2575 542242 468955 428107 309916 441315 547274 471681 372938 367581 302324 283069 431346
2564 431346 252760 290638 462698 343228 3303 -29588 188840 372252 369445 278272 102078
2553 102078 344069 570115 416747 252896 -7225 97920 -143144 -88281 296337 392840
2543 392840 253736 151245 303767 345947 304485 220531 506891 311063 161560 42560
2533 42560 13352 61042 191571 132528 131536 173236 388726 451978 401266 342924 258229 394638
2521 394638 372474 371572 242348 228248 432135 442760 304991 109896 235367 242657 231454
2510 231454 199411 205213 134980 227029 396583 214137 34082 206407 253885 67171 -127010
2499a27010O6721K29846J56603k15215m8609J22199J10869k92192J92082K31526
2489D26820j3331k66524j46518J46700r105l5645q689P7345k55468O104p6870
2478a55181M95859j26651Q15J52672k29562r646Q7558J52911Q1603l39367J4352
2467A25363m4367J27939j2503p6506J14849k25257K7436J7458l2566n1291J34044
2456A04599r5056K4571j27952m1929J63346J62016L0273o4757J90040l3037q8685
2445B23429K6427J32613l64527N3772M9766J10611j13494q071J68564k6300K4074
2434B76864o6096j88055k00649L63489M5492k91656L0075Q5930K71344k16799
2424A09939L9354L9097j22335M3026J70849m5749n1311p9874K73143P1552m66486
$$ plain form
2499 -127010 -60289 169557 326160 110945 62336 184535 295404 3212 195294 426820
2489 426820 413489 146965 447 147147 138042 102397 93708 171053 -84415 -78311 -155181
2478 -155181 340678 214027 214842 367514 137952 128306 215864 368775 450378 111011 125363
2467 125363 80996 208935 196432 119926 234775 9518 36954 54412 21846 -29445 104599
2456 104599 9543 34114 -93838 -135767 27579 189595 219868 155111 345151 312114 223429
2445 223429 249856 382469 17942 71714 121480 232091 118597 110526 279090 252790 276864
2434 276864 210768 22713 -177936 185553 231045 -60611 -30536 55394 326738 109939
2424 109939 149293 188390 66055 109081 279930 234181 182870 102996 376139 447691 -18795
2413a8795j59905L71658O6046m14749K67948K75743j60234j5348Q462m0343L4069
2402B14552M616j9145q2826m5377o0351K87229N2207j07385j19857j24037L8161
2391C7787J77847j4964k59010N139O8968Q3656q2738L7131J42721m5344O8837
2380B20030j6566K1851M209J08632j33628j23199k8944j6041n2737L2895n9435
2369d2933j39547K01980K36172q9930n1190j55680J81502O2445q2836K41014r3015
2358B67982k79733J26464L8557q7572K18545J35023l35259k67232P0002K00568
2348H7345J9282K5435N9753R1095j30210p7395R7704Q4812j4152k16794o9826
2337d2951j2784J98029N2741o0645l0928j65114J60693J98103J56529j21378j78928
$$ plain form
2413 -18795 -178700 192958 259004 -155745 112203 387946 227712 212364 220826 180483 214552
2402 214552 219168 200023 117197 71820 11469 298698 350905 243520 123663 -374 37787
2391 37787 215634 200670 -58340 -53201 15767 99423 16685 53816 196537 151193 220030
2380 220030 203464 225315 229524 338156 204528 81329 52385 36344 -16393 16502 -42933
2369 -42933 -182480 19500 255672 165742 114552 -41128 140374 202819 119983 360997 267982
2358 267982 -11751 114713 153270 65698 284243 419266 84007 -183225 -113223 87345
2348 87345 106627 132062 191815 282910 152700 75305 173009 257821 243669 26875 -42951
2337 -42951 -55735 142294 195035 134390 103462 -61652 99041 297144 453673 332295 153367
2326A53367J90020k1037r1911O8143J05084k7678r5744N1246o5864R7923J64491
2315E28040m9206l1457k79971M1323J55080o5640R4185J01390j7577m9945J5809
2304D42031K40703K74548O9341j94338o1331j75043J17656J59195m3836j89008
2294F39918k54580N7961Q0834K6039K11283k15836j39272L9888j7914j81281K8185
2283B75225J95257n6576m9123Q6437k3209j72190K635Q1334N1839O587k98671
2272I9545J47223K2265j70597J29672o8738k4532O0559L14804p9632N1795j68182
2261C14182L4695j31785N2495j41526o7159Q5492K10685K94245k58505J12306
2251E05125j04484k700k7481K2949j58471j62043K43719J62918j43216l3751J19196
$$ plain form
2326 153367 343387 322350 230439 298582 403666 375988 280244 331490 265626 363549 528040
2315 528040 478834 447377 167406 208729 363809 298169 392354 493744 476167 426222 442031
2304 442031 682734 957282 1026623 832285 770954 595911 713567 872762 828926 639918
2294 639918 385338 443299 524133 550172 761455 545619 406347 446235 428321 247040 275225
2283 275225 470482 413906 364783 451220 428011 255821 258456 339790 391629 398216 99545
2272 99545 246768 269033 98436 228108 159370 134838 195397 510201 430569 482364 314182
2261 314182 348877 217092 269587 128061 60902 146394 357079 651324 392819 505125
2251 505125 400641 397941 370460 393409 234938 72895 316614 479532 336316 302565 421761
2240D21761J07172q5788r5723J13347m36004K1106L42370Q5846j8372k15002Q5076
2229C25789R0854L6212N95K99457j92301M761O9802k8898J00995l4692J6705J3015
2217G02294j39217j48207J36756m7252J43197j05047Q9645J608k75586j62843
2207A95348K89556P5340o6554m0555M6373j13791J33629k25651o5656M4298O6831
2196C39168K69049L09407j29443L5170j62198j62372Q4338L40940j33669j30438
2186F59952k4162j06701K10501K07217K81006k75463j37340n9940M6487L7545
2176H39102J68326J8715J77884k23772M2328J7558k06945J51321n1262J61006
2166A094261Q4947j16063Q7119K1277N9793n4787L4282j16895J17351J63485n791
$$ plain form
2240 421761 528933 443145 347422 460769 24765 45871 388241 474087 455715 240713 325789
2229 325789 416643 452855 453450 752907 560606 565367 635169 606271 707266 672574 689279 702294
2217 702294 563077 414870 551626 504374 647571 542524 632169 633777 358191 195348
2207 195348 484904 560244 493690 453135 499508 385717 519346 293695 228039 272337 339168
2196 339168 608217 917624 788181 823351 661153 498781 583119 924059 790390 659952
2186 659952 635790 529089 739590 946807 1227813 952350 815010 755070 801557 839102
2176 839102 1007428 1026143 1204027 980255 1022583 1040141 833196 984517 933255 1094261
2166 1094261 1179208 1063145 1150264 1171541 1231334 1176547 1210829 1093934 1211285 1374770 1368979
2155A368979j49771J15588J60102O708j37305K70057q682J79317j3489Q5661K60315
2144B137480q669n9453R8594J42395j807J87603K14443J99729P4031R1751p7140
2133B998957j71558L2482J19275K0319J42600l2032K1496o0873L0022J36501N6952
2122C294141q798K9734L97691K2433j30860j93253L23436o3035m729L79958p2121
2111C974597J19104O2056M8840J73000L7734J14686r8237K57457N4542K68428
2101E012207M6477K16768K21358K40587N5045K6645K33848L23483K59356K65630
2091F901404L62922M96127L58052P16333M12044M69955M21376L90044P21192P62604
2081A2012053O60788N67087O15234Q13164O08113R73744J326015J301368J756484
$$ plain form
2155 1368979 1219208 1334796 1494898 1501606 1364301 1634358 1625676 1804993 1791504 1877165 2137480
2144 2137480 2128811 2069358 2167952 2310347 2308540 2496143 2710586 2910315 2984346 3076097 2998957
2133 2998957 2827399 2859881 2979156 2999475 3142075 3110043 3131539 3070666 3100688 3237189 3294141
2122 3294141 3285343 3315077 3712768 3735201 3604341 3411088 3734524 3671489 3666760 4046718 3974597
2111 3974597 4093701 4155757 4204597 4377597 4415331 4530017 4431780 4689237 4743779 5012207
2101 5012207 5058684 5275452 5496810 5737397 5792442 5819087 6052935 6376418 6635774 6901404
2091 6901404 7264326 7760453 8118505 8834838 9246882 9716837 10138213 10528257 11249449 12012053
2081 12012053 12672841 13239928 13855162 14668326 15276439 16250183 17576198 18877566 20634050
2072B0634050J953032K308724K934089K607024L058768L652416M811140N785842
2064D7745085O861542Q013080J0539204J2911371J4809488J7324995J5743507
2057A33948272J2861489q586567k3377065k5829776j9602887j2371833q867888
2050D8173745o321842n361574m203742k949077k155638j913054j381562k008577
2042B1878679j668583j636373j830188j483924j096077q91702p47306r79690r55389
2033A0589447q38949m98377m59412N1133o75456m24696j45830j46878j47006j48453
2023G155523l86942j74684k85412n16237m25135O750q6608j51835l94006p8411
2013D663003J52921m68023j12296q6941o6321j49449k49430k28139j50025n4115
$$ plain form
2072 20634050 22587082 24895806 27829895 30436919 33495687 37148103 41959243 47745085
2064 47745085 54606627 62619707 73158911 86070282 100879770 118204765 133948272
2057 133948272 146809761 138223194 114846129 89016353 69413466 57041633 48173745
2050 48173745 41851903 36490329 32286587 29337510 27181872 25268818 23887256 21878679
2042 21878679 20210096 18573723 16743535 15259611 14163534 13271832 12524526 11544836 10589447
2033 10589447 9750498 9252121 8792709 8843842 8168386 7743690 7597860 7450982 7303976 7155523
2023 7155523 6768581 6593897 6308485 5792248 5367113 5373863 5287255 5135420 4741414 4663003
2013 4663003 4815924 4347901 4235605 4148664 4082343 3932894 3683464 3455325 3305300 3251185
2003C251185j42674j93529j20137k62490r6033J98365j78850O8243j36243k1583
1993B366254k8149J05613Q9790k13595j15173J72045k78255j40641j13395L5317
1983A879811M4394R2101l09101p783j1080m0296j08129r89p9351p3608j43566
1972A242403j75601J78139J22900l38672J82249K45625j81866j40489n6324j43589
1962I34775M82958r8162j62564k35147P6219j05884j86951l6788L8277J01594
1952H08327o1609J51486J82845k43027j27861q6612J70869n9450l41551K03493
1942E96910m188O9304o5313j82734J17793J98454j20739j5077j10037J95803L4241
1931G14417j79720J22430j80823M8353P1147P4376r2333j25821R7399j4364J01437
$$ plain form
2003 3251185 3108511 2914982 2794845 2532355 2436322 2634687 2455837 2524080 2387837 2366254
1993 2366254 2338105 2443718 2533508 2319913 2204740 2376785 2098530 1957889 1844494 1879811
1983 1879811 1924205 2016306 1707205 1699422 1688342 1648046 1539917 1538928 1459577 1385969 1242403
1972 1242403 1066802 1244941 1367841 1029169 1211418 1457043 1275177 1134688 1078364 934775
1962 934775 1417733 1319571 1157007 921860 998079 892195 705244 668456 706733 808327
1952 808327 746718 898204 1081049 838022 710161 623549 794418 734968 393417 596910
1942 596910 592722 662026 596713 413979 531772 730226 609487 594410 484373 680176 714417
1931 714417 534697 657127 476304 524657 595804 670180 577847 452026 549425 535061 636498
1920F36498j51747J05182l7667n549l2343L08841k42155j21164N4266k6765j81248
1909C06149j18918Q5169L06436n2965o5119o6741j10309P9809R4760k04001J31393
1898C85663j26289p8045K17809o6973J32821k23146m8452j07196J14319J7621
1888B18132P3741O4321K118q4648N7359J01334j84067p1158K04983m9252J01162
1877D34025K6977k05177j08352P6297Q7407j86405Q5422j33976J05752j498J25310
1866C05782M3080r21J55348j55279k4168Q7201j26963j47580k24420K98161K69025
1855D79266r569k51161k2874J97710M3173j64870J79989k46378o2136j80266K61304
1844B24188l9919J3636J30622j39318K27133j09986j17374N4236O1123L509j98835
$$ plain form
1920 636498 484751 589933 552266 546717 514374 823215 581060 459896 514162 487397 306149
1909 306149 187231 272400 578836 525871 460752 394011 283702 363511 458271 254270 385663
1898 385663 259374 181329 399138 332165 464986 241840 193388 86192 200511 218132
1888 218132 291873 356194 358312 273664 331023 432357 248290 177132 382115 332863 434025
1877 434025 461002 255825 147473 223770 311177 124772 210194 76218 181970 180472 305782
1866 305782 348862 347941 503289 348010 323842 411043 284080 136500 -87920 210241 479266
1855 479266 469697 218536 195662 393372 436545 271675 451664 205286 143150 -37116 224188
1844 224188 184269 197905 328527 189209 416342 306356 188982 243218 304341 307850 109015
1833A09015N1304Q9327k24540M5659J07829j39730K3242J98733q7878J93401j71933
1822A94429J60554P5580k5192r199J73154q9083P2882J74865j39066p6368J72588
1811F85144L3868j79846j10071j60085P49M2670N3123j10456j74344J44933k1535
1800B04150p077R2176l09170j85502J58427J98586k62273J02547M37340j39054
1790B90150k10414J46140k00232m1997M8822l03696Q585K33367Q0279l8147L7803
1779E0660R72l06027J54497J06243j28030m3729J61052o2945k4830J55118R7136
1768A60117O7745j78268k2735j4024k2583P0727j9592j59265J57347j26660m6296
1757a33487k9545m0416J44188J50309J26072L8663n9451j02414k59506J37165
$$ plain form
1833 109015 160319 249646 25106 70765 178594 38864 62106 260839 172961 366362 194429
1822 194429 354983 430563 405371 396172 569326 480243 553125 727990 588924 512556 685144
1811 685144 719012 539166 429095 269010 269759 312429 365552 255096 80752 225685 204150
1800 204150 197073 289249 -19921 -205423 -46996 151590 -110683 -8136 429204 290150
1790 290150 79736 225876 25644 -16353 32469 -271227 -262642 -29275 51004 12857 50660
1779 50660 51632 -254395 -99898 6345 -121685 -165414 -4362 -67307 -92137 62981 160117
1768 160117 227862 49594 26859 12835 -9748 60979 41387 -117878 39469 -87191 -133487
1757 -133487 -163032 -203448 -59260 91049 217121 255784 196333 93919 -165587 -28422
1747b8422j11131K14834Q339J21130L9725p9233p9427j00485R3254p908j36786
1736f6110J64060Q0004j25750M6601L203K05839l4333k47685k3031k2776n1550
1725g1528k8580l1810O6428L5961L0163K31381j54791l53063j43101O8742J23617
1714b26581J43762K2617R3680k86847J15541J19936r9232L0076K28304p2123k2236
1703D6897J8470O8461l15356j01658L49226j20604J89790K93805M2913m76663
1693d719N8208j83444M2676q3733K4370r0444k3935L12196O4617q7864n7765M8894
1681A9057Q9609j29424k39964o5367K42022J29526k02584K65085J18573j44988
1671H1545K2097k21718j25011p1917J31695J93926J67729r9626K84960j98877
$$ plain form
1747 -28422 -139553 75281 83620 204750 244475 165242 85815 -14670 78584 70676 -66110
1736 -66110 97950 177954 52204 98805 102008 307847 273514 25829 2798 -19978 -71528
1725 -71528 -100108 -131918 -65490 -29529 634 232015 77224 -275839 -418940 -350198 -226581
1714 -226581 -82819 -60202 33478 -253369 -137828 -17892 -117124 -87048 141256 69133 46897
1703 46897 65367 133828 -181528 -283186 66040 -54564 135226 429031 471944 -4719
1693 -4719 53489 -129955 -87279 -171012 -146642 -237086 -261021 51175 115792 27928 -29837 19057
1681 19057 108666 -20758 -260722 -326089 -84067 45459 -157125 107960 226533 81545
1671 81545 103642 -118076 -243087 -315004 -183309 10617 178346 78720 363680 164803
1661A64803l45213O1587m2791M3047J1150r9239j31385M04015Q30k10858n9571
1650b03625J3214K91948Q9999O1809k25149k9744L9461p1849k60617l7666Q3939
1639b48280L8610K9181O4986Q2987k56163q4810k19816J11606J88188P6051K81548
1628F4088m3898r8110P1439q9251m3401R5924J60023k3639q3423j05108N5352
1617d0004J25527j31420p2736o4845j9995q0886J15302l29053K42976M22610j63473
1606D003j39650P3073q4255J2993o6054o8419L0755L29061j2624k8099j58912
1595a08128j8635L806j61967K49040o9840r98J63698Q0082o2322K4913k03817
1584a04168n943M183J3832k6696m79j69634O3116Q1769K8139K2089M373k76816
$$ plain form
1661 164803 -180410 -118823 -161614 -118567 -107417 -206656 -338041 65974 66804 -144054 -203625
1650 -203625 -190411 101537 191536 253345 28196 -1548 37913 -33936 -294553 -332219 -248280
1639 -248280 -209670 -180489 -115503 -32516 -288679 -373489 -593305 -481699 -293511 -217460 64088
1628 64088 20190 -77920 -6481 -95732 -139133 -43209 116814 93175 9752 -95356 -40004
1617 -40004 85523 -45897 -118633 -183478 -203473 -284359 -169057 -498110 -255134 167476 4003
1606 4003 -135647 -62574 -146829 -133836 -199890 -268309 -237554 91507 78883 50784 -108128
1595 -108128 -126763 -122957 -284924 -35884 -105724 -106722 56976 137058 74736 99649 -104168
1584 -104168 -110111 -105928 -92096 -118792 -119271 -288905 -225789 -144020 -115881 -93792 -89419 -366235
1572c66235R3176J39487K7837K0549j02999K96926k94363j02300J19037L9623
1562a29262M2374j8297m7850o2248K34132O3872k719j7313l6789o3987o1560k10403
1550c10050J47740J08832J39226p0596j74453j54387K30208L2502k94581J76640
1540a68919K22968j11585J3369j68063n0519K12929J01244L4440j27241n8747
1530a00124J6752K35429M2341J05000L6369k79636j34798J17751K3841K3352k25663
1519a39386j8038J79662p8027J75072J42348l73227j07757J54262J89586l5220
1509H9275j00335j84872J75487j44178j86741M6629j05706K07450J57390K10135
1499A64534k61509k59510N4255K2170O2150J16281J43717o2141k26036J83257
$$ plain form
1572 -366235 -273059 -133572 -105735 -85186 -188185 108741 -185622 -287922 -168885 -129262
1562 -129262 -86888 -105185 -153035 -215283 18849 82721 80002 62689 25900 -38087 -99647 -310050
1550 -310050 -162310 -53478 85748 15152 -159301 -313688 -83480 -50978 -345559 -168919
1540 -168919 54049 -57536 -44167 -212230 -262749 -49820 51424 85864 -41377 -100124
1530 -100124 -83372 152057 194398 299398 335767 56131 -78667 39084 62925 86277 -139386
1519 -139386 -157424 22238 -55789 119283 261631 -111596 -219353 -65091 124495 89275
1509 89275 -11060 -195932 -20445 -164623 -351364 -304735 -410441 -202991 -45601 164534
1499 164534 -96975 -356485 -302230 -280060 -217910 -101629 42088 -20053 -246089 -62832
1489f2832R4875j39303o2214J52836M5270J26031j10087O0427J6559J19100q8724
1478A51938j18864m9654O2422k54718j0685J45987j52924j0184J7424l4508n5134
1467c08900N6038K27709O9619K05362l2073j54551k9862M5718J01781j06228J72552
1456B47165k95421J13889k91123j05143J45025J38295L77368m0513j69305j55304
1446c5067q9192R830J14488K76966j40414j33640P3914k46467q5772J25950M4717
1435h4687m7792J10441J61428k11850r5520q4074l1695J59155K39962L0913k1977
1424A24304l13979K0749l6284j29724K93896L06768l9345k22054J60220l35612
1414a71061K8230J58892n0029j91625J4852k2771L3596n4263j16632K59762J09541
$$ plain form
1489 -62832 32043 -107260 -169474 -16638 28632 154663 44576 105003 121562 240662 151938
1478 151938 33074 -16580 45842 -208876 -219561 -73574 -226498 -236682 -219258 -253766 -308900
1467 -308900 -252862 -25153 44466 249828 217755 63204 33342 79060 180841 74613 247165
1456 247165 -48256 65633 -225490 -330633 -185608 -47313 330055 289542 120237 -35067
1446 -35067 -124259 -114429 59 277025 136611 2971 76885 -169582 -255354 -129404 -84687
1435 -84687 -132479 -22038 139390 -72460 -167980 -252054 -283749 -124594 115368 146281 124304
1424 124304 -189675 -168926 -205210 -334934 -41038 265730 226385 4331 164551 -171061
1414 -171061 -142831 16061 -33968 -225593 -210741 -233512 -199916 -254179 -370811 -111049 -1508
1403a508n140j09434R8963k89936J49630p5065p4153P936J16911J31831j02008
1392a51973L8315m5402M40342n1279k12518j87017J28493j8238j12844L1570r3332
1381b33883R6642j05721P3746J42329j07687J4699J00460j15979J47478j28104
1371a16020K16990j40974J94821r0390k53088k1940M2527M2653J46250q1065L0373
1360b9863r5465R5172l875l21395J89673M9383j59657N6302N86J5106J42830k4776
1348h5979K44394j50543o9813k452n3827L8364J01150j15423q6780m793q9414
1337b75116J31262P8216K4177K56920o3439k13635P9542m9444j00730l0886P7666
1326h5467n6656r0964J24287K4092M42151j94091j74807M6761Q2972j05453n2112
$$ plain form
1403 -1508 -6648 -116082 -17119 -307055 -157425 -232490 -306643 -298707 -181796 -49965 -151973
1392 -151973 -113658 -159060 281282 230003 17485 -169532 -41039 -59277 -172121 -140551 -233883
1381 -233883 -137241 -242962 -169216 -26887 -134574 -119875 -19415 -135394 12084 -116020
1371 -116020 100970 -40004 154817 64427 -188661 -210601 -168074 -125421 20829 -60236 -29863
1360 -29863 -125328 -30156 -34031 -355426 -165753 -116370 -276027 -219725 -219139 -204033 -61203 -85979
1348 -85979 158415 7872 -61941 -64393 -118220 -79856 21294 -94129 -180909 -185702 -275116
1337 -275116 -143854 -65638 -41461 215459 152020 -61615 17927 -31517 -132247 -163133 -85467
1326 -85467 -142123 -233087 -108800 -84708 357443 163352 -11455 35306 118278 12825 -39287
1315c9287n5857O2617M7272R2448p3233J1871J12934q8496J71821Q9839j33012
1304A98917j8770j94406Q7827P2177k00972j90641K56736j33840J43432J6674
1294C7134k69654J35971o5132k8898K05873j08862n326k4122p2815L15669m2910
1283G6928j67938O0945m795L0714J5477r2648P6842m387j4671R3752j8190j95860
1271a43831N5609O9245J67986j15674M1738J32362j66822m8670J5332j988o1178
1260e5891j28933J08218J84982O2347k36364p3023J2814N6571M513m2802L7713
1249f9855n4846K02137O6605j40884k97092J60477O6430K3775M4423r0969J17794
1238B7995k12118P3421K8964j05170J2060m996J17195j93258L71K66942j52591
$$ plain form
1315 -39287 -95144 -32527 14745 107193 33960 45831 158765 70269 242090 331929 198917
1304 198917 180147 -14259 73568 145745 -55227 -245868 10868 -122972 20460 37134
1294 37134 -232520 -96549 -161681 -190579 15294 -93568 -98894 -123016 -195831 119838 76928
1283 76928 -91010 -30065 -34860 -4146 11331 -81317 -4475 -8862 -23533 70219 52029 -143831
1271 -143831 -88222 -18977 149009 33335 75073 207435 40613 -8057 7275 5287 -55891
1260 -55891 -184824 -76606 108376 170723 -65641 -138664 -125850 -69279 -64766 -107568 -69855
1249 -69855 -124701 77436 144041 3157 -293935 -133458 -67028 -43253 1170 -89799 27995
1238 27995 -184123 -110702 -81738 -186908 -174848 -179844 -62649 -255907 -255536 11406 -141185
1227a41185j26757N2812R6545j4702J01102n3874J06959j76688r4466J89541K9118
1216c1595K06570O0082p7836k97588R4341j00297N744J78494j50035J48431J14039
1205A50350j61176n0081K33787j93881n6979l8561R3840l6904K35056j43508N1735
1194H3678j03582j27599O9113l9557J74535p6459J84196m6901r5659J0916Q8319
1183A21000k13870j12792J92687R2254j26557M0622J16556q2282N8107L8763j94173
1172f9685J0353J5730N6658J10099o3314J59514p4382k13160q3505Q5601J91727
1161A25636j59588k6235J50717N8382j14139j62322Q2444k0622Q2791K87j23304
1150a05953N8056J82261q725Q3867j54842k10459J26257p7563Q0132L170M7822
$$ plain form
1227 -141185 -267942 -215130 -118585 -133287 -32185 -86059 20900 -155788 -250254 -60713 -31595
1216 -31595 174975 235057 157221 -140367 -46026 -146323 -140579 37915 -112120 36311 150350
1205 150350 -10826 -60907 172880 -21001 -77980 -116541 -22701 -59605 175451 31943 83678
1194 83678 -19904 -147503 -78390 -117947 56588 -19871 164325 117424 21765 32681 121000
1183 121000 -92870 -205662 -12975 79279 -47278 -6656 109900 27618 85725 124488 -69685
1172 -69685 -59332 -43602 13056 123155 59841 219355 144973 -68187 -151692 -66091 125636
1161 125636 -33952 -60187 90530 148912 34773 -127549 -45105 -65727 17064 17351 -105953
1150 -105953 -47897 134364 125639 209506 54664 -155795 -29538 -107101 -26969 -23799 24023
1139B4023j77904J09704J87933m7185j1796J08618j84466k62595Q5262O4641J41959
1128C8194m8621J33693J14096m8403k59230j2009R2248J19810P4819J06511k33858
1117G7250j21188l9327J44231j39079J4540P0197o4470j03463O6402Q6013j08487
1106a17381K24918k96606J61941L0031n7170l9847p684k6777K12824J86163n7884
1095B12528j82128j69523M5012j25801j13649J48324J44736o0228r5723K15255
1085A8803j23508k2432K08954M030r1402q3343L82185k66703j18048j21682J5425
1074a97721J30847M107J59496j60072J3060o4170K99240l63204j07980q786J20034
1063a75149j95174R3382P6283J25998k06146R7195J72122k08241J09587j5279
$$ plain form
1139 24023 -153881 -44177 143756 96571 84775 193393 8927 -253668 -168406 -103765 38194
1128 38194 -10427 123266 237362 188959 -70271 -82280 9968 129778 204597 311108 77250
1117 77250 -43938 -83265 60966 -78113 -63573 6624 -57846 -161309 -94907 -8894 -117381
1106 -117381 107537 -189069 -27128 2903 -54267 -94114 -101798 -128575 84249 270412 212528
1095 212528 30400 -139123 -94111 -219912 -333561 -185237 -40501 -100729 -196452 18803
1085 18803 -104705 -127137 81817 85847 -5555 -88898 293287 26584 -91464 -213146 -197721
1074 -197721 -66874 -62767 96729 -63343 -50283 -114453 184787 -178417 -286397 -295183 -175149
1063 -175149 -370323 -276941 -200658 -74660 -280806 -183611 -11489 -219730 -110143 -125422
1053a25422j27824k5512K56339m5961j58619J49262R5694M5388j074P562P4816
1042A44649k18581j96683K23407O5017k58735J35890M4645J11924M1547J56298
1032B49378k17718j5849k55084J46636j17626J3835P0040m0231k8327j07607R0032
1021b12521o721J07052K44223l7339k54286J09475J31169j84419J914r8864K15974
1010A5657K08035j36886J1078L42351l7279k29078j20820n5647Q0528J61q7284
999i184o1837L1795J62154o6045m58184J59366J71275j9954k84139q5915o5921
$$ plain form
1053 -125422 -253246 -278758 -22419 -68380 -226999 -77737 17957 63345 62271 69833 144649
1042 144649 -73932 -270615 -47208 17809 -240926 -105036 -60391 51533 93080 249378
1032 249378 31660 15811 -239273 -92637 -210263 -196428 -126388 -166619 -194946 -302553 -212521
1021 -212521 -219242 -112190 132033 94694 -159592 -50117 81052 -103367 -101453 -200317 15657
1010 15657 223692 86806 97884 440235 402956 173878 53058 -2589 77939 78100 -9184
999 -9184 -71021 -39226 122928 56883 -401301 -241935 -70660 -90614 -374753 -460668 -526589
$$ [...]
##END NTUPLES=NMR SPECTRUM
##END=
