##TITLE=1H_EC-3257(II-41)
 CDCl3, 8 sc, 
 6.08.2021
##JCAMPDX= 6.0         $$ Bruker NMR JCAMP-DX V2.0
##DATA TYPE= NMR SPECTRUM
##DATA CLASS= NTUPLES
##ORIGIN= UXNMR, Bruker Analytische Messtechnik GmbH
##OWNER= root
$$ XWIN-NMR		Version 3.5
$$ Fri Aug  6 10:33:08 2021 Russian Standard Time (UT+4h)  she@DPX200
##.OBSERVE FREQUENCY= 200.131506
##.OBSERVE NUCLEUS= ^1H
##.ACQUISITION MODE= SIMULTANEOUS
##.ACQUISITION SCHEME= undefined
##.AVERAGES= 8
##.DIGITISER RES= 18
##SPECTROMETER/DATA SYSTEM= spect
##.PULSE SEQUENCE= zg30
##.SOLVENT NAME= CDCl3
##.SHIFT REFERENCE= (INTERNAL, CDCl3, 0, 17.5093)
##AUDIT TRAIL= $$ (NUMBER, WHEN, WHO, WHERE, WHAT)
$$ ##TITLE= Audit trail, XWIN-NMR		Version 3.5
$$ ##JCAMPDX= 5.01
$$ ##ORIGIN= Bruker BioSpin GmbH
$$ ##OWNER= she
$$ F:/spectra/data/she/nmr/H-F/1/pdata/1/auditp.txt
$$ ##AUDIT TRAIL=  $$ (NUMBER, WHEN, WHO, WHERE, WHAT)
(   1,<2021-08-06 10:32:00.93 +0400>,<she>,<DPX200>,
      <created by zg, POWCHK disabled, PULCHK disabled
       configuration hash MD5:
       00 E9 B6 7A A2 85 ED C7 34 08 36 98 17 FE 4E 26
       data hash MD5: 16K
       A1 43 F7 B0 4B D8 9B BD 29 31 5A DF 91 B3 F4 EC>)
(   2,<2021-08-06 10:32:03.45 +0400>,<she>,<DPX200>,
      <Start of raw data processing
       efp BC_mod = 2 LB = 0.24 FT_mod = 6 PKNL = 1 PHC0 = -13356.13 PHC1 = 11.40099 SI = 16K 
       data hash MD5: 16K
       39 34 EB 92 D1 61 EA A1 88 3F BE D7 9A 2B AB 4F>)
(   3,<2021-08-06 10:32:18.04 +0400>,<she>,<DPX200>,
      <pk PHC0 = 1.409898 PHC1 = -2.6 
       data hash MD5: 16K
       A9 75 D0 61 E7 5A 90 08 C1 4F 7B 5B AE CC E1 37>)
(   4,<2021-08-06 10:32:21.07 +0400>,<she>,<DPX200>,
      <abs ABSG = 5 
       data hash MD5: 16K
       B3 D5 2F 4B EC 31 9D 29 FD D4 70 38 E4 06 04 C0>)
$$ ##END=
$$ 
$$ hash MD5
$$ A2 EB BA 76 FC AA B2 90 41 44 74 6D 0A 52 03 AA
##$RELAX= 
##$RELAX= 
##$RELAX= 
##$RELAX= 
##$RELAX= 
##$RELAX= 
$$ Bruker specific parameters
$$ --------------------------
##$DU= <F:/spectra>
##$EXPNO= 1
##$NAME= <H-F>
##$PROCNO= 1
##$TYPE= <nmr>
##$USER= <she>
##$AMP= (0..31)
100 100 100 100 100 100 100 100 100 100 100 100 100 100 100 100 100 100 
100 100 100 100 100 100 100 100 100 100 100 100 100 100 
##$AQSEQ= 0
##$AQ_mod= 1
##$AUNM= <au_zg>
##$AUTOPOS= <>
##$BF1= 200.13
##$BF2= 200.13
##$BF3= 200.13
##$BF4= 200.13
##$BF5= 200.13
##$BF6= 200.13
##$BF7= 200.13
##$BF8= 200.13
##$BYTORDA= 1
##$CFDGTYP= 0
##$CFRGTYP= 5
##$CHEMSTR= <none>
##$CNST= (0..31)
1 1 145 1 1 1 1 1 1 1 1 1 1 1 1 1 1 1 1 1 1 1 1 1 1 1 1 1 1 1 1 1 
##$CPDPRG= <>
##$CPDPRG1= <>
##$CPDPRG2= <>
##$CPDPRG3= <>
##$CPDPRG4= <mlev>
##$CPDPRG5= <mlev>
##$CPDPRG6= <mlev>
##$CPDPRG7= <mlev>
##$CPDPRG8= <mlev>
##$CPDPRGB= <>
##$CPDPRGT= <>
##$D= (0..31)
0 1.2 0 0 0 0 0 0 0 0.06 0 0.03 0 0 0 0 0.0002 0 0 0 0 0 0 0 0 0 0 0 0 
0 0 0 
##$DATE= 1628231520
##$DBL= (0..7)
120 120 120 120 120 120 120 120 
##$DBP= (0..7)
150 150 150 150 150 150 150 150 
##$DBP07= 0
##$DBPNAM0= <>
##$DBPNAM1= <>
##$DBPNAM2= <>
##$DBPNAM3= <>
##$DBPNAM4= <>
$$ [...]
##$SUBNAM3= <"">
##$SUBNAM4= <"">
##$SUBNAM5= <"">
##$SUBNAM6= <"">
##$SUBNAM7= <"">
##$SUBNAM8= <"">
##$SUBNAM9= <"">
##$SW= 20.0188882624521
##$SWIBOX= (0..15)
0 0 2 0 0 0 0 0 0 0 0 0 0 0 0 0 
##$SW_h= 4006.41025641026
##$TD= 16384
##$TD0= 1
##$TE= 0
##$TE2= 300
##$TE3= 300
##$TEG= 300
##$TL= (0..7)
0 120 120 120 120 120 120 120 
##$TP= (0..7)
150 150 150 150 150 150 150 150 
##$TP07= 0
##$TPNAME0= <>
##$TPNAME1= <>
##$TPNAME2= <>
##$TPNAME3= <>
##$TPNAME4= <>
##$TPNAME5= <>
##$TPNAME6= <>
##$TPNAME7= <>
##$TPOAL= (0..7)
0.5 0.5 0.5 0.5 0.5 0.5 0.5 0.5 
##$TPOFFS= (0..7)
0 0 0 0 0 0 0 0 
##$TUNHIN= 0
##$TUNHOUT= 0
##$TUNXOUT= 0
##$USERA1= <user>
##$USERA2= <user>
##$USERA3= <user>
##$USERA4= <user>
##$USERA5= <user>
##$V9= 5
##$VALIST= <valist>
##$VCLIST= <CCCCCCCCCCCCCCC>
##$VD= 0
##$VDLIST= <DDDDDDDDDDDDDDD>
##$VPLIST= <PPPPPPPPPPPPPPP>
##$VTLIST= <TTTTTTTTTTTTTTT>
##$WBST= 1024
##$WBSW= 4
##$XGAIN= (0..3)
0 0 0 0 
##$XL= 0
##$YL= 0
##$YMAX_a= 229432
##$YMIN_a= -405040
##$ZGOPTNS= <>
##$ZL1= 120
##$ZL2= 120
##$ZL3= 120
##$ZL4= 120
##$ABSF1= 17.50689
##$ABSF2= -2.51215
##$ABSG= 5
##$ABSL= 3
##$ALPHA= 0
##$AQORDER= 0
##$ASSFAC= 0
##$ASSFACI= 0
##$ASSFACX= 0
##$ASSWID= 0
##$AUNMP= <proc_1d>
##$AZFE= 0.1
##$AZFW= 0.1
##$BCFW= 0
##$BC_mod= 2
##$BYTORDP= 0
##$COROFFS= 0
##$CY= -3
##$DATMOD= 1
##$DC= 0
##$DFILT= <>
##$DTYPP= 0
##$F1P= 0
##$F2P= 0
##$FCOR= 1
##$FTSIZE= 16384
##$FT_mod= 6
##$GAMMA= 0
##$GB= 0
##$INTBC= 1
##$INTSCL= 1.334414e-10
##$ISEN= 128
##$LB= 0.24
##$LEV0= 0
##$LPBIN= 0
##$MAXI= 10000
##$MC2= 0
##$MEAN= 0
##$ME_mod= 0
##$MI= 1.114404
##$NCOEF= 0
##$NC_proc= -6
##$NLEV= 6
##$NOISF1= 3.799351
##$NOISF2= 2.8
##$NSP= 0
##$NTH_PI= 0
##$NZP= 0
##$OFFSET= 17.50933
##$PC= 1
##$PHC0= -13354.72
##$PHC1= 8.800989
##$PH_mod= 1
##$PKNL= yes
##$PPARMOD= 0
##$PSCAL= 0
##$PSIGN= 0
##$REVERSE= no
##$SF= 200.130005063831
##$SI= 16384
##$SIGF1= 3
##$SIGF2= 2
##$SINO= 5.538805
##$SIOLD= 16384
##$SREGLST= <1H.CDCl3>
##$SSB= 0
##$STSI= 16384
##$STSR= 0
##$SW_p= 4006.41025641026
##$SYMM= 0
##$S_DEV= 0
##$TDeff= 16384
##$TDoff= 0
##$TI= <>
##$TILT= no
##$TM1= 0
##$TM2= 0
##$TOPLEV= 0
##$USERP1= <user>
##$USERP2= <user>
##$USERP3= <user>
##$USERP4= <user>
##$USERP5= <user>
##$WDW= 1
##$XDIM= 16384
##$YMAX_p= 286611629
##$YMIN_p= -304434
$$ End of Bruker specific parameters
$$ ---------------------------------
##NTUPLES= NMR SPECTRUM
##VAR_NAME=  FREQUENCY,     SPECTRUM/REAL,   SPECTRUM/IMAG
##SYMBOL=    X,             R,               I
##VAR_TYPE=  INDEPENDENT,   DEPENDENT,       DEPENDENT
##VAR_FORM=  AFFN,          ASDF,            ASDF
##VAR_DIM=   16384,         16384,           16384
##UNITS=     HZ,            ARBITRARY UNITS, ARBITRARY UNITS
##FACTOR=    0.24454680195387, 1,            1
##FIRST=     3504.14245156407, 0,            0
##LAST=      -502.267804846188, 0,           0
##MIN=       -502.267804846188, -304434,     0
##MAX=       3504.14245156407, 286611629,    0
$$ Real data points
##PAGE= N=1
##DATA TABLE= (X++(R..R)), XYDATA
$$ [...]
6947a0483o9554k8619K0139R7926o965q6922p4423p027P4687q0967N3508p7282
$$ -10483 -80037 -108656 -88517 9409 2444 -84478 -158901 -165928 -91241 -172208 -118700 -195982
6935a95982J03053K8183n6238O0590M1168P371j9372j14223n3555J69242k2378
$$ -195982 -92929 -64746 -120984 -60394 -19226 -11855 -31227 -145450 -199005 -29763 -52141
6924e2141R9402r292k3122j34414o87J71177J7181j07013p213m5333O3677j810
$$ -52141 47261 37969 14847 -119567 -120254 50923 68104 -38909 -46122 -91455 -27778 -29588
6912b9588P4569j1513M0623l5176j116L4882j44265O9940N6152r3576J22745K1001
$$ -29588 44981 33468 74091 38915 37799 72681 -71584 -1644 54508 -39068 83677 104678
6900A04678p7273J37720j03482m5237M4817J98279K7058q4021J12539Q2754p531
$$ 104678 27405 165125 61643 16406 61223 259502 286560 202539 315078 397832 390301
6889C90301M3600k8051j8496o4876p1760J4949j08402J9675r1710m4360M372M4903
$$ 390301 433901 405850 387354 322478 250718 265667 157265 176940 85230 40870 45242 90145
6877I0145o2630m191Q3209J7777o3749N9660k7111m453P7577o2121Q9128j7166
$$ 90145 27515 23324 106533 124310 60561 120221 93110 88657 166234 104113 193241 176075
6865A76075m2685K2195n598j11124J935J11999o2433o1862m3608l1839o4624O7075
$$ 176075 133390 155585 149987 38863 40798 152797 90364 28502 -15106 -46945 -111569 -44494
6853d4494J81872n8622o921M2717l0384l9213L0512K9924J20680j03352J04579
$$ -44494 137378 78756 71835 114552 84168 44955 75467 105391 226071 122719 227298
6842B27298k0048q7409P263q7651J5189M0263p8530j0930N827m1110J13168p7118
$$ 227298 207250 119841 127104 39453 54642 94905 16375 5445 11272 -29838 83330 6212
6830F212O829j872K8169K3000j2313n6407Q5676P4696p3032q6123l6617L241J01212
$$ 6212 13041 11169 39338 62338 50025 -6382 79294 153990 80958 -5165 -41782 -38541 62671
6817F2671M44q6596J66425k09309O0818j01101k3694P1080K6578M2884L9696r588
$$ 62671 63115 -23481 142944 -66365 -5547 -106648 -130342 -59262 -32684 10200 49896 40308
6805D0308o8244N4756j4398N9251q4070K6803m8247k17773K9314J56405P6655
$$ 40308 -27936 26820 12422 71673 -12397 14406 -33841 -251614 -222300 -65895 10760
6794A0760l497j825p930L7938m7641o8992P568J6691P8380o296l4131K9108J133
$$ 10760 7263 5438 -2492 35446 -12195 -81187 -73619 -56928 21452 15156 -18975 10133 11266
6781A1266P4419O1166l8739j69204Q5516J25489M6439p6048j24554p400J0844
$$ 11266 85685 146851 108112 -61092 24424 149913 196352 120304 -4250 -11650 -806
6770h06l4554P0239J02069p4990n6418M187r233m5199O5460n8772k4204P61Q6160
$$ -806 -35360 34879 136948 61958 5540 9727 494 -44705 20755 -38017 -62221 -61460 24700
6757B4700j69911N1619O4525J13724J8894r6602M2636n702j00547J69707l4255
$$ 24700 -145211 -93592 -29067 84657 103551 6949 49585 43883 -56664 113043 78788
6746G8788n0329P0829r254k5167J626j6033P9655l582m4065m4853m7975P7442
$$ 78788 28459 99288 90034 64867 66493 50460 130115 126533 82468 37615 -10360 67082
6734F7082l1081j9763j2820N6389J14533N5824m046j87429o6845P6268O9107o1130
$$ 67082 36001 16238 3418 59807 174340 230164 226118 38689 -28156 48112 117219 56089
6722E6089r7420M7340N8945J7322J2369M5670o1873p508m3046P9601M8024O8224
$$ 56089 -41331 6009 64954 82276 94645 140315 78442 70934 27888 107489 155513 223737
6710B23737n3790l8435o2840L3401M0627j37580n5662J87608k3581l7734K5929
$$ 223737 169947 131512 68672 102073 142700 5120 -50542 137066 113485 75751 101680
6699A01680J5413k2463P1743P2811m5469q8161O8228K08l5255P0457n4529r4498
$$ 101680 117093 94630 166373 239184 193715 105554 173782 173990 138735 209192 154663 60165
6687F0165L3486J3448J00241j1662j20364J14522R2567o582N2486r679L6656J0231
$$ 60165 93651 107099 207340 195678 75314 189836 282403 275821 328307 318628 355284 365515
6675C65515k0771p4923k5068K5072q7036O6273M2239L5785n2107l0573P7381L6275
$$ 365515 344744 269821 244753 269825 182789 249062 291301 327086 274979 244406 321787 358062
6663C58062N5862O5729o5735j7614o6382N3648N4854Q998Q1517k2348q9472L8278
$$ 358062 413924 479653 413918 396304 329922 383570 438424 447422 528939 506591 417119 455397
6651D55397N5213L3204r2594o6707J08186L0345n6242O1139o557J17092j4173
$$ 455397 510610 543814 451220 384513 492699 523044 466802 527941 521384 638476 624303
6640F24303j24282J12568J60778o6087j02586J6913j9780N7385J31534j69406
$$ 624303 500021 612589 773367 707280 604694 621607 601827 659212 790746 621340
6630F21340o798p6798l0594K45578j12467l5357J02060L7534R3354k1604m7700
$$ 621340 614542 537744 507150 752728 640261 604904 706964 744498 837852 816248 768548
6619G68548J9485M3206R4659j21118l7041J44005J05203n8557n7576J0343J39774
$$ 768548 788033 831239 925898 804780 767739 911744 1016947 958390 900814 911157 1050931
6608A050931J07083K2158O6748L1336n7287n084R1620J24061j1400L5983R1532
$$ 1050931 1158014 1180172 1246920 1278256 1220969 1215885 1307505 1431566 1420166 1456149 1547681
6597A547681Q1909K0064J28533p6282O2633K01889M1989J41826K7541L0725J42784
$$ 1547681 1629590 1649654 1778187 1701905 1764538 1966427 2008416 2150242 2177783 2208508 2351292
6586B351292L3228M1333Q7412j1131M3253J22006m4700J38328J27591J5235J51304
$$ 2351292 2384520 2425853 2513265 2502134 2545387 2667393 2622693 2761021 2888612 2903847 3055151
6575C055151R7340Q6112P8203J40748J57517J23586N4743K56305J98754R4646
$$ 3055151 3152491 3238603 3316806 3457554 3615071 3738657 3793400 4049705 4248459 4343105
6565D343105N3303N5125L18119L16051J48459K55508J02198K62344K33482L92440
$$ 4343105 4396408 4451533 4769652 5085703 5234162 5489670 5591868 5854212 6087694 6480134
6555F480134M80358L19774M06188N46982M34538N28430N59143Q67568R10257R71912
$$ 6480134 6960492 7280266 7686454 8233436 8667974 9196404 9755547 10623115 11533372 12505284
6545A2505284J239001J303575J597472J894398K063797K263280K585616L129702
$$ 12505284 13744285 15047860 16645332 18539730 20603527 22866807 25452423 28582125
6537B8582125L762359M360763N284033O109193O614657O712395O722284O000097
$$ 28582125 32344484 36705247 41989280 48098473 54713130 61425525 68147809 74147906
6529G4147906L888494j95431n096159r179378j0388506r353058p263202n356043
$$ 74147906 78036400 77840969 72744810 63565432 53176926 43823868 36560666 31204623
6521C1204623m027080k977712k283142j823206j514688j145270q97118o29212
$$ 31204623 27177543 24199831 21916689 20093483 18578795 17433525 16536407 15907195
6513A5907195n17171o67275q39218r38574q73210r19498p54821o34897n97430
$$ 15907195 15390024 14722749 13883531 12944957 12071747 11152249 10397428 9762531 9165101
6504I165101n25537l40019l33986l76155j47863k75798j41932r5588j06706M1345
$$ 9165101 8639564 8299545 7965559 7589404 7441541 7165743 7023811 6928223 6821517 6862862
6494F862862j972q887k05147l01596k88757q3291j4549K1500K1845j94934k62836
$$ 6862862 6860890 6852003 6646856 6345260 6056503 5973212 5958663 5980163 6002008 5807074 5544238
6483E544238m44324m28817l02427k48170l41380q8691j13856k28834o8809k8597
$$ 5544238 5099914 4671097 4368670 4120500 3779120 3690429 3576573 3347739 3278930 3250333
6473C250333p5373k71986m2229r449K593j44071N5323j39241j52357L0667J041
$$ 3250333 3174960 2902974 2860745 2851296 2853889 2709818 2765141 2625900 2473543 2504210 2505251
6462B505251J6902J28555n5776j19295J44171n4774Q5432J01048m544K2034J00173
$$ 2505251 2522153 2650708 2594932 2475637 2619808 2565034 2650466 2751514 2746970 2769004 2869177
6451B869177j96231o4964j02416j20399j58840n9248j2219K8604o8279j92339
$$ 2869177 2672946 2607982 2505566 2385167 2226327 2167079 2154860 2183464 2115185 1922846
6441A922846L5749l8146k1857J57823p1652j64903j1074J06788Q610M8307K2362
$$ 1922846 1958595 1920449 1898592 2056415 1984763 1819860 1808786 1915574 1924184 1972491 1994853
6430A994853j33264j6430q0251k04273n3650r9534L3901q4609j39656k7721m1224
$$ 1994853 1861589 1845159 1764908 1560635 1506985 1407451 1441352 1356743 1217087 1189366 1148142
6419A148142q409J3468J3171j6035m7944k9354N5763q1501n0657N6262p6954M7220
$$ 1148142 1139733 1153201 1166372 1150337 1102393 1073039 1128802 1047301 996644 1052906 975952 1023172
6407A023172m4167k3505L4444k9986n1203k793j9445q2251r1835k4796O7443m2094
$$ 1023172 979005 955500 989944 959958 908755 905962 886517 804266 712431 687635 755078 712984
6395G12984N9264p4364M7244o1256l3565J7805j15490m0594J45544K2786q7710
$$ 712984 772248 697884 745128 683872 650307 668112 552622 512028 657572 680358 592648
6384E92648O8870j5075j02757P4628n8457P853m0418L952M6490j07784P2294j85
$$ 592648 661518 646443 543686 618314 559857 567710 527292 531244 577734 469950 542244 542059
6372E42059l5317J38932n1535m9703k0510M2401P4804j44728j41156K3012k7617
$$ 542059 506742 645674 594139 544436 523926 566327 641131 496403 355247 378259 350642
6361C50642n166L4200N6543K0190n4931m8136j3940J1056j44055L9694j9879O2577
$$ 350642 345476 379676 436219 456409 401478 353342 339402 350458 206403 246097 226218 288795
6349B88795N4651J3158p9276J6639J02390p5479n7700Q150R4979j0773q653L0676
$$ 288795 343446 356604 277328 293967 396357 320878 263178 271328 366307 355534 346881 377557
6337C77557p7171m6463M3749j7589l3024Q6075K0775j18865L847M4053K7212j19814
$$ 377557 300386 253923 297672 280083 247059 333134 353909 235044 238891 282944 310156 190342
6325A90342L8214K71J6489l0748O8495J0948j16588j900O7365J46038n393k7996
$$ 190342 228556 228827 245316 214568 283063 294011 177423 175523 242888 388926 383533 355537
6313C55537q1010p6732N9569m3457M4705K0755K1090m213l1304o5019k9032l4410
$$ 355537 274527 197795 257364 213907 258612 279367 300457 296244 264940 199921 170889 136479
6301A36479k7698J40857l3442J7058L7558q8563M6996m8572j7929P2083q4856
$$ 136479 108781 249638 216196 233254 270812 182249 229245 180673 162744 234827 149971
6290A49971J8945J13723P792j32029m8458R9956K9533n3902J43735p5853l5887
$$ 149971 168916 282639 290431 158402 109944 209900 239433 185531 329266 253413 217526
6279B17526J12724n4189l6294m017p3675M3613k0545Q9328K5856q4389M5300k8969
$$ 217526 330250 276061 239767 235750 162075 205688 185143 274471 300327 215938 261238 232269
6267B32269j06897J16056K0604J22865n4454j21116J22138k2991p4021J67381
$$ 232269 125372 241428 262032 384897 330443 209327 331465 308474 234453 401834
6257D01834j47275k06514O1501J19297J0028k6964N3183m3735j49070P8472L6654
$$ 401834 254559 48045 109546 228843 238871 211907 265090 221355 72285 150757 187411
6246A87411n7797k9260k552J26887p5153N4752N7842q2647n7039m6508o0948N0342
$$ 187411 129614 100354 97802 224689 149536 204288 262130 179483 122444 75936 14988 65330
6234F5330n050O6442k441K7557l2037j5563R6129m3898p8089Q801k5231O2160
$$ 65330 60280 126722 124281 151838 119801 104238 200367 156469 78380 87181 61950 124110
6222A24110M3021n30k4323k7720O1821p0268K7630j0013l9596K7596K0453N0600
$$ 124110 167131 166601 142278 114558 176379 106111 133741 123728 84132 111728 132181 182781
6210A82781p3045k0083p4831K5845K4834J38921k1013j34607N0240P5089p7810
$$ 182781 109736 89653 14822 40667 65501 204422 183409 48802 99042 174131 96321
6199I6321N9167r1463O4830J02772q3860O9400l3404n480m5395m853l8551N6613
$$ 96321 155488 64025 128855 231627 147767 217167 183763 178283 132888 128035 89484 146097
6187A46097j6221O7829N0814j9439m0221Q366M6091J01756K9717J4817l1702l2656
$$ 146097 129876 197705 248519 229080 188859 197225 243316 345072 374789 389606 357904 325248
6175C25248O9127O1675k00989P1272J14583p0339J58566N0363l0405l7065n2962
$$ 325248 394375 456050 255061 326333 440916 370577 529143 579506 549101 512036 459074
6164D59074n4137m4109k414M338q9140J3150K430K1837k0689k0329j3244K2084
$$ 459074 404937 360828 358414 362752 273612 286762 289192 311029 290340 270011 256767 278851
6152B78851k4074J26119n3918j69904j9121J09801r1415K8002K9047k0317m7390
$$ 278851 254777 380896 326978 157074 137953 247754 156339 184341 213388 193071 145681
6141A45681j2455J09365j5826p09q5914r040K2478O046r5143Q4024K3246m5519
$$ 145681 133226 242591 226765 226056 140142 131102 153580 159626 64483 148507 171753 126234
6129A26234p5919j4035m7380K5322J90354k5678q0889j29570N1819P1182l8091
$$ 126234 50315 36280 -11100 14222 204576 178898 98009 -31561 20258 91440 53349
6118E3349L8452n154M6559n151k290n8523J2961K8931P4031J9843o2181p6185
$$ 53349 91801 86647 133206 128055 125765 67242 80203 109134 183165 203008 140827 64642
6106F4642k0549J28374M3225o1733j11612j7851Q5228l9179j26815J6461O8433
$$ 64642 44093 172467 215692 153959 42347 24496 109724 70545 -56270 -39809 28624
6095B8624n3186K6826J9949N4063L7679k2518J1905k2901K8477k0341l2531J02720
$$ 28624 -24562 2264 22213 76276 113955 91437 103342 80441 108918 88577 56046 158766
6083A58766R900r6805q06j9489o6591J14078J11787r3305R3068n5834n5775q4725
$$ 158766 168666 71861 71055 51566 -15025 99053 210840 117535 210603 154769 98994 14269
6071A4269L3171Q2414l8063m6592K9143N0996m049M032n1800Q8450l4541p1751
$$ 14269 47440 129854 91791 45199 74342 125338 121289 125321 73521 161971 127430 55679
6059E5679k7080r0353P4986R6575l7538J2690j4287J05505k6860r3964p1693m5258
$$ 55679 28599 -61754 13232 109807 72269 84959 70672 176177 149317 55353 -16340 -61598
6047f1598J01370M4971j20490n9767Q6092J0018M8980J05731o6707l6180l1725
$$ -61598 39772 84743 -35747 -95514 -9422 596 49576 155307 88600 52420 20695
6036B0695l9277n6140J2914J02543l3880N7654M1955p221o7963j29235Q955K9240
$$ 20695 -18582 -74722 -61808 40735 6855 64509 106464 99243 31280 -97955 -89000 -59760
6024e9760K650p4850J17570m489l5800J34558j06367O623P0964J8497M26n626
$$ -59760 -57110 -131960 -14390 -18879 -54679 79879 -26488 -19865 51099 69596 70022 64396
6012F4396P1817J0650l5395K3111k1724q3020M2602p5943l5334N6517m1443P3569
$$ 64396 136213 146863 111468 134579 112855 29835 72437 -3506 -38840 17677 -23766 49803
6000D9803J01609p6399m4822O211o232J19369n1732k5901J47958m1833j20123
$$ 49803 151412 75013 30191 36402 30170 149539 97807 71906 219864 178031 57908
5989E7908p1315j8600P7562J786n7439J3951R5865n4071m1093j16443J11364J5746
$$ 57908 -13407 -32007 45555 47341 -10098 3853 99718 45647 4554 -111889 -525 15221
5977A5221L0365k8298L3985L1013q6009R2919K0908R9098p3630j8524L2386q1899
$$ 15221 45586 17288 51273 82286 -3723 89196 110104 209202 135572 117048 149434 67535
5965F7535n9650K06866L0939r1040o4201M6966m2412K5315n3028r7496L3852J6097
$$ 67535 7885 214751 245690 154650 90449 137415 95003 120318 67290 -30206 3646 19743
5953A9743J26445J6333l2558o3185L5969l5398O2885M9231j33021J2536R897q8990
$$ 19743 146188 162521 129963 66778 102747 67349 130234 179465 46444 58980 68877 -20113
5941b0113J24203O705n3355K7589j80463k394J25968j5683l4407P8202r5164p9924
$$ -20113 104090 110795 57440 85029 -95434 -97828 28140 12457 -21950 56252 -38912 -118836
5929a18836J24302J09048O0927p686j00286j25403N208j076M3235L2229o716o8366
$$ -118836 5466 114514 175441 167755 67469 -57934 -52726 -53802 -10567 21662 14946 -53420
5917e3420j5003M3543J4162M184K0954L8295Q9989k9321j16138p3958P2675J4916
$$ -53420 -68423 -24880 -10718 -6534 14420 52715 142704 113383 -2755 -76713 -4038 10878
5905A0878J14675j0952J5741M2637l516n0063l4486k4097l8973K697K1235O5248
$$ 10878 125553 114601 130342 172979 169463 119400 84914 60817 21844 24541 45776 111024
5893A11024p6202k9903J34050j5623k7273L9969j2009N9190L542o3099N0570R5948
$$ 111024 34822 4919 138969 123346 96073 136042 124033 183223 186765 123666 174236 270184
5881B70184o8474M1406L638K162j87827Q9974m3372l1847O7442K5178q9646L0947
$$ 270184 201710 243116 246754 248916 61089 151063 107691 75844 143286 168464 78818 109765
5869A09765O4881q4091M1981K9212m1022j4821o5655P7261o1247m3688L1678N9909
$$ 109765 174646 90555 132536 161748 120726 105905 40250 117511 56264 12576 44254 104163
5857A04163N2086L3952R9698q4102j40291q600L6743j04754J6510Q9071O2631
$$ 104163 156249 190201 289899 205797 65506 56906 93649 -11105 5405 94476 157107
5846A57107p4034K5447P157L6087p3886k4909J3632O1129n5153j63080O8306M0135
$$ 157107 83073 108520 115677 151764 77878 52969 66601 127730 72577 -90503 -22197 17938
5834A7938K3086j6519N5551p4133K9160P4306o179M9131o0894M1175L8071m6812
$$ 17938 41024 24505 80056 5923 35083 109389 103210 152341 91447 132622 170693 123881
5822A23881o5195J21494P1758o4843k0604q026l3000L454K3875k4882n7609R1610
$$ 123881 58686 180180 251938 187095 166491 158465 125465 128919 152794 127912 70303 161913
5810A61913l3615m9824l096o1784p504J5720K2665j42158N692P8238J02446L5825
$$ 161913 128298 78474 75378 13594 6090 21810 44475 -97683 -91991 -13753 88693 124518
5798A24518k65k0130N4133M4273p5987L8719m1534J7984n2653J44681l4722k3951
$$ 124518 124253 104123 158256 202529 126542 165261 123727 141711 89058 233739 199017 175066
5786A75066j9327j7863j496K26J14091n1357j28730j321k4055m949J849N2515
$$ 175066 155739 137876 136380 136606 250697 199340 70610 69289 45234 40285 42134 94649
5774I4649M7617o2789r4882Q657O3163L4971j1229n2161J3842J08683J03265m4389
$$ 94649 142266 79477 -15405 -6748 56415 91386 80157 27996 41838 150521 253786 209397
5762B09397l0383K0960P7491j79974Q244P4544J7835J15627N387j23097j02736
$$ 209397 179014 199974 277465 97491 105735 180279 198114 313741 319128 196031 93295
5751I3295q973O0184l2053J22635j4218m3187O3584n9019j6730j47287J70447
$$ 93295 84322 144506 112453 235088 220870 177683 241267 182248 165518 18231 188678
5740A88678J09473p7084M1786q1241J29264l4508o4920M5421m6007J2980j7507
$$ 188678 298151 221067 262853 181612 310876 276368 211448 256869 210862 223842 206335
5729B06335P0682p2003j3914J15262j19015M2466K7688n0026J20387n7297j4163
$$ 206335 277017 205014 191100 306362 187347 229813 257501 207475 327862 270565 256402
5718B56402N1162k7332K4578M5540p6124r7971K51220K6291p0620J45464M6228
$$ 256402 307564 280232 304810 350350 274226 176255 427475 453766 383146 528610 574838
5707E74838o4220P9983j66927q4285n4169L4969Q1829R5915P3496j3207j05477
$$ 574838 510618 590601 423674 339389 285220 320189 402018 497933 571429 558222 452745
5696D52745n1939L0546j08994J03229J33286Q675K7093O306J20747j74064q5603
$$ 452745 400806 431352 322358 425587 558873 567548 594641 600947 721694 547630 462027
5685D62027Q6059K07309J27869k64362K0092j6078j4376j5640o603j08047q8691
$$ 462027 548086 755395 883264 618902 638994 622916 608540 592900 586297 478250 389559
5674C89559N1069r3745q0779J40660L8801M0570j1705m8491k2007M8481j0223
$$ 389559 440628 346883 266104 406764 445565 486135 474430 425939 403932 452413 442190
5663D42190l7325J30517J28546j7771j2632j10022p2500M298J2046L989J6492
$$ 442190 404865 535382 663928 646157 633525 523503 451003 455301 467347 471336 487828
5652D87828J910P1527l3476l7334M0951M7308j97218j1229p8p2038N8671R9519
$$ 487828 489738 561265 527789 490455 531406 578714 381496 370267 370189 298151 356822 456341
5640D56341r4007N9231N1230k2584p0473r1498n858J69116J00203K748J4574n8887
$$ 456341 362334 421565 472795 450211 379738 288240 282382 451498 551701 554449 569023 510136
5628E10136k8786K3848n5271L6734J7490l0554M8663p030Q0029m9740L7238p5461
$$ 510136 481350 505198 449927 486661 504151 473597 522260 515230 595259 545519 582757 507296
5616E07296n1446M4230O0254K5513l6524j46262J48804M368j48367k7614P8789
$$ 507296 455850 500080 560334 585847 549323 403061 551865 556233 407866 380252 459041
5605D59041K6231n0104j9902L6161Q9465P5530k7323j3105j07946P3317J47996
$$ 459041 485272 435168 415266 451427 540892 616422 589099 575994 468048 541365 689361
5594F89361l7945j37343L3274l289q0804M374N2405j31011J46605P3206P4702
$$ 689361 651416 514073 547347 544058 463254 467628 520033 389022 535627 608833 683535
5583F83535m792q5102K566j7959M9866j6821R9893R5910k1580k265Q650n2355
$$ 683535 678743 593641 596207 578248 628114 611293 711186 807096 785516 783251 791901 739546
5571G39546M1853j11582k2928J4898n176o679j35545k6635J44536J62706j6839
$$ 739546 781399 669817 646889 661787 656611 649932 514387 487752 632288 794994 778155
5560G78155q8900O2729m3940j6949P9180N3990l0467N3242m7161r654r4753L2798
$$ 778155 689255 751984 708044 691095 770275 824265 793798 847040 799879 790225 695472 728270
5548G28270P0527J54344J0344q9697J16247O2385O1698J5047o3909n0586n5313
$$ 728270 798797 953141 963485 873788 990035 1052420 1114118 1129165 1065256 1014670 959357
5537I59357M642O3319j5799M3581J32607M9332p8107R8758l4848j58423M1424
$$ 959357 963999 1027318 1011519 1055100 1187707 1237039 1158932 1257690 1222842 1064419 1105843
5526A105843O8153J0500q927j0334j9376N6944K14977N9904p1445l0793Q3192
$$ 1105843 1173996 1184496 1175569 1165235 1145859 1202803 1417780 1477684 1406239 1375446 1458638
5515A458638N7190O2457k8795l4828O6061j08782k773N4322k3289N9352M9210
$$ 1458638 1515828 1578285 1549490 1514662 1580723 1471941 1469168 1523490 1500201 1559553 1608763
5504A608763J3660N2502O9929k1518p9676J28043J7096M9093O279J46993m7844
$$ 1608763 1622423 1674925 1744854 1723336 1643660 1771703 1788799 1837892 1844171 1991164 1943320
5493A943320q0932J08641O693O1474J07561J06975J31539P4145j15870p611r213
$$ 1943320 1862388 1971029 1977722 2039196 2146757 2253732 2385271 2459416 2343546 2335935 2326722
5482B326722J72993P843L605j5106J80749P288O8474J86961J54494j17431o706
$$ 2326722 2499715 2507558 2511163 2496057 2676806 2684094 2752568 2939529 3094023 2976592 2969886
5471B969886J18170N2860J83756J10213J70829l8881K33828M6265J02083J45449
$$ 2969886 3088056 3140916 3324672 3434885 3605714 3566833 3800661 3846926 3949009 4094458
5461D094458P1698J83711J74577J08882J25025L25702J29552L2617R0433J10787
$$ 4094458 4166156 4349867 4524444 4633326 4758351 5084053 5213605 5246222 5336655 5447442
5451E447442K90389K34232J84022K39288K83787K18912M04312L55862L27320L35344
$$ 5447442 5737831 5972063 6156085 6395373 6679160 6898072 7302384 7658246 7985566 8320910
5441H320910L21180L19564L54936L76501M02201N68211L50775L62917N61842O30162
$$ 8320910 8642090 8961654 9316590 9693091 10095292 10663503 11014278 11377195 11939037 12569199
5431A2569199P09176Q35105R29843J060044J156574J381645J594698J836235K078565
$$ 12569199 13278375 14113480 15043323 16103367 17259941 18641586 20236284 22072519 24151084
5422B4151084K186904K401546K414255K266283K256228K290065K580868K847516
$$ 24151084 26337988 28739534 31153789 33420072 35676300 37966365 40547233 43394749
5414D3394749K397418Q73892j206632k651876l009281k315361j719146j159522
$$ 43394749 45792167 46666059 45459427 42807551 39798270 37482909 35763763 34604241
5406C4604241n19100k00428L58518P66477J137275J652389K230102K777411L419555
$$ 34604241 34085141 33884713 34243231 35009708 36146983 37799372 40029474 42806885 46226440
5397D6226440M024670M141850M267510L876279L478918L599810M549110N453573
$$ 46226440 50251110 54392960 58660470 62536749 66015667 69615477 74164587 79618160
5389G9618160N765047L433074j365573n956685q124582q036714p135482n847976
$$ 79618160 85383207 88816281 87450708 81494023 73369441 65332727 58197245 52349269
5381E2349269m722980l575327k676908j875612j279171p41054k04660J37009N22659
$$ 52349269 47626289 44050962 41374054 39498442 38219271 37478217 37273557 37410566 37933225
5372C7933225R37547J309642J615726J356179J337369J256281J706765K238302
$$ 37933225 38870772 40180414 41796140 43152319 44489688 45745969 47452734 49691036
5364D9691036K877600K754180J396737j403457m273637n596963n336749m553475
$$ 49691036 52568636 55322816 56719553 55316096 51042459 45445496 40108747 35555272
5356C5555272l657266k824517k282769j924180j523356j241206j065766p70690
$$ 35555272 31898006 29073489 26790720 24866540 23343184 22101978 21036212 20265522
5348B0265522q84031o74241n07507l98772m53602l23775j82980p132k77784l43053
$$ 20265522 19381491 18707250 18199743 17800971 17347369 17023594 16840614 16833482 16555698 16212645
5338A6212645j41421j83713q2122k14661k74217m83841n20596m34263n20008m99211
$$ 16212645 16071224 15887511 15805389 15590728 15316511 14832670 14312074 13877811 13357803 12858592
5328A2858592m67820l26228k51549k70317k18932k07748n2281j25768j79069j38645
$$ 12858592 12390772 12064544 11812995 11542678 11323746 11115998 11063717 10937949 10758880 10620235
5318A0620235J1237j37225j10839r3067k87218k91104j35080k15731l93146k05903
$$ 10620235 10631472 10494247 10383408 10290341 10003123 9712019 9576939 9361208 8968062 8762159
5308H762159m4172j48203j48871L6075j56666k61787l21732j62087j53742k31065
$$ 8762159 8717987 8569784 8420913 8456988 8300322 8038535 7716803 7554716 7400974 7169909
5298G169909q4899j99983q7489j18650j43394j18953m3636j6047r0445l980j47678
$$ 7169909 7085010 6885027 6797538 6678888 6535494 6416541 6372905 6356858 6266413 6262433 6114755
5287F114755j05611j85440j81192j17715j34179o3722j04534p8400P1744k7447
$$ 6114755 6009144 5823704 5642512 5524797 5390618 5326896 5222362 5143962 5215706 5188259
5277E188259k3833j36086k6853j4247j04321p9093p5046o9524M1453j1783l1048
$$ 5188259 5164426 5028340 5001487 4987240 4882919 4803826 4728780 4659256 4700709 4688926 4657878
5266D657878J7801j20067j72936R997j08470q0249j66781J9726N2286p0299l9165
$$ 4657878 4675679 4555612 4382676 4392673 4284203 4203954 4037173 4056899 4109185 4038886 3999721
5255C999721Q7380m0596p2307J93050J53535J5691M1273K1958J14575L00775J30682
$$ 3999721 4087101 4046505 3974198 4167248 4320783 4336474 4377747 4399705 4514280 4815055 4945737
5244D945737R6018K12954P2624M9297K1960j02001l7598p1547j12985j06901l0393
$$ 4945737 5041755 5254709 5327333 5376630 5398590 5296589 5258991 5187444 5074459 4967558 4937165
5233D937165j21579P3540O151j17016m554J27061J28794r13O0566K14718R4394
$$ 4937165 4815586 4889126 4895277 4778261 4773707 4900768 5029562 5028649 5089215 5303933 5398327
5222E398327J94293R6792Q6469p3052K604J98117J08610j4212k3683J17495m4156
$$ 5398327 5592620 5689412 5775881 5702829 5705433 5903550 6012160 5997948 5974265 6091760 6047604
5211F047604j89621j16134j25598K3365q1017l5455Q3180J47355K2242k5152j9325
$$ 6047604 5857983 5741849 5616251 5639616 5558599 5523144 5606324 5753679 5775921 5750769 5731444
5200E731444k8569R0397k1267P093J7886j71444p6062j34937j52983j01938m5807
$$ 5731444 5702875 5793272 5772005 5779098 5796984 5625540 5549478 5414541 5261558 5159620 5113813
5189E113813j08531j09379j56639l9168J15426k38j48825O8704R8125n2258q839
$$ 5113813 5005282 4895903 4739264 4700096 4815522 4815284 4666459 4735163 4833288 4781030 4772191
5178D772191p5461J82967K616J6864L3247P6960K45815R1607J68499J69018M0868
$$ 4772191 4696730 4879697 4882313 4899177 4932424 5009384 5255199 5346806 5515305 5684323 5725191
5167E725191J97221K80491M14078L70166L15836N43210R49731R99436J344389
$$ 5725191 5922412 6202903 6616981 6987147 7302983 7846193 8795924 9795360 11139749
5158A1139749J360796O64164q09556j756670j689397j247458q96695o73851l27885
$$ 11139749 12500545 13164709 12355153 10598483 8909086 7661628 6764933 6091082 5763197
5149E763197j77392k30638k19133k01058n5219j35832l7798M1090N911N1215J8088
$$ 5763197 5585805 5355167 5136034 4934976 4879757 4743925 4706127 4747217 4753128 4804343 4822431
5138D822431M4231J40702J28606J60082L84001M42509J37195k35396k87883m71322
$$ 4822431 4866662 5007364 5135970 5296052 5680053 6122562 6259757 6024361 5736478 5265156
5128E265156l32636k23083k08366j10251M2191k5676j50321r096N4168O75j48472
$$ 5265156 4932520 4709437 4501071 4390820 4433011 4407335 4257014 4247918 4302086 4302761 4154289
5117D154289J08102m8272P4738O9376J08309M2050j18815P7103Q4279j23107R8403
$$ 4154289 4262391 4214119 4288857 4358233 4466542 4508592 4389777 4466880 4551159 4428052 4526455
5106D526455M12915n7421Q0847Q8994J23666j6004Q8125L6532L9802J41068L25800
$$ 4526455 4939370 4881949 4962796 5051790 5175456 5159452 5247577 5284109 5323911 5464979 5790779
5095E790779J15074P1625J47663Q9516K93922L23094O0477J56393K21690J14324
$$ 5790779 5905853 5977478 6125141 6214657 6508579 6831673 6892150 7048543 7270233 7384557
5085G384557K60770K77402K17590K18808L40970L31483L32295L90283M07600M66567
$$ 7384557 7645327 7922729 8140319 8359127 8700097 9031580 9363875 9754158 10161758 10628325
5075A0628325M49498O00004O11920P38686P80969Q45784R24655J056059J251936
$$ 10628325 11077823 11677827 12289747 13028433 13809402 14655186 15579841 16635900 17887836
5066A7887836J468016J449740J873055K066442K105267K469515K580305K333675
$$ 17887836 19355852 20805592 22678647 24745089 26850356 29319871 31900176 34233851
5058C4233851J524063N25308p05010j670624k008234j826162j561377j033076
$$ 34233851 35757914 36283222 35578212 33907588 31899354 30073192 28511815 27478739
5050B7478739n31568k97717j75013M21237N26402Q50390J225412J453528J857256
$$ 27478739 26947171 26649454 26474441 26895678 27422080 28272470 29497882 30951410 32808666
5041C2808666K077545K284076K694167L164059L649279M122068M658110M562975
$$ 32808666 34886211 37170287 39864454 43028513 46677792 50799860 55457970 60020945
5033F0020945M163358K694060K13784k238725m139412m875574m716309m102764
$$ 60020945 64184303 66878363 67092147 64853422 60714010 55838436 51122127 47019363
5025D7019363l393451k729209k170475j654087j204894p65471m47479j06583K04819
$$ 47019363 43625912 40896703 38726228 37072141 35867247 35101776 34654297 34547714 34752533
5016C4752533N50361P10543J065638J468801J694490J948297K117108K045789
$$ 34752533 35302894 36013437 37079075 38547876 40242366 42190663 44307771 46353560
5008D6353560J807214J346528o179j528110k708997l182462l186401l008943k573471
$$ 46353560 48160774 49507302 49501123 47973013 45264016 42081554 38895153 35886210 33312739
4999C3312739k182275j906031j702621j492189j216533j321144j038546q88407
$$ 33312739 31130464 29224433 27521812 26029623 24813090 23491946 22453400 21564993
4991B1564993q04600o34300p04901n00680l57798l47203l37742l98082n37559
$$ 21564993 20760393 20126093 19421192 18920512 18562714 18215511 17877769 17479687 16942128
4982A6942128l63371m70382n65319l95247m91832n00580m99069m13880n04261
$$ 16942128 16578757 16108375 15543056 15147809 14655977 14155397 13656328 13242448 12738187
4973A2738187l58662l79806m66371l60461l49656l64950k18680j38885j18413
$$ 12738187 12379525 11999719 11533348 11172887 10823231 10458281 10239601 10100716 9982303
4964I982303m4274k04135k15112j47722j8986j84496R434r6470j38450j04895
$$ 9982303 9938029 9733894 9518782 9371060 9352074 9167578 9177012 9080542 8942092 8837197
4954H837197l1165J1395O1348K3140p5649R0408m0776m149l2828j25488J28875
$$ 8837197 8806032 8817427 8878775 8901915 8826266 8916674 8875898 8871749 8838921 8713433 8842308
4943H842308J59058J0827j06338K5620K4587J83626Q6855k6869J42232J18288
$$ 8842308 9001366 9012193 8905855 8931475 8956062 9139688 9226543 9199674 9341906 9460194
4933I460194k6245K4223j9790J63662r4630o6145L07255O3882J42792K30176J82905
$$ 9460194 9433949 9458172 9438382 9602044 9507414 9441269 9748524 9812406 9955198 10185374 10368279
4922A0368279K75603M05182L04860L99596N05289N42451P50225Q84038R52762
$$ 10368279 10643882 11049064 11353924 11753520 12258809 12801260 13551485 14435523 15388285
4913A5388285Q62602P11519J87362l81106o09867p01661p03451m98295l56602
$$ 15388285 16250887 16962406 17149768 16768662 16158795 15457134 14753683 14255388 13898786
4904A3898786j05838M082J5685Q0208J26372J83451L34817N19448N19566P29324
$$ 13898786 13792948 13797030 13812715 13892923 14019295 14202746 14537563 15057011 15576577 16305901
4894A6305901Q48751Q85490J171791J186273J408495J751794J807403J758361
$$ 16305901 17154652 18040142 19211933 20398206 21806701 23558495 25365898 27124259
4886B7124259R33656r3532j082473j338496j071273o60563k59523k32856n43817
$$ 27124259 28057915 27964383 26881910 25543414 24472141 23811578 23552055 23319199 22775382
4877B2775382l24391k41909J6346K07351L48340K77350J74358n2987o1310O6419
$$ 22775382 22450991 22209082 22225428 22432779 22781119 23058469 23232827 23179840 23118530 23184949
4867B3184949M83075O11884O03834P67039O71853M98367K29800N7292k71726k51968
$$ 23184949 23668024 24279908 24883742 25650781 26322634 26821001 27050801 27108093 26836367 26584399
4857B6584399j45401K489j01768p85447j541394j559031j369830j221824q68320
$$ 26584399 26438998 26441487 26339719 25554272 24012878 22453847 21084017 19862193 18993873
4848A8993873o05555n75051l20108m42756m34494j48205k74225k63410r5339k03429
$$ 18993873 18388318 17813267 17493159 17050403 16615909 16467704 16193479 15930069 15834730 15631301
4838A5631301k1424n2750p4764N2105n7138j33367l8952l4692m92172p27907p65913
$$ 15631301 15609877 15557127 15482363 15534468 15477330 15343963 15305011 15270319 14778147 14050240 13284327
4827A3284327q15721p89660o12953m60024l62213k6643j55476j91425j52802j5313
$$ 13284327 12468606 11678946 11065993 10605969 10243756 10217113 10061637 9870212 9717410 9702097
4817I702097M3234k41506k46260j97425j06853j38276r1336k06184j82570j97098
$$ 9702097 9745331 9503825 9257565 9060140 8953287 8815011 8723675 8517491 8334921 8137823
4807H137823k36851j31358j09180j18542k25926j90537k57340l5177j5845j46960
$$ 8137823 7900972 7769614 7660434 7541892 7315966 7125429 6868089 6832912 6817067 6670107
4797F670107j85371q2372r5586k5997R4285j07807p2959j12548j20078K6726j44967
$$ 6670107 6484736 6402364 6306778 6280781 6375066 6267259 6194300 6081752 5961674 5988400 5843433
4786E843433k11445q3055o1076l7757j97625q2329R7913p040j5766j46395p3024
$$ 5843433 5631988 5548933 5487857 5450100 5252475 5170146 5268059 5261019 5245253 5098858 5025834
4775E025834o6188q7949P9582K9154l4015j17100k3961j10876r8954q4670P5604
$$ 5025834 4959646 4871697 4951279 4980433 4946418 4829318 4805357 4694481 4595527 4510857 4586461
4764D586461J4711j8072M5006O143o2855k0537O6746m5532J093J4462J0278q6495
$$ 4586461 4601172 4583100 4628106 4634249 4571394 4550857 4617603 4572071 4573164 4587626 4597904 4511409
4752D511409O2663o8475P455M3604L8953j18151o1521J60178Q5003m7910J12513
$$ 4511409 4574072 4505597 4513052 4556656 4595609 4477458 4415937 4576115 4661118 4613208 4725721
4741D725721L2023k7123J01026J14592L9362O1395J92610m6946Q5372o4509O4294
$$ 4725721 4757744 4730621 4831647 4946239 4985601 5046996 5239606 5192660 5278032 5213523 5277817
4730E277817q3348m3939j56098k61309j55027p9488r7528j55270j10061N5236
$$ 5277817 5194469 5150530 4994432 4733123 4578096 4498608 4401080 4245810 4135749 4190985
4720D190985q4395k36948L2050j61477P2546m3649n0575O0284j33290p3555j01806
$$ 4190985 4106590 3869642 3901692 3740215 3812761 3769112 3718537 3778821 3645531 3571976 3470170
4709C470170j42928j65397M4007l1028n6676L1924j23618r4448Q467o6973j36879
$$ 3470170 3327242 3161845 3205852 3174824 3118148 3150072 3026454 2932006 2940473 2873500 2736621
4698B736621p1006j53117j03122N050j06824p3327M9084L305j04264J6697L8201
$$ 2736621 2665615 2512498 2409376 2414426 2307602 2234275 2283359 2286664 2182400 2199097 2237298
4687B237298j09905K9549N159j0595L0469L7886P9008R0348K4098J04755O2922
$$ 2237298 2127393 2156942 2162101 2151506 2181975 2219861 2298869 2389217 2413315 2518070 2580992
4676B580992m7100K9345l4740k32188j64812K2998j63357p8992j10346L3815n72
$$ 2580992 2533892 2563237 2528497 2296309 2131497 2154495 1991138 1912146 1801800 1835615 1835043
4665A835043r6079j22236o0324J63610j3570m7275p827o6029l4146q7724l8594
$$ 1835043 1738964 1616728 1556404 1720014 1706444 1659169 1651342 1585313 1551167 1463443 1424849
4654A424849N6691o9680J3899O0947m0313R109j60759o357J6441k5607N4002P3964
$$ 1424849 1481540 1411860 1425759 1486706 1446393 1455502 1294743 1288386 1304827 1279220 1333222 1407186
4642A407186n5644m6111P5333n6256P9172j20275o940m0640Q6258O2768o031o5823
$$ 1407186 1351542 1305431 1380764 1324508 1403680 1283405 1276465 1235825 1322083 1384851 1378820 1312997
4630A312997L8000l711j13634N1814k7150n7072O1230L4308L6605o1381J0784
$$ 1312997 1350997 1347286 1233652 1285466 1258316 1201244 1262474 1296782 1333387 1272006 1282790
4619A282790M6781l0032p1761n5741M1694j117J15398P3573m0911L2240k9815
$$ 1282790 1329571 1299539 1227778 1172037 1213731 1212614 1328012 1401585 1360674 1392914 1363099
4608A363099o8443P6631O1203r4068j19854M355J09090J30205j27971k4086q122
$$ 1363099 1294656 1371287 1432490 1338422 1218568 1222923 1332013 1462218 1334247 1310161 1302039
4597A302039O1606Q8534l6274M137m1455J39168p151p1322p7366K1531J7445J09040
$$ 1302039 1363645 1452179 1415905 1420042 1378587 1517755 1510604 1439282 1361916 1383447 1400892 1509932
4585A509932R990n0280Q8485k1666K3867J1127k058J86252K501j24352p6594l3980
$$ 1509932 1519922 1469642 1558127 1536461 1560328 1571455 1569397 1755649 1758150 1633798 1557204 1523224
4573A523224O2251L2899M4520K0903K3110J19440M2200k8632J264n8893J541K8903
$$ 1523224 1585475 1618374 1662894 1683797 1706907 1826347 1868547 1839915 1841179 1782286 1783827 1812730
4561A812730R3974P6974N6934o6720J3181P5741O7193k0124M4621J5675q7390
$$ 1812730 1906704 1983678 2040612 1973892 1987073 2062814 2130007 2109883 2154504 2170179 2082789
4550B082789J09224R2681O1796O2739r3292P0525q5475P6654n1138J1040J420
$$ 2082789 2192013 2284694 2346490 2409229 2315937 2386462 2300987 2377641 2326503 2337543 2338963
4539B338963j43136J36350J53215p904n552N0728M6981Q9529Q6460J27222J3166
$$ 2338963 2195827 2332177 2485392 2477488 2471936 2522664 2569645 2659174 2745634 2872856 2886022
4528B886022J20078J87283Q2718P0634P1565P8441p4124J91090J66924J69198
$$ 2886022 3006100 3193383 3276101 3346735 3418300 3496741 3422617 3613707 3780631 3949829
4518C949829K5113M5898Q8455R4415J17718J84534J61613R4857J93723J12545
$$ 3949829 3974942 4020840 4109295 4203710 4321428 4505962 4667575 4762432 4956155 5068700
4508E068700J29242J60924J58868P8805K39737J83647J56385J35393O7082j8126
$$ 5068700 5197942 5358866 5517734 5596539 5836276 6019923 6176308 6311701 6378783 6360657
4498F360657J29375K37263J31096J06682L74076K31826J44697K48265J87651N4723
$$ 6360657 6490032 6727295 6858391 6965073 7339149 7570975 7715672 7963937 8151588 8206311
4488H206311K27602M08403K56487J79749K25581K67294L34043M99168N19962M35460
$$ 8206311 8433913 8842316 9098803 9278552 9504133 9771427 10105470 10604638 11124600 11560060
4478A1560060N04564O16291O03562O39999P52369P53753P91433J025416J052952
$$ 11560060 12064624 12680915 13284477 13924476 14676845 15430598 16222031 17247447 18300399
4469A8300399J281980J382354J550764J843492K299170K541010L053081L669086
$$ 18300399 19582379 20964733 22515497 24358989 26658159 29199169 32252250 35921336
4461C5921336M105403M900068N596161O418448P316877Q750684J1074914J4364243
$$ 35921336 40026739 44926807 50522968 56941416 64258293 73008977 84083891 98448134
4453I8448134J8373256K0766206J6263197M395119j0106846k1798773k4473203
$$ 98448134 116821390 137587596 153850793 158245912 148139066 126340293 101867090
4446A01867090k0452863j4825768j0120827p367889n353581m318693l553410l054187
$$ 101867090 81414227 66588459 56467632 49099743 43746162 39427469 35874059 32819872
4438C2819872k508835k021251j531774j347072j140359r89696o93958o51533m18424
$$ 32819872 30311037 28289786 26758012 25410940 24270581 23280885 22586927 21935394 21516970
4429B1516970m89601m78278k50520r6399p0184P3341j283J49785L0509J58960
$$ 21516970 21027369 20549091 20298571 20202172 20131988 20205329 20204046 20353831 20384340 20543300
4419B0543300K82499K71741K70212M90894O57767O84278R18330J150246J204397
$$ 20543300 20825799 21097540 21367752 21858646 22516413 23200691 24119021 25269267 26473664
4410B6473664J536218K041895K202682K817216L426613M141914M880039N393221
$$ 26473664 28009882 30051777 32254459 35071675 38498288 42640202 47520241 52913462
4402E2913462O304638P646329R538063J1771975J4973693J8705091J7353944Q816670
$$ 52913462 59218100 66864429 76402492 88174467 103148160 121853251 139207195 148023865
4394A48023865m75011r736981j9313881k1969027j9283838j4174488r843177p137706
$$ 148023865 147548854 137811873 118497992 96528965 77245127 63070639 53227462 46089756
4386D6089756n555052m455572l559689k915307k498553k179937j811967j612718
$$ 46089756 40534704 36079132 32519443 29604136 27105583 24925646 23113679 21500961
4378B1500961j234292r59002q31791q48578r24444p09324o40365n82150n09550
$$ 21500961 20266669 19307667 18475876 17627298 16702854 15993530 15353165 14771015 14261465
4369A4261465l76670m55791m81266n08076m65586l53591k83720l76976l77731
$$ 14261465 13884795 13429004 12947738 12439662 11974076 11620485 11336765 10959789 10582058
4360A0582058k48356m34949l40768l45491l44300k60862k71555k11199k99184
$$ 10582058 10333702 9898753 9557985 9212494 8868194 8607332 8335777 8124578 7825394
4351G825394l09311n8654k5374o9371j90441k86149L8721p1343r0833j32790j66172
$$ 7825394 7516083 7457429 7432055 7362684 7172243 6886094 6924815 6853472 6762639 6629849 6463677
4340F463677j70583k5024N2334j50560k12980n5443j5714l590k8678j9106P5126
$$ 6463677 6293094 6268070 6320404 6169844 5956864 5901421 5885707 5882117 5853439 5834333 5909459
4329E909459q4526k3110j25643q2842k6949j26456Q716J6428j23296j03342k1086
$$ 5909459 5824933 5801823 5676180 5593338 5566389 5439933 5448649 5465077 5341781 5238439 5217353
4318E217353k0676q6561j06749P214j3880j31679n0533j37812o3524j07022p039
$$ 5217353 5196677 5110116 5003367 5010581 4996701 4865022 4814489 4676677 4613153 4506131 4499092
4307D499092p834n5570o3798j2937l3560k12566q5615j11228J6384k1300N3593
$$ 4499092 4491258 4435688 4371890 4358953 4325393 4112827 4027212 3915984 3932368 3911068 3964661
4296C964661l9090q083P6260k05961k0918m6987q4771r9801O6005l9794j30343
$$ 3964661 3925571 3917488 3993748 3787787 3766869 3719882 3635111 3535310 3601315 3561521 3431178
4285C431178m5956o6121k9323j6443n0529m0574R7276O4038P4910K2666k12049
$$ 3431178 3385222 3319101 3289778 3273335 3222806 3182232 3279508 3343546 3418456 3441122 3229073
4274C229073O2625O4400j10068j10976k8171r5323n4576K2225Q2125P6386k54596
$$ 3229073 3291698 3356098 3246030 3135054 3106883 3011560 2956984 2979209 3061334 3137720 2883124
4263B883124m9270R5991p8603p6700o6946K7287Q731q796l5266o6516j0754j24537
$$ 2883124 2833854 2929845 2851242 2774542 2707596 2734883 2743614 2734818 2699552 2633036 2622282 2497745
4251B497745J6813J81665M0591j31334m7469R3544j0416k2803p5298K1237r9293
$$ 2497745 2514558 2696223 2736814 2605480 2558011 2651555 2641139 2618336 2543038 2564275 2464982
4240B464982j5346J7594l6839r2130k6400J48738o3971K7446K421q6240J3880
$$ 2464982 2449636 2467230 2430391 2338261 2311861 2460599 2396628 2424074 2426495 2340255 2354135
4229B354135N829j0213k1774r2005J3117L35R2689j24418p7212O4010K3807J9932
$$ 2354135 2359964 2349751 2327977 2235972 2249089 2249424 2342113 2217695 2140483 2204493 2228300 2248232
4217B248232o3390N4108l4126R199k3709j10275r259J70047J00760j7275r6623
$$ 2248232 2184842 2238950 2204824 2214023 2190314 2080039 2070780 2240827 2341587 2324312 2227689
4206B227689l9931L5966N4732j05697J6599K1980L4263M4705K5938j9452N1256
$$ 2227689 2187758 2223724 2278456 2172759 2189358 2211338 2245601 2290306 2316244 2296792 2348048
4195B348048J08043j31942K2573R9441r4789K5101J16357j26003l2244K906k5410
$$ 2348048 2456091 2324149 2346722 2446163 2351374 2376475 2492832 2366829 2334585 2337491 2312081
4184B312081P3027N434J06641j05719P1387l081n7137J14763O4034J85378Q3170
$$ 2312081 2385108 2390542 2497183 2391464 2462851 2459770 2402633 2517396 2581430 2766808 2849978
4173B849978N4683J52400K21300J23628J60302K41846J47505Q8954J94806J0079
$$ 2849978 2904661 3057061 3278361 3401989 3562291 3804137 3951642 4040596 4235402 4245481
4163D245481L3548l61829k74711k11118k20144p5280p0734j35079j01732r9456
$$ 4245481 4279029 3917200 3642489 3431371 3211227 3135947 3065213 2930134 2828402 2728946
4153B728946J8227j05812Q1575m4398J7109m2569p161j8435P0442N0250j88435
$$ 2728946 2747173 2641361 2722936 2678538 2695647 2653078 2645917 2627482 2697924 2748174 2559739
4142B559739J38944l88K0424L7241k3513j7868l4816J24250q9362K9342M8113
$$ 2559739 2698683 2698295 2718719 2755960 2732447 2714579 2679763 2804013 2714651 2743993 2792106
4131B792106r0137J27472J382N3259n6207J66533P782K2361O0122l0726m936J01897
$$ 2792106 2701969 2829441 2830823 2884082 2827875 2994408 3002190 3024551 3084673 3053947 3049011 3150908
4119C150908M8800N9467L9291l0626Q6003J60678P2920L044K12323O0533L625
$$ 3150908 3199708 3259175 3298466 3267840 3353843 3514521 3587441 3590485 3802808 3863341 3866966
4108C866966M4105r4795k04145j08205m2761l5555R6815k2481k858j8756R6940
$$ 3866966 3911071 3816276 3612131 3503926 3461165 3425610 3522425 3499944 3497086 3478330 3575270
4097C575270j9219n0816N7848N5681p4030m5677J47446L3608J3913N6236O4685
$$ 3575270 3556051 3505235 3563083 3618764 3544734 3499057 3646503 3680111 3694024 3750260 3814945
4086C814945l590J45566P8338J0899J47697O8373N7650R0058l7797K4925N4492
$$ 3814945 3811355 3956921 4035259 4046158 4193855 4262228 4319878 4409936 4372139 4397064 4451556
4075D451556Q3327J36115Q6717O3579J01327J43612L5669M3236J90632J5928r883
$$ 4451556 4534883 4670998 4757715 4821294 4922621 5066233 5101902 5145138 5335770 5351698 5341815
4064E341815K8258J91455j7203N0616Q3129N1959K28272J80689J05071l043L0060
$$ 5341815 5370073 5561528 5544325 5594941 5678070 5730029 5958301 6138990 6244061 6241018 6271078
4053F271078J88004J09811R6916K02669J58895J54388J34514J61282Q0853J49916
$$ 6271078 6459082 6568893 6665809 6868478 7027373 7181761 7316275 7477557 7558410 7708326
4043G708326R6098J06614P3794J88141J49271K79553J7328J15765J13994O1233
$$ 7708326 7804424 7911038 7984832 8172973 8322244 8601797 8619125 8734890 8848884 8910117
4033H910117J7088N2529K62774J87133J62965J59069J94813L02866K52989J31297
$$ 8910117 8927205 8979734 9242508 9429641 9592606 9751675 9946488 10249354 10502343 10633640
4023A0633640K56281K44408J57964K32976J97274K53780K57307J82102K56423
$$ 10633640 10889921 11134329 11292293 11525269 11722543 11976323 12233630 12415732 12672155
4014A2672155K71088J27763J22551L07766J87864M2273L09815L03543L78705L12518
$$ 12672155 12943243 13071006 13193557 13501323 13689187 13731460 14041275 14344818 14723523 15036041
4004A5036041J77999L66969L90307N44828N07347P02919Q73850Q48199M39813
$$ 15036041 15214040 15581009 15971316 16516144 17023491 17726410 18600260 19448459 19888272
3995A9888272R1270l26449n15867n70560n12276k99905j28723L512k7843J07550
$$ 19888272 19979542 19653093 19137226 18566666 18054390 17754485 17625762 17629274 17601431 17708981
3985A7708981J05849J37896P9256J25867K60691K15364K61881K95313K45023K11520
$$ 17708981 17814830 17952726 18031982 18157849 18418540 18633904 18895785 19191098 19436121 19647641
3975A9647641K58855L49199J44315J70839K86484K43984J79766J88153K84256
$$ 19647641 19906496 20255695 20400010 20570849 20857333 21101317 21281083 21469236 21753492
3966B1753492J10327L50792K71843J51263L40863K33722J85495M38613K44763
$$ 21753492 21863819 22214611 22486454 22637717 22978580 23212302 23397797 23836410 24081173
3957B4081173K91260K04978L87742J78195J87705L62701J84460L41602L31429
$$ 24081173 24372433 24577411 24965153 25143348 25331053 25693754 25878214 26219816 26551245
3948B6551245M46434L85473L56780K66926L91771L99919M61663M09678N00608
$$ 26551245 26997679 27383152 27739932 28006858 28398629 28798548 29260211 29669889 30170497
3939C0170497M51913M83554N17807O03310P47760O94900R24828Q96992R77290
$$ 30170497 30622410 31105964 31623771 32227081 32974841 33669741 34594569 35491561 36468851
3930C6468851R43283J112071J345048J415469J721284J851117J992373K297998
$$ 36468851 37412134 38524205 39869253 41284722 43006006 44857123 46849496 49147494
3922D9147494K706563L057498L723766M041362M866196N641970O442901P444135
$$ 49147494 51854057 54911555 58635321 62676683 67542879 73184849 79627750 87071885
3914H7071885Q715326J0187150J1815103J3635769J6423593K0851191K6361377
$$ 87071885 95787211 105974361 117789464 131425233 147848826 168700017 195061394
3907A95061394L2364827L4834533K4350875m6710k6199510m0199826l8431448
$$ 195061394 227426221 262260754 286611629 286564919 260365409 220165583 181734135
3900A81734135l0071799k1126358j5062275j0826907q038299o237409n145316
$$ 181734135 151662336 130535978 115473703 104646796 96608497 90371088 85225772
3893H5225772m818155m535939m102624l708359l601776l206232k871898k425220
$$ 85225772 80407617 75871678 71769054 68060695 64458919 61252687 58380789 55955569
3885E5955569k228699k195453k406631k347371k039711j795889j378816j211042
$$ 55955569 53726870 51531417 49124786 46777415 44737704 42941815 41562999 40351957
3877D0351957p68652n08163p3910J66703K02279j2384n15836r28223j311590j388063
$$ 40351957 39583305 39075142 39001232 39167935 39370214 39357830 38841994 37913771 36602181 35214118
3867C5214118j282588j552954j693222j371071j347853j146186r05296o40102
$$ 35214118 33931530 32378576 30685354 29314283 27966430 26820244 25914948 25274846
3859B5274846l76827l91125l39674k60078k93787j63740l09825k70133m76781
$$ 25274846 24898019 24506894 24167220 23907142 23613355 23449615 23139790 22869657 22392876
3850B2392876n57397o13437n77063l58620l10589n6922k10577j05335j79139j08054
$$ 22392876 21835479 21222042 20644979 20286359 19975770 19918848 19708271 19602936 19423797 19315743
3840A9315743P484n1335J11967J00193J21577J24302Q9124j00627j78796k46910
$$ 19315743 19323227 19271892 19383859 19484052 19605629 19729931 19819055 19718428 19539632 19292722
3830A9292722j55129m4930m4689k22816N4305L05908M34334N76698N63090O55446
$$ 19292722 19137593 19092663 19047974 18825158 18879463 19185371 19619705 20196403 20759493 21414939
3820B1414939Q90902P80905K77315l96464n75906j089612j373962j342971j174466
$$ 21414939 22305841 23086746 23364061 22967597 22391691 21302079 19928117 18585146 17410680
3811A7410680r01483p65827m92228m97850k87557j67546k38056k45603L2891Q5855
$$ 17410680 16509197 15743370 15251142 14753292 14465735 14298189 14060133 13814530 13847421 13933276
3801A3933276j20195k7382k17870j80984k7394k61850l60421k01329r2329l5179
$$ 13933276 13813081 13785699 13567829 13386845 13359451 13097601 12737180 12535851 12443522 12408343
3791A2408343r991L2002P9781K3630J44897J80651J25183J24860K02988M4563
$$ 12408343 12398352 12430354 12510135 12533765 12678662 12859313 12984496 13109356 13312344 13356907
3781A3356907J14737j18293k22047n9123l68206j33753l2655j58523J5645Q0369
$$ 13356907 13471644 13353351 13131304 13072181 12703975 12570222 12537567 12379044 12394689 12475058
3771A2475058j3346l1828Q4997N2490J92742O2566J62311J48543J27377J63172
$$ 12475058 12461712 12429884 12514881 12567371 12760113 12822679 12984990 13133533 13260910 13424082
3761A3424082L13840K95412J96912N02140L73152M10505N92848P33764Q75089
$$ 13424082 13737922 14033334 14230246 14732386 15105538 15516043 16108891 16842655 17717744
3752A7717744J044238J156990J322649J346592J191355P73102M28473J23179m34090
$$ 17717744 18761982 19918972 21241621 22588213 23779568 24552670 24981143 25104322 24670232
3743B4670232q02072j075982j028852q06832o90128m00928j88677n9541L6720
$$ 24670232 23868160 22792178 21763326 20956494 20266366 19865438 19676761 19617220 19653940
3734A9653940K20408M15645M06560J76472k35131k68145j38810K1632K73078N27822
$$ 19653940 19874348 20289993 20696553 20873025 20637894 20369749 20230939 20252571 20525649 21053471
3724B1053471O48639O61468P86077P78958P24762Q49403R55847Q81719O02799
$$ 21053471 21702110 22363578 23149655 23928613 24653375 25502778 26458625 27340344 27943143
3715B7943143N54275P47093J249200J350653J446927J704675J393799L89008j122718
$$ 27943143 28497418 29244511 30493711 31844364 33291291 34995966 36389765 36778773 35656055
3706C5656055k371258k912854k849533k112216j625343j184460q25722n72048
$$ 35656055 33284797 30371943 27522410 25410194 23784851 22600391 21774669 21202621
3698B1202621m23609l50843j72550L0144j4642k02906m14424n66216l56412j85963
$$ 21202621 20779012 20428169 20255619 20285763 20271121 20068215 19653791 19087575 18731163 18545200
3688A8545200j0536J79961N73508P46039J046820J117754J090767N14078k02767
$$ 18545200 18534664 18714625 19288133 20034172 21080992 22198746 23289513 23803591 23600824
3679B3600824p65826r54957q39807n70847l94077j73387o804O1186M42270L35650
$$ 23600824 22834998 21880041 21040234 20469387 20075310 19901923 19895119 19956305 20398575 20734225
3669B0734225k61655o43520q28884r90058p92273o29098m53614l21453k59286
$$ 20734225 20472570 19829050 19000166 18010108 17217835 16588737 16135123 15813670 15554384
3660A5554384m5118N1499J48591K15080K28056J53003j3583J43351M2986J06623
$$ 15554384 15509266 15560765 15709356 15924436 16152492 16305495 16291912 16435263 16478249 16584872
3650A6584872j14378p9039J30665M15832N08983M83050N60995M83691L31725k5460
$$ 16584872 16470494 16391455 16522120 16937952 17446935 17929985 18490980 18974671 19306396 19280936
3640A9280936k87853k71912k60235k98971n9637k75862k13188j34346L3008J16025
$$ 19280936 18993083 18721171 18460936 18161965 18102328 17826466 17613278 17478932 17511940 17627965
3630A7627965K33735K87240L98222N16792N99614Q15741R60696J051004J252893
$$ 17627965 17861700 18148940 18547162 19063954 19663568 20479309 21440005 22491009 23743902
3621B3743902J301364J402257J641877J829250J539857J272949Q50247N75075
$$ 23743902 25045266 26447523 28089400 29918650 31458507 32731456 33581703 34156778
3613C4156778K84507N4723k79604n67944o88186j030815r28197o93106k71169
$$ 34156778 34441285 34496008 34216404 33648460 32960274 31929459 31001262 30308156 30036987
3604C0036987k34312K4014L42432P50912Q35654R18977P86813P55279O23560R22003
$$ 30036987 29802675 29826689 30169121 30920033 31755687 32674664 33461477 34216756 34840316 35762319
3594C5762319J161139J402480J613201J793385J868960J884576J225111K09547
$$ 35762319 36923458 38325938 39939139 41732524 43601484 45486060 46711171 46920718
3586D6920718k25134m14499j89696r5514k72973l20693n32366n84500n06831n05094
$$ 46920718 46695584 46281085 46091389 45995875 45722902 45402209 44869843 44285343 43778512 43273418
3576D3273418o28287o33820n35247m86109o98918j057109j194330j018184m85108
$$ 43273418 42645131 42011311 41476064 40989955 40291037 39233928 38039598 37021414 36536306
3567C6536306j67461J89128N12923O82855N94732Q88600O90400N76898O58324
$$ 36536306 36368845 36557973 37070896 37753751 38348483 39237083 39927483 40504381 41162705
3558D1162705Q32758J071696J324693J042504J59504o56411j163461j858171k256108
$$ 41162705 41995463 43067159 44391852 45434356 45593860 44937449 43773988 41915817 39659709
3549C9659709k087414j850533j403100j194510j217598j191222j334718j083986
$$ 39659709 37572295 35721762 34318662 33124152 31906554 30715332 29380614 28296628
3541B8296628r90792p09815n04313j26418o8761l790P4214J5775K48336L32965
$$ 28296628 27305836 26596021 26091708 25965290 25896529 25892739 25966953 25982728 26231064 26564029
3531B6564029L88264L28788J12278k08476p02591q84323p14765o97754o91747
$$ 26564029 26952293 27281081 27393359 27184883 26482292 25597969 24883204 24185450 23493703
3522B3493703n40203m92172m90719m44313n67479m20609k42202k59291j5950j21081
$$ 23493703 22953500 22461328 21970609 21526296 20958817 20538208 20296006 20036715 20020765 19899684
3512A9899684J9592j25761l08855j5408k05769j27457p5534r0135j43914j25503
$$ 19899684 19919276 19793515 19484660 19469252 19263483 19136026 19060492 18970357 18826443 18700940
3502A8700940j48622o8245j08167M3588J5468P6030K38536R6201K39036M29572
$$ 18700940 18552318 18484073 18375906 18419494 18434962 18510992 18749528 18845729 19084765 19514337
3492A9514337L93184N85781N95350O67748M72690M75522M85430N47836N44559
$$ 19514337 19907521 20493302 21088652 21756400 22229090 22704612 23190042 23737878 24282437
3483B4282437N96667P08778O98835N50977O16819L93056L14701L07072K96206
$$ 24282437 24879104 25587882 26286717 26837694 27454513 27847569 28162270 28469342 28765548
3474B8765548M43108L17859N06936M65564P10905P13235M91842K02362j29818
$$ 28765548 29208656 29526515 30033451 30499015 31209920 31923155 32414997 32617359 32487541
3465C2487541k76695l50749j80132J53065K12068L95552P80340R17416J232863
$$ 32487541 32210846 31860097 31679965 31833030 32045098 32440650 33220990 34138406 35371269
3456C5371269J331898J364972J557644J780984J542557J342785J300613J137536
$$ 35371269 36703167 38068139 39625783 41406767 42949324 44292109 45592722 46730258
3448D6730258J195718J314506J449647J099711N52686J23251o65800j301806j224254
$$ 46730258 47925976 49240482 50690129 51789840 52342526 52465777 51799977 50498171 49273917
3439D9273917j078954q47935m86529l8438N5310K22206K58354K97281M65299O22041
$$ 49273917 48194963 47347028 46860499 46822061 46877371 47099577 47357931 47655212 48120511 48742552
3429D8742552Q98085J158569J347722J501260J486372P92853P04511P21548P62883
$$ 48742552 49640637 50799206 52146928 53648188 55134560 55927413 56631924 57353472 58116355
3420E8116355R17242J062835J026601P76892P24307P91622O27820L54788P62044
$$ 58116355 59033597 60096432 61123033 61899925 62624232 63415854 64043674 64398462 65160506
3411F5160506J045979Q60854P31955J98113l73476q09927j240578j611242j723975
$$ 65160506 66206485 67067339 67799294 67997407 67623931 66814004 65573426 63962184 62238209
3402F2238209j479990j054293m49077l27371m3209n4544n3255L01525M94319O93033
$$ 62238209 60758219 59703926 59254849 58927478 58884269 58829725 58776470 59077995 59572314 60265347
3392F0265347O89457M11829K11512M17329N43796L80286K51929J89748J07079
$$ 60265347 60954804 61366633 61578145 61995474 62539270 62919556 63171485 63361233 63468312
3383F3468312j83844n82411j349851k203046k943686l121111k947026k373013
$$ 63468312 63284468 62702057 61352206 59149160 56205474 53084363 50137337 47764324
3375D7764324k000027j570398j223744j102085r71915q60432p41627o81443p44959
$$ 47764324 45764297 44193899 42970155 41868070 40896155 40035723 39294096 38612653 37867694
3366C7867694p74273o10030l75799j60283j19320l282K6604j97895n05378n25534
$$ 37867694 37093421 36483391 36107592 35947309 35827989 35824707 35851311 35653416 35148038 34622504
3356C4622504n65563r26077j019133j116334j225828j096926j005145p65452p15512
$$ 34622504 34056941 33130864 32111731 30995397 29769569 28672643 27667498 26902046 26186534
3347B6186534o07700n30373m12719n98891m34961n09909m34966m46030m99350
$$ 26186534 25578834 25048461 24635742 24036851 23601890 23091981 22657015 22210985 21711635
3338B1711635l70155l67961l16533l36811l73601l33626k45043l00119l53886
$$ 21711635 21341480 20973519 20656986 20320175 19946574 19612948 19367905 19067786 18713900
3329A8713900l33577l78049m43609l79066m10203l03003k83471k54896k83088
$$ 18713900 18380323 18002274 17558665 17179599 16769396 16466393 16182922 15928026 15644938
3320A5644938l47273j99422k05766l29793k06480k55080l56435k84367n23960
$$ 15644938 15297665 15098243 14892477 14562684 14356204 14101124 13744689 13460322 12936362
3311A2936362k26041k15282l52044m6174j39622k41456j46464k59249k99018j76834
$$ 12936362 12710321 12495039 12142995 12096821 11957199 11715743 11569279 11310030 11011012 10834178
3301A0834178j78513j41933k263j21003k08015q3130j07159j10084j52436j13060
$$ 10834178 10655665 10513732 10511469 10390466 10182451 10099321 9992162 9882078 9729642 9616582
3291I616582j42894j11005j00062j49775j89695n0819k48428j29363n8070j30751
$$ 9616582 9473688 9362683 9262621 9112846 8923151 8872332 8623904 8494541 8436471 8305720
3281H305720k53927j33860j71284n0245p8270j14726n4570j00760j07882q8109
$$ 8305720 8051793 7917933 7746649 7696404 7618134 7503408 7448838 7348078 7240196 7152087
3271G152087j5723J01028m3480j9267J4130K8493M117o1785J38931L7032N0005
$$ 7152087 7136364 7237392 7193912 7174645 7188775 7217268 7221385 7159600 7298531 7335563 7385568
3260G385568n4151q5634K762j30029l2954m3725j86680q2561j40191j97119J3208
$$ 7385568 7331417 7245783 7248545 7118516 7085562 7041837 6855157 6772596 6632405 6435286 6448494
3249F448494j44443k04390J03334K3223l4249K9885P865j09810n2903J2013M749
$$ 6448494 6304051 6099661 6202995 6226218 6191969 6221854 6229719 6119909 6067006 6079019 6083768
3238F083768L1951P3543O3982K15143R4719r538R5408J43932O4177l4145n9412
$$ 6083768 6115719 6189262 6253244 6468387 6563106 6553568 6648976 6792908 6857085 6822940 6763528
3227F763528O9178r17p3406j3385n1038n6428O862n5730r1981j66004j02882o0127
$$ 6763528 6832706 6831789 6758383 6744998 6693960 6637532 6644394 6588664 6496683 6330679 6227797 6167670
3215F167670l599J2198n7371o9435J69819j0901p219m2683m9381N5352J58934
$$ 6167670 6164071 6176269 6118898 6049463 6219282 6208381 6201162 6158479 6109098 6164450 6323384
3204F323384J41526M5620k6921j0296k9018o1929k2719R7962Q805p6420K323J8953
$$ 6323384 6464910 6510530 6483609 6473313 6444295 6382366 6359647 6457609 6466414 6389994 6392317 6411270
3192F411270q9815q0390j13634q83K4771m4713k86445L4061O3838J6449q5760
$$ 6411270 6321455 6241065 6127431 6126548 6151319 6106606 5820161 5854222 5918060 5934509 5848749
3181E848749k05684j13144o1344J30404j1878k7248l7869J3170J095O0150r4120
$$ 5848749 5643065 5529921 5468577 5598981 5587103 5559855 5521986 5535156 5536251 5596401 5502281
3170E502281n1424O1262J4245j5831O0579Q0269J4521m0142m1575j04659N6584
$$ 5502281 5450857 5512119 5526364 5510533 5571112 5651381 5665902 5625760 5584185 5479526 5536110
3159E536110j1186M1005l666p2366j14813N2257M5481k8523j9455M1881L0963
$$ 5536110 5524924 5565929 5562263 5489897 5375084 5427341 5472822 5444299 5424844 5466725 5497688
3148E497688R017j96937q9702Q4279o3352m3754P1400P321L2041j27999l6625
$$ 5497688 5506705 5309768 5220066 5304345 5240993 5197239 5268639 5275960 5308001 5180002 5143377
3137E143377P8828P3357J45390m7506j08940J45696m7203j63470J50238P7981
$$ 5143377 5222205 5295562 5440952 5393446 5284506 5430202 5382999 5219529 5369767 5447748
3127E447748M9282J5518k4402k9672Q028J2127p4650M0099J20676J07506O425
$$ 5447748 5497030 5512548 5488146 5458474 5466502 5478629 5403979 5444078 5564754 5672260 5678685
3116E678685Q688j91659p3047r758J05190l6972P3262m028Q2136r0363m1875N0214
$$ 5678685 5687373 5495714 5422667 5412909 5518099 5481127 5554389 5550361 5632497 5542134 5500259 5550473
3104E550473m0229J57346J02217J03980k0223J48251n6100K9326J84999O8693
$$ 5550473 5510244 5667590 5769807 5873787 5853564 6001815 5945715 5975041 6160040 6228733
3094F228733K62269K36784R7542J59119J96719K69064K20437J87923K19537K61184
$$ 6228733 6491002 6727786 6825328 6984447 7181166 7450230 7670667 7858590 8078127 8339311
3084H339311J66513J42287N4120j03800j50195k73780l68105k42397l34913k23882
$$ 8339311 8505824 8648111 8702231 8598431 8448236 8174456 7806351 7563954 7229041 7005159
3074G005159k38740k15076j50633j40999j28094j80256l32348j86602o2576j13422
$$ 7005159 6766419 6551343 6400710 6259711 6131617 5951361 5619013 5432411 5369835 5256413
3064E256413j93596o3504J197l5246j70414J246k5452L2569L1361n5531M5488
$$ 5256413 5062817 4999313 5000510 4965264 4794850 4796096 4770644 4803213 4834574 4779043 4824531
3053D824531n3797r2672j00516l8176Q6187m9101M6378n2327o5210J95484k3003
$$ 4824531 4770734 4678062 4577546 4539370 4625557 4576456 4622834 4570507 4505297 4700781 4677778
3042D677778q6750o5164k6067j9459j5281R0407K6750p8524l9567K0473q5338
$$ 4677778 4591028 4525864 4499797 4480338 4465057 4555464 4582214 4503690 4464123 4484596 4399258
3031D399258m6621J2757k5162l1703J17500Q5224r3682Q945O9647J51920J33148
$$ 4399258 4352637 4365394 4340232 4308529 4426029 4511253 4417571 4426516 4496163 4648083 4781231
3020D781231J38994m37L3274K11653K19133P9060K3276M3611j12564j50497M9229
$$ 4781231 4920225 4919788 4953062 5164715 5383848 5462908 5486184 5529795 5417231 5266734 5315963
3009E315963J17862O975m076P1081o2599m866K01005J53505J77489K66713K30555
$$ 5315963 5433825 5440800 5436724 5507805 5445206 5440340 5641345 5794850 5972339 6239052 6469607
2998F469607n2007j41532k13644j79246m8328p4116K59137K5604P993J0615j84851
$$ 6469607 6417600 6276068 6062424 5883178 5834850 5760734 6019871 6045475 6053468 6064083 5879232
2987E879232j08843j69303J7562p3839n4718P8270R851O8509J24006J62704J08908
$$ 5879232 5770389 5601086 5618648 5544809 5490091 5568361 5578212 5646721 5770727 5933431 6042339
2976F042339O2532L49404j0659j81764l29966l72859k62502k12030j70376r5325
$$ 6042339 6104871 6454275 6443616 6261852 5931886 5559027 5296525 5084495 4914119 4818794
2966D818794j536j84498r748O7292o7131k8717j03684q737J2557k17711p0065
$$ 4818794 4817258 4632760 4623012 4690304 4623173 4594456 4490772 4482035 4494592 4276881 4206816
2955D206816n6925N2570Q8546n6747o0446j64497p5490o0854j44161L6145K7508
$$ 4206816 4149891 4202461 4291007 4234260 4173814 4009317 3933827 3872973 3728812 3764957 3792465
2944C792465n8973o7152m0516L6335l4518l7386N9528l5537j08459j29361K9580
$$ 3792465 3733492 3666340 3625824 3662159 3627641 3590255 3649783 3614246 3505787 3376426 3406006
2933C406006j3789j15942j12561p829q8637J9044K8120m3220n645o0672m9791
$$ 3406006 3392217 3276275 3163714 3155885 3067248 3086292 3114412 3071192 3065547 3004875 2955084
2922B955084m4522q6284o4816l940J12623O2015r7840m4696n1964p2230m1246
$$ 2955084 2910562 2824278 2759462 2755522 2868145 2930160 2832320 2787624 2735660 2663430 2622184
2911B622184m6785N155p5442K270J06097l6844k15333p2698J3705o1695p0582
$$ 2622184 2575399 2580554 2505112 2507382 2613479 2576635 2361302 2288604 2302309 2240614 2170032
2900B170032M4551o1953j96326L0128Q0208j32791N6750K4194k5919o4657q5891
$$ 2170032 2214583 2152630 1956304 1986432 2066640 1933849 1990599 2014793 1988874 1924217 1838326
2889A838326J6402m6425k2959p6869q539J31619P489l1530j66475o1146J8623
$$ 1838326 1854728 1808303 1785344 1708475 1699936 1831555 1839044 1807514 1641039 1579893 1598516
2878A598516J1206Q2555q6623P406j26016q2046J2749o3130n4673q0233N8623
$$ 1598516 1609722 1692277 1605654 1613060 1487044 1404998 1417747 1354617 1299944 1219711 1278334
2867A278334j1912Q759j7272k3389K1939r8331P3244M8323Q6285p6317j37687
$$ 1278334 1266422 1275181 1257909 1234520 1256459 1158128 1231372 1279695 1365980 1289663 1151976
2856A151976j59468N8664Q2819Q0184K8958j06582p4597P6891J45774r1965r4801
$$ 1151976 992508 1051172 1133991 1214175 1243133 1136551 1061954 1138845 1284619 1192654 1097853
2845A097853j40572J17744K420J875K6023K906Q7795j1542r9393J45276L3382
$$ 1097853 957281 1075025 1077445 1079320 1105343 1108249 1196044 1184502 1085109 1230385 1263767
2834A263767j98500P4943m8179N0817J16532p5579q5773q9341j18627K7770N5967
$$ 1263767 1065267 1140210 1092031 1142848 1259380 1183801 1098028 1008687 890060 917830 973797
2823I73797L1561j163J13815J1411l6065m5324N2016K4495n0105q8942j2649K6349
$$ 973797 1005358 1004195 1118010 1129421 1093356 1048032 1100048 1124543 1074438 985496 972847 999196
2811I99196R2604J2346m5092j4164N2314J8555N3741m8894j0595L343K2242j1444
$$ 999196 1091800 1104146 1059054 1044890 1097204 1115759 1169500 1120606 1110011 1113354 1135596 1124152
2799A124152M8669L3299o4279o6629p1356P3157k5878K7693P4815J6903n4431
$$ 1124152 1172821 1206120 1141841 1075212 1003856 1077013 1051135 1078828 1153643 1170546 1116115
2788A116115q851N9328L552L5725L1983N2784O3959M0935L9616n2391O851J35326
$$ 1116115 1107264 1166592 1170144 1205869 1237852 1290636 1354595 1395530 1435146 1382755 1389606 1524932
2776A524932K1177J0271k8849j9174J3833l3091r5356j02962J6024p073k0461
$$ 1524932 1546109 1556380 1527531 1508357 1522190 1489099 1393743 1290781 1306805 1299732 1279271
2765A279271j52966J6647P903O817p986N9842o356K9306O2183n0745q2874O2918
$$ 1279271 1126305 1142952 1150855 1157672 1149686 1209528 1203172 1232478 1294661 1243916 1161042 1223960
2753A223960r1509k9287N3862Q4879o4909l7271L684j21305K4116J608J6483O7048
$$ 1223960 1132451 1103164 1157026 1241905 1176996 1139725 1143409 1022104 1046220 1047828 1064311 1131359
2741A131359q9639r6110q8102k9028r0701q0550J21395p498Q1035p4258j6253
$$ 1131359 1041720 945610 857508 828480 737779 657229 778624 771126 852161 777903 761650
2730G61650j4892R849O0940p3834p0906L9973K8510m5529l5881p2830k7379R750
$$ 761650 746758 756607 817547 743713 672807 712780 741290 695761 659880 587050 559671 569421
2718E69421K1082j899M639l0103q2116q6914J7019K08160k3330q5765o1598q2629
$$ 569421 590503 588604 593243 563140 481024 394110 411129 619289 595959 510194 448596 365967
2706C65967Q0009p0250j0700K1750j9277n9484J4821l2738L1831J935J9868O8213
$$ 365967 445976 375726 365026 386776 367499 308015 322836 290098 321929 323864 343732 411945
2694D11945o8242k5290K6275q7404N8251L250q1899J14157l1598P822j1473j12753
$$ 411945 343703 318413 344688 257284 315535 318785 236886 351043 319445 327267 315794 203041
2682B03041R7728k6803j2673M5470r959n4454k9050j3412K808M7331K3844q6900
$$ 203041 300769 273966 261293 306763 296804 242350 213300 199888 202696 250027 273871 186971
2670A86971m332l486j9341P4926j17215M77P5750k1217n5583M0336r0931O7293
$$ 186971 182639 179153 159812 234738 117523 118000 193750 172533 116950 157286 66355 133648
2658A33648K863K142Q1161n058p7911O9352n4061n8819l9640l9946J50567m0256
$$ 133648 136511 138653 219814 214756 136845 206197 152136 93317 53677 13731 164298 124042
2646A24042K789P1804m7058p6066m1832N9124P600r3348r09J10995l1846L8029
$$ 124042 126831 198635 151577 75511 33679 92803 100403 7055 6146 117141 85295 123324
2634A23324k8912n5971K2789M2295L8331p048j9118m0602K8118r3977k0020l112
$$ 123324 94412 38441 61230 103525 141856 134808 115690 75088 103206 9229 -10791 -13903
2622a3903k6146J00839L0598r341p7737j8310l3087M027N8100j43754P5138M2826
$$ -13903 -40049 60790 91388 82047 4310 -14000 -47087 -43060 15040 -128714 -53576 -10750
2610a0750J5956r9775L5178J20246L5937l9085k6130N766k6334n0627j03773M3003
$$ -10750 5206 -94569 -59391 60855 96792 57707 31577 37343 11009 -39618 -143391 -100388
2598a00388L9319J23582L5111r2373q9831K160o8223k529K01147N0168j26645
$$ -100388 -61069 62513 97624 5251 -84580 -82420 -150643 -153172 47975 98143 -28502
2587b8502J5779q1467R0262L8513m5446n158m3871J72758o280n2302n6634o227
$$ -28502 -12723 -94190 -3928 34585 -10861 -16019 -59890 112868 106588 54286 -2348 -8575
2575h575O787j4037j09055M9926O3859p147o9413k2981J79900p4642p3934L0656
$$ -8575 -1788 -15825 -124880 -74954 -11095 -18242 -87655 -110636 69264 -5378 -79312 -48656
2563d8656N3393p2665j01719Q3522N2510j9782L1723r6263j0073J0373P1640N8114
$$ -48656 4737 -67928 -169647 -86125 -33615 -53397 -21674 -117937 -128010 -117637 -45997 12117
2551A2117O4024M7291j82819J0142l0999Q1334L8332k7178k6606q3990M8989J32052
$$ 12117 76141 123432 -59387 -49245 -80244 1090 39422 12244 -14362 -98352 -49363 82689
2539H2689l7914q4494k9521m699j18242k0856Q6647p0603M0788J6318R3739J8616
$$ 82689 44775 -39719 -69240 -73939 -192181 -213037 -126390 -196993 -156205 -139887 -46148 -27532
2527b7532P929N390n7573J00556r6189J5512O7675n3093P6426L0636q5007q0736
$$ -27532 -19603 -14213 -71786 28770 -67419 -51907 15768 -37325 39101 69737 -15270 -96006
2515i6006J9239O651N0796J3842L1943k8455J31433j46795K8667Q3050j11743
$$ -96006 -76767 -70116 -19320 -5478 26465 -1990 129443 -17352 11315 94365 -17378
2504a7378l3436m2066J73225l8583q1657L782l9592K1832O8799l1361J4588N8337
$$ -17378 -50814 -92880 80345 41762 -39895 -36113 -75705 -53873 14926 -16435 -1847 56490
2492E6490q6678l7517j0673j4033r9737k4797Q6900M4582J9638k0838L776k3139
$$ 56490 -30188 -67705 -78378 -92411 -192148 -216945 -130045 -85463 -65825 -86663 -82887 -106026
2480a06026J19817j6171N1287M5325q1260j2040j37850N4172J7123j5759J09046
$$ -106026 13791 -2380 48907 94232 12972 932 -136918 -82746 -65623 -81382 27664
2469B7664J0082Q4812m4349j12406l1479r6210l238k4484j6957k0023P8508J19970
$$ 27664 37746 122558 78209 -34197 -65676 -161886 -165124 -189608 -206565 -226588 -148080 -28110
2457b8110n6852j6180q0853J67867j06512j0930R461m148l2409p2477J17952L703
$$ -28110 -84962 -101142 -181995 -14128 -120640 -131570 -122109 -126257 -158666 -231143 -113191 -109488
2445a09488K284l7885K0826N6338M6997M9919l6904l356k3264M7917Q016l7596
$$ -109488 -107204 -145089 -124263 -67925 -20928 28991 -7913 -11269 -34533 13384 21400 -16196
2433a6196m5018J4570K8917L3356N6389j07878J6653l8794k7177r7774j9380J25735
$$ -16196 -61214 -46644 -17727 15629 72018 -35860 -19207 -58001 -85178 -182952 -202332 -76597
2421g6597P0208M397o9338J0299M913J5114M9901Q029k8855L0491J0185n3225
$$ -76597 -6389 -1992 -71330 -61031 -56118 -41004 8897 16926 -11929 18562 28747 -24478
2409b4478r0345k5890k4215n8427q1079P9478P9005l4217O8557k7391J12169p8153
$$ -24478 -114823 -140713 -164928 -223355 -304434 -224956 -145951 -180168 -111611 -139002 -26833 -104986
2397a04986m5875M9422N1156j5119o5339Q800n4612J6192N0695j0910M1230N9135
$$ -104986 -150861 -101439 -50283 -65402 -130741 -121941 -176553 -160361 -109666 -120576 -79346 -20211
2385b0211o9578N3504l675j62094P0823Q0510q0851Q9453O1362l3584J5448q86
$$ -20211 -89789 -36285 -39960 -202054 -131231 -50721 -131572 -42119 19243 -14341 1107 221
2373B21j78585k8487M3810k5888J48707j3616k3585O5893m7377k8615M3709j17564
$$ 221 -178364 -206851 -163041 -188929 -40222 -53838 -77423 -11530 -58907 -87522 -43813 -161377
2361a61377j09532J21286O0696R0226O2023o1413m5004K4430o7441j2447L5469
$$ -161377 -270909 -149623 -88927 1299 63322 1909 -43095 -18665 -86106 -98553 -63084
2350f3084j2402J08542m8129L2395j06098j2329M3460L2036o3507M9496n7325
$$ -63084 -75486 33056 -15073 17322 -88776 -101105 -57645 -25609 -89116 -39620 -96945
2339i6945q851k3181J68262P3216j61123q9340L8456m2503o394M3108o49J5516
$$ -96945 -105796 -128977 39285 112501 -48622 -137962 -99506 -142009 -148403 -105295 -105944 -90428
2327i0428P4483J7245M0700k6017p0792O6966o6020K8465K9299l7031Q2955n045
$$ -90428 -15945 1300 42000 15983 -54809 12157 -53863 -25398 3901 -33130 49825 44780
2315D4780j12647K3775l7173Q6181k2023P9247P0678l2414j03508J43788o9804
$$ 44780 -67867 -44092 -81265 4916 -17107 62140 132818 100404 -3104 140684 70880
2304G0880p1567N3153q3956R1273J21909l3969m8960J09747J12357o8208l698
$$ 70880 -687 52466 -31490 59783 181692 147723 98763 208510 320867 252659 248961
2293B48961N9180j35836j08477N8361m2726N5456M6157Q604q7362l5731l9801
$$ 248961 308141 172305 63828 122189 79463 134919 181076 189680 102318 66587 26786
2282B6786K4916P8024J2762r6591q8521J44150J3702j06822N5697p330k9524n1849
$$ 26786 51702 129726 142488 45897 -42624 101526 115228 8406 64103 56773 27249 -24600
2270b4600n133M2041k4858J5741k1129k1637J34918l6489j3099o0560M1575P9748
$$ -24600 -29733 12308 -12550 3191 -17938 -39575 95343 58854 45755 -14805 26770 106518
2258A06518j44919L4545j0316q798J33399j05705l4405k6417J06590J22491j19874
$$ 106518 -38401 -3856 -14172 -22970 110429 4724 -29681 -56098 50492 172983 53109
2247E3109L3238R601P748M1528m8079k9304O4781q7886l3946m9447m681J07617
$$ 53109 86347 95948 103696 145224 97145 67841 132622 44736 10790 -38657 -43338 64279
2235F4279P86Q6977m387j02826l2156P8332j5790O5277k0358k2614k2388J0163
$$ 64279 65065 152042 147655 44829 12673 91005 75215 140492 120134 97520 75132 85295
2223H5295q5422l6144J31900n4682l2323N02L4074O2110j11920K3932J696l7339
$$ 85295 -127 -36271 95629 40947 8624 9126 43200 105310 -6610 17322 19018 -18321
2211a8321J04171q1582J34585j03626M0680J17476j00399j40242L4628M8386J68178
$$ -18321 85850 4268 138853 35227 75907 193383 92984 -47258 -12630 35756 203934
2200B03934j4980m0028p0970l3316N9478n9507J13M3347O9078R456R6561R2751
$$ 203934 188954 148926 77956 44640 104118 44611 44724 88071 157149 166605 263166 355917
2188C55917r2708N224J0802J7589M3226l6751o2819L9586n563o7668j1866P4269
$$ 355917 263209 268433 279235 296824 340050 303299 240480 280066 274503 206835 194969 269238
2176B69238O5056J4508p0196P0082L8783K644m229L8959q5384m9043O121L9883
$$ 269238 334294 348802 278606 348688 387471 390115 385886 424845 339461 290418 296539 336422
2164C36422J90361Q287j03882p467J7467O5698p5048l8646o871J7271p694K9189
$$ 336422 526783 535070 431188 423721 441188 506886 431838 393192 386321 403592 395898 425087
2152D25087J4462k7791R7299N1353K0549j3908n1943n7297M0375P5484k5413r9006
$$ 425087 439549 411758 509057 560410 580959 567051 515108 457811 498186 573670 548257 449251
2140D49251M5444J40031r6094M8930J73401m2104m9155R6342Q6275J4882o5624
$$ 449251 494695 634726 538632 587562 760963 718859 669704 766046 852321 867203 801579
2129H01579k2851J40465n7278l7867Q0638J05920P3951J19531m0531R5398L5210
$$ 801579 778728 919193 861915 824048 904686 1010606 1084557 1204088 1163557 1258955 1294165
2118A294165L6070N2667l9112Q6805J19235m7465M8113J64034L5950L176J10123
$$ 1294165 1330235 1382902 1343790 1430595 1549830 1502365 1550478 1714512 1750462 1753638 1863761
2107A863761O7146J31228j9952J12141n1029J04467N4994j1441R7335J43820J09020
$$ 1863761 1930907 2062135 2042183 2154324 2103295 2207762 2262756 2251315 2348650 2492470 2601490
2096B601490J50551K8913P5018J04745R9823J12481J09935J53601Q8626Q7430
$$ 2601490 2752041 2780954 2855972 2960717 3060540 3173021 3282956 3436557 3525183 3612613
2086C612613L1281K01787K53470K41412K59842K65959R5780L18331L34657M16339
$$ 3612613 3643894 3845681 4099151 4340563 4600405 4866364 4962144 5280475 5615132 6031471
2076F031471L78439L03949N03349M71906O78958P07525Q93938J010335J359422
$$ 6031471 6409910 6713859 7217208 7689114 8368072 9075597 9969535 10979870 12339292
2067A2339292J439929J330656J270595J483881J904686K581336K848509L436372
$$ 12339292 13779221 15109877 16380472 17864353 19769039 22350375 25198884 28635256
2059B8635256L934631N316867P043821Q533554J1686788J1843646k27087j1907701
$$ 28635256 32569887 37886754 44930575 53464129 65150917 76994563 76767476 64859775
2051F4859775j3917564j2328798p677180n186907l882224l000264k206249j656014
$$ 64859775 50942211 38613413 30936233 25749326 21867102 18866838 16660589 15004575
2043A5004575j210847r89070p92579p52707q32061j006212r24658p78946n27992
$$ 15004575 13793728 12804658 12012079 11259372 10427311 9421099 8496441 7717495 7189503
2034G189503l97488n27670l14243k27292l22848k77462l36230j35088k46438k23264
$$ 7189503 6792015 6264345 5950102 5722810 5399962 5122500 4786270 4651182 4404744 4181480
2024D181480n1206o3130j75834k29851j65476j58274k17883q1207j52996j02263
$$ 4181480 4130274 4067144 3891310 3661459 3495983 3337709 3119826 3038619 2885623 2783360
2014B783360j51297k67478m6728J421p1379j09712j84579L2572m2558q384j09928
$$ 2783360 2632063 2364585 2317857 2319278 2247899 2138187 1953608 1986180 1943622 1935238 1825310
2003A825310j50422j78691L3890L8428q8860r1119k5986J8531J5102l6530l7776
$$ 1825310 1674888 1496197 1530087 1568515 1479655 1388536 1362550 1381081 1396183 1359653 1321877
1992A321877m2228O583Q0917k4411r0115k1853P7386j58858K5095k3750N0682
$$ 1321877 1279649 1286232 1367149 1342738 1252623 1230770 1308156 1149298 1174393 1150643 1201325
1981A201325q2393j49803k235m4208p1049Q4619P506P457j08819l2500N2143n6145
$$ 1201325 1118932 969129 966894 922686 851637 936256 943762 951219 842400 809900 862043 805898
1969H05898k0574n6558j21812j4500k2592J1848j06407O1478Q3402m2468l3539
$$ 805898 785324 728766 606954 592454 569862 581710 475303 536781 620183 577715 544176
1958E44176l0857K189M0353r2901Q857j878N1395n5731p2738l4862N833K8805
$$ 544176 513319 515508 555861 462960 471817 469939 521334 465603 392865 358003 363836 392641
1946C92641m7770o5942o7813j20404J70612R9698j67256p5132K8837R4494R31
$$ 392641 344871 278929 211116 90712 261324 361022 193766 118634 147471 241965 242896
1935B42896P3469k7157r2546J0051P5578J4484j026n0937M7904L6941k36575l2386
$$ 242896 316365 289208 196662 206713 282291 296775 295749 244812 292716 329657 93082 60696
1923F0696O5901p0214M2790P2271k5853n9830K984L9525J9733n8380J6887m7920
$$ 60696 126597 56383 99173 171444 145591 85761 88745 128270 148003 89623 106510 58590
1911E8590K2013j35912N6238Q7961p8700L3622P7329L0828o8193N050P7207R4203
$$ 58590 80603 -55309 929 88890 10190 43812 121141 151969 83776 88826 166033 260236
1899B60236K1001j22732j73955O1236L2523l0125J33927L1534k0220l359n9066
$$ 260236 281237 158505 -15450 45786 78309 48184 182111 213645 193425 190066 131000
1888A31000l8226j01661J06412l7817K8264J11189o5358p1883Q5586p3558O654
$$ 131000 92774 -8887 97525 59708 87972 199161 133803 61920 147506 73948 80602
1877H0602N6320K7357n7143o3302o0333j49163J09728J14187M8391m7908N0891
$$ 80602 136922 164279 107136 43834 -16499 -165662 -55934 58253 106644 58736 109627
1866A09627K4525k8530j6849Q274j10588o6032j418J17819n288K1566Q0487R712
$$ 109627 134152 105622 88773 97047 -13541 -79573 -80991 36828 31540 53106 133593 143305
1854A43305m1078j14992N4091L5678o8558J9364o1762k6716L3181J4169L5892
$$ 143305 102227 -12765 41326 77004 8446 27810 -33952 -60668 -27487 -13318 22574
1843B2574o0812r4182L4904J00198j44742J2413J07499Q237Q2536l4045M8275
$$ 22574 -38238 -132420 -97516 2682 -142060 -129647 -22148 -13911 68625 34580 82855
1832H2855m5050m0993K602L1713M2310Q8787J7927k0274P050k6695j2861q7860
$$ 82855 37805 -3188 -586 31127 73437 162224 180151 159877 166927 140232 127371 39511
1820C9511O1617l4694P496J15104M7997O7086J1933l9354J67194n288r2499r75
$$ 39511 101128 66434 73930 189034 237031 304117 316050 276696 443890 438602 346103 345128
1808C45128j00730k1682l6862j14768K9109J9503j9345K8990M0015j12674j51375
$$ 345128 244398 222716 185854 71086 100195 119698 100353 129343 169358 56684 -94691
1797i4691R4879k1354n5563J15485P4559N4879l9567r7330j2507l1380l191p005
$$ -94691 188 -21166 -76729 38756 113315 168194 128627 31297 18790 -12590 -15781 -22786
1785b2786P4772m4654l9585L5715K8764m7546l3521q0559p685N3105J18286o0300
$$ -22786 51986 7332 -32253 3462 32226 -15320 -48841 -129400 -137085 -83980 34306 -25994
1773b5994n4188N7610N8529K827l0175o4756M9248j6741o4902j2691R8139O1092
$$ -25994 -80182 -22572 35957 38784 8609 -56147 -6899 -23640 -88542 -101233 -3094 57998
1761E7998K3528K5786l8670j18316O2730P5117n6570p3774j2679M621j52728P9387
$$ 57998 81526 107312 68642 -49674 13056 88173 31603 -42171 -54850 -50229 -202957 -123570
1749a23570L5082Q1070m9792m5430Q855K5841P1611M5392j50156N2808O4950p5624
$$ -123570 -88488 -7418 -57210 -102640 -93785 -67944 3667 49059 -101097 -48289 16661 -58963
1737e8963L6915r2459O3831p1356j0417Q6788r2271J08863L7596n9913p7202P4042
$$ -58963 -22048 -114507 -50676 -122032 -132449 -45661 -137932 -29069 8527 -51386 -128588 -54546
1725e4546J6646r8783j4375P6612k6212r5950K0945J36573n0174J4314J8362k0189
$$ -54546 -37900 -136683 -151058 -74446 -100658 -196608 -175663 -39090 -89264 -74950 -56588 -76777
1713g6777M5493j4541K885M6187j68988J52469p225O5730K2866o7125m6782O2345
$$ -76777 -31284 -45825 -42940 3247 -165741 -13272 -20497 45233 68099 974 -45808 16537
1701A6537J2600j06470J9418N9552M0279q5731K0709O9629j35790Q0303O8954
$$ 16537 29137 -77333 -57915 1637 41916 -43815 -23106 46523 -89267 -8964 59990
1690E9990m4377n1259o0773m2814j7171R5558O2864L564j53432J5404K5133L0475
$$ 59990 15613 -35646 -96419 -139233 -156404 -60846 2018 5582 -147850 -132446 -107313 -76838
1678g6838p668J9684r7301J12793J03923M1943j09767n8281m1379Q9440J834J1803
$$ -76838 -84506 -64822 -162123 -49330 54593 96536 -13231 -71512 -112891 -23451 -21617 -9814
1666i814M5501j54457M3171L8860o1766l8957K5980J53872R443J21166j25574
$$ -9814 35687 -118770 -75599 -36739 -98505 -137462 -111482 42390 51833 172999 47425
1655D7425j16873M1924J2923L5735J4547j40525O2950K0953j73857O2860J53965
$$ 47425 -69448 -27524 -14601 21134 35681 -104844 -41894 -20941 -194798 -131938 22027
1644B2027j784k8863r610m1958L3783p2834M9552j9346M0348L6825P7834k9535
$$ 22027 20243 -8620 -18230 -60188 -26405 -99239 -49687 -69033 -28685 8140 85974 56439
1632E6439p7840k6392N50o9160M165P6099L1712q450n4654l9890m0682J60701
$$ 56439 -21401 -47793 -47243 -116403 -112238 -36139 -4427 -12877 -67531 -107421 -148103 12598
1620A2598L9711j44085r6756R6036J5814k5108j9289O8489m4066Q48k8498K0460
$$ 12598 52309 -91776 -188532 -92496 -76682 -101790 -121079 -52590 -96656 -95808 -124306 -103846
1608a03846M3169r4244J17013l2K3868k3614j10897J7254N8843k4862m700J23564
$$ -103846 -60677 -154921 -37908 -37940 -14072 -37686 -148583 -131329 -72486 -97348 -102048 21516
1596B1516J4145n2525n9077j198j419O924P8929m779q0049R9445N603q3560p5477
$$ 21516 35661 -16864 -75941 -77139 -78558 -71634 7295 2516 -77533 21912 27515 -56045 -131522
1583a31522m2122P6906J6147P0829m2596j09434Q8844L1816p7348j3975O0340
$$ -131522 -173644 -96738 -80591 -9762 -52358 -161792 -72948 -41132 -118480 -132455 -72115
1572g2115P0387r9740O7469l5190j7979R7521J00443n6796j7514M9133n3166n7693
$$ -72115 -1728 -101468 -33999 -69189 -87168 10353 110796 54000 36486 85619 32453 -25240
1560b5240N751J7903n6945j4009J3037j5315J03214p7811k5614l7679n8894P0211
$$ -25240 -19489 -1586 -58531 -72540 -59503 -74818 28396 -49415 -75029 -112708 -171602 -101391
1548a01391J4567j5148q2387q1051J70901k6131n1948J28931O4724l1818n4471
$$ -101391 -86824 -101972 -184359 -265410 -94509 -120640 -172588 -43657 21067 -10751 -65222
1537f5222m2878L3737J77032j74489J32700N3651p3747m1440o1385j742k5714
$$ -65222 -108100 -74363 102669 -71820 60880 114531 40784 -656 -62041 -63783 -89497
1526h9497j5153R359l5182N5309M3434Q6756n2024j20018N2089P9006K5461j5350
$$ -89497 -104650 -95291 -130473 -75164 -31730 55026 3002 -117016 -64927 14079 39540 24190
1514B4190J3262j49807J31869N7163j5386j5061j55853j5504J20739o6503M2446
$$ 24190 37452 -112355 19514 76677 61291 46230 -109623 -125127 -4388 -70891 -28445
1503b8445J12159j27559K2100m873k1347j2330p4639l3886J19091O1653M9330
$$ -28445 83714 -43845 -21745 -26618 -47965 -60295 -134934 -168820 -49729 11924 61254
1492F1254J6666o8541p7890j2982n911K2490N5406o7327M8685Q2847k1850j1594
$$ 61254 77920 9379 -68511 -81493 -87404 -64914 -9508 -76835 -28150 54697 32847 21253
1480B1253L3544n7916q5099j1670N3697R4481r4594K0875O407N513K8121J8718
$$ 21253 54797 -3119 -88218 -99888 -46191 48290 -46304 -25429 -19022 -13509 14612 33330
1468C3330j541j1023P1n6127q1671J9739J6767N2708J34473j42961l4576l112
$$ 33330 31789 20766 20837 -35290 -116961 -97222 -80455 -27747 106726 -36235 -70811 -73923
1456g3923M7746N3302p878M4253j00167j6506J6829m8003Q2786K1829l8208q1494
$$ -73923 -26177 27125 19247 63500 -36667 -53173 -36344 -84347 -1561 20268 -17940 -99434
1444i9434r804l7052P9587M2222j3134n6658N1589j1750j355K9993j8216j01061
$$ -99434 -109238 -146290 -66703 -24481 -37615 -94273 -42684 -54434 -55789 -25796 -44012 -145073
1432a45073p0028M8698O2409P2648Q2659j03771M8798J8692j860M3077o6558j43549
$$ -145073 -215101 -166403 -103994 -31346 51313 -52458 -3660 15032 13172 56249 -10309 -153858
1420a53858K1084J27354K5915j52230k879Q4404L4079J6991o1498l3932L8503
$$ -153858 -132774 -5420 20495 -131735 -134614 -50210 -16131 860 -60638 -94570 -56067
1409e6067R7239j43548R5264j4409n1212N4522j49809l2443J89549M0702m9769
$$ -56067 41172 -102376 -7112 -21521 -72733 -18211 -168020 -200463 -10914 29788 -19981
1398a9981o7534P9399o5623L1248J34015n1605j26645K9785m7937M4631l158p6612
$$ -19981 -87515 -8116 -73739 -42491 91524 39919 -86726 -56941 -104878 -60247 -63405 -140017
1386a40017L7335Q0199O877K2711k2611j3220k1384l1475R4281R8238K3313r9903
$$ -140017 -102682 -22483 -15606 7105 -15506 -28726 -50110 -81585 12696 110934 134247 34344
1374C4344j01683N5695J1463J8824j12148m566P4700k0837m0776K8117O6562J5370
$$ 34344 -67339 -11644 -181 18643 -93505 -98071 -23371 -44208 -84984 -56867 9695 25065
1362B5065q7977M5252J938n8595l5131K8169R7809Q366j41591R7563n5340J037
$$ 25065 -62912 -17660 -15722 -74317 -109448 -81279 16530 24896 -116695 -19132 -74472 -73435
1350g3435R3607l5611J6024o8792J5288m4478j46572J6422N4617L735K00735k6271
$$ -73435 20172 -15439 585 -68207 -52919 -97397 -243969 -227547 -172930 -169195 31540 5269
1338E269O3608L0821k9251j01669L5832J3078p0726l0419P5768L634j21858L7354
$$ 5269 68877 99698 70447 -31222 4610 17688 -53038 -83457 -7689 -4055 -125913 -88559
1326h8559K4486n7241O4956J08992K6766l2970j04148n7311K7250m8555Q6410
$$ -88559 -64073 -121314 -56358 52634 79400 46430 -57718 -115029 -87779 -136334 -49924
1315d9924m7067P8851q2916L4960p748O3226Q2214j74840J613P908L582J43501
$$ -49924 -96991 -18140 -101056 -66096 -73844 -10618 71596 -103244 -101631 -93723 -90141 53360
1303E3360j1036o7843j56946J14026R1641n9175m8195J06085j6972j07974L5547
$$ 53360 42324 -25519 -182465 -68439 23202 -35973 -84168 21917 4945 -103029 -67482
1292f7482k0676O0718j01300n4659J56739N1697K1754l2095k8524j5747j27575
$$ -67482 -88158 -27440 -128740 -183399 -26660 25037 46791 14696 -13828 -29575 -157150
1281a57150J94205K9467R291r3216j04m0279L0262k9841n1397O7481q2449P4042
$$ -157150 37055 66522 75813 -17403 -17507 -57786 -27524 -57365 -108762 -41281 -123730 -49688
1269d9688J03482N8166j6394j1351m9494j44243j5531K0899O3441r7742J52277
$$ -49688 53794 111960 95566 84215 34721 -109522 -125053 -104154 -40713 -138455 13822
1258A3822O3598k14895N5645R6551o4478M7587j7853N9636N523l3178O2295r4119
$$ 13822 77420 -137475 -81830 14721 -49757 -2170 -20023 39613 45136 11958 74253 -19866
1246a9866r4890r5818J04764K6947k633P7949K3469l6117M5117j08815N7039O3057
$$ -19866 -114756 -210574 -105810 -78863 -81496 -3547 19922 -16195 28922 -79893 -22854 40203
1234D0203o1358L5966k4428j5026j15907K6581P3863R0212j00346N6345Q338l193
$$ 40203 -21155 14811 -9617 -24643 -140550 -113969 -40106 50106 -50240 6105 14443 11250
1222A1250L6280j9542p4551Q8166J1072j39507J3903J823q988J8808N0302M1696
$$ 11250 47530 27988 -46563 41603 52675 -86832 -72929 -71106 -80094 -61286 -10984 30712
1210C0712L3647l0924M0067r1337L0541J3225m5256j30018L0143Q0780J078o1164
$$ 30712 64359 33435 73502 -17835 12706 25931 -19325 -149343 -119200 -38420 -37342 -98506
1198i8506k954j854k5423K2303J1874M5390m1658J3829r1046l1392N0653L7033
$$ -98506 -101460 -103314 -128737 -106434 -94560 -49170 -90828 -76999 -168045 -199437 -148784 -111751
1186a11751m56P1631q7398l3205l5298M2754J40821j1624m0229L4979l6522k9805
$$ -111751 -112207 -40576 -127974 -161179 -196477 -153723 -12902 -24526 -64755 -29776 -66298 -96103
1174i6103n0704N5848J89101j09189n110J3884O0084M8047J4660r1503j26687
$$ -96103 -146807 -90959 98142 -11047 -16157 -2273 57811 105858 120518 29015 -97672
1163i7672P0538M5834j46575P6012k7147J15317O4490L3138j06216m7297m5133
$$ -97672 -27134 18700 -127875 -51863 -79010 36307 100797 133935 27719 -19578 -64711
1152f4711K4279P6313j03714M3417L51K002j02123N652P6691m3008k5523J04206
$$ -64711 -40432 35881 -67833 -24416 -24065 -22063 -124186 -118534 -41843 -84851 -110374 -6168
1140f168O6447j08929k742J3071L2503R2876j11671N0663j3734O584L243j3500
$$ -6168 60279 -48650 -51392 -38321 -5818 87058 -24613 26050 12316 18900 22143 8643
1128H643k8644N55k8232J04659Q1270r5586j21389j1634R0396m9047L3352l5684
$$ 8643 -20001 -19446 -47678 56981 138251 42665 -78724 -90358 38 -49009 -15657 -51341
1116e1341O119O2570j3580J49156q2731p2829l0911k5865Q5866k9347j64921L4064
$$ -51341 -45222 17348 3768 152924 70193 -2636 -33547 -59412 26454 -2893 -167814 -133750
1104a33750R8333J0123j2509j00856P6935N0057K0779j6846k4493j030J8587l2858
$$ -133750 -35417 -25294 -37803 -138659 -61724 -11667 9112 -7734 -32227 -33257 -14670 -47528
1092d7528r395K5182o0624Q7149N8900Q9516p9037m2982j3619m459k4070L9507
$$ -47528 -56923 -31741 -92365 -5216 53684 143200 64163 21181 7562 3103 -20967 18540
1080A8540k2897O7309k7350p9724q573j46583N5232R3276R8054r943j5389p6314
$$ 18540 -4357 62952 35602 -44122 -52695 -199278 -144046 -50770 47284 37341 21952 -54362
1068e4362R7816j36010K1592J39026n9236p6866R875Q2374Q9677L4498j7607K6245
$$ -54362 43454 -92556 -70964 68062 8826 -68040 -58165 24209 113886 148384 130777 157022
1056A57022r0465k06659j8710J64307K469l0672O0483m9308L6297O3655j00247
$$ 157022 66557 -140102 -158812 5495 7964 -22708 37775 -11533 24764 88419 -11828
1045a1828M4445P9591r4586L8308o2343J5553J57876j35733k4963m9495k3575
$$ -11828 32617 112208 17622 55930 -6413 9140 167016 31283 6320 -43175 -66750
1034f6750j8434j2824J38569l8102m5696m8582K6575K9995n6183k318o6515Q3824
$$ -66750 -85184 -98008 40561 2459 -43237 -91819 -65244 -35249 -91432 -93750 -160265 -76441
1022g6441O1681J4203N2612r1581M4643J97300m3249j36747k6073N5662P9484
$$ -76441 -14760 -557 52055 -39526 5117 202417 159168 22421 -3652 52010 131494
1011A31494J15629j01059k1958o0896M8110M7457k7517O092o5214j06990Q3385
$$ 131494 247123 146064 124106 63210 111320 158777 131260 137352 72138 -34852 48533
1000D8533K8844j57411N0050J32574N3943r0256q2806l8874K4879N5383J61954
$$ 48533 77377 -80034 -29984 102590 156533 66277 -16529 -55403 -30524 24859 186813
989A86813n5500k6323m7837n1269p0701n566J37357p9681j80360L7966K2979N0776
$$ 186813 131313 104990 57153 5884 -64817 -70383 66974 -12707 -193067 -155101 -132122 -81346
977h1346M411m4400n0580Q0170k5467R9265p1197M8298J38821o7677J5492j5287
$$ -81346 -76935 -121335 -171915 -91745 -117212 -17947 -89144 -40846 97975 30298 45790 30503
965C0503l2390L4205Q04j6093j4778m2131j329J23189J36690j26482K61l0177
$$ 30503 -1887 32318 33122 17029 2251 -39880 -41209 81980 218670 92188 92449 62272
953F2272m3974o681R2763l5184m2073o329O3994k4041r1002l9035K7524o3664
$$ 62272 18298 11617 104380 69196 27123 20794 84788 60747 -30255 -69290 -41766 -105430
941a05430j775R7783L1576k1457L9642l3320P6651M8704p9707j15792M1269Q2141
$$ -105430 -107205 -9422 22154 697 40339 7019 83670 132374 52667 -63125 -21856 60285
929F0285l7525K8666J32521j28369j92771M7650J56443n3572p5103P5653J38843
$$ 60285 22760 51426 183947 55578 -137193 -89543 66900 13328 -61775 13878 152721
918A52721l849p3886p757k8448k7692O0798k5615k8131O9442j04468m3916N4965
$$ 152721 148872 74986 67229 38781 11089 71887 46272 18141 87583 -16885 -60801 -5836
906e836K1382j3075j5510j21033K3166m8360J72426j820j31910N656N9228l514
$$ -5836 15546 2471 -13039 -134072 -110906 -159266 13160 11340 -120570 -114914 -55686 -59200
894e9200n1309O8202P3047j20686K8522R8058N4888r765p7978j6997J2660j41849
$$ -59200 -110509 -42307 30740 -89946 -61424 36634 91522 81757 3779 -13218 -558 -142407
882a42407L992P1790M0798O4094R149N7865r7902m3050K018n9891J25652n225
$$ -142407 -138415 -66625 -25827 38267 47416 105281 7379 -35671 -33653 -93544 32108 26883
870B6883p2989N8254J18772j61667j32459J84381r2975M5106N7537k1855L7867
$$ 26883 -46106 12148 130920 -30747 -163206 21175 -71800 -26694 30843 8988 46855
859D6855K86O1208j16741p1052L1093q610M6860q9002J07198N3354j94650n3746
$$ 46855 47141 108349 -8392 -79444 -48351 -56961 -10101 -99103 8095 61449 -133201 -186947
847a86947P7158m1688J00860m3613J44618M7603r1248k6495j2529J0127K6634
$$ -186947 -109789 -151477 -50617 -94230 50388 97991 6743 -19752 -32281 -22154 4480
836D480P7893m6006L0648j26956J3903k7614j097L0571m3373L9387Q548Q4816
$$ 4480 82373 36367 67015 -59941 -46038 -73652 -74749 -44178 -87551 -48164 -39616 45200
824D5200r7133N4870N8584q0595J0311L3976j25616O4706R4776J7476j06013N080
$$ 45200 -51933 2937 61521 -19074 -8763 25213 -100403 -35697 59079 76555 -29458 -24378
812b4378J07861k3350j45275J7118J99066k8322n5369k5132M8145j22884l5192
$$ -24378 83483 60133 -85142 -68024 131042 102720 47351 22219 70364 -52520 -87712
801h7712O321j9660N6026O9403J7284K9682j10501k9746Q8452N9912j28047J4650
$$ -87712 -81391 -101051 -45025 24378 41662 71344 -39157 -68903 19549 79461 -48586 -33936
789c3936M294O1463l6766l3651L9646P8040J07139j00728k854j11914l4015Q7252
$$ -33936 -29642 31821 -4945 -38596 1050 79090 186229 85501 82647 -29267 -63282 23970
777B3970J032l5558p514M1601K3028j7198L2674K3794L000k3592p668l5683R0444
$$ 23970 25002 -10556 -18070 23531 46559 29361 62035 85829 88829 65237 57569 21886 112330
$$ [...]
##END NTUPLES=NMR SPECTRUM
##END=
