##TITLE=1H_EC-3257(II-4)
 CDCl3, 8 sc, 
 5.08.2021
##JCAMPDX= 6.0         $$ Bruker NMR JCAMP-DX V2.0
##DATA TYPE= NMR SPECTRUM
##DATA CLASS= NTUPLES
##ORIGIN= UXNMR, Bruker Analytische Messtechnik GmbH
##OWNER= root
$$ XWIN-NMR		Version 3.5
$$ Thu Aug  5 09:37:53 2021 Russian Standard Time (UT+4h)  she@DPX200
##.OBSERVE FREQUENCY= 200.131506
##.OBSERVE NUCLEUS= ^1H
##.ACQUISITION MODE= SIMULTANEOUS
##.ACQUISITION SCHEME= undefined
##.AVERAGES= 8
##.DIGITISER RES= 18
##SPECTROMETER/DATA SYSTEM= spect
##.PULSE SEQUENCE= zg30
##.SOLVENT NAME= CDCl3
##.SHIFT REFERENCE= (INTERNAL, CDCl3, 0, 17.5032)
##AUDIT TRAIL= $$ (NUMBER, WHEN, WHO, WHERE, WHAT)
$$ ##TITLE= Audit trail, XWIN-NMR		Version 3.5
$$ ##JCAMPDX= 5.01
$$ ##ORIGIN= Bruker BioSpin GmbH
$$ ##OWNER= she
$$ F:/spectra/data/she/nmr/H-F/1/pdata/1/auditp.txt
$$ ##AUDIT TRAIL=  $$ (NUMBER, WHEN, WHO, WHERE, WHAT)
(   1,<2021-08-05 09:36:44.14 +0400>,<she>,<DPX200>,
      <created by zg, POWCHK disabled, PULCHK disabled
       configuration hash MD5:
       00 E9 B6 7A A2 85 ED C7 34 08 36 98 17 FE 4E 26
       data hash MD5: 16K
       C1 83 46 34 5F 86 E2 15 7E A7 C1 12 6A A2 C6 F2>)
(   2,<2021-08-05 09:36:46.85 +0400>,<she>,<DPX200>,
      <Start of raw data processing
       efp BC_mod = 2 LB = 0.24 FT_mod = 6 PKNL = 1 PHC0 = -13355.22 PHC1 = 12.601 SI = 16K 
       data hash MD5: 16K
       DB CB 8A 94 4E 10 D0 89 95 4A A7 8C 9E 54 42 31>)
(   3,<2021-08-05 09:37:08.56 +0400>,<she>,<DPX200>,
      <pk PHC0 = -1.377692 PHC1 = 0.6 
       data hash MD5: 16K
       2E 1F EE 30 AA B6 BE 5A 58 2D D6 2B 9B 32 9A DA>)
(   4,<2021-08-05 09:37:12.01 +0400>,<she>,<DPX200>,
      <abs ABSG = 5 
       data hash MD5: 16K
       D1 9B 08 91 2B 75 5A 0D B7 61 15 F7 E6 2A D0 BD>)
$$ ##END=
$$ 
$$ hash MD5
$$ 9C E9 8F 32 96 AB C6 1F EC E3 6C 2C 5E 79 37 51
##$RELAX= 
##$RELAX= 
##$RELAX= 
##$RELAX= 
##$RELAX= 
##$RELAX= 
$$ Bruker specific parameters
$$ --------------------------
##$DU= <F:/spectra>
##$EXPNO= 1
##$NAME= <H-F>
##$PROCNO= 1
##$TYPE= <nmr>
##$USER= <she>
##$AMP= (0..31)
100 100 100 100 100 100 100 100 100 100 100 100 100 100 100 100 100 100 
100 100 100 100 100 100 100 100 100 100 100 100 100 100 
##$AQSEQ= 0
##$AQ_mod= 1
##$AUNM= <au_zg>
##$AUTOPOS= <>
##$BF1= 200.13
##$BF2= 200.13
##$BF3= 200.13
##$BF4= 200.13
##$BF5= 200.13
##$BF6= 200.13
##$BF7= 200.13
##$BF8= 200.13
##$BYTORDA= 1
##$CFDGTYP= 0
##$CFRGTYP= 5
##$CHEMSTR= <none>
##$CNST= (0..31)
1 1 145 1 1 1 1 1 1 1 1 1 1 1 1 1 1 1 1 1 1 1 1 1 1 1 1 1 1 1 1 1 
##$CPDPRG= <>
##$CPDPRG1= <>
##$CPDPRG2= <>
##$CPDPRG3= <>
##$CPDPRG4= <mlev>
##$CPDPRG5= <mlev>
##$CPDPRG6= <mlev>
##$CPDPRG7= <mlev>
##$CPDPRG8= <mlev>
##$CPDPRGB= <>
##$CPDPRGT= <>
##$D= (0..31)
0 1.2 0 0 0 0 0 0 0 0.06 0 0.03 0 0 0 0 0.0002 0 0 0 0 0 0 0 0 0 0 0 0 
0 0 0 
##$DATE= 1628141803
##$DBL= (0..7)
120 120 120 120 120 120 120 120 
##$DBP= (0..7)
150 150 150 150 150 150 150 150 
##$DBP07= 0
##$DBPNAM0= <>
##$DBPNAM1= <>
##$DBPNAM2= <>
##$DBPNAM3= <>
##$DBPNAM4= <>
$$ [...]
##$SUBNAM3= <"">
##$SUBNAM4= <"">
##$SUBNAM5= <"">
##$SUBNAM6= <"">
##$SUBNAM7= <"">
##$SUBNAM8= <"">
##$SUBNAM9= <"">
##$SW= 20.0188882624521
##$SWIBOX= (0..15)
0 0 2 0 0 0 0 0 0 0 0 0 0 0 0 0 
##$SW_h= 4006.41025641026
##$TD= 16384
##$TD0= 1
##$TE= 0
##$TE2= 300
##$TE3= 300
##$TEG= 300
##$TL= (0..7)
0 120 120 120 120 120 120 120 
##$TP= (0..7)
150 150 150 150 150 150 150 150 
##$TP07= 0
##$TPNAME0= <>
##$TPNAME1= <>
##$TPNAME2= <>
##$TPNAME3= <>
##$TPNAME4= <>
##$TPNAME5= <>
##$TPNAME6= <>
##$TPNAME7= <>
##$TPOAL= (0..7)
0.5 0.5 0.5 0.5 0.5 0.5 0.5 0.5 
##$TPOFFS= (0..7)
0 0 0 0 0 0 0 0 
##$TUNHIN= 0
##$TUNHOUT= 0
##$TUNXOUT= 0
##$USERA1= <user>
##$USERA2= <user>
##$USERA3= <user>
##$USERA4= <user>
##$USERA5= <user>
##$V9= 5
##$VALIST= <valist>
##$VCLIST= <CCCCCCCCCCCCCCC>
##$VD= 0
##$VDLIST= <DDDDDDDDDDDDDDD>
##$VPLIST= <PPPPPPPPPPPPPPP>
##$VTLIST= <TTTTTTTTTTTTTTT>
##$WBST= 1024
##$WBSW= 4
##$XGAIN= (0..3)
0 0 0 0 
##$XL= 0
##$YL= 0
##$YMAX_a= 243688
##$YMIN_a= -380493
##$ZGOPTNS= <>
##$ZL1= 120
##$ZL2= 120
##$ZL3= 120
##$ZL4= 120
##$ABSF1= 17.49467
##$ABSF2= -2.524366
##$ABSG= 5
##$ABSL= 3
##$ALPHA= 0
##$AQORDER= 0
##$ASSFAC= 0
##$ASSFACI= 0
##$ASSFACX= 0
##$ASSWID= 0
##$AUNMP= <proc_1d>
##$AZFE= 0.1
##$AZFW= 0.1
##$BCFW= 0
##$BC_mod= 2
##$BYTORDP= 0
##$COROFFS= 0
##$CY= -3
##$DATMOD= 1
##$DC= 0
##$DFILT= <>
##$DTYPP= 0
##$F1P= 0
##$F2P= 0
##$FCOR= 1
##$FTSIZE= 16384
##$FT_mod= 6
##$GAMMA= 0
##$GB= 0
##$INTBC= 1
##$INTSCL= 1.334414e-10
##$ISEN= 128
##$LB= 0.24
##$LEV0= 0
##$LPBIN= 0
##$MAXI= 10000
##$MC2= 0
##$MEAN= 0
##$ME_mod= 0
##$MI= 1.114404
##$NCOEF= 0
##$NC_proc= -7
##$NLEV= 6
##$NOISF1= 3.799351
##$NOISF2= 2.8
##$NSP= 0
##$NTH_PI= 0
##$NZP= 0
##$OFFSET= 17.50322
##$PC= 1
##$PHC0= -13356.6
##$PHC1= 13.201
##$PH_mod= 1
##$PKNL= yes
##$PPARMOD= 0
##$PSCAL= 0
##$PSIGN= 0
##$REVERSE= no
##$SF= 200.130006286288
##$SI= 16384
##$SIGF1= 3
##$SIGF2= 2
##$SINO= 5.538805
##$SIOLD= 16384
##$SREGLST= <1H.CDCl3>
##$SSB= 0
##$STSI= 16384
##$STSR= 0
##$SW_p= 4006.41025641026
##$SYMM= 0
##$S_DEV= 0
##$TDeff= 16384
##$TDoff= 0
##$TI= <>
##$TILT= no
##$TM1= 0
##$TM2= 0
##$TOPLEV= 0
##$USERP1= <user>
##$USERP2= <user>
##$USERP3= <user>
##$USERP4= <user>
##$USERP5= <user>
##$WDW= 1
##$XDIM= 16384
##$YMAX_p= 378870959
##$YMIN_p= -704594
$$ End of Bruker specific parameters
$$ ---------------------------------
##NTUPLES= NMR SPECTRUM
##VAR_NAME=  FREQUENCY,     SPECTRUM/REAL,   SPECTRUM/IMAG
##SYMBOL=    X,             R,               I
##VAR_TYPE=  INDEPENDENT,   DEPENDENT,       DEPENDENT
##VAR_FORM=  AFFN,          ASDF,            ASDF
##VAR_DIM=   16384,         16384,           16384
##UNITS=     HZ,            ARBITRARY UNITS, ARBITRARY UNITS
##FACTOR=    0.24454680195387, 1,            1
##FIRST=     3502.9194494773, 0,             0
##LAST=      -503.490806932959, 0,           0
##MIN=       -503.490806932959, -704594,     0
##MAX=       3502.9194494773, 378870959,     0
$$ Real data points
##PAGE= N=1
##DATA TABLE= (X++(R..R)), XYDATA
$$ [...]
11033a14606j30910J72064O4739J25977J235K6138k7821k12225K6945K5577R0966
11022D8079m445n3922L7324l3939J05797j63590J53935N0750r6023p0001k2124
11011d8159j31309r1006O918J07282O2344j1171P7036J34531r9336n8168R6030
11000D4992j09558Q9101n3674k98119M838J52694j00593J89346p007n6071J4329
10989a29722J52786j65232J36493j38780k4598K20665m54118J62430J4303o4586
10979b90359J8097k03175K04245K36847P392j0754l5004q9885J11876q9592J05667
10968c4645j18400J41607N9717j06111j6566L11465q7197k61394j9807j03477
10958b34808K9122n3481J06996R7569N3720k3877o0508l1501J86700M5151p739
$$ y = [-114606, -245516, -73452, -8713, 117264, 118499, 144637, 116816, -95409, -68464, -42887, 48079, 43634, -10288, 27036, -6903, 98894, -64696, 89239, 139989, 43966, -26035, -48159, -179468, -270474, -263556, -156274, -93930, -105101, -28065, 106466, 7130, -51038, 44992, -64566, 24535, -29139, -327258, -322420, -169726, -270319, -80973, -87980, -144051, -129722, 23064, -142168, -5675, -144455, -169053, 51612, -402506, -240076, -225773, -290359, -272262, -475437, -271192, -34345, -26953, -37707, -72711, -162596, -50720, -140312, -34645, -153045, -11438, 48279, -57832, -74398, 237067, 149870, -111524, -131331, -234808, -205686, -259167, -152171, -54602, -882, -24759, -85267, -116768, 69932, 115083, 107344]
10947A07344k39617R7616J20724l5983N7865K3859P1703o2700j88871l65831K04783
10936b09108j0569k0081J45515J96719l28049N2128J97516k99019J26270O2181
10926h6497K5998k00553P2383J47372L681l8445j78711J78315j42627N7031K49585
10915H7532J09678j68783O4594J0072k61325M4195p3939J35763L21249j49963
10905A19073k08180k70833J2720K08185P848K55022l20094M1137j60013J47047
10895a68088K62969o6270R4504J8704l16710p1905L24274J97648k24328j48560
10885i7762J52216K0681k89465j24498Q0921K26167j19778M1025j86004O8769
10875b27728K41690k3346j93299K55917p6227P0748J62188k29885j68819j15647
$$ y = [107344, -132273, -34657, 86067, 50084, 107949, 131808, 203511, 140811, -48060, -413891, -209108, -219677, -239758, -94243, 102476, -225573, -173445, 24071, -274948, -148678, -86497, -60499, -261052, -188669, -41297, -37616, -76061, -254772, -76457, -219084, -162053, 87532, 197210, 28427, 93021, 103093, -158232, -114037, -187976, -52213, 269036, 119073, -89107, -359940, -347220, -139035, -131187, 123835, -196259, -155122, -315135, -168088, 94881, 28611, 123115, 141819, -174891, -246796, 77478, 275126, 50798, -97762, 54454, 75135, -214330, -338828, -257907, -31740, -151518, -110493, -296497, -227728, 13962, -9384, -202683, 53234, -22993, 47755, 209943, -19942, -188761, -304408]
10865c04408P1227J9521J42416j096o4890j4538K07301m8524m7998J77129r0425
10854D5715k57327N9041J59398l676j55305J7216l2821n9574R8414R3023p6613
10843a12509J85492m7965l8553k6060o7690J07230p4270k01906L3481J61230m8745
10832a30265R6503J46990r0449l3556j02889j6137K5836o9457L6445L07234k42323
10821g2068k9296j43530j05444p2166J48188K59158L68301j13531l10720J5324
10811e5784J90816o2769j77596K58425j69895k17988J10437M7985J27288P7867
10801A28786j13974l80936j7759O0258J73200R9689K03553k21299k09662N1648
10791b26496J61105n245n4077J86163j01624j42078l0945K0947j8721L3995j22901
$$ y = [-304408, -233181, -213660, -71244, -72340, -137230, -151768, 55533, 7009, -40989, 136140, 45715, -211612, -152571, 6827, 3151, -152154, -134938, -167759, -227333, -128919, -35896, -112509, 72983, 25018, -13535, -39595, -107285, -55, -74325, -276231, -242750, -81520, -130265, -33762, 113228, 22779, -10777, -113666, -129803, -103967, -173424, -136979, 170255, -72068, -101364, -244894, -350338, -422504, -274316, -15158, 353143, 239612, -71108, -55784, 135032, 72263, -105333, 153092, -16803, -234791, -124354, -76369, 50919, 128786, 14812, -366124, -383883, -323625, -150425, -50736, 152817, -68482, -278144, -226496, -65391, -70636, -124713, 61450, -40174, -182252, -213197, -192250, -210971, -176976, -299877]
10780b99877p9426J86897j75999k28048K48358J00597J11345P900j56169K75622
10770h800K26010k40027L9032j08782p4253Q5301L3184r9872O8685j06277J8751
10759a67048J95286J00969j33710M2011j7654J50510L727r4128l30039r1507J78304
10748a63279J22844q8306M3059k17942K11362K98326o5185l8278k30549j8597
10738a46545J02570k00455J88108J52692m381j34043j11398Q651K17797q2305
10728i309n5253p3232J31908j33691J31366J07j34445k00737J66694n4860j29271
10717c60723J73347M8491k0087K4239J92923k20296K65287J21367j61769L8203
10707A00982q0411j40400M4691p6630K95694J8040l02449o2155L2679o544K2536
$$ y = [-299877, -379303, -192406, -368405, -596453, -348095, -247498, -136153, -128253, -284422, -8800, 217210, -22817, 16215, -92567, -166820, -81519, -48335, -148207, -79522, -185799, -167048, 28238, 129207, -4503, 37508, 19854, 170364, 174091, 79963, -250076, -341583, -163279, -40435, -128741, -85682, -303624, -92262, 206064, 140879, 102601, -127948, -146545, -43975, -244430, -56322, 96370, 91989, -42054, -153452, -144801, 72996, -9309, -64562, -137794, -5886, -139577, -8211, -8104, -142549, -343286, -176592, -231452, -360723, -187376, -138885, -158972, -134733, 58190, -162106, 103181, 224548, 62779, 100982, 20571, -119829, -75138, -151768, 143926, 161966, -140483, -202638, -169959, -176503, -153967]
10696a53967l6576L4951j58722o4230J05158N0948J06045N2265R0827J71608j83293
10685A5014m1022j32772N8697j64250N1209J67997J02493K6200J15810n5561K8643
10674A72458j62375q6060J58960L1372k87002n1396K43824J94040k44852j80704
10664b11735K27263m991j3786n5035j15588K05870N4992m23j38500J27191P4011
10653A49269p237l42937R6586q4282j18350J49322K23874n8521L7931j79032k56160
10642c89537K65755R39j05611J91230j28609L28287p6563L1657J10217j71253
10632E6512j2879J09347K1052M7402j88681q9647J98290J91655J37942l29605
10622A41388j69308j29107Q9145j11862J54368J02024J46561l75695K6274K18278
$$ y = [-153967, -190543, -155592, -314314, -378544, -273386, -222438, -116393, -64128, 26699, 198307, 15014, -26008, -158780, -100083, -264333, -213124, -45127, 57366, 83566, 199376, 143815, 172458, 10083, -75977, 82983, 114355, -172647, -224043, 19781, 213821, -31031, -211735, 15528, 10537, -3249, -58284, -173872, 31998, 86990, 86567, -51933, 75258, 149269, 142032, -200905, -104319, -188601, -306951, -157629, 66245, 7724, 45655, -133377, -389537, -123782, -122843, -228454, -37224, -165833, 162454, 85891, 117548, 227765, 56512, 43633, 152980, 174032, 221434, 32753, -56894, 141396, 333051, 470993, 141388, -27920, -157027, -67882, -179744, -25376, 76648, 223209, -152486, -126212, 92066]
10612I2066J49139k38118L8966J3859Q473j93190j19722J16291P0801j94283Q7152
10601a68566j15285p5119J91825o6584j02564J24539K6287J2583J34864J80266
10591A42246p9607k9459q1695R3482j1278J51162j04184j76292m9491L4258j54622
10580b65480R5732o1974K07176n7700O872K6031o6578K68278n0661l6512n8835
10569F349J10454M2231K2871j05829o9960N2586L7020l13402k16406J09125J40230
10558a84731O1147J49029q3766R6955j29833l20120J47868J40426j16932J86380
10548e3577l9791R9473J93563j55732k2086j21799r3741K07978J85563K4494r5842
10537A28503j60872m9247j13362K8276P1127K68720M0886P3790j02101j2427o0952
$$ y = [92066, 241205, 3087, 42053, 55912, 64385, -128805, -248527, -132236, -61435, -255718, -168566, -283851, -358970, -167145, -233729, -336293, -211754, -185467, -172884, -38020, 142246, 62639, 33180, -48515, 44967, 33689, 184851, 80667, -95625, -145116, -110858, -265480, -169748, -231722, -24546, -82246, -75374, -49343, -115921, 152357, 101696, 65184, 6349, 116803, 159034, 181905, 76076, 6116, 58702, 95722, -217680, -434086, -324961, -184731, -123584, 25445, -58321, 38634, -91199, -411319, -263451, -123025, -239957, -53577, -93368, 6105, 199668, 43936, 21850, -99949, -193690, 14288, 199851, 224345, 128503, -32369, -81616, -194978, -166702, -95575, 173145, 214031, 287821, 185720, 173293, 112341]
10526A12341k47878K48634k39132k1667K10711K82306j82161q7357l389N8151
10516A30559j39813o1802J1153J61110m0592p7176P1480j84955N577J50434m8988
10505b3013J01974R4211k33578j90213N3243K40246q5884r385j04141j05949J00794
10494a61695j0057p9970n209m1726J99604n9480o99O5004J6957J28223k33059
10483a82107K70524J07707M9393j51602M7955N9421r2115q0491J34232l6400J14938
10472B41455K2848q9997J491k3193q5256j87378r6131j63950R2699J77183J54140
10461D3911r5295j03037J77867l168J93618Q9487k48702j62585l1917J01372m5532
10450h3981J12165K51170j1597l91847p2148J62225J8629n2125j27244L793n5388
$$ y = [112341, -135537, 113097, -126035, -147702, 63009, 345315, 163154, 75797, 72408, 130559, -9254, -71056, -59903, 101207, 60615, -16561, 54919, -130036, -124459, 25975, -23013, 78961, 173172, -60406, -250619, -197376, 42870, -43014, -52399, -156540, -262489, -161695, -171752, -251722, -256931, -298657, -99053, -158533, -159232, -94228, -77271, 50952, -182107, 88417, 196124, 245517, 93915, 141870, 201291, 109176, 28685, 162917, 126517, 241455, 264303, 174306, 175797, 152604, 67348, -120030, -216161, -380111, -287412, -110229, 43911, -51384, -154421, 23446, 20278, 213896, 303383, 54681, -107904, -139821, -38449, -83981, 28184, 279354, 267757, -124090, -196238, -34013, -15384, -67509, -194753, -190960, -246348]
10439b46348J70328J64779j67398L3996J60093q8963j92926J19436M4222Q4507
10429H1726j8730J52904k5607j44593N869r3591j57628j13786J44368K79454N8992
10418A69378j32520q0015k37175q4401K50877j2879O9884n7639j11474p3242Q0202
10407b19004L7868L960L17814q5690m4231O106j91345p227K01233m6169k92878
10396c19563J7545j055N8414N1554l1121J6690K77471K4140L9199Q2483k00009
10385A5748J51558K13903k13343m9408N634j31789n416L4892l17602O9596J93842
10374c2385m6799r492j60473J42854M3930m4824m7709R804p1336j11678J16473
10363b11635p0436P1881J06168P9794j30620j32704n301J22178j18343J20732
$$ y = [-246348, -76020, 88759, -78639, -44643, 115450, 26487, -166439, -47003, -2781, 81726, 62996, 215900, 190293, 45700, 51569, -42022, -199650, -313436, -169068, 110386, 169378, 36858, -43157, -280332, -364733, -113856, -126735, -56851, -114490, -225964, -299206, -219004, -181136, -177176, 140638, 54948, 10717, 16823, -174522, -181749, 19484, -26685, -319563, -302018, -303073, -244659, -193105, -224226, -207536, 69935, 94075, 133274, 215757, 15748, 167306, 381209, 167866, 118458, 124092, -7697, -13113, 21779, -295823, -226227, -32385, -79184, -88676, -249149, -106295, -62365, -107189, -154898, -145094, -216430, -328108, -211635, -282071, -210190, -104022, -24228, -154848, -287552, -292853, -170675, -289018, -168286]
10353a68286J26750j21502j627K47248j17427j06769N6263K78443o0950l72290
10343b40147j05822J66834R3962j14899L40778M6515m0936p8606j03419J0557
10333b5183O924l4543J36282k20799j92641J67723M3393N2167j2112j5968J9699
10322g5058j06608L8589m4796Q3438P8229K58836K021L9920k00298N5431j43078
10311a3374j44063j00454J65839K7229J08733M5817m9810k1850J48705j35995
10301C0777k97276P2135K94380q7856j02929p6162j58288J70965m0827q2553Q9145
10290a88489L41883m21547R3120j27898m6229R0930Q0926K14082L2972k54904
10280a85154N3800k0494L4724m4514k913L01844r863k02135l4701J25457k78709
$$ y = [-168286, -41536, -163038, -164665, 82583, -34844, -141613, -85350, 193093, 132143, -240147, -345969, -179135, -85173, -200072, 140706, 187221, 146285, 67679, -35740, -25183, -18259, -52802, 83480, -137319, -329960, -162237, -118844, -66677, -78789, -94757, -75058, -181666, -143077, -187873, -104435, -26206, 232630, 234651, 274571, 74273, 129704, -13374, -157437, -257891, -92052, -64823, 43910, 89727, 39917, 18067, 166772, 30777, -266499, -194364, 100016, 12160, -90769, -166931, -325219, -154254, -195081, -277634, -188489, 153394, -268153, -175033, -302931, -349160, -258230, -177304, 36778, 69750, -185154, -131354, -151848, -117124, -161638, -164551, 137293, 127430, -74705, -109406, 16051, -262658]
10269b62658K38979J91334j89641R9950m2123j68066j02558L6727R5444J54783
10259E2171J3445P2476j69209K5020J05707p477j73292k4203K4000M9385J12503
10248H0526k46720p3922L5094m4443k8226M04971j61102j65134K28745j38684
10238a08895J8275q3644j60311K18057l5239J17447k11759k7375J35760Q1283
10228e6401J12095J10220j76602j93869J30966K15943p7363l9377J39423j76668
10218a1633L2474k6522l7354P6870J24988j82187r9045l9101L6394J72681j58152
10207a10587k113L0774J46389m6340l21739J38434K93503j25191j27322l7568
10197a61760J74454R2068L3977k57123O6401K23442m4295j72499j43823J33115
$$ y = [-262658, -23679, 167655, -21986, 77964, 35841, -132225, -234783, -198056, -102612, 52171, 65616, 138092, -31117, -6097, 99610, 92133, -81159, -105362, -81362, -31977, 80526, -166194, -240116, -205022, -249465, -277691, 127280, -33822, -198956, 29789, -108895, -90620, -174264, -334575, -116518, -151757, -34310, -246069, -273444, -137684, -56401, 55694, 165914, -10688, -204557, -73591, 142352, 64989, 25612, 165035, -11633, 20841, -5681, -43035, 33835, 158823, -23364, -122409, -161510, -125116, 47565, -110587, -112700, -81926, 64463, 18123, -303616, -165182, 128321, 3130, -124192, -161760, 12694, 104762, 138739, -118384, -51983, 171459, 127164, -45335, -189158, -56043]
10187e6043M229p9836L1467Q0328p8544p5902N5941n5679o5719J71783o4902J61834
10175B8957J24514n1921l31242K17569K1011j62819j9294j13443P25L78316j4855
10164G7518k19284Q3248J14773j54063j32818K74408K7951M4566r0072p6794O3977
10153A3410J17529J6203m4190k35760p8667K55281r1259j06986J05574M6553q8409
10142i0721K00940p7784J75651L2139j76467J21612o8026n9744j73279M9018O0740
10131e921q6507k4367P6929P1254k73358p459K67116j0545k1876k32566j3167
10120b60467K00725P3736l0882l4148j1484O4825l2823P054R357j75672J31632
10109e8147J14689j61424Q2278P0414J12196j10154l2051j6887j55449J09055
$$ y = [-56043, -51814, -131650, -100183, -19855, -98399, -174301, -118360, -174039, -239758, -67975, -132877, 28957, 153471, 101550, -229692, -12123, 8888, -153931, -173225, -286668, -285943, 92373, 77518, -141766, -58518, 56255, -97808, -230626, 43782, 71733, 116299, 26227, -50567, 13410, 130939, 147142, 102952, -132808, -211475, 43806, -47453, -154439, -48865, -2312, -90721, 110219, 32435, 208086, 240225, 63758, 185370, 117344, 57600, -115679, -66661, -5921, -92428, -116795, -39866, 31388, -241970, -249429, 17687, 7142, -14734, -247300, -260467, -59742, 13994, -16888, -51036, -62520, 2305, -30518, -23464, -14107, -189779, -58147, 56542, -104882, -22604, 47810, 160006, 49852, 17801, 914, -154535, -45480]
10099d5480j38235l2933n940L3532l5342Q9789N7724O7795j58578N380O1460k460
10087a03288K87561l1760k38323J41259K80576k03541k54166O7646j0515j7480
10077h2031q3684J27057Q0508K6357j49845J7598P2565J7141K4421j85810m1118
10066a76841K26918J55393j04745j46934J05052P5350k61787R3008p9830J69455
10056E5039q2565M0846Q7996p5814k99216Q9317p5583K57599R4053p4654M2156
10045E9174k2986r6461M2606N5242m2845q3053R3429k19824L4028J04318j27974
10034b04346K79697j43048n3453K54489N9192n2460k894k51912M3692o7544l3579
10023a72166J19216k27263J25081J46158l245K38812j20434p6204m2897J84873
$$ y = [-45480, -183715, -216648, -222588, -189056, -224398, -134609, -76885, -9090, -167668, -162288, -100828, -103288, 184273, 152513, -85810, 55449, 336025, 132484, -121682, -54036, -64551, -82031, -165715, -38658, 41850, 68207, -81638, -64040, 8525, 25666, 50087, -135723, -176841, 50077, 205470, 100725, -46209, 58843, 134193, -127594, -34586, -114416, 55039, -27526, 13320, 101316, 25502, -273714, -184397, -259980, -2381, 91672, 17018, 59174, 36188, -60273, -17667, 37575, -5270, -88323, 5106, -214718, -180690, -76372, -204346, 75351, -67697, -121150, 133339, 192531, 140071, 137177, -114735, -71043, -138587, -172166, -52950, -280213, -155132, -8974, -12219, 226593, 106159, 29955, -12942, 171931]
10013A71931l7226k36354j1163r0087K4030o5737J63756n2270j98055O6875J95517
10002f8783k08086J80509K55161L037k18609j13553j5616q7956L34834j76595
9992a15657K19556r8703j67025j8802J35845Q2017l197j12069J0071N7270N6083
9981D5389P7001K5752j23825K62672m9188j12209L8208k9768j96221K47998p4050
9970A11759l0086K0034j64087j43974o0796L22078r4947j11070J40289Q1346o7672
9959B874r1698K35351J47176k47696m9582j28790J58085j36452j01310J1607J6271
9948a84164Q1986k0357k4901Q4275k3432R9017K46782o4308P8117J40239l41615
9937G1639K7978k3763Q7114q5490o2401M9407l15618L12975o5231q7290J67827
$$ y = [171931, 134705, -101649, -112812, -202899, -178869, -244606, -80850, -133120, -331175, -264300, -68783, -276869, -96360, 158801, 161838, -56771, -170324, -185940, -273896, 60938, -115657, 103899, 5196, -161829, -180631, -44786, 37231, 34034, -78035, -67964, -10694, 45389, 122390, 148142, 24317, 286989, 237801, 125592, 163800, 134032, -62189, 185809, 111759, 81673, 101707, -62380, -206354, -267150, 54928, -40019, -151089, -10800, 70546, 2874, -88824, 146527, 293703, 46007, -3575, -132365, 25720, -110732, -212042, -200435, -184164, -102178, -122535, -147436, -63161, -86593, 12424, 259206, 194898, 273015, 413254, 71639, 99617, 75854, 162968, 77478, 15077, 64484, -251134, 61841, -3390, -90680, 77147]
9926G7147r8592o0477m6384M994L3380L1518l936J04981k2340R6932O2310j66406
9914A3127n3632m1995m8621L14552P8914k01740j81154Q5604M2087p357j3318
9903a3533m4082j4838L8110k93282K9033J8397P4105P2720j43440K27858k7704
9892g6656r5117K83922Q4737j37893r337k18819J9839L0225q5994J36983R1055
9881B2945j272k91761n1732K85743j7736k4856k16468J20612Q6618K61844l0975
9870A42962j76504k2705Q3202j39454M1845O6359J04692m3243r2262K16637j04207
9859G7322k27882M4477j19411j18953K91536k8858J23457j06626M3551J78533
9849A57146q1734J677J64878J3593n6624j01006j26223M6759J19786k02981J03694
$$ y = [77147, -21445, -81922, -128306, -123312, -89932, -58414, -62350, 42631, 20291, 117223, 179533, 13127, -40505, -82500, -131121, 183431, 262345, 60605, -120549, -34945, 7142, -215, -13533, -57615, -72453, -34343, -327625, -298592, -280195, -206090, -133370, -276810, -48952, -76656, -171773, 112149, 196886, 58993, 49656, -169163, -149324, -119099, -205093, -68110, 22945, 21673, -270088, -321820, -36077, -53813, -78669, -295137, -174525, -87907, 173937, 142962, -33542, -56247, 26955, -112499, -70654, -4295, 100397, 57154, -35108, 181529, 77322, -150560, -106083, -225494, -344447, -52911, -81769, 41688, -64938, -21387, 157146, 75412, 77089, 241967, 255560, 198936, 97930, -28293, 18466, 138252, -64729, 38965]
9838C8965J25756k6419k09523O1235M6656j23371J34971K28108j62231J4455P0972
9827A99574j62074j15244m6025J97270m9772k72934J46080J54659j27858J65087
9817H8763J63457k03121j98961J18637r0864Q4831r509J1438l2654q6848P8222
9806g6609L32951o0521m9424j41523j91651J5648K03069R0587n5945J15063J35161
9795C16806j62975J26037J03028j55449j37324j80087M4009R2347K8216J12167
9785A86775j15875r7895K62283k13786r9610k01250J0661J57859o5511M2683J02826
9774c0840K4018J6848K34302k8835k34077o053N4140j03694M4661l8069m5677
9763a13276N6247J71133q3297j56514J63034l7780K84296n1613l76345k2572j50330
$$ y = [38965, 164721, 138302, -71221, -9986, 36670, -86701, 48270, 276378, 114147, 128602, 199574, 37500, -77744, -123769, 73501, 23729, -249205, -103125, 51534, -76324, 88763, 252220, 49099, -149862, -31225, -122089, -37258, -46767, -35329, -67983, -154831, -76609, 256342, 195821, 146397, 4874, -186777, -171129, 31940, 122527, 66582, 181645, 316806, 153831, 279868, 382896, 227447, 90123, -89964, -45955, 46392, 74608, 186775, 70900, -26995, 235288, 21502, -78108, -279358, -268697, -110838, -176349, -133666, -30840, -6822, 10026, 244328, 215493, -18584, -24637, 29503, -74191, -29530, -67599, -113276, -57029, 114104, 30807, -125707, 37327, -453, 283843, 232230, -144115, -166687, -317017]
9752c17017K204J61717J18059k76598J15920L02421j03240n5232J09648p8623
9742b0741r8176J19734j01977J16812j24982k31478J50173K68117m4662k61376
9732b28556m7464P1981K9858o817N7495J5874O709j42075N4237M500J06479j7972
9720i5751j33797J45918J59300q2124M6189O9087M925K4485j38054j76158k50688
9709d26668J65915J0588L60618k71414N5077j19995K3827J4533K57571J53909
9699B23961j90067j28112K26954n5852k2018r9404n0082J33324l1947l278J681
9688E160j07816j02107J04360j27315J097Q6615P9626J28081j01051M9442j73160
9677a57068j89394O2457k30789M46128j0560J3709q797K0403j22631K52446l2546
$$ y = [-317017, -314813, -153096, -35037, -311635, -195715, 106706, 3466, -51766, 57882, -20741, -118917, 817, -101160, 15652, -109330, -340808, -190635, 77482, 32820, -228556, -276020, -204039, -174181, -180998, -123503, -107629, -100920, -242995, -188758, -184258, -77779, -95751, -229548, -83630, 75670, -6454, 39735, 108822, 113747, 138232, 178, -175980, -426668, -260753, -250165, 110453, -160961, -105884, -225879, -202052, -187519, 70052, 223961, 33894, -94218, 132736, 76884, 54866, -44538, -94620, 38704, 6757, 3479, 5160, -102656, -204763, -100403, -227718, -226621, -140006, -60380, 67701, -33350, 16092, -157068, -346462, -284005, -514794, -68666, -79226, -65517, -74314, -53911, -176542, 75904, 43358]
9666D3358L06633j65307l16123L87951j82655k87758M55064k17587o7980J47533
9656A03129j26902J22042J11984k92741k157j99553O0946L35934j66126l406O8494
9645A1644j94084L48966p1068k91367Q1780L3334K32887M6773k33450o2868j31535
9634b28988J07031N5022J60192N8111m7714r5231q7372L0468Q3698K16850k1036
9623B31031j15358j33575j09816n1773n485K06448J64611m59587M84460j17969
9613I2987k21294m3565J69950J7954Q7536k3854j51910J45009L6016p2L424k67110
9601a54929l9713J53839R5261R8914j69111j04595N0206J21260R988r1921k2119
9590e2920m1986L7114N6927j22895K27725p5902j48821R0323K50567j55173k1386
$$ y = [43358, 349991, 184684, -131439, 256512, 73857, -213901, 241163, 23576, -44404, 103129, -23773, 98269, 210253, -82488, -84645, -284198, -223252, 112682, -53444, -56850, 11644, -182440, 166526, 95458, -195909, -114129, -80795, 152092, 198865, -34585, -97453, -228988, -121957, -66935, 93257, 151368, 103654, 8423, -78949, -48481, 35217, 252067, 231031, 115673, -17902, -127718, -179491, -184976, 21472, 186083, -273504, 210956, 92987, -128307, -171872, -1922, 16032, 103568, 79714, -72196, 72813, 108829, 108757, 112181, -154929, -194642, -40803, 54458, 153372, -15739, -120334, -70128, 51132, 61120, -30801, -52920, -94906, -57792, -865, -123760, 103965, 28063, -120758, -30435, 220132, 64959, 43573]
9579D3573J8594k26060J3482p9175k7938J63494K15029N9214j39147k48286J44506
9568f2714L1194m5816l0330K43669p8951K35217n13898K05265k28231j18866K87369
9557g6092L42720Q5032k29773M0643n884J39008j17206n4842p162r3945j53804
9546a31305J93269j64245m9724P0276K90887r0902q0354L1920j1537m5809k7676
9535a5200R7792L0166J76704j1994m41960J29746K8010k3137R7439m1441O4881
9524I1006j25332N176J63116j84694J04985q7203P387K31560p6163J00726J963
9513B32527k73733L5410J65152J33581j12488p6934k7555L6991J28113q7746j93566
9502d0248j2040j4246j77653k2465J92665J89275J29572o8398n1424k3146P037
$$ y = [43573, 62167, -163893, -150411, -229586, -257524, -94030, 120999, 180213, 41066, -207220, -62714, -31520, -77336, -107666, 136003, 57052, 292269, -221629, -16364, -244595, -363461, -76092, 266628, 351660, 121887, 162530, 156646, 295654, 178448, 123606, 116444, 22499, -131305, 61964, -102281, -152005, -81729, 209158, 118256, 37902, 69822, 58285, 12476, -15200, 82592, 112758, 289462, 277468, -164492, -34746, -6736, -29873, 67566, 26125, 91006, -34326, -29150, 133966, -50728, 54257, -32946, -25559, 206001, 129838, 230564, 232527, -41206, -5796, 159356, 292937, 180449, 103515, 75960, 112951, 241064, 153318, -40248, -52288, -66534, -244187, -266652, -73987, 115288, 244860, 176462, 125038, 101892, 108929]
9491A08929r8657o5732q169M3374m4672O3P4207J55499m8556j29030N2006k04065
9479a64803j75166J30716J6717L8376P642J33008M5688k74993O2625L09814J23790
9468B53414j32062l31745K39595J81831Q1400O2332l1390j67237l42520R6098
9458i0284l1884J17063K02284j46908j88299O1949n089J07127j9297j05550K14976
9447A16088j99520k13835K1452J77389K53582m6886R7171l64007J80692K47814
9437B69940k59228l762O2157j03386j74859j60422K39078L38007j5939l925L6579
9426B24240j57219L2494j09438K80533j65132p3328K13171m9877r1068j83653
9416g9277R9324j23731J86126J93968o0286m8078j06385j24539J25968l1016n8207
$$ y = [108929, 10272, -55460, -63629, -20255, -64927, -64864, 9343, 164842, 116286, -12744, 39262, -164803, -339969, -209253, -192536, -154160, -146518, -13510, 32178, -242815, -180190, 129624, 253414, 121352, -210393, 29202, 211033, 292433, 354765, 323375, 156138, -186382, -90284, -122168, -5105, 197179, 50271, -138028, -76079, -81168, 25959, 6662, -98888, 116088, -83432, -297267, -275815, -98426, 155156, 108270, 205441, -158566, 22126, 269940, 10712, 6950, 69107, -34279, -209138, -369560, -130482, 207525, 191586, 187661, 224240, 67021, 99515, -9923, 270610, 105478, 32150, 245321, 195444, 104376, -79277, 20047, -103684, 82442, 276410, 216124, 168046, 61661, -62878, 63090, 32074, -26133]
9405b6133o2934M5808K8857o4439J35187j5920r1938J6751J89135k60264M2289
9394f3601L76003o4188k24016M860J07725l4922n0804r027N9170o5455L2886O1925
9382A30556N1992j70711j36408J15011J06249k9124j4901R6745q0783J53969K9945
9371B52540L0731j94152m0197N7420k74080P1328j8261K29690k02173p4583L73447
9360B11710P6956l412k55230j08379K37868J8490j28604k09212l0310j0874R4645
9349a06352M8514J51013k9575Q2881J1530r1063k8392K08584j06889r9930N8135
9338I8456n5556o2895p8030J63485q5621l702K16102n3539j69105L5756n9418
9327e4067j02381M3461M2198M7899j29441J23057P3592j18694K58075k60470j08023
$$ y = [-26133, -89067, -43259, -14402, -78841, 56346, 40426, -51512, -34761, 154374, -105890, -63601, 312402, 248214, 24198, 29058, 136783, 101861, 51057, 42030, 101200, 35745, 68631, 130556, 182548, 11837, -124571, -9560, 96689, 67565, 52664, 149409, 68626, 222595, 252540, 283271, 89119, 48922, 106342, -167738, -96410, -114671, 115019, -87154, -161737, 211710, 288666, 285254, 30024, -78355, 159513, 178003, 49399, -159813, -190123, -200997, -106352, -57838, 93175, 63600, 146481, 158011, 66948, 38556, 247140, 140251, 40321, 98456, 42900, -19995, -98025, 65460, -20161, -23863, 192239, 138700, -30405, 5351, -54067, -156448, -112987, -70789, -22890, -152331, -29274, 44318, -74376, 183699, -76771, -184794]
9316a84794J97127J81489j28900K14425k12013j80394J65987J53224N0506l10066
9306e3409R8645J49787j92360M6740J4706Q904p2005r0329n090P8229K2916P4899
9294H1633j03303J51273j02003Q1894r18J5937k543N4391p6234J4413J46720Q4072
9282C45332J17714j84457l9892l33752o702K17083J97655j72085j04340j37749
9272a01193O1356O7044N6221p1662j13101p2414Q8416J91250P203M0975N0349
9261B04444m9325M6742K85617j78756q1432K9079k96021K26859k14379l9182K96683
9250B30329J88809k21515k74858L0139K00969r0191l2477J22027J49740K1744
9240C24716j47469k02595j80878L7229Q763K82689Q3035p5138O9796J0809j5006
$$ y = [-184794, 12333, 193822, 64922, 279347, 67334, -113060, 52927, 206151, 256657, -53409, 45236, 195023, 2663, 49403, 64109, 73013, 1008, -89321, -94411, -16182, 6734, 81633, -21670, 129603, 27600, 109494, 108576, 124513, 121970, 176361, 100127, 114540, 261260, 345332, 463046, 278589, 238697, -95055, -101757, 115326, 312981, 140896, 36556, -101193, -39837, 27207, 83428, 11766, -101335, -173749, -85333, 105917, 113120, 154095, 204444, 155119, 201861, 487478, 308722, 227290, 256369, -39652, 187207, -27172, -66354, 230329, 419138, 197623, -77235, -47096, 153873, 63682, 31205, 153232, 302972, 324716, 177247, -25348, -206226, -168997, -160234, 122455, 205490, 130352, 200148, 210957, 195951]
9229A95951O0122q1366J5351K02380J11650p0327j43108n0993K26902k46018j76638
9218D3906l7105N3958M7899R388j4067N7650K07978j44540J767R0070j02543r1100
9206A23261J21096k7299p9689R588K52271p5418j04853j60729j0515q3685J91840
9195A55868K5846q5376M4690j6073j76750N3735Q1817L7839L6421m4230K02582
9184C16369j27751k20188P5107M3265j74531r3555J78540J13988j0030L5050N1302
9173A87566k25780P2336J10435j45581M1280O7322K43589j56344J34332j2575
9163C16580k14995j41777L10995N4147L3730l3241k75428j09680J26994K08294
9153B75619j71957O52q9038q8524J14596Q9709p2059j6365O0541j55269M9232
$$ y = [195951, 256073, 174707, 190058, 392438, 504088, 433761, 290653, 239660, 466562, 220544, 43906, 6801, 60759, 108658, 118046, 103979, 161629, 369607, 225067, 226834, 316904, 214361, 123261, 244357, 217058, 137369, 146957, 399228, 323810, 218957, 58228, 47713, -35972, 155868, 181714, 96338, 141028, 124955, -51795, 1940, 83757, 121596, 158017, 113787, 316369, 188618, -31570, 43537, 86802, -87729, -181284, -2744, 111244, 101214, 136264, 187566, -38214, 34122, 144557, -1024, 40256, 107578, 351167, 194823, 329155, 316580, 101585, -40192, 270803, 324950, 358680, 325439, 50011, -59669, 67325, 275619, 103662, 104314, 15276, -73248, 41348, 131057, 58998, 42633, 103174, -52095, -2863]
9142b863j44812J28438J05839J38236M7493k5570n3677J49900J02055j46741K4252
9131C22550k04231J0023N9193O7892R3534Q9902J291r4919L2621q0900j17723
9120A79233l9392M087k0631l372j6523J68898L1618q7210k1565J70785p2743K01210
9108D94395l3965J7242j08318l35183J39350q3696o8201K20295K57422r7734j9505
9097C82102j30267R3011q0828j01876L7100J42889l24516P4657L83529j63373
9087C12428j21643j08853J08083N1487J5516l4163K01313j91153J9776O8666k57057
9076F4400N6477L1448j44180K84163k2814J07826K7094j33369m3407J55499J63889
9065E47026j66910j59307j34815K19029N9446k35311k04092J70214O0674M5644
$$ y = [-2863, -147675, -19237, 86602, 224838, 272331, 246761, 193084, 342984, 445039, 298298, 322550, 118319, 128342, 187535, 255427, 348961, 438863, 440154, 345235, 377856, 296956, 179233, 139841, 143928, 123297, 119925, 103402, 272300, 303918, 216708, 195143, 365928, 293185, 494395, 460430, 477672, 369354, 34171, 173521, 89825, 21624, 241919, 499341, 401607, 382102, 251835, 344846, 264018, 162142, 199242, 342131, 17615, 92272, 475801, 312428, 190785, 81932, 190015, 241502, 257018, 222855, 424168, 233015, 252791, 321457, 64400, 120877, 152325, 8145, 292308, 269494, 377320, 404414, 271045, 227638, 383137, 547026, 380116, 220809, 85994, 305023, 364469, 129158, -74934, 95280, 155954, 201598]
9055B01598R9541n0264q7006J61217r4185J55628m6539k4229Q7581j25550k48719
9044B9073o2835J62491l662k9849R2391o729P5611R990O7278K4420k80024j47182
9032f9027K0220Q1521K44417j85104l8049j48665K71308N3483m280j4083R4932
9021C06673k31625j8479J75079k43634O7106j85590J49053R5982K71254k24305
9011A61514p0332P7656k75055J00185K61179R7583j25243k8312j05644J01372
9001A94903n6430J69836P5753j47680j20816J38351J39455j04359M2026K647j03731
8990B29955n8404k0112O0270k0544j76703K60061n1025j41925J1142J41814L633
8979B38162P2880k14720n0128k7958j68961M0155L14191J04011L55o6831N917
$$ y = [201598, 301139, 250875, 163869, 325086, 230901, 386529, 339990, 315761, 403342, 277792, 29073, -33762, 128729, 125067, 95218, 187609, 180880, 256491, 266481, 333759, 358179, 78155, -69027, -48807, 32714, 277131, 92027, 53978, -94687, 176621, 230104, 225824, 211741, 306673, 75048, 56569, 231648, -11986, 55120, -130470, 18583, 114565, 385819, 161514, 91182, 168838, -106217, -6032, 255147, 352730, 227487, 199175, 93531, 194903, 138473, 308309, 384062, 236382, 115566, 253917, 393372, 289013, 331039, 333686, 229955, 171551, 151439, 211709, 191165, 14462, 274523, 223498, 81573, 92715, 234529, 238162, 311042, 96322, 46194, 18236, -150725, -110570, 203621, 307632, 307987, 241156, 247073]
8968B47073P2462k34176J11896P5911J95513p7985j03581M6542J5434N8976k34541
8957A73524m3650R9792P1173l55325J29594L11932J14694n2627k97430j66853
8947a5176J52784J57858m6429j21901m5669M1374J4379O7941J09136j92078L3851
8936A56070K8877j21335J68527M1737l0615o935K95360l3952k69429M3523j90266
8925H1562J37731K1539j23896J06735p0175J03447p224J29004L9935k05004n6466
8914A57188k77850n212K33503J05176J08357J75839j96366K3763K07154k0338
8904E11214o6394k53309N4971J24441J83621q8343m412J87147k12100j66173q9641
8893A81022K00408k01j1285o5686j7091J58711j6984p9996J30542J028n7466J06968
$$ y = [247073, 319535, 85359, 197255, 273166, 468679, 390694, 287113, 333655, 349089, 408065, 173524, 129874, 229666, 300839, -54486, 75108, 387040, 501734, 449107, 151677, -15176, 137608, 295466, 249037, 127136, 81467, 122841, 137220, 205161, 314297, 122219, 156070, 184947, 63612, 232139, 273876, 243261, 236326, 531686, 497734, 228305, 271828, 81562, 219293, 240832, 116936, 223671, 153496, 256943, 249719, 378723, 418658, 213654, 157188, -120662, -125874, 107629, 212805, 321162, 497001, 300635, 324398, 531552, 511214, 444820, 191511, 246482, 370923, 554544, 466201, 461789, 648936, 436836, 270663, 181022, 381430, 381229, 369944, 304258, 287167, 445878, 428894, 348898, 479440, 480468, 423002, 529970]
8881E29970j12029k19781J08436R4452k08463N0140J70158L4634n8951r9509m9068
8870B39989Q0499K3551K8194j7114J73964j36667q9295L50876O1116k75423o6934
8859C72756k181J65049N7058j32600l19557J9069J10093J74860K0435J63098r4420
8848E33660Q7632J9359j86531O3919n0196J49872j79895j14167q6294Q1821K86615
8837F05795j44758J31541l6324K6386p4952R1826K90770k07676j16946J68113
8827G33775m6631n6179Q4284k30342P6882J20179j38766l05037P7615Q1880J89317
8816E86977j6952r8266N1816o7460J95413J19867k20419J4188q3432j10446R7592
8805D68878Q4584K6546j53457J22019K46949k49765J10313j73216O5613K43163
$$ y = [529970, 417941, 198160, 306596, 401048, 192585, 242725, 412883, 447517, 388566, 289057, 239989, 320488, 344039, 372233, 355119, 529083, 392416, 303121, 653997, 715113, 439690, 372756, 370575, 535624, 592682, 460082, 140525, 159594, 269687, 444547, 464982, 628080, 533660, 621292, 640651, 454120, 518039, 467843, 617715, 437820, 323653, 237359, 319180, 605795, 461037, 592578, 556254, 582640, 507688, 599514, 890284, 682608, 565662, 733775, 687144, 630965, 715249, 484907, 561789, 681968, 543202, 238165, 315780, 397660, 586977, 570025, 471759, 523575, 456115, 651528, 771395, 550976, 565164, 481732, 371286, 468878, 553462, 580008, 426551, 548570, 795519, 545754, 656067, 482851, 548464, 791627]
8795G91627j90260R4527o4430k09784L6042J85052j22763j50332k3932J52371
8785D98118q3684J63024q084N7293n7961J24171l8364R2388R4251j3691R7106
8774I24567r9307j19777J28061J0936j13605J92397r5683Q4766j96465k0325k49950
8763D45615K33350J96961J2498J10831K4512j7534Q113K06055j82797m0883Q1154
8752A077875P1384o5344n9208J50666j19642l25366J91359P5504p3900J06940
8742A030268k235k9909J39530m2557k75739J97319M851n4032r3222p3011O5213
8731H66476M6197M8094J62315L065K32577k18738j51277K2115J21468r9383j08653
8720I24256K04666l0438o9717Q4350N5493j58121k2481J68161K87510j85366k1291
$$ y = [791627, 601367, 695894, 631464, 421680, 457722, 642774, 520011, 369679, 345747, 498118, 414434, 577458, 569374, 626667, 568706, 692877, 654513, 746901, 841152, 827461, 924567, 825260, 705483, 833544, 844480, 730875, 923272, 827589, 912355, 715890, 695565, 445615, 678965, 875926, 888424, 999255, 1023767, 1006233, 1014346, 1220401, 1037604, 996721, 1077875, 1149259, 1083915, 1024707, 1175373, 1055731, 730365, 921724, 997228, 923328, 1030268, 1028033, 998124, 1137654, 1095097, 819358, 1016677, 1021528, 967496, 874274, 801263, 866476, 912673, 960767, 1123082, 1126147, 1358724, 1139986, 988709, 1010824, 1132292, 1032909, 924256, 1128922, 1098484, 1028767, 1113117, 1168610, 1010489, 988008, 1156169, 1443679, 1258313, 1237022]
8709A237022p6753n6366R2717Q0091p565J64965J69458m0480j59649j54307K43668
8698A492801N6660k2494P5328j42198J73238O7261p6516j22386J908j12979K54426
8687A645049k4770p5354o1796P4664Q081J66434K39463K3919Q063j26397J46476
8676B023832m158J13984L27252p7965k21030k72776N7789P7572K9948K73921l6019
8665B292350j50766j61432J0268J26342K03100n6113j2128p7872J52808P8776
8655B405333J35771k1694J0412l1683J13409q5959J16989j4885K4365J94047J46689
8644B992794K05839m1303K38733k4225j70177P7657J85577o7190r1805k9233R1029
8633C367696J45845j402P5605L4667M468N8987j5015M23124q1845j78229J06707
$$ y = [1237022, 1160269, 1103903, 1196620, 1276711, 1269146, 1434111, 1603569, 1563089, 1403440, 1249133, 1492801, 1549461, 1526967, 1602295, 1460097, 1633335, 1700596, 1624080, 1501694, 1503602, 1390623, 1645049, 1620279, 1544925, 1483129, 1557793, 1565874, 1732308, 1971771, 1995690, 2003753, 1877356, 2023832, 2019674, 2133658, 2460910, 2382945, 2161915, 1889139, 1946928, 2024500, 2054448, 2328369, 2292350, 2141584, 1980152, 1990420, 2116762, 2319862, 2263749, 2251621, 2173749, 2326557, 2405333, 2541104, 2519410, 2529822, 2498139, 2611548, 2525589, 2642578, 2627693, 2652058, 2846105, 2992794, 3198633, 3157330, 3396063, 3371838, 3201661, 3279318, 3464895, 3397705, 3305900, 3276667, 3367696, 3513541, 3512139, 3587744, 3622411, 3626879, 3685866, 3670851, 4093975, 4012130, 3833901, 3940608]
8622C940608R3671L44416J06363L20194Q7443O7004J15654K36238J32290J99466
8612E643347K91128m5841J57674N932P8052L48040K96199J29256k44592J87510
8602F846705J55028k19907j31491J82399J77509P9280O8369l20213k69901J31109
8592F698887J52049K35910J18354m9329J67796J22072K9221L7639L52198n3983
8582G810814J98760K52825k6030R6907J82700L03495K67264J76502L42692J01930
8572I707859l9687R953M82320j29723l0785K54503N45931J1262j28593M19427
8562A1102467L1043K09976K48156M02597J73728K05231L40014J86858K24147j6843
8552A3107374L69083k6419M4114K10600j9212L03636J90969O4192J58674M72660
$$ y = [3940608, 4034279, 4378695, 4485058, 4805252, 4892695, 4959699, 5075353, 5311591, 5443881, 5643347, 5934475, 5888634, 6046308, 6052240, 6130292, 6478332, 6774531, 6903787, 6659195, 6846705, 7001733, 6781826, 6650335, 6832734, 7010243, 7089523, 7157892, 6837679, 6567778, 6698887, 6850936, 7086846, 7205200, 7155871, 7323667, 7445739, 7474960, 7512599, 7864797, 7810814, 8009574, 8262399, 8236369, 8333276, 8515976, 8819471, 9086735, 9263237, 9605929, 9707859, 9668172, 9678125, 10160445, 10030722, 9999937, 10254440, 10800371, 10811633, 10683040, 11102467, 11133510, 11343486, 11591642, 11994239, 12167967, 12373198, 12713212, 12900070, 13124217, 13107374, 13476457, 13450038, 13494152, 13704752, 13685540, 13989176, 14180145, 14244337, 14403011, 14875671]
8542A4875671J48723N13205N15102M37123K21978N56129N06872O72756R97445
8533A9445004O51560L80092O17203P30092M97619M52148L71515K03062l9727k12212
8523B3096356L2168k86877m26327J58355J10613l80243m26626m28486m94994m62971
8513B0490968k42975j72695k33099R9688R9870J8640L33183K72635j38606L33205
8503B0860814L21444J52090L24812L24612K47820L33393M61790L44943J25934
8494B3497652j04497m23733k26444o95243o98923p98760q77889m89066r03798
8485A8279299m10199l36110m72942n20092q60685o00719m81544m77187o41876
8476A3477945l46806l08250l99873j32488k88965j88142n5308j74082l8962j30228
$$ y = [14875671, 15024394, 15537599, 16052701, 16489824, 16711802, 17267931, 17774803, 18447559, 19445004, 20096564, 20476656, 21093859, 21823951, 22321570, 22773718, 23145233, 23348295, 23308568, 23096356, 23128524, 22841647, 22415320, 22573675, 22684288, 22304045, 21877419, 21448933, 20953939, 20490968, 20247993, 20075298, 19842199, 19941887, 20041757, 20060397, 20393580, 20666215, 20527609, 20860814, 21182258, 21334348, 21659160, 21983772, 22231592, 22564985, 23026775, 23371718, 23497652, 23393155, 22969422, 22742978, 22047735, 21348812, 20550052, 19672163, 19183097, 18279299, 17869100, 17532990, 17060048, 16539956, 15679271, 15078552, 14597008, 14119821, 13477945, 13131139, 12822889, 12423016, 12290528, 12001563, 11813421, 11758113, 11584031, 11545069, 11414841]
8466A1414841k20812R2172R2987K64069k61019K3771J68958K5695j50108j40680
8456A1309874Q122p3550k7276j95756j83841m6064j16719j52675J16693K51926
8446A0890734Q9428j23489j57674J16460P5285K1936J64752J49096J75359N36270
8436A1938157j03484l14721j5775j03905p0265k17018k9181j66496K12666Q8972
8426A1218950j11037r5592n2400K42998J6421r7371O2886J92516J99844M0186
8416A1617401J13587r5466K6757J16216K42929J40500O3623l001M7340K82403
8406A2552289P255M33148J01100J01167K77843K39599J59915J6597K26107K88058
8396A4403078R5330K17378J31846J34049M40506K1298K74239L25646J69760K04640
$$ y = [11414841, 11194029, 11286201, 11379188, 11643257, 11382238, 11406009, 11574967, 11600662, 11450554, 11309874, 11317996, 11244446, 11217170, 11021414, 10837573, 10791509, 10674790, 10522115, 10638808, 10890734, 10980162, 10856673, 10698999, 10815459, 10890744, 10912680, 11077432, 11226528, 11401887, 11938157, 11834673, 11519952, 11504177, 11400272, 11330007, 11112989, 11083808, 10917312, 11129978, 11218950, 11107913, 11012321, 10959921, 11202919, 11219340, 11121969, 11184855, 11377371, 11577215, 11617401, 11730988, 11635522, 11662279, 11778495, 12021424, 12161924, 12225547, 12222546, 12269886, 12552289, 12559544, 12992692, 13093792, 13194959, 13472802, 13712401, 13872316, 13888913, 14115020, 14403078, 14498408, 14715786, 14847632, 14981681, 15422187, 15443485, 15717724, 16043370, 16213130, 16417770]
8386A6417770N92079L41412P7319M26894M82826L63903N06386M35149O06603L29081
8376B0579422N63350M05671J83388N23795O94319Q06655L89067Q64018O79361
8367B5689046N75517Q16347N09113P10823R95097J208051J464654J195203J460117
8358C4623968J849431J775297J884283K274309K806207K979156L362588L637173
8350E5192412M010064M098101M331125M332593M030331M243222L741022L103557
8342H7082427J793412Q49215M8348m05350n92589j780663k953408l834187m198318
8333G6008887l756482l168550k307546j471054j214693j069880l47218p1682N02399
8324F3104181R76775J634965K313808K571873L157307L556659L822277M613251
$$ y = [16417770, 17009849, 17351261, 17428580, 17855474, 18338300, 18702203, 19208589, 19643738, 20250341, 20579422, 21142772, 21548443, 21731831, 22255626, 22949945, 23756600, 24145667, 25009685, 25689046, 26264563, 27080910, 27590023, 28300846, 29295943, 30503994, 31968648, 33163851, 34623968, 36473399, 38248696, 40132979, 42407288, 45213495, 48192651, 51555239, 55192412, 59202476, 63300577, 67631702, 71964295, 75994626, 80237848, 83978870, 87082427, 88875839, 89725054, 89773402, 89368052, 88775463, 86994800, 84041392, 80207205, 76008887, 72252405, 69083855, 66776309, 65305255, 64090562, 63020682, 62673464, 62601782, 63104181, 64080956, 65715921, 68029729, 70601602, 73758909, 77315568, 81137845, 85751096]
8316H5751096M646149M810517N147726M223928M065347K995118K521768J970156
8308A16131805P57932r40039k473725l680658n285345o339861o938835p425503
8300H3805771o854790o095436n109412l774308l141784k581928j883543j784666
8292E2579904j802503j423248j189389r13676p78130p80953l63787k34110m26562
8283D4667546o5900J54463K9473R4438j21053k27010n2639J48209k67982m69320
8273D3890225m52401n01359q12755q13745q62505j033340q75455j084578r28239
8264C6525848j072581p97680m85289n56891p29475l43026m01210k94201m16291
8255C1429204m37892o5383k12085k86513N3163j18147J0101K49422P1469K37728
$$ y = [85751096, 90397245, 95207762, 100355488, 104579416, 108644763, 111639881, 114161649, 116131805, 116889737, 115949698, 113475973, 109795315, 104509970, 98170109, 91231274, 83805771, 76950981, 70855545, 65746133, 61971825, 58830041, 56248113, 54364570, 52579904, 50777401, 49354153, 48164764, 47251088, 46472958, 45692005, 45328218, 45094108, 44667546, 44601646, 44756109, 44785582, 44880020, 44758967, 44531957, 44479318, 44627527, 44359545, 43890225, 43437824, 42936465, 42123710, 41309965, 40447460, 39414120, 38538665, 37454087, 36525848, 35453267, 34655587, 34170298, 33613407, 32883932, 32540906, 32139696, 31845495, 31429204, 30991312, 30925929, 30713844, 30427331, 30480494, 30362347, 30372448, 30621870, 30693339, 30931067]
8245C0931067L73826j34592J45064K31581J43282j1634L1682p9474l95747p36389
8235C0498666r40634j051867j032694j074811j131921j263573j053488p07055
8227B2242623n84423o27827l68669m38212l29028m10116l66375k15302j05397
8218A8797274l01370j40824j99695j57572L9126k37342J2535j53686m393o9371
8208A7584682M64647l44476K55166J04178J00285k45843J31375J05619L20925
8199A8476558j50734m5564k59369N66768n14633o6781j190714J485385L030847
8190B1331763q91798M15831o3294N43047l1695J62585K22974J13109k40434L88272
8180B1950360K05980O26251L19209J96351K8797L99231L79985N20535M82586K63188
$$ y = [30931067, 31304893, 31170301, 31315365, 31546946, 31690228, 31678594, 31710276, 31630802, 31235055, 30498666, 29558032, 28506165, 27473471, 26398660, 25266739, 24003166, 22949678, 22242623, 21658200, 21030373, 20661704, 20223492, 19894464, 19484348, 19117973, 18902671, 18797274, 18495904, 18355080, 18155385, 17997813, 18036939, 17799597, 17812132, 17658446, 17654053, 17584682, 18049329, 17704853, 17960019, 18064197, 18164482, 17918639, 18050014, 18155633, 18476558, 18325824, 18280260, 18020891, 18587659, 18073026, 18006245, 16815531, 18300916, 21331763, 20439965, 20855796, 20792502, 21335549, 21303854, 21466439, 21689413, 21802522, 21562088, 21950360, 22156340, 22782591, 23101800, 23298151, 23326948, 23726179, 24106164, 24626699, 25109285, 25372473]
8170B5372473N11416L98308L27780N13390N24297P17720O76335P01810P91551
8161C0535080R13833Q64868O84061R88894P32663R00451J190823J080715J295760
8152C9187148J236590J479532J517145J753184J784071J608865K346076J847929
8144E2760540K423637K535550K882388K798576L055114K893178L517012L402108
8136G6268103L293872L410731L427970L172292K485944K207561J106604k8297
8128I5344780o96334r86471j278169j027461o73244j82009j55184L13495Q69442
8119I1528845J040211J092262J231379K073143K286485K901609L222831L583265
8111A08960030L953597M053221M298384M645020M934007N068781N517961N722308
$$ y = [25372473, 25883889, 26282197, 26609977, 27123367, 27647664, 28365384, 29041719, 29743529, 30535080, 31448913, 32313781, 32997842, 33986736, 34719399, 35619850, 36810673, 37891388, 39187148, 40423738, 41903270, 43420415, 45173599, 46957670, 48566535, 50912611, 52760540, 55184177, 57719727, 60602115, 63400691, 66455805, 69348983, 72865995, 76268103, 79561975, 82972706, 86400676, 89572968, 92058912, 94266473, 95373077, 95344780, 94648446, 93661975, 92383806, 91356345, 90683101, 90501092, 90345908, 90659403, 91528845, 92569056, 93661318, 94892697, 96965840, 99252325, 102153934, 105376765, 108960030, 112913627, 116966848, 121265232, 125910252, 130844259, 135913040, 141431001, 147153309]
8103A47153309N051671M059524K565160P44724r37477k683210l833542m680088
8095A47440071m823238m614833m428012l997451l752332l739650l412497k568686
8087A16103372k178945j571398r99065p99754j1357L72590P39548N30461Q98166
8078A13083618J339288J574930J898125J847996J959864J671112J919420J623313
8070A26917666J325159R00997k82403q04334k210077l411885m096867m450823
8062A13887433m468307m068123l300581k895173k069337j914383j702286j478250
8054I1990993j342276j105622j170791q77978o04929o36740n37031k15824l89452
8045H5110350J30387J20953J70918K07865J30516P10247Q96145N07777M96541
$$ y = [147153309, 152204980, 156264504, 158829664, 159574388, 158636911, 155953701, 152120159, 147440071, 142616833, 138002000, 133573988, 129576537, 125824205, 122084555, 118672058, 116103372, 113924427, 112353029, 111353964, 110554210, 110542853, 110915443, 111654991, 112185452, 113083618, 114422906, 115997836, 117895961, 119743957, 121703821, 123374933, 125294353, 126917666, 128242825, 129143822, 128861419, 128057085, 125847008, 122435123, 118338256, 113887433, 109419126, 105351003, 102050422, 99155249, 97085912, 95171529, 93469243, 91990993, 90648717, 89543095, 88372304, 87494326, 86889397, 86252657, 85715626, 85499802, 85110350, 85240737, 85361690, 85532608, 85740473, 85870989, 86581236, 87477381, 87985158, 88481699]
8036H8481699J033292R88142R97642J104540J472220J676194K114593K504065
8028A00372387K682347K778108L232700L824343M692255N435056O205544P684295
8020A36907035R347153J0669386J2280469J3804251J6162032J8848717K2995251
8013B41014294K7512991L2814933L6011937L0526486J0990318k2290893m6025925
8006C10554141m9217347l9328432k7980514k0069642j4276519j0237016p502402
7999A41942269n595038m737357l564823k850759k186224j780845j339048j219108
7991A18669067j359869j138178j338010j655648k762891l122898k802028k944725
7983A01544820l094698k806560k838457k473140k180093k195260j718901j542558
$$ y = [88481699, 89514991, 90503133, 91500775, 92605315, 94077535, 95753729, 97868322, 100372387, 103054734, 105832842, 109065542, 112889885, 117582140, 123017196, 129222740, 136907035, 146254188, 156923574, 169204043, 183008294, 199170326, 218019043, 241014294, 268527285, 301342218, 337354155, 367880641, 378870959, 356580066, 310554141, 261336794, 222008362, 194027848, 173958206, 159681687, 149444671, 141942269, 136347231, 131609874, 128045051, 125194292, 123008068, 121227223, 119888175, 118669067, 117309198, 116171020, 114833010, 113177362, 110414471, 107291573, 104489545, 101544820, 98450122, 95643562, 92805105, 90331965, 88151872, 85956612, 84237711, 82695153]
7975H2695153j185135j097615n17691j82574k79788L19889O54999R44614R33417
7966H2285269J006548J066305J122256J513273J661028J281417Q81977J1482j416245
7957H9413310k373551l574533m034979l716786l138060k649816k643495k469487
7949F4812603k143536k077777j875464j451299j168333j159580q47179p87243
7941E3302192p80759j34272l05859J23569J69334K24121P11954N24337M54767
7932E4289384J49925q8206N0230l59523p00424j334798j739567k025962k027074
7923D6213985j932303j576817j610419j583481j672596j174876j122256q58345
7915C4682892p82860n72772r81766o65006m67038q05243k24941l43470l71201
$$ y = [82695153, 81510018, 80412403, 79894712, 79712138, 79432350, 79752239, 80407238, 81351852, 82285269, 83291817, 84358122, 85480378, 86993651, 88654679, 89936096, 90818073, 90829555, 89413310, 87039759, 83465226, 79430247, 75713461, 72575401, 69925585, 67282090, 64812603, 62669067, 60591290, 58715826, 57264527, 56096194, 54936614, 54089435, 53302192, 52521433, 52387161, 52081302, 52204871, 52374205, 52598326, 53310280, 53834617, 54289384, 54439309, 54351103, 54401333, 54041810, 53341386, 52006588, 50267021, 48241059, 46213985, 44281682, 42704865, 41094446, 39510965, 37838369, 36663493, 35541237, 34682892, 33900032, 33327260, 32345494, 31680488, 31213450, 30408207, 30183266, 29839796, 29468595]
7906B9468595m29620m15477l11880l61759l72127l50467j48547l04486m41804
7897B6332428l49273o00515n44162n88021n74441o13121l99970n11254p60209
7888B1391462n54949m07435l22937k37263o17082o78549j92164k63624k03147
7879A7914312k42092n07088j60952j61681k09273m60653l33028q7995j64963k27916
7869A5358671l16070j89639k10253l38561j02307m1000l32869m15055j34365k06668
7859A3071884k10723k34726p7416j35754l30797j67822j80834l88778j43906m8331
7849A1152797j17114l62926k50257k23290k38641j68099N73727K7929m53476j95169
7839I745481k89621p9918j39453j24997k77453j81316j58690n7933N2953j20771
$$ y = [29468595, 29038975, 28623498, 28311618, 27949859, 27577732, 27227265, 27078718, 26774232, 26332428, 25983155, 25382640, 24838478, 24250457, 23676016, 23062895, 22662925, 22151671, 21391462, 20836513, 20429078, 20106141, 19868878, 19251796, 18573247, 18381083, 18117459, 17914312, 17672220, 17165132, 17004180, 16842499, 16633226, 16172573, 15839545, 15751550, 15586587, 15358671, 15042601, 14852962, 14642709, 14304148, 14201841, 14160841, 13827972, 13412917, 13278552, 13071884, 12861161, 12626435, 12549019, 12413265, 12082468, 11914646, 11733812, 11345034, 11201128, 11152797, 11035683, 10672757, 10422500, 10199210, 9960569, 9792470, 10366197, 10394126, 9940650, 9745481, 9455860, 9375942, 9236489, 9111492, 8834039, 8652723, 8494033, 8436100, 8489053, 8368282]
7829H368282k03587j36455m07471m3760Q0532k29172k77107k75508J42895J6689
7819G035338j58498k28758j08652j9054J82870k3279m41888K22631n1690j62929
7809F246091k2988K6560k09077m11500K25294J17687j20154O6889N3779q9626
7799E882955j19492o0331j02702n889j51523j50045j19066k55021L7531J86115
7789E142532p9673l5065R6017j63628R336j06694J41827j19405l21537j93112
7779D370598J3519N6493K3844O4391J33106j12280N2682J15681L6696j62000M8964
7768D641694J10884l97802Q1687j62022r1139p0022J72488k0771j94461J01967
7758D172503M3108p9117j03007p0994r9563K3907O1654k60826k13033M4684J74496
$$ y = [8368282, 8164695, 8028240, 7620769, 7577009, 7657541, 7428369, 7151262, 6875754, 7018649, 7035338, 6876840, 6648082, 6539430, 6520376, 6703246, 6679967, 6238079, 6460710, 6409020, 6246091, 6223103, 6249663, 6040586, 5629086, 5854380, 5972067, 5851913, 5918802, 5972581, 5882955, 5763463, 5703132, 5600430, 5594541, 5443018, 5292973, 5173907, 4918886, 4956417, 5142532, 5062859, 5027794, 5123811, 4960183, 4969519, 4862825, 5004652, 4885247, 4563710, 4370598, 4384117, 4440610, 4464454, 4528845, 4661951, 4549671, 4602353, 4718034, 4754730, 4592730, 4641694, 4752578, 4354776, 4436463, 4274441, 4183302, 4113280, 4285768, 4264997, 4070536, 4172503, 4215611, 4136494, 4033487, 3962493, 3862930, 3886837, 3948491, 3687665, 3474632, 3519316, 3693812]
7747C693812J64899N2799J09309k82735n5202j05405j23429J74893J14048j91201
7737C551788j73159K36159O9404j76870j20448k5308m8330L35670l28969j76869
7727C143068M1880k6118o6828j878r4985J42874J43837j74749k61796R245k3843
7716B830707N5262k0150j91612J56295J21305j66027p0870M5924M102j34761j6298
7705B613877k24432k3453K73626K5051J20717j40185q1729j5592j07596j95227
7695B245057m4366L6133J6718P9219J66157q3692j99816K8338K7604j12326j55422
7684B003604L6568K32988K4592j35502Q6877j8294k71846P3895Q7534K18294k73383
7673B065327o6073M605k117M5202l6504J53708k56488O0894j07883j89460K72920
$$ y = [3693812, 3858711, 3911510, 4020819, 3738084, 3682882, 3577477, 3454048, 3628941, 3742989, 3551788, 3378629, 3614788, 3684192, 3507322, 3386874, 3361566, 3313236, 3648906, 3319937, 3143068, 3184948, 3158830, 3092002, 3090124, 2995139, 3138013, 3281850, 3107101, 2845305, 2854550, 2830707, 2885969, 2865819, 2674207, 2830502, 2951807, 2785780, 2714910, 2760834, 2764936, 2630175, 2613877, 2389445, 2365992, 2639618, 2664669, 2785386, 2645201, 2563472, 2547880, 2440284, 2245057, 2200691, 2236824, 2253542, 2332761, 2498918, 2415226, 2215410, 2243748, 2271352, 2159026, 2003604, 2040172, 2273160, 2297752, 2162250, 2249127, 2230833, 1958987, 2032882, 2120416, 2338710, 2065327, 1999254, 2003859, 2001742, 2046944, 2010440, 2164148, 1907660, 1968554, 1860671, 1671211, 1944131]
7662A944131J49383J1231Q5542o9679j56383K1785j43151j15800M9195n9315o7874
7651A649065o4631J28261J58769r7826j58316k5120P6115j82580K30680O5516
7641A779933J51562n876J00974q3874j13497N0157J67340k64436j6997n1514n6459
7630A657313O8669l781J31024r3838R4267N0160o1001j71132J63708k06165K15814
7619A845038p6331k56324K57931j19334j12971J12172k63095J00675J66492j48347
7609A505906l0485Q8441P6641j88637J66793r5529j68556K54258o2605k83171
7599A263056o5903K40007J78051j25808r4824J35306M6278j32313q8281J65903
7589A521472O3180n1846k9975J5290N9197L40411L33079J79808j06886J46336
$$ y = [1944131, 2093514, 2104745, 2190287, 2120608, 1964225, 1986010, 1842859, 1727059, 1776254, 1716939, 1649065, 1584434, 1712695, 1871464, 1773638, 1615322, 1590202, 1666317, 1483737, 1714417, 1779933, 1931495, 1925619, 2026593, 1942719, 1829222, 1879379, 2046719, 1782283, 1765286, 1713772, 1657313, 1725982, 1722201, 1853225, 1759387, 1853654, 1903814, 1842813, 1671681, 1835389, 1629224, 1845038, 1768707, 1512383, 1770314, 1650980, 1538009, 1650181, 1387086, 1487761, 1654253, 1505906, 1475421, 1563862, 1640503, 1451866, 1618659, 1523130, 1354574, 1608832, 1546227, 1263056, 1197153, 1437160, 1615211, 1489403, 1394579, 1529885, 1576163, 1443850, 1355569, 1521472, 1584652, 1532806, 1502831, 1518121, 1577318, 1917729, 2250808, 2430616, 2323730, 2470066]
7579B470066K13953K15447k54938l26155l21339m74776j55473J7404j47897Q8807
7569A325099K35445k35115J5899j52545q7861m6962j94133r1247Q9512L00366
7559A158458j61459k5709J4866J17724k01342K6365N4088j82960J41741j06662
7549H35110J29796K30622J3256L7396m83336j37695J40434j49124Q7636O9414
7539G73509k2754J15312L5222J05263j55185l6503Q1686j18935q5844j05117J33931
7528G20585J74654K1109l2296k80547o0466K30388r8052K5581j31124Q3920J63599
7517H17351j8267l616J85394J85089j38202j27621r920n9278K1549K0417k08636
7506F64260R2629J94642l71045K8001J47112j55088j38359M11019l47743l1648
$$ y = [2470066, 2684019, 2899466, 2644528, 2318373, 1997034, 1522258, 1366785, 1384189, 1236292, 1325099, 1560544, 1325429, 1341328, 1188783, 1100922, 1053960, 859827, 768580, 858092, 1158458, 996999, 971290, 986156, 1103880, 902538, 928903, 982991, 800031, 941772, 835110, 964906, 1195528, 1208784, 1246180, 762844, 625149, 765583, 616459, 704095, 773509, 750755, 866067, 901289, 1006552, 851367, 814864, 896550, 777615, 691771, 586654, 720585, 895239, 916348, 884052, 603505, 543039, 773427, 675375, 700956, 569832, 653752, 817351, 799084, 795468, 980862, 1165951, 1027749, 900128, 890208, 830930, 852479, 872896, 664260, 756889, 951531, 580486, 608487, 755599, 600511, 462152, 873171, 525428, 493780]
7496D93780J90837J23897l41277j15277J23924L2438J32738m5820Q4150o4804
7486F14586l19124j2507J68537K82352j09128k3433j51060j46524m2993M2488
7476C03194n6513J45954J22271K6728R979K2164o506j87059O0583j17734P2943
7465C96004j55710K6313P0242N2488J03957j15095k6015P1704m5043J46827k9516
7454D96156J1287o9635J85414j15143j8614l04020Q5664R3286J2633q4808O0001
7443C52221R2239p5546L4878R51n9811N283O140J01061k87378p6787k3964J32201
7431B01488J68058K39737p038k488j14883j92737K63400n9734l350P2026j05323
7420D59156l9106j5046j27340o3601J50797j44801p6319J85411n7750N8812j83635
$$ y = [493780, 684617, 808514, 467237, 351960, 475884, 508322, 641060, 595240, 679390, 614586, 295462, 282955, 451492, 733844, 624716, 601283, 450223, 303699, 260706, 303194, 246681, 392635, 514906, 541634, 551613, 573777, 567271, 380212, 440795, 323061, 396004, 240294, 266607, 336849, 389337, 493294, 378199, 352184, 423888, 378845, 525672, 496156, 507443, 437808, 623222, 508079, 489465, 185445, 271109, 364395, 377028, 292220, 352221, 444460, 368914, 403792, 404743, 344932, 350215, 356355, 457416, 170038, 93251, 69287, 201488, 369546, 609283, 602245, 599757, 484874, 292137, 555537, 495803, 492453, 564479, 459156, 420050, 405004, 277664, 214063, 364860, 220059, 143740, 329151, 271401, 330213, 146578]
7409A46578O9019o244N1362N246m3671O2279o9501M5896k0587l1052R0229L4735
7397C34289j33276r5992n1927M8215k14365J60579J93556r8356n9331j70716J35804
7386D8480J38250l4885l39066J43824J51133L8078L0196o1795P5751q4053q8158
7375A7755K38738j66107N8072k3659l8060p9938K4978n4696K28978N5331Q9730
7364C51122J76849l9523k30846O6674p6321K3913p1662k19294K05368n2449P9363
7353B13194M3808k7553j74349j73165J50236J9752j5637J41074r2410L2526p9504
7342C7972n3130J5550R9255j34112j97095M5191M30872J6376K3876J03538j59887
7331B28406j59306n8985Q3070J10808j28776o813R2309M6509j95024J96764K9236
$$ y = [146578, 215597, 209353, 260715, 265961, 222290, 284569, 215068, 260964, 240377, 209325, 299554, 334289, 201013, 105021, 53094, 101309, -113056, 47523, 241079, 142723, 83392, -87324, 48480, 186730, 151845, -187221, -43397, 107736, 145814, 176010, 114215, 189966, 105913, 17755, 256493, 90386, 148458, 124799, 86739, 6801, 31779, -22917, 206061, 261392, 351122, 527971, 488448, 257602, 324276, 247955, 271868, 200206, -19088, 186280, 133831, 213194, 257002, 229449, 55100, -118065, 32171, 51923, 36286, 177360, 84950, 117476, 37972, -15158, 392, 99647, -34465, -231560, -186369, 244503, 260879, 284755, 388293, 228406, 69100, 10115, 93185, 203993, 75217, 68404, 160713, 207222, 12198, 208962, 238198]
7320B38198k42584n4491K08514j34023P1618R0321m6993L9612J3498L05688l19857
7309A69501N1357p6947l1567p0799j16667K33089N8770n7805j27817J18455R2603
7298B42173m8605O8660j03818j6893n8512l9908j18309J38795j43956l1897J30733
7287A8463n768r4146r3155J65148O8685j0284p5980p3766j02620R1725K25812
7276A14114P7719j91602J04757n4022k97671N5715P2753k48228l0371k3857J25895
7265b94798J72091j92969J56971Q3929O3237Q4555j66304m6256Q4298j22766q116
7254a86128J48975j01276J58845q3651l0252j0182P3940j54215r5136l3295n378
7243c17753J80647N6528j11363k3143J44750Q2623l5451r9399R843N4629J32026
$$ y = [238198, -4386, -58877, 149637, 15614, 87232, 177553, 130560, 170172, 183670, 489358, 169501, 220858, 143911, 112344, 41545, -75122, 157967, 216737, 158932, 31115, 149570, 242173, 193568, 262228, 158410, 141517, 83005, 43097, -75212, 63583, -80373, -112270, 18463, 12695, -81451, -174606, -9458, 59227, 48943, -27037, -100803, -203423, -111698, 114114, 191833, 231, 104988, 50966, -246705, -190990, -118237, -366465, -396836, -420693, -294798, -122707, -315676, -158705, -74776, -11539, 73016, -93288, -139544, -55246, -178012, -186128, -37153, -138429, 20416, -63235, -93487, -103669, -29729, -183944, -279080, -312375, -317753, -137106, -80578, -191941, -215084, -70334, 12289, -23162, -122561, -112718, -58089, 73937]
7232G3937q2439p5140j38898o2040L3604J27044m6275L2879J2448L5821N5570
7221c3489j09948j54528J7188K04944J00472l6036J84329k66801p0912J15207
7211d9574j65689K18450n1836k50642R8741J19562k45727J83918J41485l14796
7201c16108j39294J73840J38635k50871r967K09614M1733M6104j44548k75863
7191e26725M23803N2145j36908J8204R043p5084k6037o1776K21346N0183R4070
7180D2264J99729l33520p1238Q602J36241k15156J49545k55105J10910O4449r0125
7169b53404m4111J8204o3477J47193J50599q4122j82178J20271K02016k1228j80674
7158a90911k49634K17J29818m5775q0481k5158J61928P6965m6732J08667k42576
$$ y = [73937, -8502, -83642, -222540, -284580, -250976, -123932, -170207, -137328, -124880, -89059, -33489, -143437, -297965, -280777, -75833, 24639, -11397, 172932, -93869, -164781, -49574, -215263, 3187, -48649, -299291, -200550, -80988, -326715, -142797, -1312, -316108, -455402, -281562, -142927, -393798, -403765, -194151, -152418, -106314, -250862, -526725, -102922, -50777, -187685, -169481, -160438, -235522, -261559, -323335, -101989, -51806, 42264, 241993, -91527, -162765, -154163, -17922, -233078, -83533, -338638, -227728, -163279, -253404, -297515, -279311, -342788, -195595, -44996, -129118, -311296, -191025, 10991, -10237, -190911, -440545, -440328, -310510, -356285, -436766, -461924, -299996, -223031, -269763, -161096, -403672]
7147d03672J67980l6789P5476k07228J13073p7001n3297J62778Q1510j14617k72640
7136e64427P0427K83200M0806J01239j23744j59792J85431L4801O6740R097l20050
7125c76272j56258J52261J22654K39201n4893j31278j0551n7921p4209J27640
7115b19626Q6834J6299j25917r1051J80538j91981O4988J45147n489n8319k29866
7104d28443Q1411n1318r587N6875N0426K5541K36706l59027J4979J46412J33230
7093a02795r5960m780k5808l00324R4140k1478p1550J10829K17545K2011p705
7082a85875J1255N8350j82446r6271K46215J8605k03213o9601L2158J050N9642
7071c10131N7438r81J64948j9996J10199j89174L881R9939J467k65497J96667
$$ y = [-403672, -235692, -272481, -197005, -404233, -291160, -368161, -421458, -258680, -177170, -291787, -564427, -494000, -210800, -169994, -68755, -192499, -352291, -166860, -132059, -65319, -56222, -376272, -532530, -380269, -257615, -18414, -73307, -204585, -215136, -273057, -347266, -219626, -132792, -116493, -242410, -333461, -152923, -344904, -279916, -134769, -140258, -198577, -428443, -347032, -398350, -407937, -351062, -300636, -275095, -38389, -397416, -382437, -236025, -102795, -198755, -203535, -229343, -529667, -435527, -457005, -528555, -417726, -200181, -178170, -185875, -174620, -116270, -298716, -394987, -148772, -130167, -333380, -402981, -370823, -369773, -310131, -252693, -253674, -88726, -108722, 1477, -187697, -183816, -83877, -82410, -347907, -151240]
7060a51240k3365L0370l5077r9637p9045o2324K51413p5157O005l36587j29950
7049g04594L99489L34788k19452n3262K05589q868j32204O8683L8995k24112O0200
7038b34748L9232P0710k12098K13002J13436j6739J0514K6177M6090l35530J1739
7027b68215Q0544K1885N0528K89172o9563k25989p4834k6571J95972P5482l24929
7016b76518J26293j88963q0497K92449O6348l9816m5015R9752j7899j46196p708
7005b17770M5431L5154J51216r1964J6511q0350q1069L828P9783M9006m9049K42897
6993A03624j24333l3136j50989J13277j471j3887j91877L5119o5465J55892J18481
6982e4765O7324J67950j84103j04357j91880K8358q7887j54500R3673J39872K76510
$$ y = [-151240, -174605, -144235, -179312, -278949, -357994, -420318, -168905, -244062, -238057, -574644, -704594, -305105, 29683, -189769, -243031, -37442, -46310, -178514, -109831, -70836, -294948, -234748, -195516, -124806, -336904, -123902, -10466, -27205, -16691, 9486, 55576, -279954, -268215, -187671, -165786, -115258, 173914, 104351, -121638, -196472, -223043, -27071, 48411, -276518, -150225, -339188, -419685, -127236, -60888, -100704, -145719, -45967, -63866, -210062, -217770, -172339, -137185, 14031, -77933, -61422, -141772, -222841, -219013, -139230, -90224, -139273, 103624, -20709, -53845, -204834, -91557, -93028, -106915, -298792, -263673, -329138, -173246, -54765, 12559, 180509, -3594, -107951, -299831, -271473, -359360, -513860, -420187, -280315, -3805]
6971c805O5378j78132k8284M0707R1522m16561J25409K15914O3160r367p2746
6960a06805k06101J95170M5209L9000p0878j20615K3536K96820j37122j24251
6950a66037K608K6790J2487j78041O7313J36969J16580Q0338k316p3637K4088
6939D7142p4351K33024j03121j03676j02150p0424j80973J27968j83175K7788
6929c81948M61298N3298j26570L3977O3478j75665r8266R8096P7087m595K31729
6918B31919K8150k25923J02567l3888k17550J36374j23149l45577K133P1209K38446
6907a35289J26318K49511j23254k42577M6639J32973R9781j94488P978K24256
6897A91848j62177k42082K51694M41574k919N0371p6869j12287m1001j60004J67934
$$ y = [-3805, 61573, -116559, -144843, -104136, -12614, -429175, -303766, -87852, -24692, -34059, -106805, -312906, -117736, -72527, -33527, -104405, -225020, -201484, 95336, -41786, -166037, -163429, -136639, -124152, -302193, -234880, -97911, 18669, 99007, 96691, 23054, 47142, -27209, 205815, 102694, -982, -103132, -173556, -354529, -226561, -409736, -381948, 79350, 132648, 6078, 40055, 103533, -72132, -170398, -72302, 4785, 190, 231919, 260069, 34146, 136713, 102825, -114725, 21649, -101500, -447077, -444944, -373735, -135289, -8971, 240540, 117286, -125291, -78652, 54321, 154102, -40386, -32408, 191848, 29671, -212411, 39283, 480857, 477938, 528309, 451440, 339153, 298152, 138148, 306082]
6886C06082L02444k08318k31924J87473n7703k618j5129j43601J31284k8699k17423
6875B1868j43345J35377Q0091P1460N4034K0002J48783j89188P9539k21406K8663
6864H5878L4775k617j43679M5558K0399O4127J0969k84399r0551J84258p1817
6853a47099j1469K37205J92208r0999J2022j79958n3835K37295n9634P4137K263
6842B12136l15131K66447r205Q5528l79140J36379o0156n6380O2925Q8611M2918
6831G4932k98583J56306r9480j9567R8454K80574k41094j64230p3403K30567J24328
6820F8804o1196k21928N8801J16221o9413k24431K98324K9632M8222N625j13391
6809f4730o8810R8539N9453N0160l2962n7636j75239j06437n935K66630l1513
$$ y = [306082, 608526, 400208, 168284, 355757, 298054, 295436, 280307, 136706, 267990, 239291, 21868, -121477, 13900, 93991, 165451, 219485, 239487, 388270, 199082, 278621, 57215, 85878, 120653, 118036, -25643, 19915, 40314, 104441, 115410, -168989, -259540, -75282, -147099, -158568, 78637, 270845, 179846, 191868, 11910, -41925, 195370, 135736, 209873, 212136, -102995, 163452, 154247, 239775, -139365, -2986, -63142, -119522, -56597, 32014, 74932, -223651, -67345, -166825, -186392, -87938, 192636, -48458, -212688, -286091, -55524, 68804, 7608, -214320, -155519, -39298, -108711, -333142, -34818, -5186, 43036, 48661, -64730, -133540, -35001, 24452, 74612, 41650, -15986, -191225, -297662, -303597, -36967, -68480]
6798f8480K07045M7532l38257J74182J20978K0624L5717m4036j31550j04817M8949
6787c2113p0215L46112j74836j852j76750P4196J44262R6036k870l70688N6637
6776a12081L1625J41136n1095k39544m8439L26950j22563K78430J27368j12483
6766B19304l63128q3910K45137l3725j14688M1311Q4775J4070k7262J49659K1142
6755A52685n7463j5193O0350r433J7610n4294J39353j86718R6258P9742o2451
6744A60446R7878J27885l28543j0177O8817j05219K80904P6377k39423k3754q2912
6733B2279J32231L356k24295J24415R1482j80361J99139J75620j4605Q6592l40573
6722G5280J85474J48237k34622j13999L25963o8161l8694p0746q1698O2179m28017
$$ y = [-68480, 138565, 186097, -152160, 22022, 143000, 163624, 199341, 155305, 23755, -81062, -32113, -102328, 243784, 68948, 67096, -109654, -35458, 108804, 204840, 201970, -168718, -112081, -80456, 60680, 9585, -229959, -278398, 48552, -74011, 204419, 331787, 219304, -143824, -227734, 17403, -16322, -131010, -89699, -4924, 9146, -18116, 131543, 152685, 95222, 80029, 140379, 130946, 148556, 94262, 233615, 46897, 143155, 222897, 160446, 258324, 386209, 57666, 47489, 116306, 11087, 291991, 368368, 128945, 105191, 22279, 154510, 157866, -66429, 57986, 149468, -30893, 168246, 343866, 329261, 415853, 75280, 260754, 408991, 174369, 60370, 386333, 318172, 279478, 208732, 127034, 189213, -238804]
6711b38804J47728K65014r9047J01836k2055j06221J33385J70592l1403j22605
6701A98420J19386J50122k56197P8252M4691q6358l4785J27520j33147M2018J2110
6690B62032m3357L11093l2326p1456k13915j13353K83948l1826J2241J1384j98745
6679A75720O6284k7918k7405J73790J81508l8494p3906K9506j65173K59514J6225
6668E69651N2276N1518Q298j45839J57395J82812j99800j96516m3448K76904k6514
6657F86737p5200J59956L2341k4987J97063j52913l25816K1947Q4582O957J70404
6646G81071J07617r8340R8161L740j24245P278L2401N2085L5188n2340P6557j90257
6634G28916M6905K24530j01761K3682k4980J91947j03435J20839j05709Q5512
$$ y = [-238804, -91076, 173938, 74891, 176727, 154672, 48451, 181836, 352428, 321025, 198420, 317806, 467928, 211731, 289983, 334674, 248316, 213531, 341051, 207904, 249922, 262032, 218675, 529768, 497442, 425986, 212071, 98718, 382666, 350840, 363081, 374465, 175720, 242004, 214086, 186681, 360471, 541979, 503485, 429579, 459085, 293912, 553426, 569651, 621927, 673445, 681743, 535904, 693299, 876111, 676311, 479795, 436347, 713251, 686737, 611537, 771493, 803834, 778847, 975910, 822997, 497181, 519128, 603710, 610667, 781071, 888688, 790348, 888509, 892249, 768004, 775282, 807683, 859768, 894956, 842616, 919173, 728916, 775821, 1000351, 898590, 922272, 897292, 1089239, 985804, 1106643, 1000934, 1086446]
6624A086446J70317j14222J40407K28378J02074j70632O5430J23522j81866J97502
6614A647356Q2997J38539N0627K9011n4513J09601M672J69385J69100j34854N6174
6603B268095J33681J1787J63640J64042L5884K09221j96070P2389K41431K22832
6593C326932l6045N3242n3772J31936M40168J97727j00668J05531k5103j24435
6583C915513L72828L27238k76962k14682K34717N8748K07641L31806J39693N5010
6573E151550M22875K75760J29064J91625L30765K69014K13204K10371J92698M97240
6563G884166O49925P8547J75181N50581N27273P17876M17079N34635O83688M17040
6553A2635991O82436Q05537R82213J063626J262345J466767J575641K006642K140757
$$ y = [1086446, 1256763, 1142541, 1282948, 1511326, 1613400, 1442768, 1508198, 1631720, 1449854, 1647356, 1730353, 1868892, 1919519, 1948530, 1894017, 2003618, 2008290, 2177675, 2346775, 2211921, 2268095, 2401776, 2413563, 2577203, 2741245, 2777129, 2986350, 2790280, 2862669, 3104100, 3326932, 3290887, 3344129, 3290357, 3422293, 3862461, 4060188, 3959520, 4065051, 4039948, 3915513, 4288341, 4615579, 4338617, 4123935, 4358652, 4417400, 4625041, 4956847, 5096540, 5151550, 5574425, 5850185, 5979249, 6170874, 6501639, 6770653, 6983857, 7194228, 7386926, 7884166, 8534091, 8612638, 8787819, 9338400, 9865673, 10583549, 11000628, 11535263, 12218951, 12635991, 13318427, 14123964, 15106177, 16169803, 17432148, 18898915, 20474556, 22481198, 24621955]
6544B4621955K254792K586814L043733L921692M313726N261167N661398O174800
6536E7840077O253904N560927N069920M518754M717369N115712M262838J343516
6528I4683017l216523p425105r899933j0433580r058481p327703n674217m453310
6520C7194165l034856k482716j702604j758834j562083j546508j605719j813288
6512B1687557j378960j436924j280847j246075q17379o37160o20095o98101o09606
6503A2962410k07642l08001j48462k83926o9956J57263J38708o6104m30606k38766
6493A1504918Q890k5513j70123m50178m9980k34418l67278l77987l23959m46558
6483I067814l82407j76083l14766k35286j29699l59295k99348j75376m4507l4254
$$ y = [24621955, 26876747, 29463561, 32507294, 36428986, 40742712, 46003879, 51665277, 57840077, 64093981, 69654908, 74724828, 79243582, 83960951, 89076663, 93339501, 94683017, 91466494, 84041389, 74141456, 63707876, 54649395, 47321692, 41647475, 37194165, 34159309, 31676593, 29973989, 28215155, 26653072, 25106564, 23500845, 21687557, 20308597, 18871673, 17590826, 16344751, 15527372, 14890212, 14270117, 13572016, 12962410, 12754768, 12446767, 12298305, 12014379, 11944423, 12101686, 12240394, 12174290, 11743684, 11504918, 11513808, 11488295, 11318172, 10867994, 10818014, 10583596, 10216318, 9838331, 9514372, 9067814, 8685407, 8509324, 8194558, 7959272, 7829573, 7470278, 7170930, 6995554, 6951047, 6916793]
6473F916793j3774J22606j30143j5047Q9709L12507L56892N0681N25604L43330
6463H559158Q38071M48971M37167Q77050Q35682J307722J138521J057075P59500
6454A6258917L50194l06711q79232j492105j680280j288697j057840r51846r02833
6445H049567n56782l10517m00913l00098j87005l17677J9785k71587l34193j4678
6435E375902j34347j94906j29731k56056r1355m343K105k49655j1012o8062J48579
6424D387119N6476K3395o611M370Q5841k91178r5371K01529J70128R3927J98620
6413D828245J12541J11511j60152L50435k29662O318N07676K04187J56370J20092
6403F007561O9226L27712J12567K34158J86913J1217L75520K27562J97665J77141
$$ y = [6916793, 6903019, 7025625, 6895482, 6880435, 6970144, 7282651, 7639543, 7690224, 8215828, 8559158, 9397229, 9846200, 10283367, 11160417, 11996099, 13303821, 14442342, 15499417, 16258917, 16609111, 16302400, 15423168, 13931063, 12250783, 10962086, 9904246, 8952400, 8049567, 7492785, 7182268, 6781355, 6481257, 6294252, 5976575, 5996360, 5724773, 5390580, 5375902, 5241555, 5046649, 4916918, 4660862, 4569507, 4565164, 4567269, 4317614, 4306602, 4238540, 4387119, 4443595, 4466990, 4460379, 4464749, 4550590, 4259412, 4164041, 4365570, 4535698, 4629625, 4828245, 4940786, 5052297, 4892145, 5242580, 5012918, 5019236, 5526912, 5731099, 5887469, 6007561, 6076787, 6404499, 6517066, 6751224, 6938137, 6949354, 7324874, 7552436, 7750101, 7927242]
6393G927242K53539K03517L33004L0571J70861K18783K56986L32805J49146Q0202
6383I956656j37815J46909J34731j05977o064J52001j99641k79076K34985o1936
6373I834773L8545j9805k44065r7163p1130l64630k35839m23113k97299j34256
6363G986018n67184j4696m3372k51427l82236j99694k98523k99569j34345j19480
6353E675492k57689l44862j75925m19966j00175N2282l03789k24703M6122r8339
6343C848448l45294q6652N4908l00714j16354M8226p2467o5326k26877p3834J32601
6332B796665l25209J23248o1249l94669k32451K70542J66111j20600j65894k33169
6322A823325p0099j47821j2267n0065J00484M1504N9680j21451j1039m82149K22724
$$ y = [7927242, 8180781, 8384298, 8717302, 8747873, 8918734, 9137517, 9394503, 9727308, 9876454, 9956656, 9818841, 9965750, 10100481, 9994504, 9988440, 10140441, 9940800, 9661724, 9896709, 9834773, 9873318, 9853513, 9609448, 9512285, 9441155, 9076525, 8840686, 8417573, 8120274, 7986018, 7418834, 7404138, 7360766, 7109339, 6727103, 6527409, 6228886, 5929317, 5794972, 5675492, 5417803, 5072941, 4897016, 4477050, 4376875, 4429157, 4125368, 3900665, 3946787, 3848448, 3503154, 3416502, 3471410, 3170696, 3054342, 3102568, 3030101, 2964775, 2737898, 2664064, 2796665, 2471456, 2594704, 2533455, 2138786, 1906335, 2176877, 2342988, 2222388, 2056494, 1823325, 1753226, 1605405, 1593138, 1543073, 1643557, 1685061, 1744741, 1623290, 1612251, 1130102, 1352826]
6311A352826P4813k33119L02886O8488k64407p0015l6746j05341k59913N9823
6301H89295K77051j27215m9883R352P2066K9857R1845r6694j88285k10376j14627
6290E82386k1132J43375P2444J74162L2603k58473R0862P3674L97J9979m2324
6279H67953M7830j86983J51331J66371m9624j02298M60774j38015l90913l0840
6269G95586p4953q6404j7655p9042q4420R2787M4748J83157n5177j77954N9175
6258E99848J36195n2181J43344o7912j10391q4142K46229K0274O7366k39383m9283
6247F09964J9750l7521j42432M5998k7582J01162m6149q6730j38098n6096J62025
6236D04291J49399m3855m3032J1354J4088p9285K1889J85522o9628j57420r6895
$$ y = [1352826, 1427639, 1194520, 1497406, 1565894, 1301487, 1231472, 1194726, 1089385, 829472, 889295, 1166346, 1039131, 989248, 998600, 1070666, 1100523, 1192368, 1095674, 907389, 697013, 582386, 561254, 704629, 777073, 951235, 983838, 725365, 816227, 889901, 890298, 910277, 867953, 915783, 728800, 880131, 1046502, 996878, 894580, 1355354, 1217339, 826426, 795586, 720633, 634229, 616574, 537532, 453112, 545899, 590647, 773804, 718627, 540673, 599848, 736043, 683862, 827206, 759294, 648903, 564761, 810990, 831264, 898630, 659247, 609964, 629714, 592193, 449761, 495759, 468177, 569339, 523190, 436460, 298362, 242266, 404291, 553690, 509835, 466803, 478157, 492245, 412960, 434849, 620371, 550743, 393323, 296428]
6225B96428o7588j82697J27508O9458Q2365q5510J56993o2432j34733j7343L0915
6214B13364L1054O8177M572J25848N5448n6033j97761M7456Q8912k78194J29344
6203B32187k7300j9640J16749R0577r6048K2256R7819j00588J47852L056r3963
6192C72957k55014J40568j40321k1602J04007J88099j40766k22218j6305K11957
6182B21362J47290J36196k7804k8179r9196p5866k2817m5138J76103L50929j24121
6171F08759j80121Q7221J55531M088j8421j00639r942J51515k74144O8612m5552
6160D46907j53194K59975j25345k0623q9534n9096J3538M427J18750k2626j08823
6149B64356L8308J10689l8374J39236Q4941l70787j7249L07250q5752J9r7826
$$ y = [296428, 228840, 46143, 173651, 243109, 325474, 239964, 396957, 334525, 199792, 182449, 213364, 244418, 312595, 317167, 443015, 498463, 442430, 244669, 292125, 381037, 102843, 232187, 204887, 185247, 301996, 392573, 296525, 318781, 416600, 316012, 463864, 466920, 372957, 117943, 258511, 118190, 96588, 200595, 388694, 247928, 25710, 9405, 221362, 368652, 504848, 477044, 448865, 349669, 273803, 250986, 205848, 381951, 732880, 608759, 428638, 515859, 671390, 675478, 657057, 556418, 546476, 697991, 423847, 492459, 446907, 293713, 553688, 428343, 407720, 318186, 259090, 272628, 277055, 395805, 373179, 264356, 302664, 413353, 374979, 514215, 599156, 228369, 211120, 518370, 432618, 432637, 334811]
6138C34811N7814j01007L8387J8057k4156K13990J47045j04098k18953J9938L3234
6127D15062j39770M8324J63002m7252j1432K05512l08075o7318L8842r5470O7635
6116B69060R5543j76145l4110p570J29043o8050J59188J18047R522k84597K60181
6105D70112k2930r3984m0837L7800j2311j82607K54035M390j33654K18345J48212
6094F46571k45058j25694J86706M5900m2911j4841j48713k04585J71800K9282
6084B98457k43937K38237j23302k7816k18913R8141P1715J98114M3331n37J4728
6073C48218j79735r1916P6577p2352Q4371M6483j59967R5219M7442O5720j09280
6062A50780O3893J13105o6604q4621J40290j7533K44710o986q5507j59247k17550
$$ y = [334811, 392625, 291618, 330005, 348062, 323906, 537896, 684941, 580843, 361890, 381828, 415062, 275292, 323616, 486618, 439366, 427934, 633446, 325371, 258053, 296895, 201425, 269060, 364603, 188458, 154348, 146778, 275821, 207771, 366959, 485006, 494528, 209931, 470112, 447182, 353198, 312361, 350161, 337850, 155243, 409278, 413668, 280014, 498359, 646571, 401513, 275819, 462525, 508425, 465514, 450673, 301960, 97375, 269175, 298457, 54520, 292757, 169455, 141639, -77274, 20867, 92582, 290696, 334027, 333490, 348218, 168483, 76567, 153144, 80792, 165163, 211646, 51679, 146898, 194340, 260060, 150780, 214673, 327778, 261174, 176553, 316843, 299310, 544020, 537034, 451527, 292280, 74730]
6051G4730l1975J50769N811R3120M0689j35732L23682j11159J32973j28776J156
6040D15288j98305n7230j8029J41293j24795l8862J21518j21096L51876j59921
6030C11737k84218r6443J12294K94342j00898k30252P3879J78422M8564J0424
6020C17851j50451N5716j9574j17002K17823O3985j96847k65837K55694J96397
6010C57755o9154n2585J4173r6512o1791K07624R0138J4279j08135J03012q1575
5999C17229j22266J73451j8560j93661J72723L70689k50819j14912K69199k6169
5989E76904l85462L13147M4917n41951J35720O1808K4827q5248o4216K35127q2333
5978B33240K1582j44967k6901J01288J260J79964k24535k4193J05722o0096o8043
$$ y = [74730, 42755, 193524, 199335, 292455, 333144, 197412, 521094, 409935, 542908, 414132, 415288, 216983, 159753, 141724, 283017, 158222, 119360, 240878, 119782, 471658, 311737, 27519, -68924, 43370, 337712, 236814, 6562, 80441, 258863, 307427, 317851, 167400, 223116, 203542, 86540, 304363, 368348, 171501, -94336, 161358, 357755, 288601, 236016, 250189, 153677, 91886, 299510, 389648, 403927, 295792, 398804, 317229, 194963, 368414, 349854, 156193, 328916, 699605, 448786, 333874, 603073, 576904, 191442, 504589, 549506, 7555, 143275, 205083, 229910, 144662, 80446, 315573, 233240, 254822, 109855, 82954, 184242, 185502, 365466, 140931, 116738, 222460, 162364, 94321]
5967I4321K50726k9259l16224j2645J51006J07360k21391J83394J54293n3141
5957C08440P5672K27056k21236l43429n7148K29426r065R6613o501n0491j18698
5946A30639r4041K0950q7469M61799J37899m48682k9301J33467l697k0077j36860
5935F4627J66581q0703m3422J65447j00652j28546M343J55868J64699j28731L1673
5924B71184Q3465j32003j24529M9026J68546Q1842l8582J05953j00441k24496
5914A39965j65406P1835J26162K27358o7222j9450j12267J23207j11558o0236
5904A52388K7924Q6373J1384n827r3817k05335M1205J79449J45871m9110j49904
5893A40601n3358Q4550L1725K33038j73512k56745o489Q9983J3901R9320J3051
$$ y = [94321, 345047, 315788, -436, -13081, 137925, 245285, 23894, 207288, 361581, 308440, 384112, 611168, 389932, 46503, -10645, 218781, 209716, 306329, 299828, 249337, 130639, 36598, 57548, -29921, 431878, 569777, 121095, 91794, 225261, 221564, 201487, 64627, 231208, 150505, 107083, 272530, 171878, 43332, 47675, 203543, 368242, 239511, 271184, 354649, 222646, 98117, 147143, 315689, 397531, 358949, 464902, 364461, 139965, -25441, 46394, 172556, 399914, 332692, 313242, 200975, 324182, 212624, 152388, 180312, 266685, 278069, 272242, 178425, -26910, 14295, 193744, 339615, 290505, 140601, 87243, 171793, 203518, 436556, 263044, 6299, -190, 89793, 103694, 203014, 216065]
5882B16065P580J13370p3669R9525O1653j71001J29188m5118j18968j3912J40485
5871C45198M1920O4658k54972j7711J88681j6512j64341P0152P1288J2812K7923
5860C69096j24474p5896N9168j25968m1552j54189N2346Q9340R5711K74353j4697
5849D03238k5053j65844j85660L2279q3629J0201L16388j08227R671J00294k32642
5838G1016K7897J39701m3393L816j0382j1157K5384q2134j0583Q3726m7286n7933
5826H8672n3533R8732Q8370m918l7140r9056Q3573L2592K0109R8124J70745j48450
5814C37820m6286J87344K4380l26532J48569R3602m7750M6463j82387J09432M9534
5803C94189p9647P1560K10183l6015p8998k35861j7495M2371j40821k8317R786
$$ y = [216065, 223645, 337015, 263346, 362871, 424524, 253523, 382711, 337593, 218625, 204713, 345198, 387118, 451776, 196804, 179093, 367774, 351262, 186921, 257073, 328361, 341173, 369096, 244622, 168726, 227894, 101926, 60374, -93815, -41469, 47871, 143582, 417935, 403238, 378185, 212341, 26681, 58960, -24669, -14468, 301920, 193693, 203364, 303658, 71016, 98913, 238614, 195221, 199037, 188655, 177498, 202882, 120748, 110165, 193891, 146605, 88672, 35139, 133871, 222241, 217323, 180183, 81127, 164700, 197292, 217401, 315525, 486270, 337820, 291534, 478878, 503258, 176726, 325295, 418897, 371147, 417610, 235223, 344655, 394189, 314542, 386102, 596285, 560270, 481272, 245411, 227916, 270287, 129466, 101149, 110935]
5792A10935K00795q0165j19524K5025J54434n821K1654j8979q0803Q8368J12907
5781D08826p5372j56147l04393J19955J69962J05039N8537P6720L49822p9761
5771F73188l5045J1759j05137j99355n0812j8455R6799M9711J29184j45492o3165
5760C43180j13227J5364Q0395J32415k5888K11027J71936P968j07849j72614J1446
5749E54153J76551j4054p9034r7589j13765N7548J25004r7853j68551M0535j5991
5738C66954J83050j35791k23009m9740Q7882L92411m2553o9901j08564K55353
5728F56092j49903Q1182j65618J73794j30416k11418L17434j28169K7615L7911
5718E08504Q7968j20013J93529m5184J54806m284k09061r1561L4400J57053J01917
$$ y = [110935, 311730, 231565, 112041, 137066, 291500, 285679, 307333, 288354, 207551, 295919, 408826, 333454, 177307, -127086, -7131, 162831, 267870, 326407, 403127, 752949, 673188, 638143, 649902, 544765, 345410, 294598, 276143, 372942, 422653, 551837, 406345, 343180, 229953, 245317, 325712, 458127, 432239, 643266, 815202, 823170, 715321, 542707, 554153, 730704, 716650, 637616, 540027, 426262, 483810, 608814, 510961, 342410, 382945, 366954, 550004, 414213, 191204, 141464, 229346, 621757, 579204, 509303, 400739, 656092, 506189, 587371, 421753, 595547, 465131, 253713, 571147, 442978, 470593, 508504, 596472, 476459, 669988, 624804, 779610, 775326, 566265, 474704, 509104, 666157, 768074]
5707G68074Q8290j61709j82845L8445L7790K00996m391p640J68411J38147j92507
5696H91061q6057j41340L10001o231j83314R1121Q5224k2165j09333J67767j02682
5685H94052r8704j0267K92275P200k91296J13159M3213J50286r6914j65493j40979
5674F96532J80119p5113k2073K09550j26833Q3031p149J4241j81l5428r8255J04553
5662I22994L0848J63990n2434o6456j43591p5404J49384j1180L5328l6146j01426
5651H15907r5302O7751J44970O4307l8926j42173j28433l9384k5386K89224o4196
5640H48359k29069l2534K02513j42732J0108J04564J25530j43417J6822J16964
5630H77108K13894l8407k09958q3760l9500k37391L80581K25544k6585L3143k33321
$$ y = [768074, 856364, 694655, 511810, 550255, 588045, 789041, 784650, 777010, 945421, 1083568, 891061, 805004, 663664, 973665, 967434, 784120, 875241, 960465, 938300, 828967, 996734, 894052, 795348, 785081, 1077356, 1084556, 793260, 906419, 949632, 1099918, 1003004, 837511, 696532, 876651, 801538, 779465, 989015, 862182, 945213, 938064, 952305, 952124, 916696, 818441, 922994, 953842, 1117832, 1065398, 998942, 855351, 779947, 929331, 918151, 953479, 917333, 815907, 720605, 788356, 933326, 997633, 958707, 816534, 688101, 648717, 623331, 912555, 848359, 619290, 586756, 789269, 646537, 656645, 761209, 886739, 743322, 760144, 877108, 1091002, 1052595, 842637, 758877, 719377, 481986, 862567, 1088111, 1061526, 1094669, 861348]
5619H61348j96590j41131K45914l8789p7822O1120j4462o0720M47735L7946k95818
5608H28731l5370O9236m7560O4751j1729k4660j11762K20959J12389Q3145N5000
5597A203130R2233j06276o0377j2937J07619o5603j2472J56489j81978J0401j02064
5586A028165k7739P7074J1378J0331O365J45741P3018j19459J70248J39467j57877
5575A356712j8169J16419j20818k8341J55317m6534J1881j03816m8362K00892
5565A475181Q7117k73121K63246K18869r9485j13564m6562J33630j41723L9828
5555A543416p6656N6717Q5733O0806o7697o7470L86901M3135k1636P706M6508
5544A997463R5640p4394L7238P5747J46434N8636k72049j99857J92694J56211
$$ y = [861348, 664758, 523627, 769541, 730752, 652930, 714050, 699588, 638868, 1086603, 1124549, 828731, 793361, 862597, 815037, 879788, 868059, 843399, 731637, 952596, 1064985, 1148130, 1203130, 1295363, 1189087, 1128710, 1115773, 1223392, 1157789, 1145317, 1301806, 1119828, 1130229, 1028165, 1000426, 1077500, 1088878, 1099209, 1105574, 1251315, 1324333, 1204874, 1375122, 1514589, 1356712, 1338543, 1454962, 1334144, 1305803, 1461120, 1414586, 1426467, 1322651, 1274289, 1475181, 1562298, 1289177, 1552423, 1771292, 1671807, 1558243, 1511681, 1645311, 1503588, 1543416, 1466760, 1523477, 1609210, 1670016, 1602319, 1534849, 1921750, 1964885, 1943249, 1950955, 1997463, 2093103, 2018709, 2055947, 2131694, 2278128, 2336764, 2064715, 1864858, 2057552, 2213763]
5534B213763J7969j25245K06398k43387p5893L34417K9649N2546N8417m7525k09603
5523B211506J76332M750P8292R5252k246M9494k2313l9932J13671l4511k2120
5512B608175l303J12558K1419k5742L3652J82525j30612J51468J4581k0025J58654
5501C103350L2714N7988j01623J76966l0002j07258J50078J61682N2119K5823
5491C521837Q1179K18547J1406L89422O963J00908j38609j74048l9638L24374
5481D302341Q9001N7682K86225P3237Q5810j05551K11008Q7295j79845M7814L14922
5470E269939K37065M9651O2155M75867K96213j81569P5829J51136M37359J96231
5460G069876J63431O7918L80919Q1138Q4852L65045J89941N65992K62706K88856
$$ y = [2213763, 2231732, 2106487, 2312885, 2069498, 1993605, 2328022, 2357671, 2410217, 2468634, 2421109, 2211506, 2387838, 2392588, 2470880, 2566132, 2563886, 2613380, 2591067, 2551135, 2664806, 2630295, 2608175, 2604872, 2717430, 2738849, 2713107, 2746759, 2929284, 2798672, 2950140, 2964721, 2944696, 3103350, 3136064, 3194052, 3092429, 3269395, 3239393, 3132135, 3282213, 3443895, 3496014, 3521837, 3603016, 3821563, 3832969, 4222391, 4229354, 4330262, 4191653, 4017605, 3977967, 4302341, 4391342, 4449024, 4735249, 4808486, 4894296, 4788745, 4999753, 5087048, 4907203, 4955017, 5269939, 5507004, 5556655, 5618810, 6094677, 6390890, 6209321, 6285150, 6436286, 6873645, 7069876, 7233307, 7301225, 7682144, 7763282, 7848134, 8213179, 8403120, 8969112, 9231818, 9520674]
5450I520674L04607M29330K29887L98360L13998M83058K18806L38284N29967M86068
5440A3253039L72769O66497M03754M98347O85160P66677P99599J060323J036118
5431A9542283Q35339J192145J345112J616874J351530J725572J839160K056144
5423C1504159J776659J467430J490304J229467J444704J610816J827373K340289
5415D4691201K314310K680573K932528K621807K155405J503537N86923J369m40976
5406E9046677j39139m5062M57275J106426J430791K250340K332922K538436K578218
5397G1556884K048093J769921J692266K290711K595241L282375M492669M967095
5389I4695255N122694L916452K119544K89024j653199k857925m437840n772880
$$ y = [9520674, 9825281, 10254611, 10484498, 10882858, 11196856, 11679914, 11898720, 12237004, 12766971, 13253039, 13625808, 14292305, 14696059, 15194406, 15879566, 16646243, 17445842, 18506165, 19542283, 20377622, 21569767, 22914879, 24531753, 25883283, 27608855, 29448015, 31504159, 33280818, 34748248, 36238552, 37468019, 38912723, 40523539, 42350912, 44691201, 47005511, 49686084, 52618612, 55240419, 57395824, 58899361, 59486284, 59487653, 59046677, 58907538, 58862476, 59319751, 60426177, 61856968, 64107308, 66440230, 68978666, 71556884, 73604977, 75374898, 77067164, 79357875, 81953116, 85235491, 89728160, 94695255, 99817949, 103734401, 105853945, 106142969, 104489770, 101631845, 97194005, 91421125]
5381I1421125n693143n261661m220467l237718k411516j638809j135294q31791
5373F6990726p22553p03373q02414o31053k04152o8530j24163O49405P51662P44723
5363F5880278N27628L04823M52196k7273j074686k280928k869418l545450l483373
5354E3883797l290552l253167k516078k178806k177467j472055j357233j216052
5346C6422387j115789r31710p00427p37459o82772p27475o81299n71444n07543
5337B9766469p16769q37892j059394o95662q30752q79984o06311n75000n82375
5328B2982330l56895l67099l55535l09054l33232m15633k67477k57963n40276
5319A9779166l16219k40629m44208k50355q849l88360P0501k01444n3651J28022
$$ y = [91421125, 85727982, 80466321, 76245854, 73008136, 70596620, 68957811, 67822517, 66990726, 66268173, 65564800, 64762386, 64131333, 63927181, 63858651, 63734488, 64383893, 65135555, 65880278, 66407906, 66712729, 67164925, 67137652, 66062966, 63782038, 60912620, 57367170, 53883797, 50593245, 47340078, 44824000, 42645194, 40467727, 38995672, 37638439, 36422387, 35306598, 34374888, 33674461, 32937002, 32254230, 31526755, 30845456, 30274012, 29766469, 29049700, 28211808, 27152414, 26456752, 25626000, 24746016, 24139705, 23564705, 22982330, 22625435, 22258336, 21902801, 21593747, 21260515, 20844882, 20577405, 20319442, 19779166, 19462947, 19222318, 18778110, 18527755, 18518906, 18130546, 18201047, 17999603, 17945952, 18073974]
5309A8073974j5563l46957k10869k82864l98653l39757l49896n85500r1253l46108
5299A5106554l09244j74281l82971j17123j72446r0439q4261j14439j52353L7207
5289A3546204q1541k32611K23766L36818j54018J63118l7549P6228m5539R9717
5279A3894593L95682K94810j9399n0779J41038L40242K34874M98553N53510P49651
5269A7032775N20337N61296N71046M90681M63560j0969J07451J39987j95176j49075
5259A9531913p7517J21119P0258L2526L10870L3512M05231O26267M04335P01725
5249B2160239O76245Q79247J240676J091935R38099R92569R04607P19086L18947
5240B9921650k25500n02829j078422j121672j174813j107850j162616p56881o81234
$$ y = [18073974, 18058411, 17711454, 17500585, 17217721, 16819068, 16479311, 16129415, 15543915, 15452662, 15106554, 14797310, 14623029, 14240058, 14122935, 13950489, 13860050, 13775789, 13661350, 13508997, 13546204, 13464663, 13232052, 13455818, 13792636, 13638618, 13801736, 13764187, 13840415, 13794876, 13894593, 14290275, 14585085, 14565686, 14514907, 14655945, 14996187, 15231061, 15729614, 16283124, 17032775, 17553112, 18114408, 18685454, 19176135, 19639695, 19628726, 19736177, 19876164, 19680988, 19531913, 19454396, 19575515, 19645773, 19678299, 19989169, 20022681, 20427912, 21054179, 21458514, 22160239, 22836484, 23715731, 24956407, 26048342, 26986441, 27979010, 28883617, 29602703, 29921650, 29696150, 29193321, 28114899, 26993227, 25818414, 24710564, 23547948, 22791067, 22109833]
5231B2109833n08906k60819k66614K2821j11289k60644m8915M96411J84883M43155
5221B1799916J09223L28267L26182J84542j1770j26961n51252p13584o79985o14212
5211B0050366q09510q10563p37865o89017k61663o34248k69851n13411l07108
5202A5017130j61588j84920m08840k94328l36912J14220j65261j37263k65952
5193A3176286j46400l79413j45296j72965k48012Q1712k31309j78075J12741j7205
5183A1852064o6187q160O8932J4313K94711J21122q805J96221K56907M64275N38400
5172A3723793N84732Q22093R72872P85652J271956J247744J579490K210605K619658
5163B5818595K872971J949572l5040k772035l959476l609037k693504j936382
$$ y = [22109833, 21600927, 21340108, 21073494, 21096315, 20985026, 20724382, 20675467, 21171878, 21356761, 21799916, 21909139, 22237406, 22563588, 22748130, 22736360, 22609399, 22058147, 21344563, 20664578, 20050366, 19240856, 18430293, 17692428, 17003411, 16741748, 16107500, 15837649, 15324238, 15017130, 14855542, 14670622, 14261782, 13967454, 13630542, 13744762, 13579501, 13442238, 13176286, 13029886, 12650473, 12505177, 12332212, 12084200, 12165912, 11934603, 11756528, 11869269, 11852064, 11785877, 11777717, 11846649, 11860962, 12155673, 12276795, 12267990, 12464211, 12721118, 13185393, 13723793, 14308525, 15130618, 16103490, 16889142, 18161098, 19408842, 20988332, 23198937, 25818595, 28691566, 30641138, 30606098, 27834063, 23874587, 20265550, 17572046, 15635664]
5155A5635664j256845o11809p92364n81676j79982m82261p41188l343m73652j96081
5145A0316463n9195J80665k97203O9608j4389j54006L94110J9599l9767L48936
5135A0764821K68729J26434J98185K69667j92716l92030k16149k38818k86721
5126A0301402k35300k0893j60854q7528J85081k1542L33887L9574j79320L83928
5116A0538435J64108j16743J97186R2384J41853L49611J92447L99814K34548l1651
5106A2161992K72336L84990M88194K50726R4767Q9676l6571o2873K52817L01226
5096A4197280j15649J41334K18454P2655L80099M50655J03844K66159L74205L76636
5086A6465672N46801N41462O42914N89734O80694R09083R35894Q44240J013706
$$ y = [15635664, 14378819, 13767010, 12974646, 12392970, 12212988, 11730727, 10989539, 10986196, 10512544, 10316463, 10257268, 10437933, 10140730, 10210338, 10195949, 10041943, 10436053, 10455652, 10415885, 10764821, 11033550, 11159984, 11358169, 11627836, 11435120, 11043090, 10826941, 10588123, 10301402, 10066102, 10045209, 9884355, 9796827, 9981908, 9960366, 10294253, 10333827, 10154507, 10538435, 10702543, 10585800, 10782986, 10875370, 11017223, 11366834, 11559281, 11959095, 12193643, 12161992, 12434328, 12819318, 13307512, 13558238, 13653005, 13742681, 13706110, 13643237, 13896054, 14197280, 14081631, 14222965, 14441419, 14514074, 14894173, 15344828, 15448672, 15714831, 16089036, 16465672, 17012473, 17553935, 18196849, 18786583, 19467277, 20376360, 21312254, 22156494, 23170200]
5077B3170200O94867P60416P56266O86686L53787J57381L44553J97214L68238
5068B7489608M48444R15245P41980P37301P39714J324927J558128J642558J776826
5059C7374731J848898J617691J981764J997009K087937J769436J570381J201374
5051E1449221Q52577N60240L83775M8452J01664Q5199r6619J35398j2411Q7520
5041E3595016L41586M38288J066322J356428J644711K010357K184146K499798
5033F5136652K549452K672126K773373K650373K078664J796620Q80176k65775
5025H0271661r58758j323000j685438k375594k103287k121490j832876j281429
5017F6589789j146287j188631q36061k86897r3672m6029K64480L88798R23983
$$ y = [23170200, 23865067, 24625483, 25381749, 26068435, 26422222, 26579603, 26924156, 27121370, 27489608, 27938052, 28853297, 29595277, 30332578, 31072292, 32397219, 33955347, 35597905, 37374731, 39223629, 40841320, 42823084, 44820093, 46908030, 48677466, 50247847, 51449221, 52301798, 52862038, 53245813, 53294265, 53395929, 53481128, 53384509, 53519907, 53507496, 53595016, 53936602, 54374890, 55441212, 56797640, 58442351, 60452708, 62636854, 65136652, 67686104, 70358230, 73131603, 75781976, 77860640, 79657260, 80537436, 80271661, 79312903, 77989903, 76304465, 73928871, 71825584, 69704094, 67871218, 66589789, 65443502, 64254871, 63418810, 63131913, 63038241, 62992212, 63256692, 63645490, 64569473]
5008F4569473P64381Q73749M09082K14480j00924p92291j062110j401454j555241
$$ y = [64569473, 65333854, 66207603, 66616685, 66831165, 66730241, 65937950, 64875840, 63474386, 61919145]
$$ [...]
##END NTUPLES=NMR SPECTRUM
##END=
