##TITLE=1H_EC-3257(II-3)
 CDCl3, 8 sc, 
 5.08.2021
##JCAMPDX= 6.0         $$ Bruker NMR JCAMP-DX V2.0
##DATA TYPE= NMR SPECTRUM
##DATA CLASS= NTUPLES
##ORIGIN= UXNMR, Bruker Analytische Messtechnik GmbH
##OWNER= root
$$ XWIN-NMR		Version 3.5
$$ Thu Aug  5 08:50:09 2021 Russian Standard Time (UT+4h)  she@DPX200
##.OBSERVE FREQUENCY= 200.131506
##.OBSERVE NUCLEUS= ^1H
##.ACQUISITION MODE= SIMULTANEOUS
##.ACQUISITION SCHEME= undefined
##.AVERAGES= 8
##.DIGITISER RES= 18
##SPECTROMETER/DATA SYSTEM= spect
##.PULSE SEQUENCE= zg30
##.SOLVENT NAME= CDCl3
##.SHIFT REFERENCE= (INTERNAL, CDCl3, 0, 17.4947)
##AUDIT TRAIL= $$ (NUMBER, WHEN, WHO, WHERE, WHAT)
$$ ##TITLE= Audit trail, XWIN-NMR		Version 3.5
$$ ##JCAMPDX= 5.01
$$ ##ORIGIN= Bruker BioSpin GmbH
$$ ##OWNER= she
$$ F:/spectra/data/she/nmr/H-F/1/pdata/1/auditp.txt
$$ ##AUDIT TRAIL=  $$ (NUMBER, WHEN, WHO, WHERE, WHAT)
(   1,<2021-08-05 08:48:42.17 +0400>,<she>,<DPX200>,
      <created by zg, POWCHK disabled, PULCHK disabled
       configuration hash MD5:
       00 E9 B6 7A A2 85 ED C7 34 08 36 98 17 FE 4E 26
       data hash MD5: 16K
       3B AC 9A 9C 37 9D CE FF 5D C0 07 5C 3D 75 B3 B5>)
(   2,<2021-08-05 08:48:44.79 +0400>,<she>,<DPX200>,
      <Start of raw data processing
       efp BC_mod = 2 LB = 0.24 FT_mod = 6 PKNL = 1 PHC0 = -13366.34 PHC1 = 25.201 SI = 16K 
       data hash MD5: 16K
       3E 62 D1 8A 27 D6 DD 82 6B FB C4 F7 40 60 51 FF>)
(   3,<2021-08-05 08:49:08.17 +0400>,<she>,<DPX200>,
      <pk PHC0 = 11.11806 PHC1 = -12.6 
       data hash MD5: 16K
       E6 F2 AC 69 3E 10 BA 81 B0 D5 F6 1A 58 12 00 93>)
(   4,<2021-08-05 08:49:11.76 +0400>,<she>,<DPX200>,
      <abs ABSG = 5 
       data hash MD5: 16K
       13 EB C8 05 30 FA 68 9D 63 75 C8 C0 C7 38 50 82>)
$$ ##END=
$$ 
$$ hash MD5
$$ D5 A2 29 54 7B 26 62 8E 55 EF F9 DA 46 53 D9 6A
##$RELAX= 
##$RELAX= 
##$RELAX= 
##$RELAX= 
##$RELAX= 
##$RELAX= 
$$ Bruker specific parameters
$$ --------------------------
##$DU= <F:/spectra>
##$EXPNO= 1
##$NAME= <H-F>
##$PROCNO= 1
##$TYPE= <nmr>
##$USER= <she>
##$AMP= (0..31)
100 100 100 100 100 100 100 100 100 100 100 100 100 100 100 100 100 100 
100 100 100 100 100 100 100 100 100 100 100 100 100 100 
##$AQSEQ= 0
##$AQ_mod= 1
##$AUNM= <au_zg>
##$AUTOPOS= <>
##$BF1= 200.13
##$BF2= 200.13
##$BF3= 200.13
##$BF4= 200.13
##$BF5= 200.13
##$BF6= 200.13
##$BF7= 200.13
##$BF8= 200.13
##$BYTORDA= 1
##$CFDGTYP= 0
##$CFRGTYP= 5
##$CHEMSTR= <none>
##$CNST= (0..31)
1 1 145 1 1 1 1 1 1 1 1 1 1 1 1 1 1 1 1 1 1 1 1 1 1 1 1 1 1 1 1 1 
##$CPDPRG= <>
##$CPDPRG1= <>
##$CPDPRG2= <>
##$CPDPRG3= <>
##$CPDPRG4= <mlev>
##$CPDPRG5= <mlev>
##$CPDPRG6= <mlev>
##$CPDPRG7= <mlev>
##$CPDPRG8= <mlev>
##$CPDPRGB= <>
##$CPDPRGT= <>
##$D= (0..31)
0 1.2 0 0 0 0 0 0 0 0.06 0 0.03 0 0 0 0 0.0002 0 0 0 0 0 0 0 0 0 0 0 0 
0 0 0 
##$DATE= 1628138921
##$DBL= (0..7)
120 120 120 120 120 120 120 120 
##$DBP= (0..7)
150 150 150 150 150 150 150 150 
##$DBP07= 0
##$DBPNAM0= <>
##$DBPNAM1= <>
##$DBPNAM2= <>
##$DBPNAM3= <>
##$DBPNAM4= <>
$$ [...]
##$SUBNAM3= <"">
##$SUBNAM4= <"">
##$SUBNAM5= <"">
##$SUBNAM6= <"">
##$SUBNAM7= <"">
##$SUBNAM8= <"">
##$SUBNAM9= <"">
##$SW= 20.0188882624521
##$SWIBOX= (0..15)
0 0 2 0 0 0 0 0 0 0 0 0 0 0 0 0 
##$SW_h= 4006.41025641026
##$TD= 16384
##$TD0= 1
##$TE= 0
##$TE2= 300
##$TE3= 300
##$TEG= 300
##$TL= (0..7)
0 120 120 120 120 120 120 120 
##$TP= (0..7)
150 150 150 150 150 150 150 150 
##$TP07= 0
##$TPNAME0= <>
##$TPNAME1= <>
##$TPNAME2= <>
##$TPNAME3= <>
##$TPNAME4= <>
##$TPNAME5= <>
##$TPNAME6= <>
##$TPNAME7= <>
##$TPOAL= (0..7)
0.5 0.5 0.5 0.5 0.5 0.5 0.5 0.5 
##$TPOFFS= (0..7)
0 0 0 0 0 0 0 0 
##$TUNHIN= 0
##$TUNHOUT= 0
##$TUNXOUT= 0
##$USERA1= <user>
##$USERA2= <user>
##$USERA3= <user>
##$USERA4= <user>
##$USERA5= <user>
##$V9= 5
##$VALIST= <valist>
##$VCLIST= <CCCCCCCCCCCCCCC>
##$VD= 0
##$VDLIST= <DDDDDDDDDDDDDDD>
##$VPLIST= <PPPPPPPPPPPPPPP>
##$VTLIST= <TTTTTTTTTTTTTTT>
##$WBST= 1024
##$WBSW= 4
##$XGAIN= (0..3)
0 0 0 0 
##$XL= 0
##$YL= 0
##$YMAX_a= 229328
##$YMIN_a= -286644
##$ZGOPTNS= <>
##$ZL1= 120
##$ZL2= 120
##$ZL3= 120
##$ZL4= 120
##$ABSF1= 17.52765
##$ABSF2= -2.491388
##$ABSG= 5
##$ABSL= 3
##$ALPHA= 0
##$AQORDER= 0
##$ASSFAC= 0
##$ASSFACI= 0
##$ASSFACX= 0
##$ASSWID= 0
##$AUNMP= <proc_1d>
##$AZFE= 0.1
##$AZFW= 0.1
##$BCFW= 0
##$BC_mod= 2
##$BYTORDP= 0
##$COROFFS= 0
##$CY= -3
##$DATMOD= 1
##$DC= 0
##$DFILT= <>
##$DTYPP= 0
##$F1P= 0
##$F2P= 0
##$FCOR= 1
##$FTSIZE= 16384
##$FT_mod= 6
##$GAMMA= 0
##$GB= 0
##$INTBC= 1
##$INTSCL= 1.334414e-10
##$ISEN= 128
##$LB= 0.24
##$LEV0= 0
##$LPBIN= 0
##$MAXI= 10000
##$MC2= 0
##$MEAN= 0
##$ME_mod= 0
##$MI= 1.114404
##$NCOEF= 0
##$NC_proc= -8
##$NLEV= 6
##$NOISF1= 3.799351
##$NOISF2= 2.8
##$NSP= 0
##$NTH_PI= 0
##$NZP= 0
##$OFFSET= 17.49467
##$PC= 1
##$PHC0= -13355.22
##$PHC1= 12.601
##$PH_mod= 1
##$PKNL= yes
##$PPARMOD= 0
##$PSCAL= 0
##$PSIGN= 0
##$REVERSE= no
##$SF= 200.130007996791
##$SI= 16384
##$SIGF1= 3
##$SIGF2= 2
##$SINO= 5.538805
##$SIOLD= 16384
##$SREGLST= <1H.CDCl3>
##$SSB= 0
##$STSI= 16384
##$STSR= 0
##$SW_p= 4006.41025641026
##$SYMM= 0
##$S_DEV= 0
##$TDeff= 16384
##$TDoff= 0
##$TI= <>
##$TILT= no
##$TM1= 0
##$TM2= 0
##$TOPLEV= 0
##$USERP1= <user>
##$USERP2= <user>
##$USERP3= <user>
##$USERP4= <user>
##$USERP5= <user>
##$WDW= 1
##$XDIM= 16384
##$YMAX_p= 507868457
##$YMIN_p= -1082065
$$ End of Bruker specific parameters
$$ ---------------------------------
##NTUPLES= NMR SPECTRUM
##VAR_NAME=  FREQUENCY,     SPECTRUM/REAL,   SPECTRUM/IMAG
##SYMBOL=    X,             R,               I
##VAR_TYPE=  INDEPENDENT,   DEPENDENT,       DEPENDENT
##VAR_FORM=  AFFN,          ASDF,            ASDF
##VAR_DIM=   16384,         16384,           16384
##UNITS=     HZ,            ARBITRARY UNITS, ARBITRARY UNITS
##FACTOR=    0.24454680195387, 1,            1
##FIRST=     3501.20862069804, 0,            0
##LAST=      -505.20163571222, 0,            0
##MIN=       -505.20163571222, -1082065,     0
##MAX=       3501.20862069804, 507868457,    0
$$ Real data points
##PAGE= N=1
##DATA TABLE= (X++(R..R)), XYDATA
$$ [...]
6861D22828l9588m41467j19594L93537N33576k87948M3994l24910O4688o8347
6851A76769M69046k76405k75132r4842M89207j90238J36984L30862j45674n60935
6841E9642j64256O5241K0068P5032M14711k91395n7331O5812J93877J04661M7313
6830E33375J78039j82347N754j21077n10184L50203J91431j70730j5590J42656
6820D01530o2265m61705l59626k4819J02925J06509Q3579K69234K82469O5923
6810D03754K18209q80481m2423L01938P1808k6469J50917j63380k60059M42319
6800B16133j16337j45385K41811j51955j37192M68548M6205j51107m34352l23070
6790d86701O38945R3616k49060k6250J38529m3483l916J26657j90064j12554M26333
$$ y = [422828, 383240, -58227, -177821, 215716, 749292, 461344, 505338, 180428, 245116, 176769, 645815, 369410, 94278, -564, 488643, 298405, 435389, 766251, 620577, 59642, -104614, -39373, -19305, 55727, 470438, 179043, 121712, 187524, 381401, 486062, 533375, 711414, 529067, 534821, 413744, -96440, 253763, 445194, 274464, 258874, 401530, 339265, -122440, -482066, -506885, -403960, -297451, -213872, 55362, 337831, 403754, 621963, -258518, -300941, 997, 72805, 46336, 197253, 33873, -226186, 216133, 99796, -45589, 196222, 44267, -92925, 375623, 421828, 270721, -163631, -486701, 152244, 245860, -3200, -29450, 109079, 65596, 61680, 188337, -1727, -114281, 312052]
6779C12052j06297r9083j09157P9048q6577L74469J83275J6106m75527j78517
6769i0208N5534K47385m28163K62150k96090M2366k26405O34989O202K74278K7980
6758E10018p83134J08814j00407L16595j74533n5875Q697R615M01791j82780j98822
6747a40021K24269K46826l00591R629L82346m44255l10107M43758L4804l85064
6737b38406N06335k56050k9024j28341N76791P2259j11134K09331q850o11870
6727a8959M7024K82285J68917m44512J20088m50326J94361L23664M385J73570
6717D00497l02255Q5094k45100L16009k93535K09811j03428j69734L71913k67657
6707A615k9725K11851M5985k52307O03491m73392J20722K46145m55153J9150J42557
$$ y = [312052, 205755, 106672, -2485, 76563, -10014, 364455, 547730, 563836, 88309, -90208, -34674, 212711, -215452, 46698, -249392, -207026, -433431, 201558, 207760, 482038, 510018, -273116, -164302, -264709, 51886, -122647, -178522, -169825, -160210, 241581, 58801, -140021, 84248, 331074, 30483, 40112, 422458, -21797, -331904, 111854, 146658, -238406, 267929, 11879, -17145, -145486, 431305, 503564, 392430, 601761, 592911, -18959, 28065, 310350, 479267, 34755, 154843, -295483, -101122, 222542, 226927, 400497, 98242, 183336, -61764, 254245, -39290, 170521, 67093, -102641, 269272, 1615, -28110, 183741, 229726, -22581, 580910, 107518, 228240, 474385, 19232, 38382, 180939]
6696A80939K2436l02443M01712k1355J73640Q1779J80673N8388j53589l33239
6686B88941k63506K72559L8179j86066L48081k8661j78218K07780j73588j82351
6676A43150L85683K27204j46512m84271J06879M59792L65625j98319o058j99782
6666F53391K49016l59835l58158j0691O2999N35000N3617j88641l7690M27324
6656A026332j35609k81741K67624M31367l31771l48106L61527j17245j53343L41284
6646A060319R0769k42156J32180K75808l02562J22046L07838L79686k95299l38694
6636A189935k8487L45394j49817q9978L39606J85172o2745L14650k07898k41468
6626A594364J375J56739L76392l4345j97717O6434j15093R10197j31239l55328
$$ y = [180939, 203375, -99068, 302644, 281289, 454929, 536708, 717381, 775769, 622180, 288941, 25435, 297994, 336173, 150107, 498188, 469527, 291309, 499089, 325501, 143150, 528833, 756037, 609525, 125254, 232133, 691925, 1057550, 859231, 853173, 653391, 902407, 542572, 184414, 173723, 236722, 771722, 825339, 636698, 599008, 1026332, 890723, 608982, 876606, 1307973, 976202, 628096, 989623, 872378, 719035, 1060319, 1151088, 908932, 1041112, 1316920, 1014358, 1136404, 1444242, 1823928, 1528629, 1189935, 1161448, 1506842, 1357025, 1267047, 1606653, 1791825, 1729080, 2043730, 1835832, 1594364, 1595739, 1752478, 2128870, 2094525, 1896808, 1963242, 1848149, 2758346, 2627107, 2271779]
6616B271779M67079Q4143K50918m39318K70936N9411n15066J68344K87293N6691
6606B962210j84704k2472R02006K69831k48885L75014j83348k0771M16076O48327
6596D913284l31841r6870J36289J26887R5204k56734j23958J13791j8467J07792
6586D665377P26393J30171K85881L29346k37021L01808J64042O52881P7889l2516
6576G064251L73548J60352M33698O20133N16681M73691P28373L09662P60765K36874
6566A1678028Q25143Q45507R16083Q40409J094994J206502J965837J363590J796233
6557B2532326J794963K832908K800499L643870M388591M992351O032982O732806
6549E5751296Q911643R980066J0558792Q429491K941462l628893q709249j1211480
$$ y = [2271779, 2738858, 2823001, 3073919, 2634601, 2905537, 2964948, 2449882, 2618226, 2905519, 2962210, 2777506, 2755034, 3657040, 3926871, 3677986, 4053000, 3869652, 3848881, 4264957, 4913284, 4581443, 4484573, 4620862, 4747749, 4842953, 4586219, 4462261, 4576052, 4557585, 4665377, 5391770, 5521941, 5807822, 6137168, 5900147, 6201955, 6365997, 7018878, 7096767, 7064251, 7437799, 7598151, 8031849, 8651982, 9168663, 9642354, 10370727, 10680389, 11441154, 11678028, 12503171, 13348678, 14264761, 15105170, 16200164, 17406666, 19372503, 20736093, 22532326, 24327289, 27160197, 29960696, 33604566, 37993157, 42985508, 49018490, 55751296, 64662939, 74643005, 85201797, 93631288, 96572750, 92943857, 84234608, 73023128]
6541G3023128j0995953q482846n989633m225829l557628m061899k892443l233848
6533B9583049k402923j873335k232752k139550q57764n12201j470204m29529l37756
6524A7327035o11387o38198j19146L25205P8280k34432q8155J90981M72490M85291
6514A7187964M51707M52999M38022J234689J242148J494479J908008K655219K571403
6505B9636638K502850L533712M184018M324376N916830P045880Q346508R760805
6497G5251617Q320299L774287k857960q301652j1983565j1606822q915690p096676
6489C6583838n156553l780374l030918k599045k417586j587879j321814j242252
6481A5447417j297601j277518p41552r97156j095406o41931n44553n53365j14488
$$ y = [73023128, 62027175, 53544329, 47554696, 43328867, 39771239, 35709340, 32816897, 29583049, 27180126, 25306791, 23074039, 20934489, 20076725, 19564524, 18094320, 17664791, 17327035, 16715648, 16077450, 15958304, 16283509, 16361789, 16127357, 16039202, 16230183, 16702673, 17187964, 17639671, 18092670, 18530692, 19765381, 21007529, 22502008, 24410016, 27065235, 29636638, 32139488, 35673200, 39857218, 44181594, 50098424, 57144304, 65490812, 75251617, 83571916, 87346203, 84488243, 76186591, 64203026, 52596204, 43680514, 36583838, 31427285, 27646911, 24615993, 22016948, 19599362, 18011483, 16689669, 15447417, 14149816, 12872298, 12130746, 11133590, 10038184, 9396253, 8851700, 8298335, 8183847]
6472H183847j80285l11976J39115n62817n76560N9749k91189m51818k72700r8905
6462E636461J95160k36507j41536J16341l65197k21141o5793j36106r5322O0062
6452D746422o55251j35725r9713p47857L63831m34382P6023M899m63708K35011
6442B889550L54299n0081o49468l6031L71327j84053k27904Q1467m61918O3030
6432B150218K70733o7051P2987m67446J15138P69687l82627k35959L60027R1189
6422B676896n74023j05246J60853p764j87729r1545k32764K06396N1713j12310
6412A784477n25117p7839K14801k94728k02038L09011M98203n7853K3643k47127
6402A425433q4062k85173L47122L57826p9181k57592o58507r075k18966J57022
$$ y = [8183847, 8003562, 7691586, 7830701, 7267884, 6691324, 6751073, 6459884, 6008066, 5735366, 5636461, 5831621, 5595114, 5453578, 5569919, 5204722, 4983581, 4917788, 4781682, 4686360, 4746422, 4091171, 3955446, 3855733, 3107876, 3471707, 3037325, 3113348, 3118247, 2654539, 2889550, 3243849, 3193768, 2544300, 2508269, 2879596, 2695543, 2467639, 2549106, 2087188, 2150218, 2420951, 2353900, 2426887, 1959441, 2074579, 2844266, 2461639, 2225680, 2585707, 2676896, 2102873, 1997627, 2158480, 2150716, 1962987, 1871442, 1638678, 1845074, 1896787, 1784477, 1259360, 1181521, 1396322, 1101594, 899556, 1208567, 1706770, 1648917, 1672560, 1425433, 1341371, 1056198, 1403320, 1761146, 1681965, 1424373, 765866, 756791, 537825, 694847]
6392F94847L87359j52455K80239l75153L22617J59398k39705J8041q1653N79057
6382A592592p32642k00020K20114L03110J51282j26395j86627m95593L51590N97157
6372A474568J15251l36754m48060O7324K27383Q3623l11684j59029L28261J2257
6362A053140R7247k0937K4868J55889m4881k03721L79295L27521k79092n15410
6352I73919P76094j62162K86144l9694l21354J33914n4030j9696k78459j00885
6342A193791m53140K20772j09056J73372J89870j4470j06920o8301P25831j79199
6332A572550l95402l2627N3974M77618k28509n59347m09269J09078k92981K42073
6322E37158L9838J94092J96403P1379j80599M1440J99216Q9280q5716k64403p7
$$ y = [694847, 1082206, 929751, 1209990, 834837, 1157454, 1316852, 1077147, 1095188, 1013535, 1592592, 859950, 659930, 880044, 1183154, 1334436, 1208041, 1021414, 525821, 877411, 1474568, 1589819, 1253065, 805005, 872329, 1099712, 1183335, 871651, 712622, 1040883, 1053140, 1150387, 1129450, 1154318, 1310207, 1265326, 1061605, 1440900, 1768421, 1489329, 973919, 1750013, 1587851, 1873995, 1834301, 1512947, 1646861, 1592831, 1573135, 1294676, 1193791, 740651, 961423, 852367, 1025739, 1215609, 1201139, 1094219, 1025918, 1751749, 1572550, 1177148, 1144521, 1198495, 1676113, 1447604, 888257, 478988, 588066, 295085, 537158, 576996, 771088, 967491, 1038870, 858271, 899711, 1098927, 1188207, 1102491, 838088, 838011]
6311H38011O442p8962j30925K2228j0613L35255m20910j6786L21005k8264J97460
6300A033941l36383k35976J4901J19986J59849L95584L34076j65861p26362k65982
6290C27773J93327O08597q5191M32816k23885k24633J56120J55612L96154n63406
6280A173284K26139p4120Q823j3630l7292Q358r8515L0506l01333n04026N53196
6269I71390k82107J99486L57312l09712m79139P98587q8793j02661m7964J89307
6259A205706p5474J05925k74001j74750p4226M2113k16125k69880J31064K23312
6249F23664L37822J53429j07226k01320L22212l78262L37449k9083l56036k22055
6239D80594O82398m43530k80526l06190N47074l3335l1639K51487k76849L25085
$$ y = [838011, 844453, 765491, 634566, 656794, 646181, 981436, 560526, 543740, 864745, 836481, 1033941, 697558, 461582, 476483, 596469, 756318, 1151902, 1485978, 1320117, 593755, 327773, 521100, 1129697, 1044506, 1477322, 1253437, 1028804, 1184924, 1340536, 1736690, 1173284, 1399423, 1325303, 1334126, 1320496, 1283204, 1291562, 1193047, 1223553, 922220, 418194, 971390, 689283, 888769, 1246081, 936369, 457230, 1255817, 1167024, 1064363, 1016399, 1205706, 1130232, 1236157, 962156, 787406, 713180, 755293, 539168, 269288, 400352, 623664, 961486, 1114915, 1007689, 806369, 1128581, 750319, 1087768, 1058685, 702649, 480594, 1162992, 719462, 438936, 132746, 679820, 646485, 614846, 866333, 589484, 914569]
6229I14569p2980k36309l85607R7392l36895J73104K425J86387J2156P33508N0348
6218A138098l48943j73699r2407j48460k18398L96307K54558l95168k42856K82343
6208D51375k19240j60284K81776J35705k59900K68877K23274k8370P4122j51243
6198F16092J16973J91737k49931l3730l72398N00972K71114k43256j62276n9208
6188E76089J20456r3217n97514M43793R0355J35587k8143K35353K57059J33693
6178A273511n9941j12017m24863j05140j33253k74243L34968J78558k75030l07122
6168I5428K24839M27305r6272J2958k45693j39552K87864M23951l01849n44948
6158A44031R9293O4659J48632l66903l33454O45010k2592k04061J23905K50995
$$ y = [914569, 841589, 605280, 219673, 317065, -19830, 153274, 155699, 342086, 354242, 1087750, 1138098, 789155, 615456, 523049, 374589, 156191, 552498, 807056, 411888, 169032, 451375, 232135, 71851, 353627, 489332, 229432, 498309, 721583, 693213, 767335, 616092, 733065, 924802, 674871, 641141, 268743, 769715, 1040829, 797573, 635297, 576089, 696545, 603328, 5814, 449607, 539962, 675549, 647406, 882759, 1139818, 1273511, 1213570, 1101553, 676690, 571550, 438297, 164054, 499022, 677580, 402550, 95428, 320267, 747572, 651300, 664258, 418565, 279013, 566877, 990828, 688979, 144031, 243324, 307983, 456615, 89712, -243742, 401268, 378676, 174615, 298520, 549515]
6148E49515J43134M5025l45841K28485K75810k21678j64127j44562l07305l28437
6138b69981L89258M92103J5031l17404K93876K5043j06971o654l5958l05673k97861
6127a25191R9133j2177K21802L80747n26294n4623l024L72962l53998j40195k73191
6116d14049P6357K78935l07642l07170O10970j92091N31141k75688k71779J85086
6106h5930j49168j79653N84853n1419o341O53143j72146l93710l44160R1740p5446
6095a28237m4860P5449n6898O4647L90602j09885K69908l35896M72654O5360n01331
6084A61513n65988J21979J15144j69006P8872J74545K99027n15136k00452J50877
6074c48625P24029J43874m82378r1222m15262P6845J55615M18673N9464k59180
$$ y = [549515, 692649, 737674, 391833, 620318, 896128, 674450, 510323, 365761, 58456, -269981, 119277, 611380, 626411, 309007, 602883, 627926, 520955, 514301, 478343, 172670, -125191, -26058, -38235, 183567, 564314, 38020, -16603, -19627, 353335, -663, -140858, -414049, -337692, -58757, -366399, -673569, -62599, -254690, 276451, 763, -271016, -85930, -235098, -414751, 170102, 118683, 112342, 765485, 593339, 199629, -144531, -52791, -128237, -173097, -97648, -154546, -89899, 300703, 190818, 460726, 124830, 597484, 662844, 161513, -404475, -282496, -167352, -336358, -257486, -82941, 216086, -299050, -499502, -348625, 375404, 519278, 36900, -54322, -469584, -392739, -237124, 181549, 241013, -18167]
6064a8167j79905n397J53845J05737k87001j34273M23102l74222J07212l923J26367
6053h6625J08092k5559m60819j52973O70411n13278M04688k36844K24025M63058
6043C94176m23406K61171j10735j65553j33850j28061n44393N61489J49398j47269
6033b87033j21435M48042N0021j22206k65524k35462M74138j01000l5198j19206
6023c14863k53187l41297J17548M18833K02759n1339J95056L57507m3510j64368
6013A23139j72125l03796o762p2091R6879K3239K91645m97247L79117R2672n47913
6002e93243K53594k51722l16991r1946J21211K1102N38389K27489l00872L52003
5992d0986o47925J46292Q8399j30237M4259R070k97521N04266L59099m42615R0961
$$ y = [-18167, -198072, -203469, -49624, 56113, -230888, -365161, 57941, -316281, -209069, -212992, -86625, 21467, -4092, -464911, -617884, 52527, -460751, -56063, -292907, -68882, 394176, -29230, 231941, 121206, -44347, -178197, -306258, -850651, -289162, -139764, -287033, -408468, 39574, 89595, -32611, -298135, -533597, -59459, -160459, -195657, -314863, -568050, -909347, -791799, -372966, -170207, -221546, -26490, 331017, 287507, 123139, -48986, -352782, -359544, -431635, -334756, -311517, -19872, -517119, -138002, -45330, -593243, -339649, -591371, -908362, -1000308, -879097, -857995, -319606, -92117, -392989, -40986, -688911, -542619, -454220, -584457, -540198, -531128, -828649, -324383, 34716, -407899, -316938]
5981c16938K57178O774l29195j74082K46735j29833k15300p2340J9911M98782
5971b08308K86824J94905J33093k86946k39056J76288o07137M05711M59128k40649
5961G3853j08L33451j26400k9933l3337R3913j10783l26865J24283j08341k64216
5950c74483k42519M34047K04339l20386J46448K94958j09142K3841O1461j97j16309
5939B058O8862l80397k53374N63372J19113m4444m46306M72122l46922r2333M2701
5928b95548j88370n1143K34227J46722J09719j2752j51608R1844j77139K42096
5918e1952K53534j73522k4437M05607l65242j43331j583j49513k36814Q1513J24200
5907b81540l6542j53060k45619L51516J55604L0769O1186m28456R356r6405k3875
$$ y = [-316938, -59760, -52986, -382181, -556263, -309528, -439361, -654661, -727001, -707090, -208308, 78516, 273421, 406514, 119568, -119488, 56800, -550337, -144626, 314502, 73853, 73745, 407196, 280796, 250863, 217526, 311439, 200656, -126209, -1926, -110267, -374483, -617002, -182955, 21384, -299002, -152554, 142404, 33262, 57103, 118564, 118367, 2058, 70920, -309477, -562851, 521, 119634, 75190, -371116, 101006, -245916, -338249, -295548, -483918, -535061, -300834, -154112, -44393, -57145, -208753, -116909, -294048, -51952, 201582, 28060, 3623, 409230, 43988, -99343, -100926, -250439, -487253, -405740, -281540, -318082, -471142, -716761, -365245, -209641, -178872, -117686, -546142, -536786, -633191, -657066]
5896f57066N28907p539l40950k79784j77036M86456K63911M4662k10715K09686
5886a39468k04512k6956J33221j8638Q3742o277m55125J84874k08232L59612L21940
5875B4181K28516K30845m02750k85841L4959M1784o07912K36863k02036L8306
5865f63085K86546J36754l88884k61150P66927K38844o55511M383L90714j6832
5855a61294m60392K29212m569p4072l96102L30026L99320m75189j97196J34574
5845f75682L71308L16612l6211k86869J27951K9517l01328N852m8755O5589l96365
5834h28381K35786N63518J56555k08964j5336k25072M3089N7257j31649j49134
5824e02331J24732k58661l15868M01180L92743l75350m8253M11367k65353L02411
$$ y = [-657066, -128159, -135698, -476648, -756432, -933468, -447012, -183101, -138439, -349154, -139468, -343980, -370936, -237715, -256353, -172611, -178888, -634013, -449139, -657371, -297759, 24181, 252697, 483542, 80792, -205049, -170090, -128306, -736218, -499355, -701391, -663085, -376539, -239785, -628669, -889819, -122892, 115952, -539559, -535176, -144462, -161294, -621686, -392474, -397043, -471115, -867217, -537191, -137871, -613060, -810256, -675682, -304374, 12238, -23973, -310842, -182891, -153374, -454702, -448850, -497605, -432016, -828381, -592595, -29077, 127478, -81486, -96822, -321894, -278805, -221548, -353197, -502331, -377599, -636260, -952128, -550948, -158205, -533555, -581808, -170441, -435794, -133383]
5814a33383R7778Q6823J44855n23635l57866m34M38796k63372m31398O01524J06763
5803b33549r120l34729O53289k64285J59911n9129n01386J30670Q5428K34561
5793a38339n65207M8695J07782K13010q2167K66811L40132m65140p7359L51653
5783a29m88933L14642J01273J13557r6625k19910M68000k9786l18742m35643K31252
5772c61044L87735J58765k77488J8313k36732K16350J77632O5375j73097q7952
5762a12143k12278J49105k28275j48137K19921J98848K7051P339k65761j41521
5752e05851L44017L56744k02517K02246m45472l71266L66597L04772Q5023p3422
5742F0871rk35584M47717r0588j10876K10555n09290L41575k1645K51554j25786
$$ y = [-133383, -35605, 51218, 196073, -327562, -685428, -685862, -247066, -510438, -941836, -340312, -233549, -242669, -577398, 75891, -188394, -28483, -87612, -588998, -458328, -372900, -138339, -703546, -654851, -547069, -334059, -416226, -149415, 190717, -274423, -351782, -129, -489062, -174420, -73147, 40410, -56215, -276125, 191875, 162089, -156653, -592296, -361044, 26691, 185456, -92032, -73719, -310451, -94101, 83531, 148906, -24191, -112143, -324421, -175316, -403591, -551728, -331807, -132959, -105908, -98569, -364330, -505851, -161834, 194910, -7607, 194639, -250833, -622099, -255502, 49270, 134293, 60871, 60862, -174722, 272995, 182407, 71531, 282086, -227204, 114371, 92726, 344280, 218494]
5731B18494o0231M32654J73509m29111M8711K62913r0077l7881Q423O1214o8593
5720E20025R6459n1428j41338Q28K26312R8689j39164L8201N6885K33022K51225
5709A189716K55635k87430p86814K37509j09195L94511l99237J74296l5939J62235
5699G95287K79312n0324o0264J31822m63486J94261Q0724l78634J0506L22358
5689H61562P7223J64930q6999l94300j29729q4792O7403J83406J41272j11548
5679F88428k56714j12710J70637L42433o9229n11590l99102L62173K02488K69250
5669F86064j01034k67520k63524J02425L06594K20974K05218k34916l25050P0863
5659D00094k4254L99037K93364k26786m72491L16455n06873J10773K88836k61543
$$ y = [218494, 158263, 590917, 764426, 335315, 384026, 646939, 556862, 518981, 527404, 588618, 520025, 616484, 565056, 423718, 424546, 650858, 749547, 610383, 648584, 705469, 938491, 1189716, 1445351, 1157921, 371107, 608616, 499421, 893932, 494695, 668991, 633052, 795287, 1074599, 1024275, 964011, 1095833, 632347, 826608, 907332, 528698, 539204, 861562, 938785, 1103715, 1016716, 622416, 492687, 407895, 475298, 658704, 799976, 688428, 431714, 319004, 489641, 832074, 762845, 251255, -147847, 214326, 416814, 686064, 585030, 317510, 53986, 156411, 463005, 683979, 889197, 654281, 329231, 400094, 375840, 774877, 1068241, 841455, 368964, 685419, 178546, 289319, 578155, 316612]
5649C16612j6100L46109L19154k09412l51268K04454J67608j64906K41325k6783
5639H26793k2523p8096L75798k70635K20466p7183K92684k18066J32723Q8166
5629A270127j58350N572L88441p04050K85690J52511k35231J35863k33583n9983
5619H47007J08702N91716K69051o12906j56332j18377J23934J37336J66319j62984
5609A193466j12093J62952N59261k22854j40578k40506P3151j03482k2275K71562
5599A418604n03273M54405L84050k27426R2348N3272l15402L48252L08752Q256
5589B021838o11307K2537K08047L75361P2867k80515J03883o2257j07733Q1008
5579A823729M926j43375M64361j96747j62674M64910M9763k05968K62788K99612
$$ y = [316612, 300512, 646621, 965775, 756363, 405095, 609549, 777157, 612251, 853576, 826793, 804270, 726174, 1101972, 831337, 1051803, 974620, 1267304, 1049238, 1181961, 1270127, 1111777, 1117349, 1505790, 801740, 1087430, 1239941, 1004710, 1140573, 906990, 847007, 955709, 1547425, 1816476, 1203570, 1047238, 928861, 1052795, 1190131, 1356450, 1193466, 1081373, 1244325, 1803586, 1580732, 1440154, 1199648, 1272799, 1169317, 1147042, 1418604, 915331, 1369736, 1753786, 1526360, 1618708, 1671980, 1356578, 1704830, 2013582, 2021838, 1410531, 1433068, 1641115, 2016476, 2089343, 1808828, 1912711, 1850454, 1742721, 1823729, 1828655, 1685280, 2149641, 1952894, 1790220, 2255130, 2304893, 2098925, 2361713, 2661325]
5569B661325l10205k50046l49003M03050K65219k72304K9340J00082l07104L63329
5559B333683M86626M8954o18k38213M5054J52169j42657J197J99244L05363r6676
5548C094126L3672j63349P28185l68399m98625J06574N3716J22199q9994N57319
5538C575424R087J44821k31535J47826J97305p9479L84522j36058L1579L75304
5528D418796J44404J90647m58669N58936N55139m40952N7653J53574J95237N5223
5518E429988K29477l03354P746P44477m4741K15743L47048M33393L56277L82634
5508G798688N11140m22315o02765L02560Q23053q4831M87364K89170M56576K17578
5498I776218n2321L61662L07139N88878P10461l38129L32773Q35194K87723N54611
$$ y = [2661325, 2351120, 2101074, 1752071, 2155121, 2420340, 2148036, 2177376, 2277458, 1970354, 2333683, 2820309, 2869263, 2868645, 2630432, 2675486, 2827655, 2684998, 2686195, 2885439, 3190802, 3094126, 3127798, 2964449, 3692634, 3324235, 2825610, 2932184, 2985900, 3108099, 3018105, 3575424, 3584511, 3729332, 3497797, 3645623, 3842928, 3763449, 4147971, 4011913, 4043492, 4418796, 4563200, 4753847, 4295178, 4854114, 5409253, 4968301, 5025954, 5179528, 5374765, 5429988, 5659465, 5356111, 5363857, 6108334, 6063593, 6279336, 6626384, 7059777, 7416054, 7798688, 8309828, 7887513, 7284748, 7587308, 8410361, 8325530, 8812894, 9102064, 9558640, 9776218, 9723897, 10085559, 10392698, 10981576, 11692037, 11353908, 11686681, 12521875, 12809598, 13364209]
5488A3364209J17205M21998M43481Q941M4041L95681P08203O95917k50177N0041
5478A5999540J113834R12622N02132Q9837L95361J093647M57858P14587R09877
5469B2189295O10155N84202R22217R78785J415292J861575J346659J737131K053870
5460C3699181K416461K417269K517651L546136L236428M052779M334576M735016
5452F0955497N466878L758285K385751P15148k54398o76151q15047k43405R18873
5443G2211431J729877K589611L508046M285913N197927O178797O584693O585174
5435A08871469O085519N816721N125790M165278L380518M206763N438340O613089
5427A49703487P715798O789820M083190k2936l755953m959784m639983k379974
$$ y = [13364209, 13481414, 13903412, 14346893, 14355834, 14399875, 14795556, 15503759, 16199676, 15949499, 15999540, 17113374, 18025996, 18528128, 18617965, 19013326, 20106973, 20564831, 21279418, 22189295, 22799450, 23383652, 24305869, 25284654, 26699946, 28561521, 29908180, 31645311, 33699181, 36115642, 38532911, 41050562, 44596698, 47833126, 51885905, 56220481, 60955497, 66422375, 70180660, 72566411, 73281559, 73027161, 72351010, 71535963, 71292558, 72211431, 73941308, 76530919, 80038965, 84324878, 89522805, 95701602, 102286295, 108871469, 114956988, 120773709, 125899499, 130064777, 133445295, 137652058, 143090398, 149703487, 157419285, 164209105, 168292295, 168269359, 164513406, 159553622, 154913639, 152533665]
5419A52533665k84555J152441L266413M295531N467062N421931M772079L962652
5411A80587219L285584J193586l073398o226437q317785q169792p058862n326118
5403A46893997l735113m205899m046354m872086n640661p137860p075189n599764
5395A04581071m884759l574125k987421j740622k86679p65352J25968k85425L02476
5386I0485132o58096j754431l312187n586054n601154n604388n542271m837118
5378E7589433l485135k928682k858581k267600k454646k365022k133784k154582
5370C6941401k117249j573566j555336j090451j519345j769770n26048m48291
5362B6341345p56192j15257j23019n36426k99046m00675j57284m24261k71135
$$ y = [152533665, 152249110, 153401551, 156667964, 160963495, 166430557, 171852488, 176624567, 180587219, 183872803, 185066389, 181992991, 175766554, 167448769, 159278977, 152220115, 146893997, 143158884, 138952985, 134906631, 130034545, 124393884, 117256024, 110180835, 104581071, 99696312, 96122187, 93134766, 91394144, 91107465, 90342113, 90468081, 90182656, 90485132, 89827036, 88072605, 84760418, 79174364, 73573210, 67968822, 62426551, 57589433, 54104298, 51175616, 48317035, 46049435, 43594789, 41229767, 39095983, 36941401, 34824152, 33250586, 31695250, 30604799, 29085454, 27315684, 26789636, 26341345, 25585153, 25469896, 25346877, 24810451, 24511405, 24110730, 23953446, 23529185, 23258050]
5353B3258050p0643o74648Q9280q42338J10303M08654q42543m63866n46915J0295
5343B0435629m77550p58901p77008j58778l09615j5724l78463k12705p43604K41238
5333A6844519J55888N1580N9506k74920l32808n8352N939M53881m40023l40816
5323A6124394L21259P48523J79511o65923K53901k74331n65300l88679q85680
5314A4847675j024952o24434n56879L60859q31940L13093L49862p70495j150491
5305A0912298j19946L39228l14993O7594l34395J33955j22092J78665l19206m46506
5295I974602k14784K58923J28931m68949m46837J8455o1675o19607l45922j17411
5285H105726o19258m21865j75517j5311l481l3448j05538k25827k9865m21700
$$ y = [23258050, 23187407, 22512759, 22602039, 21759701, 21870004, 22278658, 21436115, 20972249, 20425334, 20435629, 19958079, 19199178, 18422170, 18263392, 17953777, 17938053, 17559590, 17346885, 16603281, 16844519, 17000407, 17051987, 17111493, 16836573, 16503765, 16445413, 16451352, 16905233, 16465210, 16124394, 16445653, 17194176, 17373687, 16707764, 16961665, 16687334, 16122034, 15733355, 14847675, 13822723, 13198289, 12641410, 13002269, 12170329, 12483422, 12833284, 12062789, 10912298, 10792352, 11131580, 10816587, 10884181, 10549786, 10683741, 10561649, 10740314, 10421108, 9974602, 9759818, 10018741, 10147672, 9678723, 9231886, 9250341, 9188666, 8569059, 8223137, 8105726, 7486468, 7064603, 6889086, 6873775, 6870294, 6836846, 6731308, 6505481, 6475616, 6053916]
5275F053916L0272l60335o14571K54910J20501L58102p46l45109n90280j0488
5265D896172L0699j19627K47142J46547l46956J74234K48266j65860K1701q4563
5255E047755k3338k1110r7766K78338m4266L55624l68832R100L72813L61215J37766
5244F007299l64822m42327m13722M55008P9120k1412M22739L65038q80919J30627
5234E336629k66433J24292P5144L84148J57776j61124j5382M96751j87548J1416
5224E955669J49218k7615k97722J80166k0658r4856k11325j29827J06855p5645
5214E534260N33361M8241m13621k1543r5180O08803l05725n18087J93906k75143
5204E289272K50715N9133l44159o66967J09857N78233O2618j46087m651m42868
$$ y = [6053916, 6084188, 5723853, 5109282, 5364192, 5484693, 5842795, 5842049, 5496940, 4906660, 4896172, 4926871, 4807244, 5054386, 5200933, 4853977, 5028211, 5276477, 5110617, 5132318, 5047755, 5024417, 5003307, 4905541, 5183879, 5139613, 5495237, 5126405, 5135505, 5508318, 5869533, 6007299, 5642477, 5200150, 4786428, 5241436, 5320556, 5299144, 5721883, 6086921, 5206002, 5336629, 5070196, 5194488, 5269632, 5653780, 5811556, 5650432, 5635050, 6131801, 5944253, 5955669, 6104887, 6077272, 5779550, 5959716, 5939058, 5844202, 5632877, 5503050, 5609905, 5534260, 6067621, 6115862, 5702241, 5680698, 5585518, 6194321, 5888596, 5370509, 5564415, 5289272, 5539987, 5599120, 5254961, 4587994, 4697851, 5276084, 5338702, 5192615, 5187964, 4745096]
5194D745096j30110K45667k62076k96279L13982j57708k38548R3643L0349J10470
5184D454486m6304j72464j73266q4273j8967J14646k02786n1844R5473n27465
5174C387236O5867j65531M14840k86230J33624k41811k43039l48289J33560m16078
5164B434149K19300L54627K41045l23280j40824J71438j82234Q20174m0000l73146
5154C181249j57328j85885o8150J23041k57574L15868K63783k00784J44233L90167
5144C548620p02764J5174J74306L29654j635j57601j56457Q28971l44454L62297
5134C896111N04205J39731l19776J36780J78308j14439J26522k44046l32476j04167
5124C866753K44149j72540j88232J47632n87045j83301N99746l81255J63581J67109
$$ y = [4745096, 4614986, 4860653, 4598577, 4302298, 4616280, 4458572, 4220024, 4313667, 4344016, 4454486, 4408182, 4235718, 4062452, 3978179, 3959212, 4073858, 3871072, 3819228, 3914701, 3387236, 3453103, 3287572, 3702412, 3416182, 3549806, 3307995, 3064956, 2716667, 2850227, 2434149, 2653449, 3008076, 3249121, 2925841, 2785017, 2956455, 2774221, 3594395, 3554395, 3181249, 3023921, 2838036, 2769886, 2892927, 2635353, 2951221, 3215004, 3014220, 3158453, 3548620, 2845856, 2861030, 3035336, 3364990, 3363355, 3205754, 3049297, 3878268, 3533814, 3896111, 4400316, 4540047, 4220271, 4357051, 4535359, 4420920, 4547442, 4303396, 3970920, 3866753, 4110902, 3938362, 3750130, 3897762, 3310717, 3127416, 3727162, 3345907, 3509488, 3676597]
5114C676597O188J61105J71328p96678L66228K26935j78477k48217j8882l00587
5104C065540j2298N7044J43435J57727N10208m9807l20138J51369j93990o094
5094C502996j096K04122Q3021j08076k21046J10382L50927K28580K90861M96588
5084D937259j90582j52872m39512k1884j5648k76644r3481j70296L71972Q1952
5074D030264l65565n9043n845O9250Q4366M06577O9630q0517J34249L99119M08446
5063E090931j00066L02387J71898J84279K8513L5024j55770l58781K77698m44552
5053E031561l33347m742l25434L78914R1481K49499m85338j65656m06758K73601
5043D303781L63277l2910L34653J15726K66211j4223M15274K55139k78091M22643
$$ y = [3676597, 3682785, 3843890, 4015218, 3218540, 3584768, 3811703, 3633226, 3385009, 3366127, 3065540, 3053242, 3110286, 3253721, 3411448, 3921656, 3871849, 3551711, 3703080, 3509090, 3502996, 3501900, 3706022, 3789043, 3680967, 3459921, 3570303, 3921230, 4149810, 4440671, 4937259, 4746677, 4593805, 4154293, 4132409, 4116761, 3840117, 3746636, 3576340, 3948312, 4030264, 3664699, 3605656, 3599811, 3669061, 3753427, 4160004, 4229634, 4149117, 4283366, 4682485, 5090931, 4990865, 5293252, 5465150, 5649429, 5677942, 5712966, 5557196, 5198415, 5476113, 5031561, 4698214, 4693472, 4368038, 4746952, 4838433, 5087932, 4602594, 4436938, 4030180, 4303781, 4667058, 4634148, 4968801, 5084527, 5350738, 5336515, 5751789, 6006928, 5728837, 6151480]
5033F151480j59927p2499J04461n35929j20018K79673k11187O5170j1270m41625
5023E048329j14823M35093j01538P8023m179l26514j91577J28996K7773l8908
5013D940675O2609n14223L90011K93029l78505r6460L26885J4699K8793m2220
5003E025293J91757j7962M0503J10313j76258K76756K85731P315J36352k69080
4993E610720n6242k6427m03356K255L413j98050m40557R7597M03170q8373N78699
4982E482849r9074J05706k94985j62990K61525N98157k82844m91759j88512N43865
4972E471938L0337l61839k04430K11073l93927L48451L00303L61702K23640k89935
4962E697313J66021k56321K37942J25466j06333o6653N8019M67124k05526k44540
$$ y = [6151480, 5991553, 5919054, 6023515, 5487586, 5367568, 5647241, 5436054, 5501224, 5489954, 5048329, 4933506, 5368599, 5267061, 5345084, 5340905, 5014391, 4822814, 4951810, 4979583, 4940675, 5003284, 4489061, 4879072, 5172101, 4793596, 4697136, 5024021, 5038720, 5067513, 5025293, 5217050, 5199088, 5239591, 5349904, 5173646, 5450402, 5736133, 5743448, 5879800, 5610720, 5554478, 5528051, 5124695, 5126950, 5130363, 4932313, 4491756, 4589353, 4992523, 4904150, 5482849, 5383775, 5489481, 5194496, 5031506, 5293031, 5891188, 5608344, 5116585, 4928073, 5471938, 5502275, 5140436, 4936006, 5147079, 4753152, 5101603, 5401906, 5763608, 5987248, 5697313, 5863334, 5607013, 5844955, 5970421, 5864088, 5797435, 5855454, 6322578, 6117052, 5872512]
4952E872512K36173M22474J71811K08831o5550k89205J37048P01722K16093j12983
4942G498926P05173k76182L80839N88021j4405j58385Q27204L31960L1358L2374
4932I946883O9526Q99282Q41925M758R0814l9291L2280O55995L50268N5221L15050
4921A3222711N34970q482o1787j47166K31714R93234J07038O09866K24302K79988
4911A5986388L11200Q42655P35524O15160P41335O79531O28308M0566l984M96260
4901B1072943M85173K69041Q97234Q98443N50769Q23574J097512J084268Q92079
4892B8071036J132688P69824J107420J275860J026063J541304J526858J653713
4884C8104766K380000K722911J917455K588740K705541K024997J839711K246503
$$ y = [5872512, 6108685, 6531159, 6702970, 6911801, 6846251, 6557046, 6694094, 7395816, 7611909, 7498926, 8204099, 7927917, 8308756, 8896777, 8882372, 8723987, 9551191, 9883151, 9914509, 9946883, 10016409, 10915691, 11757616, 11762374, 11853188, 11813897, 11846177, 12502172, 12852440, 12907661, 13222711, 13757681, 13749199, 13687412, 13540246, 13771960, 14765194, 14872232, 15482098, 15706400, 15986388, 16297588, 17140243, 17875767, 18490927, 19232262, 19911793, 20540101, 20580667, 20576683, 21072943, 21558116, 21827157, 22724391, 23622834, 24173603, 24997177, 26094689, 27178957, 28071036, 29203724, 29973548, 31080968, 32356828, 33382891, 34924195, 36451053, 38104766, 40484766, 43207677, 45125132, 47713872, 50419413, 52444410, 54284121, 56530624]
4876E6530624K718789K608328M105685M911955N387664O745591Q160028R744878
4868A00913542J0980838J1903458J4465584J7051249K0375749K4323364K5790176
4861B25803960K7067661K7533067J8516822P682964O71785j1628530k3441336
4854B72206393k8768145l1506172l0619533k6637667k2358226j8127827j3217587
4847A00971236j0313818q710503p114066n887343n217266m887806m860013m538193
4839D9442228l477510l036868k419866j659643j864530k325561j434218j653011
4831C1571021o56555j258897q15395j168711j615664p72093p51356p60387r99739
4822B2772224j013528q25296m90483q95549r60859o84545p83129m81313l67007
$$ y = [56530624, 59249413, 61857741, 65963426, 70875381, 76263045, 83008636, 91168664, 100913542, 111894380, 123797838, 138263422, 155314671, 175690420, 200013784, 225803960, 252871621, 280404688, 298921510, 306604474, 307276259, 295647729, 272206393, 243438248, 211932076, 181312543, 154674876, 132316650, 114188823, 100971236, 90657418, 81946915, 74832849, 68945506, 63728240, 58840434, 53980421, 49442228, 45964718, 42927850, 40507984, 38848341, 36983811, 34658250, 33224032, 31571021, 30914466, 29655569, 28840174, 27671463, 26055799, 25283706, 24532350, 23771963, 22772224, 21758696, 20933400, 20442917, 19547368, 18586509, 17901964, 17118835, 16637522, 16270515]
4813A6270515m00294p62208o99029l21685k83318m96009j25287m24679l27364
4804A2430642k05283l46602j16022l67377l41488J319n99810l73687j94875k25617
4794I661200j83574m07333l98704Q7089K08764k3346n20605l42495K57550r2796
4784H245750j81358k72043l35577k08105k24103J13497J76401m42449j82900l61904
4774F327209J49365j75838Q4745n16012o5429j55929m30769J64626k52893j9378
4764E109697l7162j98986j5451k45175l17997J56643l14790M41474l90251J09118
4754D297120r9172k82921r065m22577K65499k17203J8089j7374K70461J84311
4744C987168j47306L75577l26326l456r357j07189l07742n94480k52608J06821
$$ y = [16270515, 15870221, 15108013, 14408984, 14087299, 13803981, 13307972, 13182685, 12758006, 12430642, 12225359, 11878757, 11762735, 11395358, 11053870, 11055189, 10455379, 10081692, 9886817, 9661200, 9477626, 9070293, 8671589, 8758678, 8967442, 8944096, 8423491, 8080996, 8338546, 8245750, 8064392, 7792349, 7456772, 7248667, 7024564, 7138061, 7314462, 6872013, 6689113, 6327209, 6476574, 6300736, 6385481, 5869469, 5804040, 5648111, 5217342, 5381968, 5129075, 5109697, 5072535, 4873549, 4858098, 4612923, 4294926, 4451569, 4136779, 4578253, 4188002, 4297120, 4197948, 3915027, 3905962, 3483385, 3748884, 3531681, 3549770, 3532396, 3802857, 3987168, 3839862, 4215439, 3889113, 3885657, 3876300, 3769111, 3461369, 2866889, 2614281, 2721102]
4734B721102L71390M42298k23053n70234j64885j79951L1907J34549J56582q1578
4724B638127k75339m04086k0209O6029J29241k3189P96650k3528j20339l55962
4714B407395l8678J26367o6669k58174L69500m16252o4307M4460O7646K20202
4704B391490p2973j12272j31558j54120m26725Q0288j32908O10739o6490m67669
4694A517802L45074J19483j02855k32997j37518K02011j89961L55834J3687k19300
4684A671260j22264k14309k00007K69064K21137l37338k8591M49315J29277k04049
4674A633495m66774K93574K0009Q7925m37448J95322K98015k50160J53443Q1589
4664A608990n7083k99318k62073K30959K18472M4809Q0994J25967k31408j42757
$$ y = [2721102, 3092492, 3534790, 3311737, 2741503, 2576618, 2396667, 2428574, 2563123, 2719705, 2638127, 2362788, 1958702, 1938493, 2004522, 2133763, 2110574, 2907224, 2883696, 2763357, 2407395, 2368717, 2495084, 2428415, 2170241, 2539741, 2123489, 2059182, 2103642, 2171288, 2391490, 2318517, 2206245, 2074687, 1920567, 1493842, 1574130, 1441222, 2051961, 1985471, 1517802, 1862876, 1982359, 1879504, 1646507, 1508989, 1711000, 1521039, 1876873, 1890560, 1671260, 1548996, 1334687, 1134680, 1403744, 1624881, 1287543, 1258952, 1708267, 1837544, 1633495, 1166721, 1460295, 1480304, 1568229, 1130781, 1326103, 1624118, 1373958, 1527401, 1608990, 1551907, 1252589, 990516, 1221475, 1439947, 1484756, 1565750, 1691717, 1460309, 1317552]
4654A317552j37497j00365M10030L89144J72111J4976L20956L51311o16097k38454
4644A883667r8618o07097M44712j99354k45975o3623K08514J56193K50209L44800
4634B073428j9003m43135J96813k56751j96726K9947J91895m21592k23932J54355
4624A085299n288J45417l58555L24716r9486J27375m03678J22610n8052l52961
4614E27397O1552j27872k964J75054J34576J99630J44289j78613m5739k15034
4604F72276L56497k63480j34740J04550L23458J46543l95286L21746o193j18837
4594A006534L96256O417j4205j95633K87419M74520M6913M8146L51255P8822j97895
4583B288549j96555m02389J93105k35198j65440n1299l0297N4601j65367j84053
$$ y = [1317552, 1180055, 1079690, 1489720, 1878864, 2050975, 2065951, 2386907, 2738218, 2122121, 1883667, 1785049, 1177952, 1622664, 1423310, 1177335, 1113712, 1322226, 1478419, 1728628, 2073428, 2054425, 1611290, 1808103, 1551352, 1354626, 1384573, 1576468, 1154876, 930944, 1085299, 1080011, 1225428, 866873, 1191589, 1092103, 1219478, 815800, 938410, 880358, 527397, 588949, 461077, 458113, 633167, 767743, 967373, 1111662, 933049, 887310, 672276, 1028773, 765293, 630553, 735103, 1058561, 1205104, 809818, 1131564, 1125371, 1006534, 1402790, 1409207, 1395002, 1199369, 1486788, 1961308, 2008221, 2056367, 2407622, 2486444, 2288549, 2091994, 1689605, 1882710, 1647512, 1482072, 1430773, 1400476, 1455077, 1289710, 1105657]
4573A105657r2407k33584L32633k70209k79060N39561l16072j86351m4452J98270
4563G53986J8948k10291N20612j34758k12143K58868k53438m30508M53923K55122
4553A020321o36351j29977P4315L34269L15990l74671k83293M3740K28194M1928
4543F34465l56155K16321p9458l82842P2944K87813N200q8311l6209m12650J52338
4532A3456j90849K12083Q2237r4233m1237K26548R9241K01246m68542m30654M06589
4521A5885q0324L44565J19513j95921M3032K0170l07459N52305R4631J04466l84239
4510C26624N9308j81355k00849M37269m55k22374J61105o108k10847K62578n42114
4499a17218p3635m1149J82352M16855O9858j69355k47889J72812o2311K55626
$$ y = [1105657, 1013250, 779666, 1112299, 842090, 563030, 1102591, 786519, 600168, 555716, 753986, 772934, 562643, 1083255, 948497, 736354, 995222, 741784, 311276, 765199, 1020321, 383970, 253993, 328308, 662577, 978567, 603896, 320603, 364343, 592537, 634465, 278310, 494631, 415173, 32331, 105275, 393088, 398288, 309977, 273768, -138882, 13456, -177393, 34690, 116927, 22694, -18543, 208005, 307246, 508492, 39950, -390704, 15885, -64439, 280126, 399639, 203718, 246750, 266920, -40539, 511766, 606397, 710863, 326624, 385932, 204577, 3728, 440997, 440542, 218168, 379273, 373165, 162318, 424896, -117218, -190853, -232002, -49650, 367205, 437063, 267708, 19819, 192631, 130320, 385946]
4489C85946j16727N671M3398j68283j35185r9066J33471N30374m5884j29783L89008
4478G92940l15755J77483J09J96608q0608l3787l10098N5880k45018m74004n8303
4467b94553M85701q4084K75685J97465j02548o2785K57997J65279j24897k01557
4457E11703K94985Q4259j02017k67309k0797P27425j23104l95200m57909O78471
4447I30507l18789j27998N5127j93284J20497O29589l27238r3970R2305j40140
4437F26606k61246J00913j66403k0045j80965K37155J71013r2507n5328l13958
4427D5235L56128j49828j86072J65200M8165L23849k81661r9060k355N31005m2294
4416G08312k21421k21899j13848J20324R9400q9337l26731M71977J64753M3914
$$ y = [385946, 269219, 274890, 318288, 150005, 14820, -84246, 49225, 579599, 533715, 403932, 792940, 477185, 654668, 654777, 851385, 770777, 736990, 426892, 482772, 237754, -236250, -294553, 191148, 107064, 382749, 580214, 477666, 414881, 672878, 838157, 713260, 511703, 806688, 890947, 788930, 521621, 500824, 1228249, 1105145, 709945, 252036, 930507, 611718, 483720, 538847, 345563, 466060, 1095649, 768411, 674441, 766746, 626606, 365360, 466273, 299870, 279825, 98860, 336015, 507028, 414521, 359193, 45235, 401363, 251535, 65463, 230663, 278828, 602677, 321016, 221956, 219601, 750606, 708312, 486891, 264992, 151144, 271468, 370868, 281531, -45200, 426777, 591530, 635444]
4406F35444k56670L67998m2540k07708N3539N57477n98777q0543M37482n1988
4396H13714j01575n6935l01854L03508k09421R5273K11444k66213L515J80703
4386F72159j69195p1973j6693k78250M06639M27543J61971j94303j78907j11597
4376F47394m4478N09964k59287k43746K88355L09560k34279m32164L42772J63868
4366A047959j44372J56966k38587Q2946O68302l66038k26440p63653M10034k76763
4356C50354k51102L89517J10672L26489L02458Q9513m35544P3432j11668j56971
4346F87150M16482M5069m55365O33520j2235l08559j42116J45654j57068K75804
4336A128336l43162M8209L10345P5960j5283k52576M27025N9387l19300o06827
$$ y = [635444, 378774, 746772, 704232, 496524, 550063, 1107540, 508763, 428220, 865702, 813714, 712139, 655204, 353350, 656858, 447437, 542710, 754154, 487941, 491456, 672159, 502964, 430991, 414298, 136048, 542687, 970230, 1132201, 937898, 758991, 647394, 602916, 1112880, 853593, 609847, 898202, 1207762, 973483, 541319, 884091, 1047959, 903587, 1060553, 821966, 904912, 1573214, 1207176, 980736, 217083, 627117, 350354, 99252, 488769, 599441, 925930, 1228388, 1317901, 882357, 955789, 844121, 687150, 1103632, 1148701, 693336, 1326856, 1314621, 1006062, 863946, 1009600, 852532, 1128336, 785174, 833383, 1143728, 1219688, 1204405, 951829, 1378854, 1438241, 1118941, 512114]
4326E12114L82082J02290J79441j104P3114j4552n27893M85324K49995m69135
4316I71676k02487j43760j40209M5452J71648J84733K19689Q8598l413j09084
4306A082843J3218O46424K81029m76965k81626k69738L41207J55737K74095m6009
4296A720215R6493J87209r1206p1831m7876l26703N32470O06289n28063O3038
4286B140035J85651l44347J12656K45600Q1138m1159j0496O5988J26508K05124
4276B766698j14937j58818k13073r8788j32379M37672N53662k08197k0105m6875
4266B764860K98488K14467L08299j7297k32220J18569O01360K83239l79310L08353
4256D268808K21593M00722L70800m1713l07895k46543J9681k31816Q9717l46336
$$ y = [512114, 894196, 996486, 1175927, 1174823, 1247937, 1233385, 705492, 1190816, 1440811, 971676, 769189, 625429, 485220, 530672, 702320, 887053, 1106742, 1195340, 1191927, 1082843, 1096061, 1742485, 2023514, 1546549, 1264923, 995185, 1336392, 1492129, 1766224, 1720215, 1816708, 2003917, 1912711, 1840880, 1793004, 1466301, 1998771, 2605060, 2076997, 2140035, 2325686, 1981339, 2093995, 2339595, 2420733, 2379574, 2369078, 2435066, 2561574, 2766698, 2651761, 2492943, 2279870, 2181082, 2048703, 2486375, 3040037, 2831840, 2811735, 2764860, 3063348, 3277815, 3586114, 3568817, 3336597, 3455166, 4056526, 4339765, 3960455, 4268808, 4490401, 4891123, 5261923, 5220210, 4912315, 4665772, 4685453, 4453637, 4543354, 4197018]
4246D197018K27844L44375R855j60103j7996L03649m16420p7072J4318K62231
4236D687699L83904K11114K23734m41587J09156Q13311P764m2996O83935L3481
4226F669515r1988L27717j69148O51484J62117N94375N15016N26222M73539K76517
4216I935366R26034O73337P31652J250247P90196Q52803R59909J891795K359225
4207B0370564L002259K548424K878667L500161M056301N888542P312074Q161313
4199E7718305P064874L453475k360108o592499r353033r304499o856114n101836
4191B8668565l647172k527811j357020j927566j020043j040454j203388j11247
4183A5833864l92883j103350j052930l85626m17018o15852l47621m8562m61515
$$ y = [4197018, 4424862, 4769237, 4779092, 4618989, 4600993, 4904642, 4488222, 4411150, 4425468, 4687699, 5071603, 5282717, 5506451, 5064864, 5174020, 5987331, 5995095, 5952099, 6636034, 6669515, 6577527, 6905244, 6736096, 7387580, 7549697, 8144072, 8659088, 9185310, 9658849, 9935366, 10861400, 11534737, 12266389, 13516636, 14306832, 15159635, 16119544, 18011339, 20370564, 23372823, 25921247, 28799914, 32300075, 36356376, 42244918, 49556992, 57718305, 64783179, 68236654, 65876546, 59284047, 49931014, 40626515, 33770401, 28668565, 25021393, 22493582, 21136562, 19208996, 18188953, 17148499, 15945111, 15833864, 15440981, 14337631, 13284701, 12899075, 12482057, 11866205, 11518584, 11470022, 11008507]
4174A1008507k81732l72811k37198p9862l80492l8054j44737l15299J50581m89180
4164H819723j70453M31361m87236l02626m6823n73348J31816j18873K97477K41350
4154H222368n41410P6000j75610L83472k2349k51429M50649P0288n17284j3655
4144G681040L63210m2308L8210m1612O66917J0355n23967l07954J5486J06439
4134G965816K25879m32254K57510L97479k65692j15406J32351K47359M57817R4952
4124H965811l62784n108N93296l1394j23483J29436O4842J42607K84078N5287
4114I712588M02590J30007N01723L08897L65275O07151k66883j3872J41909K89782
4104A2179167O01j68563k52470k85262O0084J15492L65112K78667k97874K60777
$$ y = [11008507, 10726775, 10353964, 10116766, 10036904, 9656412, 9618358, 9473621, 9158322, 9308903, 8819723, 8649270, 9080631, 8593395, 8290769, 8243946, 7670598, 7802414, 7683541, 7981018, 8222368, 7680958, 7756958, 7581348, 7964820, 7942471, 7691042, 8141691, 8211979, 7694695, 7681040, 8044250, 8001942, 8040152, 7998540, 8665457, 8675812, 8151845, 7843891, 7859377, 7965816, 8191695, 7759441, 8016951, 8414430, 8148738, 8033332, 8165683, 8413042, 8870859, 8965811, 8603027, 8597919, 9191215, 9159821, 9036338, 9165774, 9230616, 9373223, 9657301, 9712588, 10115178, 10245185, 10746908, 11055805, 11421080, 12028231, 11761348, 11747476, 11889385, 12179167, 12179768, 12011205, 11758735, 11473473, 11533557, 11649049, 12014161, 12292828, 11994954, 12255731]
4094A2255731L8061L32119j6954J36332J98054M46447K6465M62646L61222O10015
4084A4850138R08135n39567K59262j28045L41563J85009J49421Q09322L12739
4075A7147977K19961M89646O76945O88734N18409L62593N10370O31482N97285
4066B1843402Q38760Q04862J53953P50298J175384O44840J022344Q41809O34812
4057B8710464J213629J009495J189534J056395Q98641Q79982K85005Q74662Q23559
4048C6941366Q56079P46801O37849Q61985J284630J969659J820759K551957L514900
4039E1185985L602933L840618L688711M615208N755439P345128Q620157P775543
4031I6429722L565240k664490o954859q637479p545452n407925l928055k153149
$$ y = [12255731, 12293792, 12625911, 12608957, 12745289, 12943343, 13389790, 13416255, 13878901, 14240123, 14850138, 15758273, 15218706, 15477968, 15349923, 15691486, 15876495, 16025916, 16835238, 17147977, 17367938, 17857584, 18534529, 19223263, 19741672, 20104265, 20614635, 21246117, 21843402, 22682162, 23487024, 23640977, 24391275, 25566659, 26211499, 27233843, 28075652, 28710464, 29924093, 30933588, 32123122, 33179517, 34078158, 34958140, 35243145, 36117807, 36941366, 37797445, 38544246, 39182095, 40044080, 41328710, 43298369, 45119128, 47671085, 51185985, 54788918, 58629536, 62318247, 66933455, 72688894, 80034022, 88654179, 96429722, 99994962, 97330472, 90375613, 81738134, 74192682, 68784757, 64856702, 62703553]
4023F2703553j129738k19768K6934J51281K88349N79438P99758J563492J961643
4014F6724942J989861K224821K792607L619908K959230M065800M601120N639842
4006I4618131P117402Q123894R079120J0949155J2612005J5304536J8007802K0399709
3998A96211754K3333011K9003631L5286247M5112261N3270579M1370772L283896
3991D26872151l2852872n2006571n2970272m0502790k8178817j7987734j0981218
3984A91391877o393977m366323n442799q761425j2272358j4117370j3329810j1557443
3976A15150372r551624o881760n832903n032881l762354k982999k700415k061807
3968G6343629j625819j613399k012230j148414q79293r14676K95396k54037p68562
$$ y = [62703553, 61573815, 61354047, 61380981, 61532262, 61820611, 62400049, 63199807, 64763299, 66724942, 68714803, 70939624, 73732231, 77352139, 80311369, 84377169, 88978289, 94618131, 101735533, 109859427, 118938547, 129887702, 142499707, 157804243, 175812045, 196211754, 219544765, 248548396, 283834643, 328946904, 382217483, 423588255, 426872151, 394019279, 342012708, 289042436, 248539646, 220360829, 202373095, 191391877, 184997900, 180631577, 175188778, 166427353, 154154995, 140037625, 126707815, 115150372, 105598748, 98716988, 92884085, 87851204, 84088850, 81105851, 78405436, 76343629, 74717810, 73104411, 71092181, 69943767, 69064474, 68149798, 68445194, 68191157, 67422595]
3959F7422595k14135K68512l0135K24637R03878J041393J053361K045641J844097
3950G4559844J993118J833629K052714K389797K307300J929802K335537K714425
3942I2116166K766726L716285L962427M994252N375206O541144P615010Q488621
3934A35575837J0786841J2303272J4694331J7190118J9568675K3295078K8484911
3927B61899063L5964454M5241942M9122293L8721211J6704378o302176j6835837
3920D24515328j2932519p85051Q487875J891212j7597406l8401793m7840499m5700745
3912B71636402l6645013k7576212k0747876j6110883j2891861j0516820q518926
3905A38628811o569285m856707m841875m717386n204617n039918m261891l383308
$$ y = [67422595, 67208460, 67476972, 67446837, 67671474, 68575352, 69616745, 70670106, 72715747, 74559844, 76552962, 78386591, 80439305, 82829102, 85136402, 87066204, 89401741, 92116166, 94882892, 98599177, 102561604, 107555856, 112931062, 119472206, 127087216, 135575837, 146362678, 158665950, 173360281, 190550399, 210119074, 233414152, 261899063, 297863517, 343105459, 392227752, 430948963, 447653341, 441351165, 424515328, 411582809, 410797758, 419285633, 421176845, 403579439, 365177646, 317337147, 271636402, 234991389, 207415177, 186667301, 170556418, 157664557, 147147737, 138628811, 132059526, 127202819, 122360944, 117643558, 112438941, 107399023, 103137132, 99753824]
3897I9753824k195337j461692o02833m79133K7990L8258l53090j71691j176840
3888I3379456j510417j499982j656842j440106j248229j435291j98275p59685
3880H3630629n33164l49083o802P95228J011190K052061J907642K353423K779919
3871I3641043L269112L285905L355750M384431L723304K422848K046700J789433
3863A17918526K514464M040391N676704P039906R220118J0843301J2671353J5928278
3855A85853041J8870776K2757104K7688095L2968362M1240975M8148950M5154183
3848D22681486L9418654L4253337J1514980j6446833l3258277m7532901n3185050
3841C57445396n0957240m5363127l6371769k5881135j9253798j5189476j1792741
$$ y = [99753824, 97558487, 96096795, 95493962, 95014829, 95042819, 95081077, 94727987, 94556296, 93379456, 91869039, 90369057, 88712215, 87272109, 86023880, 84588589, 84390314, 83630629, 83097465, 82748382, 82741580, 83536808, 84547998, 86600059, 88507701, 90861124, 93641043, 96910155, 100196060, 103551810, 107936241, 111659545, 114082393, 116129093, 117918526, 120432990, 124473381, 130150085, 137189991, 146410109, 157253410, 169924763, 185853041, 204723817, 227480921, 255169016, 288137378, 329378353, 377527303, 422681486, 462100140, 496353477, 507868457, 491421624, 458163347, 410630446, 357445396, 306488156, 261125029, 224753260, 198872125, 179618327, 164428851, 152636110]
3834A52636110r417850q066567p250593o102128o244391n624092m357295k712720
3826A02860474k921551k576875j465606j323065j199737j411376n06204p57775
3818I0698285o34402o13107l09151N99412J99136M67436P51807J453338O58052
3809I3270806Q02607J450167J822265J691225K412634J733552K769697K751009
3801A08703962L374277M371111N362687N759999P693575R314806J1214308J2745093
3793A68539818J4697510J6549417K0908289K6613279L4556942M7069845M5951000
3786C74886100R092518k8595900m6362537n0655323l7816784k6152876j7897785
3779A76497413j2842938r233653p201662m830011m053565k860473j130469o86192
$$ y = [152636110, 143218260, 135151693, 127901100, 121798972, 115554581, 109930489, 105573194, 102860474, 99938923, 97362048, 95896442, 94573377, 93373640, 91962264, 91456060, 90698285, 90063883, 89450776, 89141625, 89741037, 89940173, 90407609, 91159416, 92612754, 93270806, 94073413, 95523580, 97345845, 99037070, 101449704, 103183256, 105952953, 108703962, 112078239, 116449350, 121812037, 127572036, 135265611, 144580417, 155794725, 168539818, 183237328, 199786745, 220695034, 247308313, 281865255, 328935100, 374886100, 383978618, 355382718, 309020181, 258364858, 220548074, 194395198, 176497413, 163654475, 154420822, 147219160, 142389149, 138335584, 135475111, 134344642, 133658450]
3771A33658450o62583p98984L45210K37054l0064N20624J751451K147812K409290
3762A39578260M345584N853691N388068M859652K928357J496812o90791o90274
3754A63069359j197366k79435J096194K258706L871136M173286N121768O282023
3746A84395671P150886P641066R694502J0273330J2402051J5170833J9864476
3739B66592815K7049448L6814546M1730770K4826108q260737l1097518m2414398
3732C15241034l9628217l1141179k3949707j8505234j4917802j2012827r725993
3725A65360075p872069o170946n142005m043782l404667n003869n742349n268059
3717A22712329m385225l192935k733830k228666j658861j924316j562832j334221
$$ y = [133658450, 132995867, 132196883, 132542093, 132779147, 132749083, 133269707, 135021158, 137168970, 139578260, 143923844, 149777535, 155165603, 160025255, 162953612, 164450424, 163759633, 163069359, 161871993, 161592558, 162688752, 164947458, 168818594, 172991880, 178113648, 184395671, 191546557, 199187623, 208882125, 219155455, 231557506, 246728339, 266592815, 293642263, 330456809, 372187579, 397013687, 388752950, 357655432, 315241034, 275612817, 244471638, 220521931, 202016697, 187098895, 175086068, 165360075, 157488006, 151317060, 146175055, 142131273, 138726606, 133722737, 127980388, 122712329, 118327104, 115134169, 112400339, 110171673, 108512812, 106588496, 105025664, 103691443]
3709A03691443j432087j361195n95346l30950K47759J626078L38025J091284J717413
3700A04992424K129074K918523L385696L712893K028619L85651j837000k998038
3692A14717842j717511j893660j467094j018364o11179N85111M27712M5534O93883
3683A09762274L75234O01041o35880q63572p78575q75729J58802j08932J62096
3674A07796759l262k67893Q36109J232860Q01180P89926J165745J941291J721180
3665A16013895K625758L592355L452643K925040P42290o91727j619448k403182
3657A24637624j961902j078852n87668p09807l39692j310212o76715k81006j36396
3648A17555374p1921m21013m65206M04631M48405J092134O37305Q82152J055551
$$ y = [103691443, 102259356, 100898161, 100302815, 99971865, 100219624, 101845702, 102183727, 103275011, 104992424, 107121498, 110040021, 113425717, 117138610, 119167229, 119552880, 117715880, 114717842, 113000331, 111106671, 109639577, 108621213, 108010034, 108595145, 109022857, 109068391, 109762274, 110137508, 110738549, 110102669, 109239097, 108460522, 107584793, 107743595, 107634663, 107796759, 107793497, 107525604, 108361713, 109594573, 110395753, 111185679, 112351424, 114292715, 116013895, 118639653, 122232008, 125684651, 128609691, 129351981, 128660254, 127040806, 124637624, 122675722, 121596870, 121009202, 120299395, 119959703, 118649491, 117972776, 117691770, 117555374, 117483453, 117062440, 116597234, 117001865, 117450270, 118542404, 119179709, 120061861, 121117412]
3639A21117412M02337K88367J68951n62115m08574j01522K13313J37894J005252
3630A22261315m481n56748n63766l18928m35591p33065k0716O20669Q22358P86981
3620A21858028Q23545J036388J643134R68536R78886J70176O45779Q34422P27369
3611A29686263P67129K034741K565266K129716J583548N91462o49044j276482
3603A37432599r51158p51459J0701q5097k23669o4623l58823K94410J91709O03216
3593A36097806J657315J965404K811230K782896K858449J328206N81363L87070
3585A50469739N52427J151251J264136L120175M419614L853746L480333K613214
3577A70924635J110338K30492o77357j131330j078831j850609k666029l434587
$$ y = [121117412, 121519749, 121808116, 121977067, 121414952, 121006378, 120904856, 121118169, 121256063, 122261315, 122256834, 121700086, 121136320, 120817392, 120381801, 119648736, 119628020, 120248689, 121071047, 121858028, 122681573, 123717961, 125361095, 126329631, 127308517, 127478693, 128124472, 128958894, 129686263, 130453392, 132488133, 135053399, 137183115, 138766663, 139358125, 138709081, 137432599, 136481441, 135729982, 135740683, 135655586, 135431917, 135367294, 135008471, 135302881, 135494590, 136097806, 137755121, 139720525, 142531755, 145314651, 148173100, 149501306, 150082669, 150469739, 151022166, 152173417, 153437553, 156557728, 160977342, 164831088, 168311421, 170924635, 172034973, 172265465, 171588108, 170456778, 169377947, 167527338, 164861309, 161426722]
3569A61426722l911229l830168l414834k865292k510222k976480k257682k896738
3561A36764077k695763j896798j524893j143589m26316j819410j857357j394894
3553A24005057r35571j54338j436717j846042j750041j606160k181838j863948
3545A12230402k593833k381080k609819k748337k827933l002833l167204l138195
3537H9761168k664758j635020p89068K21772l14664M17324N54281j86475j362394
3528H4002166q91573q08432k79634k78960q98930l71306o77320r56158j238290
3519G7601563j767781j989959r55608n55772j096791j615614j268428j323061
3511F7028549q18626n95877L68931R97317J160323J006035j51071j267254j889062
$$ y = [161426722, 157515493, 153685325, 150270491, 147405199, 144894977, 141918497, 139660815, 136764077, 134068314, 132171516, 130646623, 129503034, 129076718, 127257308, 125399951, 124005057, 123069486, 122915148, 121478431, 119632389, 117882348, 116276188, 114094350, 112230402, 109636569, 107255489, 104645670, 101897333, 99069400, 96066567, 92899363, 89761168, 87096410, 85461390, 84672322, 84894094, 84579430, 84996754, 85551035, 85364560, 84002166, 83110593, 82302161, 82022527, 81743567, 80844637, 80473331, 79796011, 78839853, 77601563, 75833782, 73843823, 72888215, 72332443, 71235652, 69620038, 68351610, 67028549, 66209923, 65614046, 65982977, 66980294, 68140617, 69146652, 68995581, 67728327, 65839265]
3502F5839265k461282k400860j776170j201678r36451q96220k39410J37928o95259
3493E5369863j019973o99225r08285m16112m36312p72506p91376o63333q42783
3484D8819958r13452L75891l39430o19499p05014j002517l53879o43541n49615
3475D4068902m79921m71760r9779P0318N37128J29662N8420K60410n3023j98310
3465D3822047p26850l37511k7355q5886k4039J55203K36323N04967O9380j96839
3455D3389440j12874J31043l2944l3688K4094M30650M54180P35693O88513J216909
3445D6891016P78855Q03425N94996k0124j107203q05251j932148j886558o67808
3436D2649200p59973j139133j25417m79867l53759k25994r91028j77057q65784
$$ y = [65839265, 63377983, 60977123, 59200953, 57999275, 57062824, 56166604, 55927194, 56065122, 55369863, 54349890, 53650665, 52742380, 52326268, 51889956, 51117450, 50326074, 49662741, 48819958, 47906506, 48282397, 47942967, 47323468, 46618454, 45615937, 45262058, 44618517, 44068902, 43588981, 43117221, 43017442, 43087760, 43624888, 43754550, 43812970, 44073380, 44020357, 43822047, 43095197, 42757686, 42730331, 42644445, 42620406, 42775609, 43011932, 43516899, 43586279, 43389440, 43276566, 43407609, 43374665, 43340977, 43365071, 43795721, 44249901, 44985594, 45674107, 46891016, 47669871, 48473296, 49068292, 49048168, 47940965, 47135714, 45203566, 43317008, 42649200, 41889227, 40750094, 40624677, 40144810, 39791051, 39565057, 38574029, 38396972, 37531188]
3427C7531188k15082J42506n05951J6679k47703n28679l7729m39967L7238o70967
3417C5081533m44986k39681K4475q05864K13397k88787l30507j91678j02697p33108
3407C2182097j54441j50442n19623k78324K1277p58562l37124k25026j77526j5938
3397B9586368j314667n10489m71639j34562j57748l39702m49442o02193k08868
3388B5397058o7738n67022n35203K53054j89987p47523l34105l6799n13925l91610
3378B2266200l90717k01299M11114n30951p27298J76915M5132p25486j89058m98277
3368A9636275m62727K17489k51165J51915j2685k31264k96489J60284l61959m44730
3358A8104944l05935l67268M57247j7107n06359l3361n62227k55088k66892l62296
$$ y = [37531188, 37316106, 37458612, 36952661, 36969340, 36721637, 36192958, 36155229, 35715262, 35752500, 35081533, 34636547, 34396866, 34421341, 33615477, 33828874, 33540087, 33209580, 33017902, 32915205, 32182097, 32027656, 31877214, 31357591, 31079267, 31100544, 30341982, 30004858, 29779832, 29602306, 29586368, 28271701, 27761212, 27289573, 27155011, 26997263, 26657561, 26208119, 25605926, 25397058, 25329320, 24762298, 24227095, 24480149, 24290162, 23542639, 23208534, 23171735, 22657810, 22266200, 21875483, 21674184, 22085298, 21554347, 20827049, 21003964, 21049096, 20323610, 20134552, 19636275, 19173548, 19391037, 19139872, 19291787, 19279102, 19047838, 18751349, 18911633, 18549674, 18104944, 17799009, 17431741, 17888988, 17871881, 17365522, 17332161, 16769934, 16514846, 16247954, 15885658]
3348A5885658J59259k69260j18278k66243k03166j34059j35219k42234m94369
3339A4182089j23246l67589l08858M82943k57484J26635j51292k68883k15065
3330A3099250n2427J30233l66648j00351N26375n06715j12916m33746J16577l17696
3320A1981936k57599N6241j40997l76852J81249j08138m33088n6877k45218k30122
3310A0370535L09333m0059J10012k46558j79782L49298p09197L73370J62626k7267
3300A0472311l73399Q2115L6290k58215n59990O22016N9088j95044j13337m46593
3290I325242j76861L82804k13485m94022m90711J5673K94194O0022m67026k77094
3280G958736L2700K36515N57771p27466p2171L04335k71690K08438R4199j23088
$$ y = [15885658, 16044917, 15775657, 15657379, 15391136, 15187970, 15053911, 14918692, 14676458, 14182089, 14058843, 13691254, 13382396, 13865339, 13607855, 13734490, 13583198, 13314315, 13099250, 13046823, 13177056, 12810408, 12710057, 13236432, 12729717, 12616801, 12183055, 12299632, 11981936, 11724337, 11780578, 11639581, 11262729, 11443978, 11335840, 10902752, 10845875, 10600657, 10370535, 10679868, 10639809, 10749821, 10503263, 10323481, 10672779, 9963582, 10336952, 10499578, 10472311, 10098912, 10181027, 10217317, 9959102, 9399112, 10021128, 10080216, 9885172, 9771835, 9325242, 9148381, 9531185, 9317700, 8823678, 8332967, 8348640, 8642834, 8702856, 8235830, 7958736, 7991436, 8227951, 8785722, 8058256, 7986085, 8290420, 8018730, 8227168, 8321367, 8198279]
3270H198279j29052J73396K06387K21714R119l08328n8399K19332j43252J8172
3260H407368J71333k14561L28823n74807n4400Q2060K15971j52430l7277P3763
3250H245843K4189Q8625j94105J0247M94368O70273K75341L3730k75169O43208
3240A0016550L63367n56706M66990j48949j86515P07210k12900J40261M83484
3231A1072792l26320r6271L9042k9031j58205J89285J8002n42701l55097M68150
3221A0279646K73421K5034k86530M01204K19604l19735K52710N35419M0173N3774
3211A1474720N17414J23378K69800N44530M94363J02557p51703q60473l24834
3202A1589752k15428n37369m60464R1064m9543j86186N1758k87981M29848r757
$$ y = [8198279, 8069227, 8242623, 8449010, 8670724, 8679843, 8371515, 8313116, 8532448, 8389196, 8407368, 8578701, 8364140, 8692963, 8118156, 8063756, 8145816, 8361787, 8209357, 8172080, 8245843, 8270032, 8358657, 8164552, 8174799, 8669167, 9339440, 9614781, 9648511, 9373342, 10016550, 10379917, 9823211, 10290201, 10141252, 9954737, 10661947, 10449047, 10589308, 11072792, 10746472, 10650201, 10689243, 10660212, 10502007, 10691292, 10709294, 10166593, 9811496, 10279646, 10553067, 10578101, 10291571, 10692775, 10912379, 10592644, 10845354, 11380773, 11420946, 11474720, 11992134, 12115512, 12385312, 12929842, 13424205, 13526762, 12775059, 11914586, 11589752, 11374324, 10836955, 10376491, 10467555, 10418012, 10231826, 10283584, 9995603, 10425451, 10415694]
3192A0415694k47934N08293j32926M33944j82551M38007l76473N14999Q62703
3183A2233756K85457J41742l91136k94078k72929j26650n59024j01467r7573K10149
3173A1028247K22577K89806l74459L0868M38016N64985Q1225k11884L74755J85247
3163A2629383P21460K02198L12021j1094P05393N39481J91319J160048Q99984
3154A7350193O41258J01077r41075j141307o64117o77528o23519k13533m76454
3145A3354995K74020Q1710q151N32072k55705j90928K3973K56440L70231j52947
3135A4285710j22062k04408k87742N72496M27888j45929j01182m15916P36008
3126A4744863O54534J83855N66087m08628M25340L67514j24407N70502N99187
$$ y = [10415694, 10167760, 10676053, 10543127, 10977071, 10794520, 11232527, 10856054, 11371053, 12233756, 12519213, 12660955, 12269819, 11975741, 11702812, 11576162, 11017138, 10915671, 10818098, 11028247, 11250824, 11540630, 11166171, 11197039, 11635055, 12200040, 12281265, 12069381, 12444136, 12629383, 13350843, 13553041, 13865062, 13853968, 14559361, 15098842, 15290161, 16450209, 17350193, 17991451, 18092528, 17151453, 16010146, 15346029, 14668501, 14044982, 13831449, 13354995, 13629015, 13710725, 13702574, 14234646, 13978941, 13788013, 13811986, 14068426, 14438657, 14285710, 14163648, 13959240, 13671498, 14243994, 14671882, 14525953, 14424771, 14008855, 14744863, 15399397, 15583252, 16149339, 15740711, 16166051, 16533565, 16409158, 16979660, 17578847]
3117A7578847P66134M45053P18413O06565O91653N68679N445P25652Q53194M41845
3107B3401480P64953Q62858J062373J539967Q53991N56429J422790J238278J327497
3098C3030616J826566Q76086N53593J028990p2772p04807j138543j600482j894946
3089C1904301j617940j415933j845806j226559j126871j119674q09443q80456
3081B1861619q48394m92646q46218k74431k99037m82909k26861k27768l94192
3072A7769163L15070j2358p31607l88313N49112K82549k21288L9564J94743m06774
3062A7389861L30104q0558N72229P35546k61675Q40948Q30221N75708O61760l24647
3052B1269497k99558q61356r62470m03667o94506r17994l44266p7146l35424k31746
$$ y = [17578847, 18344981, 18790034, 19508447, 20115012, 20806665, 21375344, 21380789, 22106441, 22959635, 23401480, 24166433, 25029291, 26091664, 27631631, 28485622, 29042051, 30464841, 31703119, 33030616, 34857182, 35733268, 36286861, 37315851, 37243079, 36538272, 35399729, 33799247, 31904301, 30286361, 28870428, 27024622, 25798063, 24671192, 23551518, 22742075, 21861619, 21013225, 20520579, 19674361, 19399930, 19100893, 18617984, 18391123, 18163355, 17769163, 18084233, 18071875, 17340268, 16951955, 17501067, 17783616, 17562328, 17601892, 17796635, 17389861, 17719965, 17639407, 18211636, 18947182, 18685507, 19526455, 20356676, 20932384, 21594144, 21269497, 20969939, 20108583, 19146113, 18742446, 18047940, 17129946, 16785680, 16708534, 16373110, 16141364]
3042A6141364K64776J3788k73937N94370J58127Q08368k57413K88600p3749r4081
3032A7570213Q87979J297731O40843O27468O94372K07174j70913n58841k02934
3023B0993092o36219n93864L30458j066K38858M15395N55521J069849O43886K96804
3013B3312714J29167j92383o40393j051660j627955j076439n89564q74191k35666
3004A7153630K8625j47017M6106P7021O88938J07129L61347J33168j324N8145
2994A8505768M44525L62616N61285L30920P52620M39183L69579k00702j193835
2985B0371959j218048j153481j077948j424745q81415J80779l52235m53136l71539
2976A3620191n57077J52864m15852p80089l1032j08986j37556k32485l0134m4223
$$ y = [16141364, 16406140, 16419928, 16145991, 16740361, 16898488, 17706856, 17449443, 17738043, 17664294, 17570213, 18458192, 19755923, 20396766, 21024234, 21718606, 21925780, 21754867, 21196026, 20993092, 20356873, 19763009, 20093467, 20092401, 20331259, 20746654, 21302175, 22372024, 23015910, 23312714, 23441881, 23249498, 22609105, 21557445, 19929490, 18853051, 18263487, 17389296, 17153630, 17182255, 17035238, 17081344, 17158365, 17847303, 17954432, 18315779, 18448947, 18447623, 18505768, 18950293, 19312909, 19874194, 20205114, 20957734, 21396917, 21766496, 21565794, 20371959, 19153911, 18000430, 16922482, 15497737, 14616322, 14797101, 14444866, 13991730, 13620191, 13063114, 13215978, 12800126, 12020037, 11989005, 11880019, 11742463, 11509978, 11479844, 11435621]
2966A1435621n62432n1841k23450k8326j52633J70733l58825n21369O01134K77146
2956A0585758l12513K8863k17418m05079J77003P7825m47027k4010j05118K26481
2946I584765r1116j35210O2995K40820j13195J58242K2761r23j40368l87141n031
2935I196599N82765L7869j80162O3971l85147O8222M64723N59344k07830N7033
2925A0257387Q46207j47642n84396p9580p96128o93471m3041L12070j8131p45884
2915H307391M0183J69195K15830l12582P6346J43348n17939K91395J15287l11939
2905H216515k25686K81211J32851P576L0241l05978M4393k67J92511L61230p7454
2894H657143k6905o94021J29687m9371j73937l82935n76019j37553L29365m04420
$$ y = [11435621, 10873189, 10821348, 10597898, 10569572, 10416939, 10587672, 10228847, 9707478, 10308612, 10585758, 10273245, 10302108, 10084690, 9679611, 9856614, 9934439, 9487412, 9463402, 9358284, 9584765, 9493649, 9358439, 9421434, 9662254, 9549059, 9707301, 9730062, 9729139, 9588771, 9201630, 9196599, 9779364, 9817233, 9637071, 9701042, 9315895, 9384117, 9848840, 10408184, 10200354, 10257387, 11103594, 10955952, 10371556, 10291976, 9495848, 8802377, 8759336, 9071406, 9053275, 8307391, 8347574, 8516769, 8732599, 8420017, 8496363, 8639711, 8121772, 8413167, 8528454, 8216515, 7990829, 8272040, 8404891, 8412467, 8442708, 8136730, 8181123, 8180856, 8373367, 8734597, 8657143, 8630238, 7936217, 8065904, 8016533, 7842596, 7459661, 6883642, 6746089, 7075454, 6671034]
2884F671034k967k69192n4009m34811q8499P97004l64077r3832J1974m03963r4182
2873E674480k18375l13597p4098j03779L35400K20321k70306r0153K29087Q4667
2863E473647L71644P4892O2094m89461M7494J28877l78165K53495j53928k3765
2853E366824L97765k84301j2993K80123K87618m04542P0498N1917J50220L85562
2843F288691m4700j63771J11526M4919k53993o03449J2377O9247K06015j05122
2833E561740J41760K32780r8917j29734J71163L2857J01619L11097J56041M80217
2823F960623l76717j56222J86770R008j24987M12698J70519L24549L64800K50547
2813H021588j48117m5832R9843J31499O665j39369J13901j5484l28416M63473
$$ y = [6671034, 6668067, 6398875, 6344866, 5910055, 5821556, 6618560, 6254483, 6160651, 6172625, 5768662, 5674480, 5456105, 5142508, 5068410, 4964631, 5300031, 5520352, 5250046, 5159893, 5388980, 5473647, 5845291, 5920183, 5982277, 5492816, 5540310, 5669187, 5291022, 5544517, 5390589, 5366824, 5764589, 5480288, 5467295, 5747418, 6035036, 5630494, 5700992, 5752909, 5903129, 6288691, 6243991, 6080220, 6191746, 6236665, 5982672, 5379223, 5391600, 5460847, 5666862, 5561740, 5703500, 5936280, 5837363, 5707629, 5878792, 5911649, 6013268, 6324365, 6480406, 6960623, 6583906, 6427684, 6614454, 6623462, 6498475, 6911173, 7081692, 7406241, 7771041, 8021588, 7873471, 7827639, 7927482, 8058981, 8065646, 7926277, 8040178, 8024694, 7696278, 8159751]
2803H159751J88828q54421J73739M47533K56731m44104K40450K46713P5433J29197
2793H619850r59k09349P06286J39178L94997L28820l78669m6593k39736q3643
2783I230182l18455j26429q86868k69116j27546k222l20401L05730Q5129m8764
2773G521240L4574n49325l15189M59011K37114K8503j48534k81587K90730M8238
2763G324775k31886O4530n13980J38890j47687K54694K88612m91524q60468r0707
2753E735249K04340M9281o14661O9021J91126n73271n7090L12014K13034m61389
2743E067654k96718K27071j90192k20676n2169j41773q921k16995m64751k90534
2733C411996L33444j03576k42319J43695P7402J04085j36323p2811j20131l25762
$$ y = [8159751, 8348579, 7494158, 7667897, 8115430, 8372161, 7928057, 8168507, 8415220, 8490653, 8619850, 8618891, 8409542, 9115828, 9255006, 9650003, 9978823, 9600154, 9553561, 9313825, 9230182, 8911727, 8785298, 7898430, 7629314, 7501768, 7499546, 7179145, 7484875, 7570004, 7521240, 7555814, 7006489, 6691300, 7150311, 7387425, 7415928, 7267394, 6985807, 7276537, 7324775, 7092889, 7157419, 6643439, 6782329, 6634642, 6889336, 7177948, 6686424, 5825956, 5735249, 5939589, 5988870, 5374209, 5443230, 5634356, 5061085, 5003995, 5316009, 5529043, 5067654, 4770936, 4998007, 4807815, 4587139, 4534970, 4393197, 4384276, 4167281, 3702530, 3411996, 3745440, 3641864, 3399545, 3543240, 3620642, 3724727, 3588404, 3515593, 3395462, 3069700]
2723C069700J01367l98657J11036j22535K44471L59365p48639l76186J71515K96742
2713B708179J17652l63863N9188K8981n6020j03449K03182k94326q0619k33705
2703A985200q2105j51920K20024j0212r0647r8916j56735L55002j74905q3087
2693A711699j83062j6463J21967K45774m09967l36235N57089k39016r002j93468
2683A249316o9809j48329O2766J62147M96142N6921l80433l01921k2411J34612
2673A239001k5321k66266j62429q4948K73083K97808l49950j63908k06805L24315
2663H74580j51432L53269K17617k82968o3877K00542J61098K49419J98389o24749
2653A131888l78473L14305j55030m9076r0322k53504J46475q9011J98017L51792
$$ y = [3069700, 3171067, 2772410, 2883446, 2760911, 3005382, 3364747, 2616108, 2239922, 2411437, 2708179, 2825831, 2461968, 2521156, 2550137, 2494117, 2390668, 2593850, 2299524, 2218905, 1985200, 1903095, 1751175, 1971199, 1960987, 1870340, 1771424, 1614689, 1969691, 1794786, 1711699, 1528637, 1512174, 1634141, 1879915, 1469948, 1133713, 1690802, 1451786, 1442784, 1249316, 1179507, 1031178, 1093944, 1256091, 1752233, 1809154, 1428721, 1126800, 1104389, 1239001, 1213680, 947414, 784985, 700037, 973120, 1270928, 920978, 757070, 550265, 874580, 723148, 1076417, 1294034, 1011066, 947189, 1147731, 1308829, 1558248, 1756637, 1131888, 753415, 1067720, 912690, 863614, 773292, 519788, 666263, 577252, 775269, 1127061]
2643A127061K66558Q5068l77406j61006q9693k88748M39190j92709J208J41129
2633I50652J95279p3021p91517N5745L23911r1497j67112M09903l9062m9688j50142
2622E73451k69139K09051Q8147k92538J29450O1482Q7098L03834K79801k80688
2612H89949K48016n9132Q607j71317j46538K01129k23586j16259j16066j83461
2602C31342K9728L46962j09410m34954l07054J27606J45359M24988K71165k85984
2592E39748j07677R8998j57277q9415j32930k41105K31729K43534M7261K4742
2582D57608J47066L72224j60462j2028k58296l7895l39982J26842M34994Q5746
2572H15817J2114n69815O86381k55279n2689J01448n4384Q8773p49980J14886
$$ y = [1127061, 1393619, 1478687, 1101281, 940275, 850582, 561834, 1001024, 808315, 809523, 950652, 1145931, 1072910, 281393, 337138, 661049, 569552, 402440, 812343, 773281, 723593, 573451, 304312, 513363, 601510, 308972, 438422, 499904, 587002, 890836, 1170637, 889949, 1137965, 1078833, 1087440, 916123, 769585, 970714, 747128, 630869, 514803, 331342, 361070, 708032, 598622, 163668, -143386, -15780, 129579, 554567, 825732, 539748, 432071, 531069, 373792, 284377, 151447, -89658, 142071, 385605, 432866, 457608, 604674, 976898, 816436, 804408, 546112, 508217, 168235, 295077, 730071, 815817, 827931, 258116, 944497, 689218, 636529, 737977, 683593, 772366, 22386, 137272]
2562A37272L17109j94733K60972o1249j76517L15863j30803J37398M97423k53474
2552H49261k03498j34828J6806Q1609m32515j61031J52118L45377l75447J89131
2542C26983J48791j5277L99076k10550m11604L83317k44771k1296O45713j05230
2532H95152R1079m71213j19609K11003J55586q9321q3004J04219j66668J11721
2522F38945l16325l61907L25035N90813o7306q2675J7477l06315j79545r8013
2512A60184j93815n4232L74989J55288J00549j70398J25156R1281J53247j24936
2502F17313k8431N01508q6357l22441k49781k38500M63915K53516O786o6132k48630
2491F02766m29199K38589k72813J96518l18534J27738N26546M887n28759j56954
$$ y = [137272, 454381, 259648, 520620, 459371, 282854, 598717, 467914, 605312, 1102735, 849261, 645763, 510935, 527741, 609350, 176835, 15804, 167922, 513299, 137852, 326983, 475774, 460497, 859573, 649023, 237419, 620736, 375965, 354669, 1000382, 895152, 986231, 515018, 395409, 606412, 761998, 672677, 589673, 693892, 527224, 638945, 322620, -39287, 285748, 876561, 809255, 726580, 744057, 437742, 258197, 160184, -33631, -87863, 287126, 442414, 542963, 372565, 497721, 589002, 742249, 617313, 588882, 1090390, 1004033, 681592, 431811, 193311, 657226, 910742, 917528, 851396, 602766, 173567, 412156, 139343, 335861, 17327, 145065, 671611, 676498, 147739, -9215]
2481i215O9640J43262M93135j54794J34838l9191k4010m06497J54906M2680N64697
2470I69451m1022l9222k79885k96645k17977J79022l9252J7967j84670q0717N94907
2459E81957k99966o2727Q5867j86546K20870j60967l01649l57393J76543K01566
2449a02445N01652j05322j57662j00913k52543J94307r0927J15602k01921K01555
2439A383O50868j87975p67952J11464k03905o6623N41726k81316l67842j26888
2429f97060M45325M8599J79879K71819L06576J19140j94465l60848k75010o297
2419a62342K16330R6445k93776K71224j0420k118l49736J11673L24767m03481
2409b01434R3309M4493p7582L56978j34028l73495L81996L18218k14147R7642
$$ y = [-9215, 60425, 203687, 696822, 542028, 676866, 637675, 613665, 207168, 362074, 404754, 969451, 928429, 889207, 609322, 312677, 94700, 273722, 234470, 252437, 67767, -12950, 581957, 281991, 219264, 305131, 118585, 339455, 178488, -123161, -480554, -304011, -102445, 399207, 293885, 136223, 35310, -217233, -22926, -113853, 1749, -200172, 1383, 652251, 464276, -303676, -192212, -396117, -462740, 78986, -202330, -570172, -697060, -251735, -203136, -23257, 248562, 555138, 674278, 479813, 118965, -156045, -162342, 53988, 150433, -143343, 127881, 117461, 115343, -234393, -122720, 202047, -201434, -108125, -63632, -141214, 215764, 81736, -291759, 90237, 408455, 194308, 291950]
2399B91950k31015l51733K61187n4498K90270m00353k19699N04778K08318j61943
2389A37262J02241k41322K3081M1393l695P9985l36791j86001J732r3851L49669
2378a26297L71884j12927n47281j49897K92697J84355q1589j24188L79932j5858
2368G0831k37352K66966L1297j83966l41651l8663K98776k01369M95193L46795
2358E06857J3433n02412J17002l38892R2184j91675M98712m63738J84100k48116
2348c32545K70418Q4680n02185J0250K06772j07019O75901L00252n20490M07708
2338D93742K23379k75306l01520O5746k55166J90634j50303j11531j60002j77280
2328d57607J05707J81446K0908k2760J31521k55938k12107N55880J16534M3394
$$ y = [291950, 60935, -290798, -29611, -84109, 206161, -194192, -413891, 90887, 299205, 137262, 239503, -1819, 21262, 62655, 58960, 138945, -197846, -383847, -382115, -475966, -126297, 245587, 132660, -414621, -564518, -271821, -87466, -169055, -293243, 86689, 70831, -166521, 100445, 131742, -52224, -393875, -432538, -133762, -335131, 160062, 506857, 520290, 17878, 134880, -204012, -111828, -303503, 195209, -268529, -84429, -332545, -62127, 22553, -479632, -469382, -262610, -369629, 306272, 606524, 86034, 493742, 717121, 441815, 140295, 206041, -49125, 141509, -8794, -120325, -280327, -457607, -351900, -170454, -149546, -172306, -40785, -296723, -508830, 47050, 163584, 206978]
2318B06978L9892K37948K69268j15226n80400J77234O54513j6619k09881O31111
2308A294818K53273m10774l4128J53688n17601j27927L64479k72931l42858K46242
2298F06281j36905q3330j03753Q3184J06547L29867N3955q4435l11629m69738
2288i956m1485k90137L29938K15214j82687K28139N89135q5054o00874M9288J84070
2277C85591j66038j25939n01387M26633K22229j42752L98237r0866n1211J24768
2267D79265r6677q42284L58674L65146J05583j97218m73126R11741J40669j95245
2257E56528R4591q7104K09568L14013l73526m06409p2811K05661J32572p4855
2247D98228J94863l78146M2195K43703m7534L9096J44094j27877L5755n58309
$$ y = [206978, 246870, 484818, 754086, 638860, 58460, 235694, 890207, 873588, 663707, 1294818, 1548091, 1137317, 1103189, 1256877, 739276, 611349, 975828, 702897, 360039, 606281, 469376, 386046, 282293, 365477, 472024, 801891, 855846, 771411, 459782, -9956, -51441, -341578, -11640, 203574, 20887, 249026, 838161, 753107, 152233, 201521, 385591, 219553, 93614, -407773, 18860, 241089, 98337, 496574, 405708, 354497, 479265, 382588, -459696, -101022, 264124, 369707, 172489, -300637, 611104, 751773, 556528, 651119, 564015, 773583, 1087596, 714070, 307661, 234850, 440511, 573083, 498228, 693091, 314945, 357140, 600843, 553309, 592405, 736499, 608622, 644377, 86068]
2237H6068J86770N98110n24380k67798J58555M13755K60607j31823j53977J58480
2227G84367J91234m17216L4141P1212K71966n10177J36731J64742K6762J2690
2217G66452J22442J75484K1460p1347j45963J87803q972n6194k19715j76872J37244
2206G31822K64169k28970k36229O01991M4468o7913J24367n28907R4356K17207
2196A016361M2076m34543L52007N26187j8555n95753l3667k24242L74175P3700
2186A077746p5900J88844J53172q3737J51073k64642K13553R54706r80857n61076
2176G72882M62776J63341M3598J56693J69920K08758j21002l66559J93724K98121
2166A982252M88427r0854l91768O5721m01932J58012p7905k75206N53320L20940
$$ y = [86068, 272838, 870948, 346568, 78770, 237325, 651080, 911687, 779864, 625887, 784367, 975601, 558385, 592526, 663738, 935704, 425527, 562258, 727000, 753762, 766452, 888894, 1064378, 1085838, 1014491, 868528, 1056331, 1047359, 991165, 771450, 594578, 731822, 995991, 767021, 530792, 1132783, 1177251, 1109338, 1233705, 704798, 799154, 1016361, 1058437, 623894, 975901, 1502088, 1483533, 887780, 854113, 629871, 1004046, 1077746, 1001846, 1190690, 1343862, 1260125, 1411198, 1146556, 1360109, 2314815, 1333958, 772882, 1235658, 1398999, 1442597, 1599290, 1769210, 1977968, 1856966, 1490407, 1684131, 1982252, 2470679, 2379825, 1988057, 2053778, 1651846, 1809858, 1731953, 1456747, 2010067, 2331007]
2156B331007m0854M23067K62622Q3466K36307o03580K08668N04580j99619m2997
2146C162667N33908M3201M16438L12659k83717M06440p2267J79604L14640L88177
2136E401750K60867J02934J0257j91235N0617L90584M52884K8185j74243L804
2126F336404q5333J10208N46523J23105L31518k6327J77753P3643o30663J75580
2116G132411J72241L44147L08690K52697K07426l26836O47388L39272J96195j05030
2106I168601P67398M25352N32491M41933L73241J052232L80776K18921R21661
2097A4282606J164871Q64693Q84498J111832R85005P63903J198351J456050J438137
2088B4149946J898053J689723J801088J855395K854074K733503L065644M387036
$$ y = [2331007, 2290153, 2713220, 2975842, 3059308, 3295615, 2692035, 2900703, 3405283, 3205664, 3162667, 3696575, 3739776, 4156214, 4468873, 4185156, 4591596, 4519329, 4698933, 5013573, 5401750, 5662617, 5765551, 5775808, 5584573, 5635190, 6025774, 6478658, 6506843, 6332600, 6336404, 6251071, 6361279, 6907802, 7030907, 7362425, 7336098, 7513851, 7587494, 6956831, 7132411, 7304652, 7648799, 7957489, 8210186, 8417612, 8090776, 8738164, 9077436, 9273631, 9168601, 9935999, 10361351, 10893842, 11335775, 11709016, 12761248, 13142024, 13360945, 14282606, 15447477, 16312170, 17196668, 18308500, 19293505, 20057408, 21255759, 22711809, 24149946, 26047999, 27737722, 29538810, 31394205, 34248279, 36981782, 40047426, 44434462]
2080D4434462M647588M071011M799058N469440P606083R822656J0561298J2696174
2072A04107770J4403593J9372991K4294185L2275948M6649406L6393484r285786
2065B68211591l4348913m6034606m2222553k8404829k0421214j3521696j0263634
2058G2994146q006358o638857m769850m033244l014736l037791l273529l728910
2050C6490871m004416l021676k079603k110573j323102j273490j393624j447086
2042A9837301o82470j093400m10353q19346r89437m09322n69994j75406o23020
2033A4064553n97873n16375n61688r005n45034k67844l84437o76047r89733l39290
2023I177227q8371J19773m58188n70509j97037q5056l52970J63337J53265p87407
$$ y = [44434462, 49082050, 53153061, 57952119, 63421559, 71027642, 80850298, 91411596, 104107770, 118511363, 137884354, 162178539, 194454487, 241103893, 277497377, 268211591, 233862678, 187828072, 145605519, 117200690, 96779476, 83257780, 72994146, 64987788, 58348931, 53579081, 49545837, 46531101, 43493310, 40219781, 36490871, 32486455, 29464779, 27385176, 25274603, 23951501, 22678011, 21284387, 19837301, 19154831, 18061431, 17651078, 16831732, 15842295, 15432973, 14862979, 14687573, 14064553, 13466680, 12950305, 12388617, 12379612, 11834578, 11566734, 11182297, 10506250, 9516517, 9177227, 9088856, 9208629, 8750441, 8179932, 7982895, 7897839, 7544869, 7708206, 7861471, 7074064]
2013G074064l39292L6365m49146j22762m98760l74326K88166j24159m73233K94366
2003E311283j98626n53490O0833r7559K00605K80411l01945o1072l05975l76126
1993C958339q0592k01676L55913K17674L26301m88642m82274m9108N7534j58199
1983C455270o9900j80116k64085K33027l21269k52173K23311j52221L64240n5917
1973B980167p37152K67371K50731p9367j75907N329J707J18778j84441m4630Q0771
1962B483357K2519l15348J0469r149j56333J23439k07653j04636K0890P8593l24399
1951A621749m1140L6043L06736j94582J11637j93005J90586k03240k02023K37792
1941A670553L81370k88143o26113J8999o883J95634P3874L08458k99761N1030
$$ y = [7074064, 6734772, 6771137, 6321991, 6199229, 5700469, 5326143, 5614309, 5490150, 5016917, 5311283, 5112657, 4559167, 4620000, 4522441, 4723046, 5003457, 4701512, 4640440, 4334465, 3958339, 3877747, 3676071, 4031984, 4249658, 4575959, 4087317, 3605043, 3555935, 3613469, 3455270, 3385370, 3205254, 2941169, 3174196, 2852927, 2600754, 2824065, 2671844, 3036084, 2980167, 2243015, 2510386, 2761117, 2681750, 2505843, 2511172, 2512879, 2631657, 2447216, 2402586, 2483357, 2505876, 2190528, 2200997, 2191848, 2035515, 2158954, 1951301, 1846665, 1867555, 1946148, 1621749, 1580609, 1616652, 1923388, 1728806, 1840443, 1647438, 1838024, 1634784, 1432761, 1670553, 2051923, 1763780, 1137667, 1156666, 1149783, 1345417, 1419291, 1727749, 1427988, 1479018]
1931A479018l3256l1770p9839K33358k56454K61385J07396k66319N0276l34695
1921A129100j02900j28987J27107J83846n8251l23619k55515r831j21053j3200
1911D26697j9666j73394N29802P7905J80200n13861k4348J13075K45385L4596
1901H76391r2869J71974P4342j68251p46133M44956L10005j95482k1313J07451
1891G61071j49811j72502L1799l6386K38936L6385J68606k19583m84531k11060
1881c7076M67636K39481p07454J09339N66422l70494l2422K93736l19455q1170
1871A28543K13786J44091p3585Q5241K52039l34616k88512K129K58614M79275
1861H67005m26564l14845J92913K04581J31168L37113n56171J78733k74246j20168
$$ y = [1479018, 1445762, 1413992, 1334153, 1567511, 1311057, 1572442, 1679838, 1413519, 1463795, 1129100, 1026200, 897213, 1024320, 1208166, 1149915, 826296, 570781, 560950, 439897, 426697, 407031, 233637, 763439, 841344, 1021544, 507683, 483335, 596410, 841795, 876391, 783522, 955496, 1029838, 861587, 115454, 560410, 870415, 674933, 653620, 761071, 611260, 438758, 470557, 434171, 673107, 709492, 878098, 658515, 173984, -37076, 430560, 670041, -37413, 71926, 638348, 267854, 235432, 529168, 209713, 128543, 342329, 486420, 412835, 498076, 750115, 415499, 126987, 129116, 387730, 867005, 440441, 125596, 318509, 523090, 654258, 991371, 435200, 613933, 339687, 219519]
1851B19519Q7725n1789j38758O0660N19128j1692k49355R8950l07311J37058N30233
1840H94368m27753r0879Q4763j45379L12761L16109m43257L8114J76584J53090
1830H68521L94313l62278J84946L8890O69791J38211j79581n5521Q7563K89044
1820B073899q05286k3771j88744k83119K85064O7459l30165l29542R2762K1306
1810E79863K69131o153l51467m5120k33827j08441P4065L35705j42445l32275
1800C9036N01743l4359k50885M19848p23832r6840R5536K98770m21673J34576
1790c8080K07213J6977L72024l9515K24135l19008l42150P36270l27282n17252
1780b6668l75043N96763L30976l18953l03430j31437J04549K93416M09182l12889
$$ y = [219519, 307244, 255455, 116697, 177357, 696485, 684793, 435438, 534388, 227077, 364135, 894368, 466615, 375736, 460499, 315120, 627881, 943990, 500733, 538847, 715431, 868521, 1262834, 900556, 1085502, 1124392, 1794183, 1932394, 1752813, 1697292, 1784855, 2073899, 1268613, 1244842, 1056098, 772979, 1058043, 1125502, 795337, 465795, 558557, 579863, 848994, 842841, 491374, 446254, 212427, 103986, 178051, 513756, 371311, 39036, 540779, 506420, 255535, 675383, -48449, -145289, -49753, 249017, -172656, -38080, 169133, 186110, 558134, 518619, 742754, 423746, 81596, 817866, 490584, -26668, -401711, 195052, 526028, 207075, -96355, -227792, -123243, 170173, 579355, 266466]
1770B66466k69097k91522J36595O4935k40587M9277J90813R9311K53903j17579
1760A42515l84986j01526P56K48048M95407m63362j44680K15714L48750j33884
1750B22752j71658N30980j43553j49548K78414k93431j169K41658m92436q0799
1740e8790J48115j56663K04242l7017k26576J12301q0855r154L09686j88748j2574
1729C967j71301K42295j21991l06969K6539P9439R238M72188L89625l40490N1376
1718C33916n70667k27717j00478L56403R3588j45066k46630K04575j04058j90904
1708e97038L47228l04293M94064j65189L51021o73722K01293M11450j76251J15837
1698D400k46092k31393Q7498Q6903J78061R7968k97906L42358l0599O6888m58421
$$ y = [266466, -2631, -294153, -157558, -92623, -333210, -283933, -93120, 6191, 260094, 142515, -242471, -343997, -343241, -95193, 400214, -63148, -207828, 7886, 356636, 222752, 51094, 582074, 438521, 288973, 567387, 273956, 272787, 514445, 22009, -58790, 89325, -67338, 136904, 99887, -126689, -14388, -95243, -104397, 205289, 16541, 3967, -167334, 74961, -47030, -353999, -327460, -248021, -238783, 233405, 623030, 282540, 333916, -236751, -464468, -564946, -208543, -114955, -260021, -506651, -302076, -406134, -597038, -249810, -554103, -60039, -225228, 125793, -547929, -346636, 64814, -111437, 4400, -241692, -473085, -385587, -298684, -120623, -22655, -320561, 21797, -8802, 58086, -400335]
1687d00335j20612K42361J24881j66032K65624J36021Q343K36218M3627l3982
1677C36114k47807K64270m07870J99982j78966K03416k40526J37150J97681l86553
1667a23109K01039j26544J24510L10375j60629m79281M0267K49790J092363l68512
1657G60269m03126k81094R9275J09979j11795M7381k0174j78423l23405j89806
1647d90919K26493K06195J23550o9685J26720l2322o77220k35071L27003N86713
1637I1457j02879L5560j80578k59683K66329R2152P4929L5371P0775K62391p4960
1626C10864j31646J69295k93293l73140Q43766l54582l05721O9712m70467L49954
1616a85258K02973j02589k88453J60290r8431J79119K00163j66509j3163K04095
$$ y = [-400335, -520947, -278586, -153705, -319737, -54113, 81908, 90251, 326469, 370096, 336114, 88307, 352577, -55293, 144689, -34277, 169139, -71387, 65763, 263444, -123109, 77930, -48614, 75896, 386271, 225642, -253639, -213372, 36418, 1128781, 760269, 357143, 76049, 175324, 285303, 173508, 220889, 200715, 22292, -301113, -490919, -264426, -58231, 65319, -4366, 122354, 90032, -587188, -822259, -495256, 91457, -11422, 24138, -156440, -416123, -149794, -57642, 17287, 52658, 123433, 385824, 310864, 179218, 348513, 55220, -317920, 525846, 171264, -134457, -64745, -535212, -185258, 17715, -84874, -373327, -213037, -311468, -132349, 67814, -98695, -111858, 92237]
1606I2237r7898R3297K88440J16442m16604o36715J12475N70800J0848K93660
1596D26982m51651j57521K11415o0270o9011k3007Q425J59719P0763k62188K62165
1585A15821m29636o7105L71723M279m1892J19621j45534j55154l9126K7301k84999
1574e24701L99679J27396j73333J09163j68581l48291K39952k6830J38829j78222
1564d04939N0579p7296K8267j01735P3675K2137K01070K93419l4909k14083J58160
1553e655L58128k41963P0193m0593L43127l79228j01054m18265J16410L83487
1543H4587J39770j60151j76016k99480K47795M36985k47275J33681N148l44360
1533a79316j46536M16946p3417J45701l09841j97320K17254l93969j55325L58271
$$ y = [92237, -5661, 87636, 376076, 492518, 75914, -560801, -448326, 122474, 133322, 426982, -24669, -182190, 29225, -31045, -100056, -123063, -114638, 45081, 115844, -146344, 115821, -313815, -380920, -9197, -4918, -46810, 72811, -72723, -227877, -267003, -239702, -524701, -125022, 2374, -170959, -61796, -230377, -578668, -338716, -365546, -226717, -404939, -354360, -431656, -403389, -505124, -431449, -409312, -208242, 85177, 50268, -163815, -5655, 352473, 110510, 180703, 140110, 483237, 104009, 2955, -415310, -298900, 84587, 224357, 64206, -111810, -411290, -163495, 273490, 26215, 159896, 165044, -179316, -325852, 91094, 17677, 163378, -146463, -343783, -126529, -520498, -675823, -317552]
1523c17552n023K50119M47331m36937q2445L78223L54221o40271q2907k30866
1513c66107O422N22854k55829l7976j46109n1635K95245L7185l54895K01881L21804
1502A72840j97437J09734J72068n24517K83504O2253K64944r6947m8951j71272
1492B6219n76523L12622M09524k02493O8731j48206k81828L20983N56958L0741
1482E16728l65488J29094k55648k04363K32284k7682J30842M3331l87034r2214
1472b80150J52368k11308K56981L04565k04879j46991o24136J86449J64270K81503
1462a21328q8719o1710k2669J8540m6295N46468m80785N4288J36791j38443L8295
1451a65567r9742R0687N1661K86796l11485L4607M9704J54397L74436r6676n21056
$$ y = [-317552, -322575, -72456, 374875, -62062, -144507, 233716, 587937, -52334, -135241, -366107, -359685, 163169, -92660, -130636, -276745, -328380, -33135, 4050, -350845, -148964, 172840, -24597, 85137, 257205, -267312, 16192, 78445, 343389, 246442, 197491, 26219, -550304, -237682, 171842, -30651, 38080, -110126, -391954, -70971, 485987, 516728, 151240, 280334, 24686, -179677, 52607, 24925, 155767, 199098, -187936, -280150, -127782, -339090, -82109, 222456, 17577, -129414, -753550, -567101, -402831, -121328, -210047, -271757, -294426, -275886, -322181, 224287, -256498, -202210, -65419, -203862, -165567, -265309, -174622, -122961, 163835, -147650, -113043, -63339, 91058, 465494, 368818, -152238]
1440a52238P0329l09602K77356J03595o2074O2554J48452r3482n645K86266k79294
1429D6217k10836r2035j37611L4006k8791l75355K33270J58606K22338K11166
1419F0975j92091k25579L95840n30565k97370K14384k66482L94681M30173n2935
1409f8969P7847p4416l75134K69192O9759k74836J18020P6865l72649K59887L99333
1398A04899q645j71616k59052j12668Q6268K18371p0103r1775J36512j11522K58218
1387b1113j68926K61438J04272l22982M5131J39102k3429N23757k77396l24954
1377f5100j23945J22393J18009j6107m3788K20128n5803n96587M01558L81168
1367C41926j94586l20850O4644J3921l29851O31945l2575r02795M54642J0816
$$ y = [-152238, -81909, -391511, -114155, -10560, -72634, -10080, 138372, 44890, 39245, 325511, 46217, -164619, -256654, -394265, -360259, -389050, -764405, -531135, -372529, -150191, 60975, -131116, -356695, 39145, -491420, -788790, -574406, -840888, -446207, -16034, -68969, 8878, -65538, -440672, -171480, -101721, -376557, -258537, -181672, -554321, -294434, 104899, 96254, -75362, -334414, -447082, -360814, -142443, -212546, -304321, -167809, -279331, -21113, -190039, 71399, 175671, -147311, -102180, 36922, 13493, 537250, 259854, -65100, -189045, -66652, 51357, 35250, -8538, 211590, 155787, -440800, -39242, 341926, 147340, -173510, -108866, -94945, -424796, 207149, 174574, -728221, -273579, -262763]
1357b62763R8022p90159O15734L70132n78358M7305L54403L25310j36921l202
1347C9503j84958K34642o4433j91433K45309j42390k74524K3340J13952J41477
1337e9515k1768J02482J10641p9581k62009n0839k10194K22433J55296L85402
1327B92348n39009J02052M08291k40634m1249q9553J53207m42664M00516M6535
1317D9840k02939l73842K15171k57441L46787N68185n40332j74159R6642M58801
1307A86713P1542J45250j47899l8631j55630K1134K1948k49833N0631L73267o6202
1296B12290m22726o9264K4428L16293j99103n94569J56595J22973r2211k99204
1286h44498K86642N32667P8046O5998o7051k87075J16839L48728j99902R2448
$$ y = [-262763, -164741, -954900, -339166, 30966, -547392, -500087, -145684, 179626, 42705, 39503, -145455, 89187, 24754, -166679, 78630, -63760, -338284, -314944, -200992, -59515, -81283, 21199, 131840, 52259, -209750, -260589, -470783, -248350, -93054, 292348, -246661, -144609, 263682, 23048, -18201, -107754, 45453, -397211, 3305, 49840, -153099, -526941, -311770, -569211, -222424, 345761, -194571, -368730, -272088, 186713, 258255, 403505, 255606, 216975, 61345, 82479, 104427, -145406, -94775, 278492, 212290, -210436, -279700, -255272, 61021, -138082, -732651, -576056, -453083, -545294, -844498, -557856, -25189, 52857, 118855, 51804, -235271, -118432, 230296, 30394, 122842]
1276A22842j68711J91825n4206k59806M78468K17570j53653l91591j27354J1130
1266a33486J13988l23682j52555L46233j7783N38938J30623l67043j44941j7591
1256b7299K47539L38191q38985l34409M82825k65121K92513K1260P9915j0105
1246a3676k35674J19390j73521q1242N81604l06565m12147J22364m70M42701J29907
1235A72671k42518l23678K90339L57285N6734p3637j71872J1875j12852K28909
1225A93256J98383j32544n53706k71504M30881J24570l4224q8456k6297K0107
1215a39534k64402o366J27089L40522l64282j51945K78153k66119M68864K49905
1205B71885l99771J58319L45320k70116K01921k44295j06766P2574J00311K73213
$$ y = [122842, -45869, 145956, 91750, -168056, 310412, 527982, 374329, -17262, -144616, -133486, -19498, -343180, -495735, -149502, -167285, 371653, 502276, 135233, -9708, -27299, 220240, 558431, -280554, -614963, -132138, -397259, -104746, -83486, -3571, -13676, -249350, -129960, -303481, -384723, 196881, -109684, -521831, -399467, -399937, 42764, 172671, -69847, -393525, -103186, 254099, 310833, 237196, 65324, 77199, -35653, 193256, 391639, 259095, -294611, -566115, -135234, -10664, -44888, -133344, -159641, -139534, -403936, -410302, -283213, 57309, -306973, -458918, -180765, -446884, 21980, 271885, -127886, 30433, 375753, 105637, 307558, 63263, -43503, 29071, 129382, 402595]
1195D02595j901k48135m3349M29296K36639r50630K28052p9525l48653K80186
1185i5425K02055q4014K80497J99142l35280j02642L1559q7765K3918J18982J45010
$$ y = [402595, 400694, 152559, 109210, 538506, 775145, -175485, 52567, -26958, -375611, -95425, 106630, 22616, 303113, 502255, 166975, 64333, 95892, 8127, 32045, 151027, 296037]
$$ [...]
##END NTUPLES=NMR SPECTRUM
##END=
