##TITLE=1H_EC-3257(II-2)
 CDCl3, 8 sc, 
 4.08.2021
##JCAMPDX= 6.0         $$ Bruker NMR JCAMP-DX V2.0
##DATA TYPE= NMR SPECTRUM
##DATA CLASS= NTUPLES
##ORIGIN= UXNMR, Bruker Analytische Messtechnik GmbH
##OWNER= root
$$ XWIN-NMR		Version 3.5
$$ Wed Aug  4 09:54:23 2021 Russian Standard Time (UT+4h)  she@DPX200
##.OBSERVE FREQUENCY= 200.131506
##.OBSERVE NUCLEUS= ^1H
##.ACQUISITION MODE= SIMULTANEOUS
##.ACQUISITION SCHEME= undefined
##.AVERAGES= 8
##.DIGITISER RES= 18
##SPECTROMETER/DATA SYSTEM= spect
##.PULSE SEQUENCE= zg30
##.SOLVENT NAME= CDCl3
##.SHIFT REFERENCE= (INTERNAL, CDCl3, 0, 17.5032)
##AUDIT TRAIL= $$ (NUMBER, WHEN, WHO, WHERE, WHAT)
$$ ##TITLE= Audit trail, XWIN-NMR		Version 3.5
$$ ##JCAMPDX= 5.01
$$ ##ORIGIN= Bruker BioSpin GmbH
$$ ##OWNER= she
$$ F:/spectra/data/she/nmr/H-F/1/pdata/1/auditp.txt
$$ ##AUDIT TRAIL=  $$ (NUMBER, WHEN, WHO, WHERE, WHAT)
(   1,<2021-08-04 09:53:15.56 +0400>,<she>,<DPX200>,
      <created by zg, POWCHK disabled, PULCHK disabled
       configuration hash MD5:
       00 E9 B6 7A A2 85 ED C7 34 08 36 98 17 FE 4E 26
       data hash MD5: 16K
       70 2C 78 61 1C 70 FD F5 38 1C 0D 03 65 6B 01 DE>)
(   2,<2021-08-04 09:53:18.31 +0400>,<she>,<DPX200>,
      <Start of raw data processing
       efp BC_mod = 2 LB = 0.24 FT_mod = 6 PKNL = 1 PHC0 = -13359.58 PHC1 = 13.40099 SI = 16K 
       data hash MD5: 16K
       C2 37 D4 22 A7 20 3E B8 41 D6 20 99 8E 67 CB EB>)
(   3,<2021-08-04 09:53:35.79 +0400>,<she>,<DPX200>,
      <pk PHC0 = 3.720395 PHC1 = -1 
       data hash MD5: 16K
       EB A8 85 D8 9F C0 A2 53 5A A6 8C 66 D3 EC AA 78>)
(   4,<2021-08-04 09:53:40.29 +0400>,<she>,<DPX200>,
      <abs ABSG = 5 
       data hash MD5: 16K
       B4 F3 59 AA E3 B8 72 E4 23 A4 A7 A6 9D 5A 4D 81>)
$$ ##END=
$$ 
$$ hash MD5
$$ E9 A2 94 5D 3B DB 6D C4 55 19 0A 98 90 53 AB E7
##$RELAX= 
##$RELAX= 
##$RELAX= 
##$RELAX= 
##$RELAX= 
##$RELAX= 
$$ Bruker specific parameters
$$ --------------------------
##$DU= <F:/spectra>
##$EXPNO= 1
##$NAME= <H-F>
##$PROCNO= 1
##$TYPE= <nmr>
##$USER= <she>
##$AMP= (0..31)
100 100 100 100 100 100 100 100 100 100 100 100 100 100 100 100 100 100 
100 100 100 100 100 100 100 100 100 100 100 100 100 100 
##$AQSEQ= 0
##$AQ_mod= 1
##$AUNM= <au_zg>
##$AUTOPOS= <>
##$BF1= 200.13
##$BF2= 200.13
##$BF3= 200.13
##$BF4= 200.13
##$BF5= 200.13
##$BF6= 200.13
##$BF7= 200.13
##$BF8= 200.13
##$BYTORDA= 1
##$CFDGTYP= 0
##$CFRGTYP= 5
##$CHEMSTR= <none>
##$CNST= (0..31)
1 1 145 1 1 1 1 1 1 1 1 1 1 1 1 1 1 1 1 1 1 1 1 1 1 1 1 1 1 1 1 1 
##$CPDPRG= <>
##$CPDPRG1= <>
##$CPDPRG2= <>
##$CPDPRG3= <>
##$CPDPRG4= <mlev>
##$CPDPRG5= <mlev>
##$CPDPRG6= <mlev>
##$CPDPRG7= <mlev>
##$CPDPRG8= <mlev>
##$CPDPRGB= <>
##$CPDPRGT= <>
##$D= (0..31)
0 1.2 0 0 0 0 0 0 0 0.06 0 0.03 0 0 0 0 0.0002 0 0 0 0 0 0 0 0 0 0 0 0 
0 0 0 
##$DATE= 1628056395
##$DBL= (0..7)
120 120 120 120 120 120 120 120 
##$DBP= (0..7)
150 150 150 150 150 150 150 150 
##$DBP07= 0
##$DBPNAM0= <>
##$DBPNAM1= <>
##$DBPNAM2= <>
##$DBPNAM3= <>
##$DBPNAM4= <>
$$ [...]
##$SUBNAM3= <"">
##$SUBNAM4= <"">
##$SUBNAM5= <"">
##$SUBNAM6= <"">
##$SUBNAM7= <"">
##$SUBNAM8= <"">
##$SUBNAM9= <"">
##$SW= 20.0188882624521
##$SWIBOX= (0..15)
0 0 2 0 0 0 0 0 0 0 0 0 0 0 0 0 
##$SW_h= 4006.41025641026
##$TD= 16384
##$TD0= 1
##$TE= 0
##$TE2= 300
##$TE3= 300
##$TEG= 300
##$TL= (0..7)
0 120 120 120 120 120 120 120 
##$TP= (0..7)
150 150 150 150 150 150 150 150 
##$TP07= 0
##$TPNAME0= <>
##$TPNAME1= <>
##$TPNAME2= <>
##$TPNAME3= <>
##$TPNAME4= <>
##$TPNAME5= <>
##$TPNAME6= <>
##$TPNAME7= <>
##$TPOAL= (0..7)
0.5 0.5 0.5 0.5 0.5 0.5 0.5 0.5 
##$TPOFFS= (0..7)
0 0 0 0 0 0 0 0 
##$TUNHIN= 0
##$TUNHOUT= 0
##$TUNXOUT= 0
##$USERA1= <user>
##$USERA2= <user>
##$USERA3= <user>
##$USERA4= <user>
##$USERA5= <user>
##$V9= 5
##$VALIST= <valist>
##$VCLIST= <CCCCCCCCCCCCCCC>
##$VD= 0
##$VDLIST= <DDDDDDDDDDDDDDD>
##$VPLIST= <PPPPPPPPPPPPPPP>
##$VTLIST= <TTTTTTTTTTTTTTT>
##$WBST= 1024
##$WBSW= 4
##$XGAIN= (0..3)
0 0 0 0 
##$XL= 0
##$YL= 0
##$YMAX_a= 200515
##$YMIN_a= -276145
##$ZGOPTNS= <>
##$ZL1= 120
##$ZL2= 120
##$ZL3= 120
##$ZL4= 120
##$ABSF1= 17.49711
##$ABSF2= -2.521927
##$ABSG= 5
##$ABSL= 3
##$ALPHA= 0
##$AQORDER= 0
##$ASSFAC= 0
##$ASSFACI= 0
##$ASSFACX= 0
##$ASSWID= 0
##$AUNMP= <proc_1d>
##$AZFE= 0.1
##$AZFW= 0.1
##$BCFW= 0
##$BC_mod= 2
##$BYTORDP= 0
##$COROFFS= 0
##$CY= -3
##$DATMOD= 1
##$DC= 0
##$DFILT= <>
##$DTYPP= 0
##$F1P= 0
##$F2P= 0
##$FCOR= 1
##$FTSIZE= 16384
##$FT_mod= 6
##$GAMMA= 0
##$GB= 0
##$INTBC= 1
##$INTSCL= 1.334414e-10
##$ISEN= 128
##$LB= 0.24
##$LEV0= 0
##$LPBIN= 0
##$MAXI= 10000
##$MC2= 0
##$MEAN= 0
##$ME_mod= 0
##$MI= 1.114404
##$NCOEF= 0
##$NC_proc= -7
##$NLEV= 6
##$NOISF1= 3.799351
##$NOISF2= 2.8
##$NSP= 0
##$NTH_PI= 0
##$NZP= 0
##$OFFSET= 17.50322
##$PC= 1
##$PHC0= -13355.86
##$PHC1= 12.40099
##$PH_mod= 1
##$PKNL= yes
##$PPARMOD= 0
##$PSCAL= 0
##$PSIGN= 0
##$REVERSE= no
##$SF= 200.130006286618
##$SI= 16384
##$SIGF1= 3
##$SIGF2= 2
##$SINO= 5.538805
##$SIOLD= 16384
##$SREGLST= <1H.CDCl3>
##$SSB= 0
##$STSI= 16384
##$STSR= 0
##$SW_p= 4006.41025641026
##$SYMM= 0
##$S_DEV= 0
##$TDeff= 16384
##$TDoff= 0
##$TI= <>
##$TILT= no
##$TM1= 0
##$TM2= 0
##$TOPLEV= 0
##$USERP1= <user>
##$USERP2= <user>
##$USERP3= <user>
##$USERP4= <user>
##$USERP5= <user>
##$WDW= 1
##$XDIM= 16384
##$YMAX_p= 391165519
##$YMIN_p= -691162
$$ End of Bruker specific parameters
$$ ---------------------------------
##NTUPLES= NMR SPECTRUM
##VAR_NAME=  FREQUENCY,     SPECTRUM/REAL,   SPECTRUM/IMAG
##SYMBOL=    X,             R,               I
##VAR_TYPE=  INDEPENDENT,   DEPENDENT,       DEPENDENT
##VAR_FORM=  AFFN,          ASDF,            ASDF
##VAR_DIM=   16384,         16384,           16384
##UNITS=     HZ,            ARBITRARY UNITS, ARBITRARY UNITS
##FACTOR=    0.24454680195387, 1,            1
##FIRST=     3502.91944948308, 0,            0
##LAST=      -503.490806927183, 0,           0
##MIN=       -503.490806927183, -691162,     0
##MAX=       3502.91944948308, 391165519,    0
$$ Real data points
##PAGE= N=1
##DATA TABLE= (X++(R..R)), XYDATA
$$ [...]
11070B8792J94106o7921j83032k4238r7912n4349n0704M2690r3105L7695J2156
11059b55822P9603J88362l1913Q7409R6046l35269N9871j45398M1667J52624N390
11048e7430p7276m4954L6236k0915M5679Q6911M4144j7365l5159P3200l1573n3984
11036e2486O1448Q1745P9076n3986l6817J39437J7317j16475j21090p268M4207
11025C5108r1882J91129M8470j32135M1281N4113k51793o4819P940K6822N4731
11014h1035j39194J59615J08693q1869Q9864j98568J39655M3353j82609j15424
11004b57519J83017J49883m0799j7545J871N710J16983l8250m9129j71289Q2599
10993c4468J25663m079k437l8891J992J05176j29946N508J8685K33980k81867
$$ plain form
11070 28792 222898 154977 -28055 -52293 -150205 -204554 -255258 -212568 -305673 -267978 -255822
11059 -255822 -176219 12143 -19770 67639 163685 -171584 -111713 -257111 -215444 -62820 -57430
11048 -57430 -134706 -179660 -143424 -164339 -118660 -31749 12395 -4970 -40129 33071 1498 -52486
11036 -52486 8962 90707 169783 115797 78980 218417 235734 119259 -1831 -9099 35108
11025 35108 -56774 134355 182825 50690 91971 146084 -105709 -170528 -162588 -135766 -81035
11014 -81035 -220229 -60614 48079 -33790 56074 -142494 -2839 40514 -142095 -257519
11004 -257519 -74502 75381 34582 17037 18908 24618 141601 103351 54222 -117067 -34468
10993 -34468 91195 87116 84679 45788 47780 152956 23010 28518 47203 281183 -684
10982f84l00532J94452J78920P6654j00960J16220j80402j51653n1526M8923n1479
10971b22067J85328j30287r5312N4439J56074K03881r948r9647K07810m9743j53268
10960D7260J3624k7581J81309k50298j5110M8467P2767p3197p4421R3777j49412
10949a32815P2191o7867j35765q2925J14908L72244J09450k23000m2504r1129
10939a07212j60702J47001J00927n1419j23562J29218J07432j26656j4117p7626
10929a76716J2374N8716O831O1549o6557O0749r1355j91681K6839K0083J15073
10918a64095J16351K0348N8712j05094o0330p802r9748K12603j55641r8400L8538
10907b44558R1451J91507r306q4569k049K4553Q2048K96348j05981k66738L4287
$$ plain form
10982 -684 -301216 -106764 72156 148810 47850 164070 -16332 -167985 -219511 -170588 -222067
10971 -222067 -36739 -167026 -262338 -207899 -51825 152056 142108 42461 250271 200528 47260
10960 47260 60884 33303 214612 -35686 -50796 -2329 70438 -2759 -77180 16597 -132815
10949 -132815 -60624 -128491 -264256 -347181 -232273 139971 249421 26421 -16083 -107212
10939 -107212 -267914 -120913 -19986 -71405 -194967 -65749 41683 -84973 -99090 -176716
10929 -176716 -164342 -105626 -98795 -37246 -103803 -43054 -134409 -326090 -299251 -279168 -164095
10918 -164095 -47744 -27396 31316 -73778 -134108 -141910 -241658 -29055 -184696 -283096 -244558
10907 -244558 -153107 38400 29094 -55475 -57524 -32971 49077 345425 239444 -27294 6993
10896F993J9322j81356J40672J09307K39589j34842P9989m4493j82313k33551
10886a80683Q1223O9339m7679n8829L52783j87993j17666P7138j07333l7855j70122
10875c27677J96523l680M0775J51096J57728k00699j03284q1791J78387l4869
10865b7491j02570P1613P2191K9417Q8085j08211J11351r7942q1194j99165J07764
10854a36152l4056J24860J38932j01216j84910m2479L42290Q4104j28399o4337
10844a363p7146K32024j50253j82621N2628j35716J78469Q0958q1642M3721k86511
10833c27452J5924J86407n5168P7563P9803R8039O7616l06133L6182M8584m0075
10822a18710J14758j509n5046J29965O7488Q7523n4629n2779j62650L034J775
$$ plain form
10896 6993 26315 -155041 -14369 94938 334527 199685 279674 235181 52868 -180683
10886 -180683 -99460 -30121 -77800 -136629 216154 28161 -89505 -12367 -119700 -157555 -327677
10875 -327677 -131154 -134834 -94059 57037 214765 14066 -89218 -171009 7378 -27491
10865 -27491 -130061 -58448 13743 43160 131245 23034 134385 36443 -44751 -243916 -136152
10854 -136152 -170208 -45348 93584 -7632 -192542 -235021 107269 191373 62974 -1363
10844 -1363 -78509 153515 3262 -179359 -126731 -262447 -83978 -3020 -84662 -40941 -327452
10833 -327452 -311528 -125121 -180289 -102726 -22923 75116 142732 -163401 -127219 -78635 -118710
10822 -118710 -3952 -5461 -60507 69458 136946 224469 169840 117061 -45589 -42555 -40780
10811d0780P5469r514k6436K1767K0333O5241k5145k65459N3844J67528j2086
10800B4762j52762k92971o5023Q9525J94546o849m9298M4349K44657j48011R6357
10789b0718j09940N2834k9346J47560j54198J7289k8822M6111Q9887M1553j1998
10778D0212j97234P4778J52481r3235j17596J85728M2589r7886J9130j17331Q2826
10767b5538l9192j08729j03406J55261j25087l0953K50032j69942J48268o8860
10757a18146L5778K87237p6135j04981k21377J55716J8429O4029j47278J05005
10747a723J8575q3281P1924m4827N7414p4299r3593J37664J72002j41757L9681
10736E7780K24319m34178J53217J49261k35237n8841j3005J00810p9283K02562
$$ plain form
10811 -40780 34689 25175 -1261 20506 40839 106080 80935 -184524 -130680 36848 24762
10800 24762 -128000 -420971 -485994 -396469 -201923 -208772 -258070 -213721 30936 -117075 -20718
10789 -20718 -130658 -77824 -107170 40390 -113808 -96519 -125341 -79230 10657 52210 40212
10778 40212 -157022 -82244 70237 -22998 -140594 45134 87723 -10163 8967 -108364 -25538
10767 -25538 -64730 -173459 -276865 -121604 -246691 -277644 -27612 -197554 -49286 -118146
10757 -118146 -82368 204869 128734 23753 -197624 -41908 -23479 40550 -106728 -1723
10747 -1723 16852 -66429 5495 -39332 18082 -56217 -149810 -12146 159856 18099 57780
10736 57780 282099 -152079 1138 150399 -84838 -143679 -156684 -55874 -135157 67405
10726F7405J3434l44881J19183K85717q0014J13701k26887j95819O7601K41440
10716F0880p8465m1493J31474j05137m3213O9699N919q5168J02335j86387k90464
10705d60020J69490K45517l2536L7737o3679j36717n4532L1653L00488q3264K1874
10694b3989O2109k3593J43243k3942j24971n4423K61625j87216j41071L8127K89085
10683B14984O3843k36049J12622k82518R7647j62345k13556K35135P1736J005
10673i7496J81062j23997M0688j202j506J32855j59178l82242K59690Q9610m961
10662f6677M0340R1253N6680k14260J38362m6652k19803J09550p5258J43130J4267
10651b9068P1823L306J35932k00875k42354j048J48250K0232J06735K10648l13267
$$ plain form
10726 67405 80839 -264042 -144859 140858 60844 174545 -52342 -248161 -180560 60880
10716 60880 -17585 -59078 72396 -32741 -75954 -6255 -336 -85504 16831 -169556 -460020
10705 -460020 -290530 -45013 -77549 -39812 -103491 -240208 -294740 -263087 37401 -45863 -23989
10694 -23989 38120 14527 157770 133828 8857 -45566 216059 28843 -112228 -74101 214984
10683 214984 278827 42778 155400 -127118 -29471 -191816 -405372 -170237 -98501 -97496
10673 -97496 83566 -40431 257 -945 -2451 130404 -28774 -411016 -151326 -61716 -66677
10662 -66677 -26337 64916 121596 -92664 45698 -954 -220757 -111207 -186465 -43335 -29068
10651 -29068 42755 46061 181993 -18882 -261236 -262284 -114034 -93802 12933 223581 -89686
10640h9686j46462M5516Q7354l2892K23657k25531k13565L94106m5221j81158
10630a83882j20700j29763K60449J2731j2627K05018j9912j38415j37090J16285
10620a47906k7338j31977J07815k3263o7120K41642J21770J23713k39615j85361
10610b27640N5631J1873L28017j84555J54502J93038l31446P3486j64131q4338
10600a75563J62911k7605j34761q171O5921R1617N4124L7055k9328K5328N7213
10589A18741j08528J50101o0189K0556j38083j98872L33480j4481k15182j5660
10579a28117j35916J8544l391L88930n9791k02526n5272j33436j15217K43520
10569a82672M4707R6847j65960o7561K2948N4871L02805L9086k231M3996k61761
$$ plain form
10640 -89686 -236148 -190632 -103278 -136170 87487 -138044 -351609 42497 -2724 -183882
10630 -183882 -304582 -434345 -173896 -161165 -173792 31226 11314 -127101 -264191 -147906
10620 -147906 -175244 -307221 -199406 -222669 -289789 -48147 73623 197336 -42279 -227640
10610 -227640 -172009 -160136 167881 -16674 137828 330866 -580 72906 -91225 -175563
10600 -175563 -12652 -40257 -175018 -183189 -117268 -25651 28473 65528 36200 61528 118741
10589 118741 10213 160314 100125 120681 -17402 -216274 117206 102725 -112457 -128117
10579 -128117 -264033 -245489 -248880 140050 80259 -122267 -177539 -310975 -426192 -182672
10569 -182672 -137965 -41118 -207078 -274639 -251691 -196820 105985 145071 142840 186836 -74925
10558g4925j05114J65804K3592r4189Q7500p4477K15664J2743j36460l3686k6065
10547c9613l12700N7066J37462K29852l563j6855N0856o8216m2722n5140R4583
10536C1010j65752M923K62760j07442l8124K71006j64702l49730J23690J51081
10526A8720k6028j66917q8392M11709l3636j01967j33813K67291M5994J02531
10516B95492k12014K8855O4468j01108q5339K6518j416k5603J34241j79322r1497
10505a46725J28423j90755R3669J98177l57219J32878P2336o6613J53595k51690
10495b33924r8248J8747P8155K5537k9359n5363R6982M7953J76598j43868M3660
10484g3130n8268o5283k2401n374K68176q4039L3172M2542k86974K37396l5723
$$ plain form
10558 -74925 -180039 -14235 9357 -84832 2668 -71809 143855 156598 20138 -13548 -39613
10547 -39613 -352313 -295247 -157785 72067 68504 51649 102505 34289 -8433 -63573 31010
10536 31010 -134742 -129819 132941 25499 -12625 258381 93679 -256051 -132361 18720
10526 18720 -7308 -174225 -262617 149092 115456 13489 -120324 146967 192961 295492
10516 295492 83478 112333 176801 75693 -9646 16872 15456 -10147 124094 -55228 -146725
10505 -146725 -18302 -209057 -115388 82789 -274430 -141552 -69216 -135829 17766 -233924
10495 -233924 -332172 -313425 -235270 -209733 -239092 -294455 -197473 -149520 27078 -116790 -73130
10484 -73130 -131398 -196681 -219082 -224456 43720 -40319 -7147 35395 -251579 -14183 -49906
10473d9906k1938r2376j85746M13697l0323J605j48510k7292k5210R5685P4426
10462D112L6730O0215j74830J5617o2017L4924L21264l9400j75393r6190l27799
10451d02767K970K53213P552p5982k4953J55477J5236j28379P0958l5893J72669
10440A0101j64717l06722J70222J35265Q5483j4262p5851K01082J0565J19138
10430A70304K4609k79865J60085k10623r6201l3845O0756J60166K52392j33836
10420G3942m222M6087o3816p8097j2515J15264j14467j76277J11233K6357j01046
10409a77557M8084R1434J85446n982k6431j7371p1680j48988j16113J80685j03511
10398a61984J53212K6324q4984K57268l10514o9499J06665J37535j6471j1398
$$ plain form
10473 -49906 -71844 -164220 -349966 63731 33408 35013 -113497 -140789 -165999 -70314 4112
10462 4112 40842 101057 -73773 -58156 -120173 -85249 236015 196615 21222 -74968 -402767
10451 -402767 -399797 -146584 -139032 -215014 -239967 -84490 -69254 -197633 -126675 -162568 10101
10440 10101 -154616 -461338 -291116 -155851 -70368 -84630 -160481 40601 51166 170304
10430 170304 194913 -84952 75133 -135490 -231691 -265536 -204780 -44614 207778 73942
10420 73942 69720 115807 51991 -26106 -38621 76643 -37824 -214101 -102868 -76511 -177557
10409 -177557 -129473 -38039 147407 141425 114994 97623 25943 -123045 -239158 -58473 -161984
10398 -161984 -8772 17552 -67432 189836 -120678 -190177 -83512 54023 37552 26154
10388B6154j38652J32874J20856l52358l1564n751K21919J8703q9972K6353j4612
10377h6050K56079j55713j95960J35534J73887j95350p2127k4518j83728M7973
10367b99973L75724M2689j12731M3681j82575k5927r1313j6210J09335n533Q8965
10356g3868P7492M6574p2589j96242N8651L21386j16692r7834m756j7364J37883
10345F2641J30175j84957j29605K64406r5233r0000k31682J80375L0584N7613
10335e683J15017J06220R6458j43290Q2829j92859O6836J28370k17992j06163
10325g0257R4265n0894k9118J3566J65849j97737J50127J2894K549n9554j70166
10314a38476R6661k2356n0369n5182K14048n7756Q3890J06891p8364k02840j08196
$$ plain form
10388 26154 -112498 20376 141232 -211126 -242690 -248441 -26522 -7819 -97791 -71438 -86050
10377 -86050 170029 14316 -181644 -46110 127777 -67573 -139700 -164218 -347946 -299973
10367 -299973 75751 118440 5709 49390 -133185 -159112 -250425 -266635 -157300 -162833 -73868
10356 -73868 3624 50198 -22391 -218633 -159982 161404 44712 -53122 -57878 -75242 62641
10345 62641 192816 7859 -121746 142660 47427 -42573 -274255 -93880 -63296 -5683
10335 -5683 109334 215554 312012 168722 251551 58692 125528 253898 35906 -70257
10325 -70257 24008 -26886 -56004 -42438 123411 -74326 75801 88695 91244 31690 -138476
10314 -138476 -41815 -64171 -114540 -169722 44326 -13430 70460 177351 98987 -103853 -212049
10303b12049O3001O7864J10075O8281l7266J83161q4863k30076L1582J82008q0588
10292F1130j06917m6803o4589m1379J02607j52288K15467r8638l86103J63647
10282c53866k6874m7737L49293L2095j26278p3936p5411J06694n4437N7432K11339
10271a686L45538j78361J5637r1746L5372J33117n7632j86418k41050J81502M1736
10260c991O507K17910m6588j76779K23421p0189j44322J0237J21771J38858j77047
10249I9788J7592j01917k07073M6784J98641Q791n9141m5680O0976J5373k62387
10238b28253K4951o2376O0902K00296j8365J41186o0388Q6894j78910l8540J57403
10227H4800j86269J04472J03990N8877j65769j21609J69260j94996Q8111R7619
$$ plain form
10303 -212049 -149048 -81184 28891 97172 59906 243067 158204 -71872 -40290 141718 61130
10292 61130 -45787 -92590 -157179 -198558 -95951 -248239 -32772 -131410 -517513 -353866
10282 -353866 -380740 -428477 -79184 -47089 -173367 -247303 -322714 -216020 -270457 -213025 -1686
10271 -1686 343852 165491 181128 89382 124754 257871 200239 13821 -227229 -45727 -3991
10260 -3991 2516 220426 173838 -2941 220480 150291 5969 16206 137977 276835 99788
10249 99788 117380 15463 -191610 -144826 53815 62606 3465 -42215 18761 34134 -228253
10238 -228253 -203302 -265678 -204776 -4480 -22845 118341 57953 144847 -34063 -72603 84800
10227 84800 -101469 3003 106993 165870 101 -121508 47752 -147244 -59133 38486
10217C8486k58171J11517J07044M6201j88003K8495o0072M9938j99171O5066N9016
10206a99654K29364L6430k00095N7949j3281m4261k3147Q0219o6788k09193j01927
10195d54384K21187J71504J52397j1025k70964j1539N6340J57011R8062p7002
10185C1587k385n6456p7279j12186M8312K01948J22761k25758Q5081L1505O5840
10174A12970r4306o7787m150k64613K7345L12832P8721j15619p2722j24804o5774
10163b77907J42039k17247J97451K25576k20577k88673J58630o3428K83846m1668
10153a01958p0494m6230j58510O3886j20822K23351k53784J04951L00462j25126
10143a84274q9071L8578J27262R2855j0213M7025L2546q8625K1289L9246J47662
$$ plain form
10217 38486 -219685 -108168 -1124 45077 -142926 -114431 -174503 -124565 -323736 -258670 -199654
10206 -199654 29710 66140 -133955 -76006 -89287 -133548 -156695 -76476 -143264 -352457 -454384
10195 -454384 -233197 -61693 90704 79679 -191285 -202824 -146484 10527 108589 31587
10185 31587 29202 -27254 -104533 -216719 -168407 33541 156302 -69456 15625 47130 112970
10174 112970 18664 -49123 -53273 -317886 -290541 22291 101012 -14607 -87329 -212133 -277907
10163 -277907 -135868 -353115 -155664 69912 -150665 -439338 -280708 -344136 -60290 -101958
10153 -101958 -172452 -218682 -377192 -313306 -434128 -210777 -464561 -359610 -59148 -184274
10143 -184274 -273345 -234767 -107505 -14650 -24863 22162 54708 -33917 -12628 26618 174280
10132A74280R4138j24863j8508J09001l02602Q5027n8524J22796J53500n9552
10122A74693j12946q5339j42602o0526J71966q6175l7174J7072J00847P0985l01101
10111b90300j30481J75659L08484J5701k13373l0450M864R8501k85318K28811
10101a17902J00807j00110M541K48268L420j09369J19532n9859m5836L3090l2986
10090D3596k39634n5244J17815P165O3325L08296k81040k24409l1596M0274K05070
10079d6382j19933o7509O235P7275P6068J15954l17416P7651K57238J40589k56804
10068e7034Q6429j8811j50356k628M9649j0877l8080L8706P359o0913J37419j13049
10056a32186N9789o4773o5598Q9638r5220j07199K04836J16005Q5032M7515p9122
$$ plain form
10132 174280 268418 143555 125047 234048 -68554 16473 -42051 80745 234245 174693
10122 174693 61747 -23592 -166194 -226720 -54754 -140929 -178103 -161031 -60184 10801 -290300
10111 -290300 -420781 -245122 63362 79063 -134310 -164760 -159896 -61395 -346713 -117902
10101 -117902 -17095 -117205 -112664 135604 139024 29655 149187 89328 43492 76582 43596
10090 43596 -196038 -251282 -133467 -126302 -62977 245319 -35721 -260130 -291726 -251452 -46382
10079 -46382 -166315 -233824 -227589 -150314 -74246 41708 -275708 -198057 59181 199770 -57034
10068 -57034 29395 10584 -139772 -142400 -92751 -103628 -141708 -103002 -95643 -156556 -19137 -132186
10056 -132186 -72397 -137170 -202768 -113130 -208350 -315549 -110713 5292 90324 137839 58717
10045E8717m5895p3618o2254J60827p0823J89107l3651p4873J19204j82573j10575
10034a26407m0792K10432L4971J5128j4680j29517o7915k1224O6785L5615J4285
10023b3319j45534J07892J83655L1766j01031l15598m7360L49416l113k60317
10013b23543R9198j34903J17873j54914J18572K08670l08952J11376j63988K05437
10003a25174K17950j14815J0049j27890K27830N5627l0288j75826P0682J42827
9993A50972j69341L0086J82400o8699J864k46792K5643L01201J05426j86993m4928
9982H0839j71388J4477k1775j34226O2995J35241k07369J58989j1363K11615o647
9971A11388l5793N3081j21585o5701r2334j11456J21439J9760j75789k73447K76878
$$ plain form
10045 58717 12822 -60796 -123050 37777 -33046 156061 122410 47537 166741 -15832 -126407
10034 -126407 -167199 43233 78204 93332 78652 -50865 -118780 -140004 -73219 -37604 -23319
10023 -23319 -168853 -60961 122694 154460 53429 -262169 -309529 39887 36774 -223543
10013 -223543 -124345 -259248 -141375 -296289 -177717 30953 -277999 -166623 -330611 -125174
10003 -125174 92776 -22039 -11990 -139880 87950 143577 113289 -62537 8145 150972
9993 150972 -18369 11717 194117 125418 127282 -119510 -93867 207334 312760 125767 80839
9982 80839 -90549 -76072 -97847 -232073 -169078 -33837 -241206 -82217 -93580 118035 111388
9971 111388 75595 128676 7091 -58610 -150944 -262400 -140961 -121201 -296990 -570437 -293559
9960b93559J66454J69641k89672j45106J01641p220K73072P752j64748J08557
9950g3188R8389j42686N3674k5644o0051M4830J54073j19322m9207L73803k27459
9939B7212O36k54091Q8051P6117o6118O3381L5102J50427k35792o2180J11180
9928f6075J49088j93704O4315j08506P2219j3858m6940N5059r6615j11349J04769
9917a91597j34699K75833l9058L7269N2897j3258R2904N7044j66986p0960J04774
9906D163m4126m4983j29095K00864O8480K658l2004j73571L3013k23777K43139
9895i5239K45254K0846k10412l4097j14580J91394N5865k25168Q7251J6182J25387
9884F2683p9400J21739k26528r0060L23787P2759j96285k12539L03548j07419
$$ plain form
9960 -293559 -127105 42536 -247136 -392242 -290601 -297821 -24749 -16997 -181745 -73188
9950 -73188 25201 -117485 -63811 -89455 -149506 -104676 49397 -69925 -119132 254671 27212
9939 27212 27848 -226243 -138192 -62075 -128193 -64812 -29710 120717 -115075 -177255 -66075
9928 -66075 83013 -110691 -46376 -154882 -82663 -96521 -143461 -88402 -185017 -296366 -191597
9917 -191597 -326296 -50463 -89521 -52252 645 -12613 80291 137335 -29651 -100611 4163
9906 4163 -39963 -84946 -214041 -13177 55303 57961 25957 -147614 -114601 -338378 -95239
9895 -95239 150015 170861 -39551 -73648 -188228 3166 59031 -166137 -78886 -62704 62683
9884 62683 -16717 105022 -121506 -211566 112221 184980 -11305 -223844 79704 -27715
9874b7715m7219l17038J28016R7093O6538Q3045j27794J90442J86617l50287Q6301
9863c2001j17068J43924Q2737Q3479j91877m0270P8858j8122r689j99732j18948
9852c38709R7858L68720n3750j52359O0903O6538j80857l1144j35502N3336k5956
9841b70922L05826l4362j9284M4923l34731l2627J42636K93036j91164j78853
9831b75522J26051j63574M7306l1780J22882J88842p643j51485N2033N9574j34271
9820a67587J11881n3647j22104J1449K75606J76810j84450j07300O2749j22336
9810a18929P89m7522p0094R6848K5996n6670j36346K82841j009j47451j8516K58762
9798F8699n9389M6589j08820J39993k18931J40375J39880j58944j99984J8861
$$ plain form
9874 -27715 -74934 -391972 -263956 -166863 -100325 -17280 -145074 45368 231985 -118302 -32001
9863 -32001 -149069 -5145 77592 161071 -30806 -71076 7782 -10340 -20029 -219761 -338709
9852 -338709 -240851 127869 74119 -78240 -17337 49201 -131656 -162800 -298302 -244966 -270922
9841 -270922 34904 542 -18742 26181 -308550 -341177 -198541 94495 -96669 -275522
9831 -275522 -149471 -313045 -265739 -297519 -174637 14205 6562 -144923 -92890 -33316 -167587
9820 -167587 -55706 -109353 -231457 -220008 55598 232408 47958 -59342 3407 -118929
9810 -118929 -118140 -165662 -235756 -138908 -112912 -169582 -305928 -23087 -24096 -171547 -190063 68699
9798 68699 9310 55899 -52921 87072 -131859 8516 148396 -10548 -210532 -191671
9788a91671L1808l7559P3980J64495j88384J61244M5179j50619j13353P1617j43562
9777b76825J31278R9676j13227j30205K0126Q2098J76949J31286k21699m0211
9767a40754p8535O793K52007k5120k76779n2559Q785K41335p7481j811L7982q8636
9755a94773k0270J31753m7123k00232J90249J39787k8414J36916n6064l2977K18761
9744B37613m0407m9828m4606j81563m9369J52095K01612j89411q2162l1054j78789
9733b55869M8183r8102J15735J32951j2969R7438o9009J26918N6879l7096k63844
9722a58785J11079M858J23755j17231q6277O8892j3721J38720J24588k26511J57521
9711A26888q4810j72270Q5300j56303J08071O7285P9539n8046j15391k5372J41493
$$ plain form
9788 -191671 -159863 -197422 -123442 41053 -147331 13913 59092 -91527 -204880 -133263 -276825
9777 -276825 -145547 -45871 -159098 -289303 -269177 -187079 -10130 121156 -100543 -140754
9767 -140754 -219289 -212496 39511 14391 -262388 -314947 -306162 -64827 -142308 -144119 -106137 -194773
9755 -194773 -215043 -83290 -130413 -330645 -140396 -609 -29023 107893 51829 18852 237613
9744 237613 197206 147378 102772 -78791 -128160 23935 225547 36136 -46026 -77080 -255869
9733 -255869 -207686 -305788 -190053 -57102 -70071 27367 -41642 85276 142155 105059 -158785
9722 -158785 -47706 -42848 80907 -36324 -122601 -53709 -67430 71290 195878 -30633 126888
9711 126888 42078 -130192 -44892 -201195 -93124 -25839 53700 -4346 -119737 -145109 -3616
9700c616R5683k47575k2454J85254j408j09540p2846l5436N8586J76006J43375
9689A66029q2772m2476m2357q9543o7745J66790o6870l9116j8535M01115j13999
9678A70521k91081l9198L8714o6455k7307N7793J9555p4264J31633j03847j96682
9667c80618J46107L75871N4403j01283N9490l5096J48805k9299k86074Q7946r0640
9656e0388R8734K38589j46353K4313j5449m7516l26991J57645J51607k27468K09940
9645F6663P4202k09278j39045R0017K31580N634p2306m1919K07495j45123j29710
9634f1790O5180R8307j00049q5617n219Q0703K3268J75548j27065j46125k42414
9623c25273K35321R8604j84812K2751M0652K3981o6227J58082R1121M6704k72317
$$ plain form
9700 -3616 92067 -155508 -177962 7292 5884 -103656 -176502 -211938 -153352 22654 166029
9689 166029 83257 40781 -1576 -91119 -158864 7926 -58944 -98060 -116595 284520 170521
9678 170521 -120560 -159758 -121044 -187499 -214806 -157013 -137458 -211722 -80089 -183936 -380618
9667 -380618 -234511 141360 195763 94480 153970 118874 267679 238380 -47694 40252 -50388
9656 -50388 48346 286935 140582 164895 149446 101930 -225061 -67416 84191 -143277 66663
9645 66663 140865 -68413 -207458 -117441 114139 119773 47467 5548 213043 67920 -61790
9634 -61790 3390 101697 1648 -83969 -89188 -8485 14783 190331 63266 -82859 -325273
9623 -325273 -89952 8652 -176160 -153409 -112757 -88776 -155003 3079 94200 140904 -131413
9612a31413j56703J35127L09393k36197k05195K93214n2456K564Q2047J2766M5008
9601I8155r613l7907J10550J29597k30565m64081L79793j10331q174J34682j9950
9590b7844R2194m3834M4436o2681m6290K03249R3917m1153r2036L1493K46595
9579C98046k04076l2991N762N1230J2779j23291j01517r2829J5563q6725N7087
9568a00962P0595Q0162l4737r1425O3760L2166J5585P2256k14362o7511J43419
9557c1054J5308J90426J2646r741j22231J40185N939k79166n1057j48990J15911
9546a61824J88180K86843k02265k13481J97130j3828j05508j25943M9637k1472
9536a22531J3111K25949k9239J01904j62904l35939J06442K21225J6116j07402
$$ plain form
9612 -131413 -288116 -152989 156404 -79793 -284988 8226 -44230 -41666 40381 53147 98155
9601 98155 88542 50635 161185 290782 60217 -403864 -24071 -134402 -142576 -7894 -27844
9590 -27844 64350 20516 64952 2271 -44019 159230 253147 211994 119958 151451 398046
9579 398046 193970 160979 166741 217971 230750 107459 5942 -86887 -71324 -158049 -100962
9568 -100962 -30367 49795 15058 -76367 -12607 19559 35144 107400 -106962 -174473 -31054
9557 -31054 -15746 174680 187326 177585 55354 195539 201478 -77688 -128745 -277735 -161824
9546 -161824 26356 313199 110934 -102547 94583 80755 -24753 -150696 -101059 -122531
9536 -122531 -109420 116529 87290 189194 26290 -309649 -203207 18018 34134 -73268
9526g3268q5498n8219Q2335L3020K77929J30570j83399p5640r3855J90603K49943
9515C94521l36203R5743j91033J1716J67751j60404r778j44311J47640k5830q0539
9504a30727P9725Q6561k3344R4767Q8871l20511p2318J44425J3899N6356J0609
9493B8313j02417n4557P3940L6604j37243J06598P0491j9050K21539J30716m2944
9482C11990k88345J24358q1182k14841J34722L8241q8206J45490M0873r464K5415
9471A39051j66213J2888j64359J14665k17163j6529L2237J64365o7253J78399
9461A0088p6583J6767J56988Q3715j63440k26989R4422O4165J22270J3499M6805
9450A41707j56033m8091J81103k22754M239K2771P8287j07261k8980K17380J20916
$$ plain form
9526 -73268 -158766 -216985 -134650 -101630 176299 306869 123470 47830 -46025 144578 394521
9515 394521 58318 154061 -36972 -25256 142495 -17909 -27687 -171998 -24358 -50188 -130727
9504 -130727 -51002 35559 12215 106982 195853 -124658 -196976 -52551 -38652 17704 28313
9493 28313 -74104 -128661 -54721 -18117 -155360 -48762 21729 2679 224218 354934 311990
9482 311990 23645 148003 66821 -148020 -13298 24943 -63263 82227 123100 113636 139051
9471 139051 -27162 -14274 -178633 -63968 -281131 -297660 -265423 -101058 -168311 10088
9461 10088 -66495 -49728 107260 190975 27535 -199454 -105032 -40867 81403 94902 141707
9450 141707 -14326 -62417 118686 -104068 -99829 -77058 1229 -106032 -135012 82368 203284
9439B03284J49948j76588j86675n5278J71160k61813P7779P6355J31093p7725
9429E1540O7358O3718n9880j68667J6966J36500o9246P6893j09577j8628p5134
9418h8157j33459P1390J74219K0133m5197j59860L0419J12640K4344n4807j33086
9407a81421K61213j76139Q2546J12375j65445j01281k10131J95321J21189J25913
9397F4140L48379j02649k40192K3025Q8738k79097j19848K89553j484K2067K7121
9386A19753j35040q4054N0085J01375N5128R1534l61429J17687K71397k25433
9376A003k56952O0251J06859m183L39150k95473J45142J28702k07956L6865K7710
9365H1118j30004j44711J02035q2830J98448q6530O4630J02201p6239k39421M1030
$$ plain form
9439 203284 353232 176644 -10031 -65309 105851 -155962 -78183 -1828 129265 51540
9429 51540 118898 182616 122736 -45931 -28965 107535 38289 115182 5605 -13023 -88157
9418 -88157 -221616 -150226 23993 44126 -1071 -160931 -130512 -17872 6472 -48335 -181421
9407 -181421 79792 -96347 -13801 98574 -66871 -168152 -378283 -182962 -61773 64140
9397 64140 412519 309870 69678 92703 181441 -97656 -217504 72049 70565 92632 119753
9386 119753 -15287 -99341 -49256 52119 107247 198781 -162648 -44961 226436 1003
9376 1003 -255949 -195698 -88839 -93022 246128 -49345 95797 224499 16543 53408 81118
9365 81118 -48886 -193597 -91562 -174392 24056 -62474 2156 104357 28118 -211303 -170273
9354a70273J37341J22879n7470J12960P5021l4167j35311n2173J97141k47111
9344e1163j01748J40645J63171j43624p6586K49040K6578l37376J22058R7069
9334H8064K0783q4149j97698O3693K2116o6193M6414P6857J29913j10367j5829
9323b6396L7366j6913p5471J52279M5644j38418J48655R6873j56621k7774O7541
9312A06765N9054k3156r0671J58763j30889M1669n3854j3186K0383k2065m4449
9301H364j5834J57497j8986l60970J493J52636K68284k91267R958J55872k0499
9290D6548O7039l18138j27773P5088J52950j33959k8507j4987O4273J27691J71488
9279H1713N3229p5043j10059J20148m2235o9717J4409j28699K6408J8563l7176
$$ plain form
9354 -170273 -32932 89947 32477 145437 220458 186291 50980 -1193 195948 -51163
9344 -51163 -152911 -12266 150905 7281 -69305 179735 206313 -131063 -9005 88064
9334 88064 108847 24698 -173000 -109307 -87191 -153384 -106970 -30113 99800 -10567 -26396
9323 -26396 10970 -5943 -81414 70865 116509 -21909 126746 223619 66998 39224 106765
9312 106765 165819 142663 51992 210755 79866 121535 67681 54495 74878 52813 8364
9301 8364 -7470 150027 131041 -229929 -228436 -75800 192484 -98783 -88825 67047 46548
9290 46548 113587 -204551 -332324 -257236 -104286 -238245 -266752 -281739 -217466 -89775 81713
9279 81713 134942 59899 -50160 69988 27753 -41964 -27555 -156254 -129846 -111283 -148459
9268a48459K119R2694J51271J75978j16822j22799P5680j18245n9959M7641P7615
9257E6714K90158l6348m25765K02785K73772n2680k69523K15873O3385j15631
9247B02740j84252K42470j34692j57333p0453L6280k67362L08555K1263l0797
9237c3581K22003m4550j7409n6343K11129m4056K6629Q5272R5130r9554l7260
9226C07410r0800K6970M8810J86815k5178J44088l9928j69419q9367J35994P9935
9215E15330p8291k70704J14585P852j37451J46902O6762j4530q0609J61890M966
9204D36702j55310o9042M6330R096k18958R1748O3355j07789N6392J23725j26600
9193A49649j7333n280O5076O1965K96195j87088m28422J51745J76207j23475j54467
$$ plain form
9268 -148459 -146340 -53646 97625 273603 156781 33982 109662 -8583 -68542 -20901 56714
9257 56714 346872 310524 -115241 87544 361316 308636 39113 254986 318371 202740
9247 202740 18488 260958 126266 -31067 -101520 -65240 -332602 -24047 -2784 -33581
9237 -33581 188422 143872 126463 70120 281249 237193 263822 349094 444224 344670 307410
9226 307410 216610 243580 292390 479205 454027 598115 558187 388768 299401 435395 515330
9215 515330 437039 166335 280920 288772 151321 298223 364985 350455 269846 431736 436702
9204 436702 281392 212350 258680 267776 48818 140566 203921 96132 152524 276249 149649
9193 149649 132316 127036 192112 254077 550272 363184 -65238 86507 262714 139239 -15228
9182a5228K05608J33401j388n023J7966j34631j44527K55929J4807o539J99305
9171E19680J6639q1645R4678k01519J82137K1900j68250M2009j528K24069l45678
9160C02492L4420J38684k1730n1885K955M2919J72438m9796r6006k05502j12488
9149A56501J72511J5268R8866o0102j20717j8786K27081J26987j08232L1065j61874
9138C58568j40966R7715j44366k49001K13217J18510j44118L7193m4733N1463
9128A53482k8331J33098j33230j84036O1687N5741j73975J23243Q5173k656J89234
9117B79430q5061r2867J10763k16646l4628R5706N7736R7871o8886J51427j35642
9106A59203J50421j1958p3162l4692J88436k4420j66265m0573j29855l4246J32281
$$ plain form
9182 -15228 190380 323781 322393 317370 335336 200705 56178 312107 326914 320375 519680
9171 519680 536319 454674 549352 347833 529970 551870 383620 425629 424101 648170 302492
9160 302492 336912 475596 453866 401981 404936 447855 620293 570497 474491 268989 156501
9149 156501 329012 344280 443146 383044 262327 243541 470622 597609 489377 520442 358568
9138 358568 217602 315317 170951 -78050 135167 253677 109559 146752 102019 153482
9128 153482 125151 258249 125019 -59017 2670 58411 -115564 7679 92852 90196 279430
9117 279430 194369 101502 212265 -4381 -39009 56697 114433 212304 143418 294845 159203
9106 159203 309624 297666 224504 189812 378248 353828 187563 146990 17135 -17111 115170
9095A15170K543m1151q5777K2497j29818o9318J81212J84684J62778q4969J2704
9084B70555r1094j78960l7420L59382j03058o8649L4677k2850m5164j51712j17529
9073a51822P2183K77054q1264j41267N4283n2374j8880K21894p5174j89876j03215
9062a88458M0339p962K31109m1163r2564P9206L8432j3714O0160K23884j9633
9051C09636j00173k35446j45973J11665n5355K86171j32400o7751L77378K5928
9041C73680J11694k15273l6117m567j23913n2869K14044Q6527Q5580J4454j55616
9030B97624l42584L9680L0699J60361J17421q2735J33904k35692J8177Q9152j22746
9019A03261l6193k45K46828m4529m26906J32541n2762J8550K50241N648n7094
$$ plain form
9095 115170 117713 76562 -9215 13282 -116536 -185854 -4642 180042 342820 257851 270555
9084 270555 179461 501 -36919 322463 219405 150756 185433 162583 117419 -34293 -151822
9073 -151822 -79639 197415 116151 -25116 29167 -23207 -42087 179807 104633 -85243 -188458
9062 -188458 -148119 -156081 75028 33865 -58699 20507 58939 45225 105385 329269 309636
9051 309636 209463 -25983 -171956 -60291 -115646 170525 38125 -29626 347752 373680
9041 373680 485374 270101 233984 229417 105504 52635 266679 353206 438786 453240 297624
9030 297624 -44960 -5280 25419 185780 303201 220466 354370 118678 136855 226007 103261
9019 103261 67068 66823 313651 269122 -157784 -25243 -78005 -59455 190786 196434 139340
9008A39340M7110r7123j28903J22243j4353O8267R7361L40008k09006j92293K351
8997A75002O04R2803q1920K46035k32266K7770p4116O853J37586j17447Q0068
8986B60972k10204K225k2925o6753K3207J97054r0875j22379K58457P2618K5694
8975C27091N1800k2071k61633J14236N5265J20612j36468q8548L3264J47644j07861
8964B33331j18121K10024j52966P1249L5106m504k2835p3773J65189j30022R1438
8953C04116O7050k22989l3554J08805R6971Q3620k20122M8417l0715K3725J25765
8942C51089j42975K5565J47553q5146k40j08917r2934J46795K8000N9776J59880
8931D88446k39097j09021K88904M5759j73630o5799j65510K4615J65831L6277
$$ plain form
9008 139340 186450 89327 -39576 82667 68314 136581 233942 573950 364944 172651 175002
8997 175002 175606 268409 186489 432524 200258 228028 153912 160765 298351 180904 260972
8986 260972 50768 52993 30068 -36685 -13478 183576 92701 -29678 228779 301397 327091
8975 327091 378891 356820 95187 209423 264688 385300 248832 160284 193548 341192 233331
8964 233331 115210 325234 172268 243517 278623 274119 251284 177511 342700 212678 304116
8953 304116 371166 148177 114623 223428 320399 404019 183897 232314 201599 225324 351089
8942 351089 208114 233679 381232 296086 295846 186929 93995 240790 268790 328566 488446
8931 488446 249349 140328 429232 474991 301361 235562 70052 94667 260498 296775
8921B96775j06828n4845R4054L2148J26207j33228O5466L0029Q8032k14364J71468
8910C94914k1866J00651r0671j29895Q268J69934j83471J18498K28419R8422j38320
8899E54883l32031j12588L17702o4546J8686j6631k3418J90153M0970L5842m9305
8888E59717k55449j16639K83610P9563P1235q6947k15334M4942J95224K09762
8878G69684q3937j88069R7395J6532n3477L2242l6283Q0286J21437J1140n2725
8867G14225k38759Q8889p5788m6069K3895j6629J75791m7983J26520N3483j36339
8856F21236R2849r6924P4483k79919K46683Q2727L382o194k58024j517J40563
8845F19345J2253O8334j6323p1583q906K5789K3435J20561Q4680l38467O8436
$$ plain form
8921 296775 189947 135102 229156 261304 387511 254283 319749 349778 437810 223446 394914
8910 394914 373048 473699 383028 253133 261401 431335 247864 366362 594781 693203 554883
8899 554883 222852 110264 427966 363420 382106 365475 342057 532210 573180 609022 559717
8888 559717 304268 187629 471239 550802 622037 535090 319756 364698 559922 769684
8878 769684 685747 497678 595073 611605 558128 590370 554087 634373 755810 766950 714225
8867 714225 475466 564355 488567 442498 466393 449764 625555 577572 704092 757575 621236
8856 621236 714085 617161 691644 411725 658408 741135 744517 738323 480299 478782 619345
8845 619345 631598 699932 683609 612026 603120 628909 652344 772905 857585 519118 587554
8834E87554L79187j55025j16485J9335q570n0509n5259J4612j92220r1131L88812
8823G20301q0250n1600j8143k7394P8898N092K08915R2661k38116n4413q2j37880
8811D97989J51759J92282n4612L5671n2907j64656J21824P1932j12545J28484
8801H15221j73249j72859K95555J17906k91662Q761Q8494n0581J94307k25486
8791F06407j30809K43236J81880j52178J268l2547P5981j83382L5884M2892k8097
8780F60535N6158K6366j42437P0271j5946L064K59190l44394K1764k2544L13837
8769H85864J02039j59909P8812j97396o0337j24260J69371M12340N3776J24370
8759A284670n0552k82748l2559J02221J4982L575q8069K6539j17656J10169j52997
$$ plain form
8834 587554 966741 811716 695231 714566 705996 655487 600228 614840 422620 331489 720301
8823 720301 640051 588451 570308 542914 621812 626904 835819 928480 690364 635951 635869 497989
8811 497989 649748 842030 787418 823089 770182 605526 727350 799282 686737 815221
8801 815221 641972 469113 764668 882574 590912 599673 688167 637586 831893 606407
8791 606407 475598 718834 900714 748536 749804 717257 793238 609856 645740 688632 660535
8780 660535 716693 743059 600622 670893 654947 658011 917201 572807 594571 572027 885864
8769 885864 987903 827994 906806 709410 649073 524813 694184 1106524 1160300 1284670
8759 1284670 1234118 951370 918811 1021032 1036014 1039589 951520 978059 860403 970572 817575
8748H17575J03080j6984j12907q6939O1661K84924k38376J4262j08900J73651
8738H91047R2697j42925K9112J50154M2848m400j78009N3932P2989k62644M3863
8727G88664K29397m1634o0326N3008J82816q4133J25754M4132j22134j07178l307
8716A005059N8211O3743j3937N63L9391J0585o1353J04339j64206J23178Q4093
8705A249666J15004P3952j15916K952J64680M3900o6199O567l4995j18854J90670
8694A511427N6508R6854k8887l27941L07215j6382J78974j46801k1246N2694j76488
8683A485927K97554j06804k7470J61634j16249k5136J44279r8850K7396J85598
8673A927879l8656J46958K7120k35J57228m1281k5317K9077k879n8149q0991j23397
$$ plain form
8748 817575 920655 903671 790764 703825 765486 1050410 812034 826296 717396 891047
8738 891047 983744 840819 869931 1020085 1062933 1058533 880524 934456 1007445 744801 788664
8727 788664 1018061 976427 916101 969109 1151925 1067792 1193546 1237678 1115544 1008366 1005059
8716 1005059 1063270 1127013 1113076 1113639 1153030 1163615 1102262 1206601 1042395 1165573 1249666
8705 1249666 1364670 1438622 1322706 1325658 1490338 1534238 1468039 1474606 1439611 1320757 1511427
8694 1511427 1567935 1664789 1635902 1307961 1615176 1598794 1777768 1630967 1609721 1662415 1485927
8683 1485927 1783481 1676677 1649207 1810841 1694592 1669456 1813735 1714885 1742281 1927879
8673 1927879 1889223 2036181 2063301 2063066 2220294 2179013 2153696 2182773 2179894 2121745 2040754 1917357
8661A917357J16275K97800J66704j45409j28209j1273m8835J18761J08087J71909
8651B563167O7810Q4997j32396j28005K9547K64765k60412K00179K46558K65650
8641C201860J77223m0201k02572p3039L74774K9380j8519Q9099P5010J86240j20458
8630C678797n8589K28611J84032J35628K77980L41551q2466J07300O232J24624
8620D943700K91541K10386N62641J50231Q4430K19932J12666N13444M55509J18665
8610G663145K68442L71729M96970J15285k5106K28148J01794K38683k51497L6954
8600I244547L20580k6936K2646k5729j30283M3460m6936m5323l8207p671J80791
8589I490939J34109J32801J95717Q5214L17791P8139N7006L56847K09380J35770
$$ plain form
8661 1917357 2033632 2331432 2498136 2352727 2224518 2213245 2164410 2283171 2391258 2563167
8651 2563167 2630977 2715974 2583578 2455573 2485120 2749885 2489473 2689652 2936210 3201860
8641 3201860 3379083 3338882 3136310 3063271 3438045 3467425 3448906 3538005 3613015 3799255 3678797
8630 3678797 3620208 3848819 4032851 4168479 4446459 4788010 4705544 4812844 4819076 4943700
8620 4943700 5235241 5445627 6008268 6158499 6242929 6462861 6575527 7088971 7544480 7663145
8610 7663145 7931587 8303316 8800286 8915571 8890465 9118613 9220407 9459090 9207593 9244547
8600 9244547 9565127 9538191 9560837 9535108 9404825 9448285 9401349 9356026 9317819 9310148 9490939
8589 9490939 9625048 9757849 9953566 10038780 10356571 10434710 10491716 10848563 11057943 11193713
8579A1193713K30242M69818J48972K42119J49140J06002J2515K59577J67939m1484
8569A2938553K01613o6638n682J35222r9800L884J9656P2823P7687K35236j20485
8558A3392069L24158L45964O5066J61543J55489M57259J39025P928k85944K96400
8548A5058957M29866P8618K57882L23731R9349J66974L11755M217L58861P90121
8538A7880331L4917K59083L82646N29073O38165N50146M88655M06323M28409J67348
8528B1765096K97112N44166M04129L12654K24777j37197N5498j3087L8713J63256
8518B3655117j8265J96484k6267j00233K10808L38691K44659L94182O98285P46664
8508B6340125N19280R22977O40657R20564Q88686M57226K36792N17041N33758
$$ plain form
8579 11193713 11423955 11893773 12042745 12284864 12434004 12540006 12552521 12812098 12980037 12938553
8569 12938553 13140166 13073528 13067846 13203068 13103268 13107152 13126808 13199631 13277318 13512554 13392069
8558 13392069 13716227 14062191 14127257 14288800 14444289 14901548 15040573 15048501 14762557 15058957
8548 15058957 15488823 15567441 15825323 16149054 16248403 16415377 16727132 16731349 17090210 17880331
8538 17880331 17915248 18174331 18556977 19086050 19724215 20274361 20763016 21169339 21597748 21765096
8528 21765096 22062208 22606374 23010503 23323157 23547934 23410737 23466235 23453148 23491861 23655117
8518 23655117 23636852 23833336 23807069 23706836 23917644 24256335 24500994 24895176 25593461 26340125
8508 26340125 26859405 27782382 28423039 29343603 30232289 30689515 30926307 31443348 31977106
8499C1977106J15948j57433j50175l55974n00192p29651j048890o61302q43472
8490B7645965r70699j011177j068917j123253r45906n05651k64580m14069k58458
8481B1083255m41631K08747L0408L02734J91205L41870L62608M16001P13255L43163
8471B3551615N90326M51937L02757M79134K13017p9820l63103o89139q96231j324519
8461B2235974j430677j132559r46352q53186p90610o68879k67400m46650n11420
8452A5188241l76773l78339o53534l46323l19018j15889j74560j32497k98463
8443A2392845k23895l6967j61169O7225J54682J91949K98638N4844l97541l76590
8433A1964021l19764j72514j31087q2120r2882j53978m18926j21912O5457J73971
$$ plain form
8499 31977106 32093054 31935621 31785446 31429472 30929280 30199629 29150739 28489437 27645965
8490 27645965 26675266 25664089 24595172 23471919 22526013 22020362 21755782 21341713 21083255
8481 21083255 20641624 20850371 20880779 21183513 21374718 21716588 22079196 22495197 23208452 23551615
8471 23551615 24141941 24593878 24896635 25375769 25588786 25508966 25145863 24456724 23560493 22235974
8461 22235974 20805297 19672738 18726386 17873200 17082590 16413711 16146311 15699661 15188241
8452 15188241 14811468 14433129 13779595 13433272 13114254 12998365 12823805 12691308 12392845
8443 12392845 12168950 12131983 11970814 12038039 12192721 12384670 12683308 12738152 12340611 11964021
8433 11964021 11644257 11471743 11340656 11258536 11165654 11011676 10592750 10470838 10536295 10710266
8423A0710266n8093j27646r1918j67747J76833l5440l4592M5562m6836J56844
8413A0527233L910j4054j44976K58386K05844J64038q4147k9469K61653L39851
8403A1488269j12751k14882K00490R9178K7391M5291L9107R8151J44242K08852
8393A2023338J28724J42926J01322j58874J43243N5916o246Q91J24091J94450
8383A2749781K38746j34752K54738o5578K57029K80671P939N0073L10419M443
8373A3953509M57844J79228j48648K09929P7242K84982p4745J03923M17677L54312
8363A5815253K53442L10670M29522K78109L41247N98345K49110M97398O33555
8354A9406651P39013P20063R56178P52580J017711Q17029P56747O66598P56973
$$ plain form
8423 10710266 10652173 10524527 10432609 10264862 10441695 10406255 10371663 10417225 10370389 10527233
8413 10527233 10531143 10517089 10372113 10630499 10836343 11000381 10916234 10886765 11148418 11488269
8403 11488269 11375518 11160636 11361126 11460304 11487695 11532986 11572093 11670244 11814486 12023338
8393 12023338 12152062 12294988 12396310 12237436 12380679 12436595 12430349 12431240 12555331 12749781
8383 12749781 12988527 12853775 13108513 13042935 13299964 13580635 13588574 13638647 13949066 13953509
8373 13953509 14411353 14590581 14441933 14651862 14729104 15014086 14939341 15043264 15460941 15815253
8363 15815253 16068695 16379365 16808887 17086996 17428243 18026588 18275698 18773096 19406651
8354 19406651 20145664 20865727 21821905 22574485 23592196 24409225 25165972 25832570 26589543
8345B6589543L73521L88649J19863M8345k96878m96926m00591o02922m82024o78279
8335B4562301j60192l19357j82884m41949j4886L0979j56635M35261M24414M64100
8325B4641152M74382L99228Q41329P52190Q57126J062342R37129Q09686R36534
8316C1711098J065335P00742P68425N74163L74273K59405l63320o53578n85287
8307C3851256j039272j405224j227517j454653j109199j011245j052620m66219
8299B5085307r39611m47333l76930k00941l3856l06029k92268k57979m18672K1583
8289B1833271K85007k15416j44663J02779Q5629j36335J19975M9875l76642k34646
8279B1368834J0208j13124l42755k98171p7413k78746r4369k31022m19256m70393
$$ plain form
8345 26589543 26963064 27351713 27471576 27519921 27223043 26726117 26325526 25722604 25240580 24562301
8335 24562301 24402109 24082752 23899868 23457919 23443033 23474012 23317377 23752638 24177052 24641152
8325 24641152 25115534 25514762 26356091 27108281 27965407 29027749 29964878 30774564 31711098
8316 31711098 32776433 33477175 34245600 34819763 35194036 35453441 35090121 34436543 33851256
8307 33851256 32811984 31406760 30179243 28724590 27615391 26604146 25551526 25085307
8299 25085307 24145696 23698363 23321433 23120492 23086636 22780607 22488339 22230360 21811688 21833271
8289 21833271 22118278 21902862 21758199 21860978 21946607 21810272 21930247 21980122 21603480 21368834
8279 21368834 21379042 21265918 20923163 20624992 20547579 20268833 20174464 19943442 19524186 19053793
8269A9053793k99372l15187l71062n96999l68519j92317k80459p2620k56841j18547
8259A6181870k16440k88401l12797L0760M08813q3367k78993J68382L43686k05233
8249A5748280L32805p2974O4747R9559K53715J48285K11582J15284J58181J60230
8239A7219694n9959k70393j94230k526l24261j25635k09583j12544l48104l91140
8229A5181319m3026M8430j63767J11676l2323J58905o1702R4149J06206R5243
8219A5495110R0592N8389J33497K08182K47388o9254J57927L07918K29489J37940
8209A6997178N1038M0614J04008K06825J00615J71000J99913K36866M85378J59154
8199A8752589K06706l6367K96926L32894L63620J38180O59016P26667l79426N34202
$$ plain form
8269 19053793 18754421 18439234 18068172 17471173 17102654 16910337 16629878 16557258 16300417 16181870
8259 16181870 15965430 15677029 15364232 15394992 15803805 15720438 15441445 15609827 15953513 15748280
8249 15748280 16081085 16008111 16072858 16172417 16426132 16574417 16785999 16901283 17059464 17219694
8239 17219694 17159735 16889342 16695112 16692586 16368325 16242690 16033107 15920563 15572459 15181319
8229 15181319 15138293 15186723 15022956 15134632 15102309 15261214 15199512 15293661 15399867 15495110
8219 15495110 15585702 15644091 15777588 15985770 16233158 16163904 16321831 16629749 16859238 16997178
8209 16997178 17048216 17088830 17192838 17399663 17500278 17671278 17871191 18108057 18593435 18752589
8199 18752589 18959295 18922928 19219854 19552748 19916368 20054548 20713564 21440231 21060805 21595007
8189B1595007R9017L56245L54795K52651N22541L61696M4725K79777J93888J63719
8179B4224061K11154K62614K06625K30155K15654J74029M13634N79266K55318
8170B6772510J92674K99379N71995O26413M04072Q07651M78031P64256M53465
8161C1370446M13448O74295P94945P81315J089519R69932P20180R03549R56782
8152C8674411J103304J119981R79014J008483J169760J398945J697811J664694
8144D8816403J313806J461510J758738J551087J907210J899951J459338J186410
8136F1354453J071048O24682K62206K02158p2921M7143K62520R3088L901L16370
8126F4164648K87577N38946M09065P60897J067007J073849R45850J393392J707856
$$ plain form
8189 21595007 21694024 22050269 22405064 22657715 23180256 23541952 23586677 23866454 24060342 24224061
8179 24224061 24435215 24697829 24904454 25134609 25350263 25524292 25937926 26517192 26772510
8170 26772510 26965184 27264563 27836558 28462971 28867043 29674694 30152725 30916981 31370446
8161 31370446 31783894 32458189 33253134 34034449 35123968 36093900 36814080 37717629 38674411
8152 38674411 39777715 40897696 41876710 42885193 44054953 45453898 47151709 48816403
8144 48816403 50130209 51591719 53350457 54901544 56808754 58708705 60168043 61354453
8136 61354453 62425501 63050183 63312389 63514547 63441626 63488769 63751289 63844377 63848278 64164648
8126 64164648 64452225 64991171 65400236 66161133 67228140 68301989 69247839 70641231 72349087
8117G2349087J763680J863057J806156K189902K381467K204563K293507K580495
8109H9431914K386801K406135J652092J393409N89770m9971k59821q54728j374003
8100I5321598j241893j552025j880545j439411j297664j436257j104213q06090
8092H4563500n62970p00603m03601j86878j58885L223N16664Q49762N83047P95994
8082H5299253J051644P35244R11107J035583R99196J093219J028794J035743M08112
8073I3597895K29296j03308m77868q02944j299109j562737j496644j326883j046672
8064H5711026j184972p88137k50992p11471n38055O986j41174l59793l70489J84589
8054H1557518K58539Q5008N20686K62056J33271L94689N47881P86081M27721N56710
$$ plain form
8117 72349087 74112767 75975824 77781980 79971882 82353349 84557912 86851419 89431914
8109 89431914 91818715 94224850 95876942 97270351 97860121 97810150 97550329 96695601 95321598
8100 95321598 94079705 92527680 90647135 89207724 87910060 86473803 85369590 84563500
8092 84563500 84000530 83299927 82896326 82709448 82550563 82553786 83070450 83920212 84503259 85299253
8082 85299253 86350897 87086141 87997248 89032831 90032027 91125246 92154040 93189783 93597895
8073 93597895 93827191 93723883 93246015 92443071 91143962 89581225 88084581 86757698 85711026
8064 85711026 84526054 83737917 83486925 82775454 82237399 82244385 82103211 81743418 81372929 81557518
8054 81557518 81816057 81901065 82421751 82683807 82817078 83211767 83759648 84545729 84973450 85530160
8044H5530160O74017O18091Q31622J158260J039892J276476J275960J242113J643641
8035I5290232J967452J851797K150284K045575K393526K770259K850773L153743
8027A14473641L422540L477329M815335N910613O753122P708259Q956277J0273605
8019A65790721J1891174J3502900J5666364J8276400K1416953K5046099K8884533
8012C00475144L3130068L4232869K3327438n24648k6119981m2166632m3716107
8005B78638151l6749797k8106633k1517785j6594337j3513982j1405889r312049
7998A41437679p521815o632090n653629n150857m492260m044861l982569l496228
7990A00463370l137683l039403l087937k610238k254497k089789k094850j924167
$$ plain form
8044 85530160 86204177 86822268 87653890 88812150 89852042 91128518 92404478 93646591 95290232
8035 95290232 97257684 99109481 101259765 103305340 105698866 108469125 111319898 114473641
8027 114473641 117896181 121373510 126188845 132099458 138852580 146560839 155517116 165790721
8019 165790721 177681895 191184795 206851159 225127559 246544512 271590611 300475144
8012 300475144 333605212 367838081 391165519 390640871 364520890 322354258 278638151
8005 278638151 241888354 213781721 192263936 175669599 162155617 150749728 141437679
7998 141437679 133915864 127283774 121630145 116479288 111987028 107942167 103959598 100463370
7990 100463370 97325687 94286284 91198347 88588109 86333612 84243823 82148973 80224806
7982H0224806j957307j982986j484876j622858j439036j507717j276166j446135
7974F7507725j091612p54813o62784j004765m42038k19240j97928p9270K9109
7965F3084384m98081j99278j00818m57486o13815r06780r38691r08724j251584
7956E7209127j149655j360090j181699j306553j340798q64941j045008p53148
7948D8207235q85669m15759l90532m19490n12298k79084Q3544j15523Q8459K00785
7938D5561668K33033M69821k9910L023L28273K35606N7875k91876o82550o55744
7928D5229219j015133j181781r34319j078425j429934r97715r44997r89228j100627
7919C5557060p86236r45990q22841o98888o12858n46673m74184j26269n13095
$$ plain form
7982 80224806 78267499 76284513 74799637 73176779 71737743 70230026 68953860 67507725
7974 67507725 66416113 65661300 64998516 63993751 63551713 63332473 63134545 63055275 63084384
7965 63084384 62586303 62387025 62286207 61828721 61214906 60308126 59369435 58460711 57209127
7956 57209127 56059472 54699382 53517683 52211130 50870332 50005391 48960383 48207235
7948 48207235 47321566 46905807 46515275 46095785 45583487 45304403 45387947 45272424 45360883 45561668
7938 45561668 45794701 46264522 46234612 46237635 46565908 46801514 46859389 46567513 45884963 45229219
7928 45229219 44214086 43032305 42097986 41019561 39589627 38591912 37646915 36657687 35557060
7919 35557060 34770824 33824834 33001993 32303105 31690247 31143574 30669390 30543121 30030026
7910C0030026n12633k07068l84591k75037j71883j28480j27162k23156j89098
7901B7810918k08903o67754j82119m30446n55786m26571o48902p75260n92852
7892B3322325m96444n76429m88523p49630m43391l74245n20383j97639k41305
7883A9234336l56033m56576l17793l12818m38151j505k67665n60127j90818l33360
7873A5999490k39051n31428k53570r4667k11419k86826l00997k51104l22069j92511
7863A3315848j10361l04007n09733j23986j24501k09332j79618R4444l63592r3645
7853A1391517j66490j28685m47343j56216k67142k3763n8292m18240k48183O68296
7843A0145459O1611k13916k44837K3803k90188l88948N2743j11113k19777m5061
$$ plain form
7910 30030026 29517393 29310325 28925734 28650697 28478814 28350334 28223172 28000016 27810918
7901 27810918 27602015 26934261 26752142 26321696 25765910 25339339 24690437 23915177 23322325
7892 23322325 22825881 22249452 21760929 21011299 20567908 20193663 19673280 19475641 19234336
7883 19234336 18878303 18421727 18103934 17791116 17352965 17351460 17083795 16523668 16332850 15999490
7873 15999490 15760439 15229011 14975441 14880774 14669355 14382529 14081532 13830428 13508359 13315848
7863 13315848 13205487 12901480 12391747 12267761 12143260 11933928 11754310 11848754 11485162 11391517
7853 11391517 11225027 11096342 10648999 10492783 10225641 10201878 10143586 9725346 9477163 10145459
7843 10145459 10207070 9993154 9748317 9772120 9481932 9092984 9145727 9034614 8814837 8769776
7833H769776O2052N836r0893p1799R4375j91334j36931N6728j86591k39573Q1439
7822H153085l20826J32365o4986O580k73104l3691J89874r9080j40134O3016o2991
7811G550108l0493m8674l14802J9859K29030q7224Q2785l6930j90843M5195k16560
7800G001451r8949Q212M5086K7069j77543j7243O8083L4992l7909K1890o4875
7789F810264R2199k34725j10749k11988J70864m8256j65887K07507K483j40716
7779F370996j29488J3836R1889K4499j96221o68j06896l83867Q6690j58858k9509
7768E582403l1981L67406l1013j95872j7835k88711K77983j3675o9659k979m0794
7757E535273J7483K3933k31805O8178J10489j00026P286j15434k85188P4629J53994
$$ plain form
7833 8769776 8831828 8837664 8746771 8674972 8769347 8578013 8441082 8497810 8311219 8071646 8153085
7822 8153085 7832259 7964624 7899638 7906218 7633114 7599423 7789297 7690217 7550083 7613099 7550108
7811 7550108 7519615 7470941 7156139 7175998 7405028 7317804 7400589 7363659 7172816 7218011 7001451
7800 7001451 6902502 6910714 6955800 6982869 6805326 6788083 6856166 6891158 6853249 6875139 6810264
7789 6810264 6902463 6667738 6556989 6345001 6515865 6467609 6301722 6509229 6511712 6370996
7779 6370996 6241508 6255344 6347233 6371732 6175511 6174843 6067947 5684080 5770770 5611912 5582403
7768 5582403 5550422 5917828 5886815 5690943 5673108 5384397 5662380 5648705 5579046 5576067 5535273
7757 5535273 5552756 5576689 5344884 5413062 5523551 5423525 5430811 5315377 5030189 5104818 5258812
7746E258812o481l71177Q9450N9166j35564k10989q3726K33586M3647q1601j58192
7735D636931m3495q5687J02037j76490k62882M2661J36495J98879m74049J801
7725D076201J84734j59252j07931J35961j62640r999k2239j70000k7398N2957
7715C790394j72419L2168J17500k33561O5203o9133Q405J24020j46887m6149k6990
7704C442551K6290K0103l3082K3634j44473J6646l072q0854J1579j82880N438
7693C101880Q1347j26418n8902K4064M9594k25157J22376l9205J07487J1367l51936
7682B696497J56324j10590k18428j60665Q6965P8088p9839J3952r2863j5809K18982
7671B572614k41574l2224j36019r3022K10191M790p6214q894L1374J38212J14844
$$ plain form
7746 5258812 5252331 4881154 4970604 5029770 4894206 4683217 4599491 4833077 4876724 4795123 4636931
7735 4636931 4593436 4507749 4609786 4433296 4170414 4213075 4349570 4548449 4074400 4076201
7725 4076201 4260935 4101683 3993752 4129713 3967073 3957074 3934835 3764835 3737437 3790394
7715 3790394 3617975 3650143 3767643 3534082 3599285 3530152 3538557 3662577 3515690 3469541 3442551
7704 3442551 3468841 3488944 3455862 3479496 3335023 3351669 3348597 3267743 3279322 3096442 3101880
7693 3101880 3183227 3056809 2997907 3021971 3071565 2846408 2968784 2929579 3037066 3048433 2696497
7682 2696497 2852821 2742231 2523803 2363138 2450103 2528191 2448352 2462304 2369441 2353632 2572614
7671 2572614 2331040 2298816 2162797 2069775 2279966 2284756 2208542 2199648 2231022 2369234 2484078
7660B484078n5949M9068k20933l8490k55984J62070l713k32311j27836M1988Q3403
7649A885391M1893j36598n1896J11597N3241J21572j07280j3502n8413M6699n6213
7638A836491n9379J59835P0534j73630n9306o0081j21402P3380q7980K0983q7192
7627A512253J02258J43591n9374j46986p9765k00466p3771J19792K22990J81636
7617A722158N1876j30657k63360K2960p8607k31660J84322L07691j59679J0485
7607A435529k9845j32044K16256j38946P39K2024n3226L40981N4396N5363l2749
7596A738478J17347k77608j56120M0381O9144K35552l8662L1462j56566J04938
7586A708346K96541q8361J86961R9319k02247M06636K38953l03404q4272J31727
$$ plain form
7660 2484078 2428129 2477197 2256264 2217774 1961790 2123860 2120147 1887836 1760000 1801988 1885391
7649 1885391 1927284 1790686 1738790 1850387 1903628 2025200 1917920 1904418 1846005 1892704 1836491
7638 1836491 1777112 1936947 2007481 1833851 1774545 1714464 1593062 1666442 1578462 1599445 1512253
7627 1512253 1614511 1758102 1698728 1551742 1471977 1271511 1197740 1317532 1540522 1722158
7617 1722158 1774034 1643377 1380017 1402977 1324370 1092710 1277032 1584723 1425044 1435529
7607 1435529 1405684 1273640 1489896 1350950 1351689 1373713 1320487 1661468 1715864 1771227 1738478
7596 1738478 1855825 1578217 1422097 1462478 1531622 1767174 1728512 1759974 1603408 1708346
7586 1708346 2004887 1916526 2103487 2202806 2000559 2407195 2646148 2342744 2258472 2390199
7576B390199j4062k35695n2080j02948j79818k65997k05818K4209j97407m2900
7566A117683j37295k15131K29067O7688j93230J31036M3245O8628n0498j06623
7556I54570J24358p2322p7403o321P418K40892k14621j38810M4832K00209J68577
7545A231379p9503j25021j43029j84709m3726K10028j14798J02305m0843j34554
7535F77529K22048n4431k89897j2592J11561M6881j12615j39393j6323K83718
7525G16486L1789j43852l0139o5271k5621p6682K11669J31635k87001K5833J7845
7514E06691p326K13669n4818j74814K6188R5008p3312n6038R656R0558j4043r1025
7502D70394J15386j56123j6514O3935j27846P3130k48638J25208P6459j69974
$$ plain form
7576 2390199 2376137 2140442 2088362 1985414 1805596 1539599 1333781 1357990 1160583 1117683
7566 1117683 980388 765257 994324 1062012 868782 999818 1043063 1111691 1061193 954570
7556 954570 1078928 1006606 929203 922882 930300 1171192 956571 817761 862593 1062802 1231379
7545 1231379 1151876 1026855 883826 699117 655391 865419 750621 852926 812083 677529
7535 677529 899577 845146 555249 542657 654218 701099 588484 449091 432768 716486
7525 716486 748275 604423 574284 509013 483392 406710 618379 750014 463013 488846 506691
7514 506691 499365 713034 658216 483402 509590 604598 531286 475248 484904 575462 561419 470394
7502 470394 585780 429657 413143 477078 349232 422362 173724 298932 375391 205417
7492B05417k4402j87828J41941j5657o1994J33560K11508j66789J2870j04599
7482A44027k435L4827j5406J7750j47375K37366K75119k5320k9810R2424j69193
7471D11974m5730M1859j27625j62062J37474P5029j68693n4879j91713J96734
7461A12368M3480j13146J96690Q7735j02019K99482k9089j34385J2180j40424
7451B32872Q8469N0523n6857j87841O3801O3019o7686q1770Q5984p1260r0458
7440B8796J8855q8515j3870R255J38508Q7869n3588Q5126M6651k09183L0075J17277
7428A97256j59200P2307j1901J30435K9492o6069r5743n8884p9183L0970k218
7417a2738K2415J29422M61946k7703j70552J36466k09905K2286m7368k34128J97863
$$ plain form
7492 205417 181015 -6813 135128 119471 57477 191037 402545 235756 248626 144027
7482 144027 141592 176419 161013 178763 31388 268754 543873 518553 488743 581167 411974
7471 411974 366244 408103 280478 118416 255890 330919 162226 107347 -84366 112368
7461 112368 155848 42702 239392 327127 225108 524590 495501 361116 373296 232872
7451 232872 321341 371864 315007 127166 190967 253986 186300 104530 190514 119254 28796
7440 28796 47651 -40864 -54734 -45479 93029 180898 127310 212436 259087 49904 79979 197256
7428 197256 38056 110363 98462 228897 258389 192320 96577 37693 -41490 -10520 -12738
7417 -12738 9677 139099 601045 573342 402790 539256 329351 351637 304269 70141 268004
7406B68004j3376r9525n1376N3975k9707J05848j20896m4914L3405j98746J87006
7395H9698r403J08884P0546N5691r6071k5917j5521Q9943J5437j97460K92915
7384C78742o2366k99004l9627J04054L29766j82676Q1902O4336J59337j85845
7374C48619r2767P3684k76165J4443l9375O4595J14272J01439r0064P1489J73423
7363D63593k7301j84687j52783m602L10084j21729k99506L7418j3592L09265p6824
7352B39336k08668j9024J3532J41366P9640n929J15867m9916j56750O4970N8065
7341B72489M0180r5468j74568k69373L5374N5589L17031L5534k37008J92167m8035
7330A23912L7670r2073L7659j40340j16055P3291J56095n0251p3745K57730J49424
$$ plain form
7406 268004 254628 155103 103727 157702 127995 233843 112947 68033 101438 -97308 89698
7395 89698 80295 189179 259725 315416 219345 193428 177907 267850 283287 85827 378742
7384 378742 316376 17372 -22255 81799 411565 228889 310791 375127 534464 348619
7374 348619 255852 329536 53371 67814 28439 93034 207306 308745 218681 290170 463593
7363 463593 436292 251605 98822 94220 404304 282575 -16931 20487 6895 316160 239336
7352 239336 30668 11644 25176 166542 246182 240253 356120 306204 149454 214424 272489
7341 272489 312669 217201 42633 -226740 -191366 -135777 181254 216788 -20220 171947 123912
7330 123912 161582 69509 107168 -33172 -149227 -75936 80159 29908 -43837 213893 363317
7319C63317O4103l02032l8712J90771j04369J0322M1946m3116J99221j60382j28847
7308I2222j1968J06661k8943q8929J21123k63406Q8826J5615l8102O8475k20508
7297a58934j05398L02046Q015k17606j53136J22656J4886j90559K24837j62868
7287c16061K8179J60641J1409R0137k03032p7676M14666n542k87794j3550K24154
7276B5531J21444k25973p5785Q0569k0494N6552q472k3923j27855p7548K7618
7265b48336K64381O0774j82468J9122j15483J8114p643K16801o7370j1069J38272
7254H5095J409j00055J17373j49351m8296J51682J69945J09733m76724J68558
7244B9369K38539k28619l15505J72523J12051j07j11620k05686j93K61219j25500
$$ plain form
7319 363317 427420 125388 86676 277447 173078 183400 225346 182230 381451 221069 92222
7308 92222 80254 186915 157972 69043 190166 -73240 15586 31201 -6901 61574 -158934
7297 -158934 -264332 37714 45729 -171877 -325013 -202357 -187471 -378030 -153193 -316061
7287 -316061 -287882 -127241 -115832 -25695 -228727 -306403 108263 102721 -185073 -198623 25531
7276 25531 146975 -78998 -154783 -74214 -94708 -38156 -46628 -70551 -198406 -275954 -248336
7265 -248336 16045 76819 -105649 -86527 -202010 -183896 -191539 25262 -42108 -53177 85095
7254 85095 86504 -13551 103822 -45529 -93825 57857 227802 337535 -139189 29369
7244 29369 267908 39289 -276216 -103693 8358 8251 -103369 -309055 -309248 -48029 -173529
7233a73529j54283Q6193K9805K04624L0486j12396M0398j69672K46408l1902k17059
7222b20927L04769j05715q7871R3454J51872j29208J15059J07261n7588L2309
7212B03415j35781P5917p4992o4131P4230j90432K5139O3233n0939o4416J27334
7201a1423P9135j42230J19746n9433k09885P6758R6462J26669k4647m8143j99794
7190a96785Q8510o7417J40732j26722k5807J12118j56272p3372J61800L4011j41018
7179b50222j13896n7657M18709j8057j27929M8357j96150J22184n3447p9056L64384
7168E7220r0353N5631m4094M9547J7715n4576O0552l00320J12327N4471l4676
7157a16556Q1963L1365N4431j55678j61067l1938K34892Q453k51461j83646K21107
$$ plain form
7233 -173529 -327812 -241619 -211814 -7190 23296 -89100 -48702 -218374 28034 -3868 -220927
7222 -220927 83842 -21873 -109744 -16290 135582 6374 121433 228694 171106 203415
7212 203415 67634 143551 68559 4428 78658 -111774 -86635 -23402 -74341 -138757 -11423
7201 -11423 67712 -74518 45228 -14205 -224090 -147332 -50870 75799 51152 3009 -196785
7190 -196785 -108275 -175692 -34960 -161682 -187489 -75371 -231643 -305015 -143215 -109204 -250222
7179 -250222 -364118 -421775 -3066 -21123 -149052 -100695 -296845 -174661 -228108 -307164 57220
7168 57220 -33133 22498 -21596 27951 45666 -8910 51642 -248678 -136351 -81880 -116556
7157 -116556 -34593 -3228 51203 -104475 -265542 -297480 -62588 -54135 -305596 -489242 -268135
7146b68135J45588l2243j22945Q1198R4948k3356q094j83284J34030P4926N9156
7135d8211l2444k55569j5609J82628j55874o0661J13213J78397J47604N3688k19097
7124a11935j10666J79691j53474M78J51891j92413R1085N4457q4113j85412l3606
7113c94017K28362q1490j35858K86592L12558j29238l4580j17513J81233k9247
7103H6802K88818j98738j07491R8831j54188j05998p1231J26147J9947j82377
7093a99478J29069j24473L03505N00k69926P6540L6779n4221N7840j0665j98744
7082b53274k9217J18806K62477K252K10567j88446j20322M2634j97820P6188K15720
7071A39565l00723Q5456J38718l9416j82392M6413L216j76473O2626K12919J5812
$$ plain form
7146 -268135 -122547 -154790 -277735 -196537 -101589 -124945 -133039 -316323 -182293 -107367 -48211
7135 -48211 -80655 -336224 -351833 -169205 -325079 -385740 -272527 -94130 53474 107162 -111935
7124 -111935 -222601 -42910 -196384 -195906 -44015 -236428 -145343 -90886 -174999 -360411 -394017
7113 -394017 -165655 -247145 -383003 -96411 216147 86909 52329 -65184 116049 86802
7103 86802 375620 176882 69391 168222 14034 -91964 -163195 -37048 -17101 -199478
7093 -199478 -70409 -194882 108623 109123 -160803 -84263 -47484 -101705 -43865 -54530 -253274
7082 -253274 -282491 -163685 98792 101044 311611 123165 2843 45477 -152343 -76155 139565
7071 139565 -161158 -75702 63016 23600 -158792 -112379 -109163 -285636 -223010 -10091 5721
7060E721r2401j987M3238j27349n3100K49412o5222R6439p2219k12628K40252
7049A0156q3698k23238J04735k0700q6995K7845m9944L13419j2441q1995j57269
7038b60125K80498L6906j19139l3672j53889k2168K54027J85306j21446J58612
7028B04910o0441J75796j85129j19891j13147J50376k4148J05933j9859L4137
7018A48537J5630l50421j64180L69288k192M8942O8095j8250k87j84205K25257
7007A56214K4190r2870j51667J99439j28772r3649n6846Q7329J9387L0351k03892
6996b10786l7471L66338Q6398l0849l40119J24425J58018k13281K60952r5631
6986F7994j43733K02864k63906j36651L036Q6332L79909j28350k25394J6385J46575
$$ plain form
7060 5721 -86680 -88667 -45429 -172778 -225878 23534 -41688 54751 -17468 -230096 10156
7049 10156 -73542 -296780 -192045 -212745 -299740 -271895 -321839 -8420 -20861 -102856 -260125
7038 -260125 20373 57279 -61860 -95532 -249421 -271589 -17562 167744 46298 204910
7028 204910 144469 320265 135136 15245 -97902 52474 28326 134259 114400 148537
7018 148537 164167 -186254 -350434 18854 16662 65604 133699 115449 115162 -69043 156214
7007 156214 180404 87534 -64133 135306 6534 -87115 -143961 -56632 -37245 -6894 -210786
6996 -210786 -248257 118081 204479 173630 -166489 -42064 115954 -97327 163625 67994
6986 67994 -75739 127125 -136781 -273432 -270396 -184064 195845 67495 -157899 -141514 5061
6975E061J46042q6106K3406R2738j64456K16358l55353J41275j14171j84305K40771
6964c8740R3620j64838J55931N3237p6957k3205j88575L0911j42222K85452J29456
6953A14070j61664j69502M6968M1445j69527r093K49314L2733J33120j607j14988
6942h731J20252M6694k16588L0610Q2333K288L0836L3450m2161m6938K90201n5016
6930B67230k74340N8310j50122l1950J47613m7747j1903J55732j27640J08650
6920I3833p7740l7258P0896j5814J01497J60699k69506k25780o3056J02219j8218
6909a78228J72562j2433j74729j15033J87537K42120n3368n337j79834J52751
6899C6008J31240N0605j22716j49008K89055o2215j01442j14113P5606J41621
$$ plain form
6975 5061 151103 64997 88403 181141 16685 233043 -122310 18965 -95206 -279511 -38740
6964 -38740 54880 -109958 45973 99210 22253 -952 -189527 -158616 -300838 -15386 114070
6953 114070 -47594 -217096 -170128 -128683 -298210 -307303 -57989 -25256 107864 106257 -8731
6942 -8731 111521 158215 -58373 -27763 54570 56858 87694 121144 78983 32045 322246 267230
6930 267230 -7110 51200 -98922 -130872 16741 -31006 -42909 112823 -14817 93833
6920 93833 16093 -21165 49731 33917 135414 296113 26607 -199173 -262229 -160010 -178228
6909 -178228 -5666 -18099 -192828 -307861 -120324 121796 68428 63091 -116743 36008
6899 36008 167248 217853 95137 -53871 235184 172969 71527 -42586 33020 174641
6889A74641r2405j11099L0539p6051Q2290j63427n097k319n0851l9701K15684
6878c7796K94941j9338q4559o1976J6814j25225J30083j08309Q2569L8077k8919
6867I6362J90862J06052j49049m0314k57522k02906j36723Q0219N2593J78870
6857h1556p0794P6946J0827J59217o8702n8027J21294j73999J0355J48064J9302
6846I2927j08606O1300j1212k01530J9644J33898j02054j15690J33100L3852K8441
6835c5930n4952j1431N4013P0747J18448j68178j11474j6508R3484n577q4136
6824a51494J55451M8458p7839O0910j79585K0142n4819K3432J28516K37125m96809
6813b86512q1312L43717q2764k3346m547k56353L19793O7778N7147Q789j66477
$$ plain form
6889 174641 82236 -28863 1676 -74375 7915 -155512 -160609 -162928 -213779 -253480 -37796
6878 -37796 257145 237807 153248 91272 108086 -17139 112944 4635 87204 125281 96362
6867 96362 287224 393276 244227 203913 -53609 -256515 -393238 -313019 -260426 -81556
6857 -81556 -152350 -75404 -64577 94640 25938 -32089 89205 -84794 -74439 73625 92927
6846 92927 -15679 45621 34409 -167121 -147477 -13579 -115633 -231323 -98223 -64371 -35930
6835 -35930 -90882 -102313 -48300 22447 140895 -27283 -138757 -155265 -61781 -67358 -151494
6824 -151494 3957 52415 -25424 35486 -144099 -123957 -178776 -155344 -26828 210297 -286512
6813 -286512 -367824 -24107 -106871 -130217 -134764 -391117 -71324 -3546 53601 62390 -104087
6802a04087J39977k70588J35185K60435M66k05689J71104j30213J8170j0848K3038
6791B6950J56044j15077q8891J07058P3392p7662k60098P0454M0780P293J16656
6780E6899J36092j50683p1318n8151m1470K8244J48946m3739j83533L27169K94730
6769D43186O093l31119m5015j35890K9209K48935r7427j02892L4683K04756j5502
6758B39017l2794m12923r145l32924L29102K06659o4511K73124L523j48235j52105
6747a01212r6106j31846J36041J77486j1528o258n3769n7001K11367J58304J33478
6736C58956j03211j09108k0911N9429M9675j9593q2988M4307j50227j5317j15447
6725a04435Q1718k4128J08628P6025J95104j72550j56233N9665j29137j03410
$$ plain form
6802 -104087 35890 -234698 -99513 160922 161388 -44301 126803 -3410 14760 3912 26950
6791 26950 182994 67917 -20974 86084 159476 81814 -178284 -107830 -67050 -59757 56899
6780 56899 192991 42308 -29010 -87161 -128631 -100387 48559 4820 -178713 148456 443186
6769 443186 449279 118160 73145 -62745 -33536 215399 117972 15080 49763 254519 239017
6758 239017 206223 -206700 -215845 -548769 -219667 -13008 -77519 195605 199128 50893 -101212
6747 -101212 -197318 -329164 -193123 -15637 -27165 -33423 -87192 -144193 67174 225478 358956
6736 358956 255745 146637 125726 185155 234830 215237 132249 176556 26329 11012 -104435
6725 -104435 -22717 -46845 61783 137808 332912 160362 4129 63794 -65343 -168753
6715a68753J61940O5591L0557J11590J68181j27678r0777J5319K6775j56556j4984
6704B1205j17177p1695M1796N1412P3607J31081q9119J49130J262k3764P5598
6693B43336k52467O7214j59689K14693J039n065r9303l9887J54919q5751j00432
6682f1393M6301N7694j17910K08386j9310o2647q0060J5062J25340n1489R0636
6671A50610L7915J79157J3607q4082m4892r7098J04781j27168m1758J30357J10430
6660C31859J34490j07152K394J12163k62975j39622J61595N6409L126r9288o7431
6649A25568J27840N5620k97415N9822K76466o4287k9009N7413o05R3342p5574
6638C29181k20452J96521J94308K07l96060m8272j6388l6259J67694n3783K28628
$$ plain form
6715 -168753 -6813 58778 89335 200925 369106 241428 150651 165970 192745 36189 21205
6704 21205 -95972 -167667 -125871 -74459 -852 130229 41110 190240 191502 167738 243336
6693 243336 -9131 58083 -101606 113087 114126 109061 9758 -30129 124790 39039 -61393
6682 -61393 -15092 42602 -75308 133078 113768 51121 -28939 -13877 111463 59974 150610
6671 150610 188525 367682 381289 297207 252315 155217 259998 132830 91072 221429 331859
6660 331859 466349 359197 361591 473754 210779 71157 232752 289161 292287 192999 125568
6649 125568 253408 309028 11613 71435 347901 283614 254605 312018 311413 404755 329181
6638 329181 108729 305250 499558 499765 103705 55433 39045 2786 170480 116697 345325
6627C45325K33569j53037M2635p2740j63085L2187J01280r4110r6207J13566J15432
6616D04815J53199j26933l42276J14683K23166j08847K53075K9178M79018k25847
6606H53231j81176J48360J3411q0183M4780M2735p4279n9244J43671J46556K8701
6595A026563j95033J93840n97j10937J21241J46923N0212J39161k28097l3377
6585A109899K76569j00786j9410m9505o6275J36218O0571j31734J12832L8856
6575A367235q9057L4189J28454j7742j07516J43971J26084J79998O2954n6036
6565A772534J77488j98085O3290K87421l6316N7640K58354J80556M8553Q3041
6555B694476K94735p5649K91631L32953M80276M15440L98610N68805M36990M58060
$$ plain form
6627 345325 578894 425857 468492 395752 232667 264854 366134 272024 175817 289383 404815
6616 404815 558014 431081 88805 203488 426654 317807 570882 600060 1079078 853231
6606 853231 672055 820415 833826 753643 798423 841158 766879 707635 851306 997862 1026563
6595 1026563 831530 1025370 1024773 913836 1035077 1182000 1232212 1371373 1143276 1109899
6585 1109899 1386468 1285682 1266272 1216767 1150492 1286710 1347281 1215547 1328379 1367235
6575 1367235 1278178 1312367 1440821 1423079 1315563 1459534 1585618 1765616 1828570 1772534
6565 1772534 1950022 1751937 1815227 2102648 2066332 2123972 2382326 2562882 2611435 2694476
6555 2694476 2989211 2913562 3205193 3538146 4018422 4433862 4832472 5401277 5838267 6296327
6545F296327Q43565P81310R98643J175104J023593J369650J597030J513329J339867
6536A6938418J135161P3048q92742j286834j529661j859100j553326j381064o69472
6527H974428q58225o84674l80172p29591k82070m97582l11902k37864n17323k73915
6517D201110k13626k46747k82194r9386R167j16788j78349j00926n8039j82671
6507B731551n5742k93676k7216J50304J30444j96403L3476R5784o52N054j19117
6496B453807j75978K67184l9232J63453j25114j21132j81355M9132L6473l2470
6486B294768K3439q6136o2638J59067m0800j68892K51961O2580J7576k8402K78049
6475B700572r6595Q469R8780k07413J79483J35941K57808J15060N1587M03826
$$ plain form
6545 6296327 7139892 7921202 8919845 10094949 11118542 12488192 14085222 15598551 16938418
6536 16938418 18073579 18146627 17253885 15967051 14437390 12578290 11024964 9643900 8974428
6527 8974428 8116203 7431529 7051357 6321766 6039696 5542114 5230212 4992348 4475025 4201110
6517 4201110 3987484 3740737 3458543 3359157 3368324 3251536 3073187 2972261 2914222 2731551
6507 2731551 2675809 2382133 2354917 2505221 2635665 2439262 2472738 2568522 2567870 2572924 2453807
6496 2453807 2277829 2545013 2505781 2669234 2544120 2422988 2241633 2290765 2327238 2294768
6486 2294768 2318207 2232071 2169433 2328500 2287700 2118808 2370769 2433349 2450925 2422523 2700572
6475 2700572 2603977 2612446 2711226 2503813 2683296 2819237 3077045 3192105 3243692 3647518
6465C647518m3627K57410L03727M17913L62391L82788L55433o2286K78047R1154
6455E990468M5368m06679p27005m16612m75296k66310j9264J15912k03341n9729
6445C577512j07341j5202q2738j33521J03766j48979j45458K03595J2202L2436
6435C296272k86137J98502k6491K05043L75548P4257j43940J78079M03113K45109
6425D519355O0689r7565L28514J72962K54673J10452R649K89459j6716K48248
6415E879720K91725k7556J90750L32079M42355K84312J0731J6122J46141L40394
6405G906773L94757l6074l4958J99858K52281J94369L23557K83518L97469K14078
6395A0095628M13595N59679J54586L40972K56641K54359M04710L48694M11934
$$ plain form
6465 3647518 3603891 3861301 4165028 4582941 4945332 5328120 5683553 5621267 5899314 5990468
6455 5990468 6035836 5629157 4902152 4485540 4010244 3743934 3724670 3840582 3637241 3577512
6445 3577512 3470171 3454969 3372231 3238710 3342476 3193497 3048039 3251634 3263836 3296272
6435 3296272 3010135 3208637 3182146 3387189 3762737 3836994 3693054 3871133 4274246 4519355
6425 4519355 4580044 4482479 4810993 4983955 5238628 5349080 5358729 5648188 5631472 5879720
6415 5879720 6171445 6143889 6334639 6666718 7109073 7393385 7404116 7420238 7566379 7906773
6405 7906773 8301530 8265456 8230498 8430356 8682637 8877006 9200563 9484081 9881550 10095628
6395 10095628 10509223 11068902 11223488 11564460 11821101 12075460 12480170 12828864 13240798
6386A3240798J06857L64621J27687J81499M66060K01344P25Q048p7751M33161
6376A5053049L82953L8901K91034J22206L04464q7596r2040J33313O2229j62939
6366A6045574j12410k45075k55556m05854m63021m61387o31771l29105o00105
6357A2541290p59090n04418m62999m65050l66626m48036m47961m08095m86756
6348H192259k91047k73640l73943k98389j80393m16618j05231k00891k87983j62990
6338E601134j77853j56216m41206J3521O9285j39432m85575k22895m4596J28009
6328D144176j30056k44725q5393l0931j66314k35956N9554m9128k07190j66157
6318B887880r2124J926J2141r5798k16337j57960K06839j3911K01204j71709k05082
$$ plain form
6386 13240798 13347655 13712276 13839963 14021462 14487522 14688866 14689591 14697639 14619888 15053049
6376 15053049 15436002 15474903 15765937 15888143 16192607 16105011 16012971 16146284 16208513 16045574
6366 16045574 15933164 15688089 15432533 15026679 14563658 14102271 13470500 13141395 12541290
6357 12541290 11782200 11277782 10814783 10349733 9983107 9535071 9087110 8679015 8192259
6348 8192259 7901212 7627572 7253629 6955240 6774847 6358229 6252998 6052107 5764124 5601134
6338 5601134 5423281 5267065 4825859 4839380 4908665 4769233 4283658 4060763 4016167 4144176
6328 4144176 4014120 3769395 3684002 3653071 3486757 3250801 3310355 3261227 3054037 2887880
6318 2887880 2795756 2797682 2809823 2714025 2497688 2339728 2546567 2532656 2733860 2562151 2357069
6307B357069M6548o7214j02982J52907j16610l746j0392k99283P0563l27369J27731
6296A827222r1834l51274K15481J60795K21859q2864k42411J04320j57072P8251
6286A682473P2165R3072j3139j84549K4047J37324j33822Q1600K9648k28517M9860
6275A610162j86045M686l4150n7577j42569O5280l9610n6996o5039M1253m0345
6264A099050j70446Q9064j79661R0121J41436J19581R722k29850L6062Q0654j1442
6253A074291P3638j16834k4420j28276j41214L6162J92027K2253j63649P427l3011
6242G98394k84376J66733k67426L049J98927M2388m2638j96706K02363Q7576N8567
6231G66851N8110p3320J07953m58k35278l806J27563j6796k15466K4745P3140
$$ plain form
6307 2357069 2403617 2336403 2233421 2386328 2269718 2265972 2255580 1956297 2026860 1699491 1827222
6296 1827222 1735388 1384114 1599595 1760390 1982249 1899385 1656974 1761294 1604222 1682473
6286 1682473 1754638 1847710 1834571 1650022 1674069 1811393 1677571 1759171 1788819 1560302 1610162
6275 1610162 1424117 1428803 1394653 1337076 1194507 1259787 1220177 1163181 1098142 1139395 1099050
6264 1099050 928604 1017668 838007 928128 1069564 1189145 1198867 969017 1005079 1085733 1074291
6253 1074291 1147929 1031095 1006675 878399 737185 773347 965374 987627 823978 831405 798394
6242 798394 514018 680751 413325 416374 615301 657689 615051 418345 620708 708284 766851
6231 766851 824961 751641 859594 859136 623858 620052 747615 730819 515353 540098 613238
6220F13238Q5700p4482k47030K26709K12348j9022j99653l9744L8059o8312J15194
6209F43005K4087Q5054k53026J014K9740q5340J65941l5732J9877j91062P9366
6198D82924N4473j02386K3833k692J09876k99756L73730j98626n0914j36201J03006
6187C57267K08499J58501j46359j58293r7049L2144J71178l2668j07099M4735
6177D30856J21054p2962J12416M152r8343q5410o9843M2251J40089l52084L47543
6166E19719j00382O063j32965p0101O1085L8855K34420l75r2771O9168o5811p9529
6154C87376J03221k0570N493k48920J55183q3059j06446J81702J22827J6957q4097
6143D29667j39116k29153R8141J65674q3368R5077M1556R6909r4023j7942m3348
$$ plain form
6220 613238 698938 624456 377426 604135 816483 797461 597808 558064 596123 527811 643005
6209 643005 667092 752146 499120 500134 529874 444534 610475 574743 594620 403558 482924
6198 482924 537397 435011 458844 456152 566028 266272 640002 441376 390462 254261 357267
6187 357267 565766 724267 577908 419615 322566 354710 525888 493220 386121 430856
6177 430856 551910 478948 591364 595516 497173 411763 341920 384171 524260 172176 519719
6166 519719 419337 425400 292435 222334 283419 322274 556694 556319 463548 532716 466905 387376
6154 387376 490597 470027 475520 226600 381783 298724 192278 373980 496807 513764 429667
6143 429667 290551 61398 159539 325213 241845 336922 378478 475387 381364 363422 320074
6132C20074P1667J15794k33836j44839J00432n2149j44518J78882J16909Q4447
6122D12863j3000j47678k2786K11008O904k85645J51736J28575r2242k60044J77117
6111B66808J6759o6086J79035k13086K54481k97017K0975J71428J9648M711N9693
6100D17349j57139j29388J77096M5868q2168J69901n532l49731l3065J68206K4360
6089B45757L02212j66930p3711q6779j66549j7799K11208j84004j5617K10019
6079B57807j25429M5235o975J4610N4367J53534p6478K13345J9501j89779J797
6068C61535j2603J93411l80930r2191K59279L3090J74841N1792j55948k16910
6058B15366l0614m5926j83288R9280L49464j21620J0199l4195J11573k50759J9188
$$ plain form
6132 320074 391741 507535 273699 128860 229292 177143 32625 211507 328416 412863
6122 412863 399863 252185 229399 440407 447311 161666 313402 441977 349735 89691 266808
6111 266808 283567 217481 396516 183430 437911 140894 161869 333297 352945 357656 417349
6100 417349 260210 130822 307918 353786 271618 441519 435987 86256 53191 221397 245757
6089 245757 547969 381039 307328 220549 54000 36201 247409 63405 47788 257807
6079 257807 132378 177613 170638 185248 239615 393149 316671 530016 549517 359738 361535
6068 361535 348932 542343 161413 69222 328501 361591 536432 588224 432276 215366
6058 215366 184752 138826 -44462 54818 404282 282662 292861 258666 370239 119480 138668
6047A38668K80195j1111k76873p2159O4546J75734r8507j70546K70310J55596
6037D55853l38043K09543o7937k4618P3717R6634Q3356J01263k52425l02627J58876
6026A93592r8555l2922K00419O87K177J21060l1232p7292P8244l436r1513J55498
6014D16727J62431j58712j6529J72440j04971j09861K38953N1277k09212k7778
6004D14765J08198P2223k53679J13916O9361k42912n0788M4527M8828J18460K6106
5993D69005N1745k32695j32345L3206l5387R6853J30163N2716l1820r9961J83485
5982D84965P5166K3152l6679j81884l8621J57141l74414r5238L08409P7864r0473
5971C09388K14347q7924k6359O7780j14517k1144j72488J0838J92579R6760k24397
$$ plain form
6047 138668 418863 407752 130879 58720 123266 299000 200493 29947 300257 455853
6037 455853 117810 327353 259416 234798 308515 405149 488505 589768 337343 34716 193592
6026 193592 95037 62115 262534 263221 265398 386458 355226 277934 356178 352742 261229 416727
6014 416727 579158 420446 403917 576357 471386 361525 600478 651755 442543 414765
6004 414765 522963 595186 341507 455423 524784 281872 231084 275611 324439 442899 469005
5993 469005 520750 288055 155710 188916 153529 250382 380545 433261 401441 301480 484965
5982 484965 560131 583283 546604 364720 326099 483240 108826 13588 321997 399861 309388
5971 309388 523735 435811 409452 477232 362715 341571 169083 179921 372500 469260 244863
5960B44863K0655K05558M7483q2556j81118P7809J0276p1654o1685J01106m3374
5949B67363K80767j40510j72149p6410J38454J49478j54270j32947J66450n8634
5939B67592J24477L2437o8013j81213J65814K0630j66921Q6879j8775J51362L7637
5928D51906N3056r9403p1831k4003J43621k75549Q6324J7073K7870k93681J35091
5917A50474K27821O6843M8569j28104P9595L797J17367j32418p8226j19389k2088
5906B14241J87965n5813K37727j07893o2947j9538m0674k9971J8791q8032M4799
5895B98655M8741j40708J04331N4757k61966J77019R4827J61841j76549j81890
5885A79058L4639O2798q7754K38102j00635R5946l8654L7722J9438j09356O042
$$ plain form
5960 244863 265518 471076 518559 436003 254885 332694 342970 271316 209631 310737 267363
5949 267363 548130 407620 235471 159061 297515 446993 292723 159776 326226 267592
5939 267592 392069 424506 356493 175280 341094 361724 194803 281682 262907 414269 451906
5928 451906 504962 405559 333728 309725 453346 177797 264121 281194 309064 15383 150474
5917 150474 378295 445138 493707 365603 445198 448995 566362 433944 355718 236329 214241
5906 214241 402206 346393 584120 476227 413280 393742 353068 323097 341888 253856 298655
5895 298655 347396 206688 311019 365776 103810 280829 375656 537497 360948 179058
5885 179058 213697 276495 188741 426843 326208 422154 383500 421222 440660 331304 337346
5874C37346Q1208j40324N0319j89849j36160L32777Q4395j02301O0492M9745j74042
5863B53606J05042K2569M4434R357J6069l0224J45805j05373m1550o5107J26518
5852D81146j89784P789P2184l0450m2304K67449k8822k66981J55504R4199j55428
5841C64502J30353J40977o6670j9263j91185O9136J31287k83831N2494o235J67861
5830D89426O1639j5337k27402K91422p7817j03987k3172j73105Q3730K39592l7604
5819E07385j40303o1929J47921q5745M19631n3912p7804r7379j41326K56442J4119
5808F87100n8353r8337J54306j54973j45434r845j95651J09644j4190k7973L8443
5797B84737r1512L06972J81397j08507m39273K87085K1713o3139P7783j79794
$$ plain form
5874 337346 418554 278230 328549 138700 2540 335317 419712 317411 377903 427648 253606
5863 253606 358648 381217 425651 435008 451077 420853 566658 461285 419735 354628 481146
5852 481146 291362 299151 371335 340885 298581 566030 537208 270227 425731 519930 364502
5841 364502 494855 635832 569162 549899 358714 427850 559137 275306 327800 321565 489426
5830 489426 551065 535728 308326 599748 521931 417944 394772 221667 305397 544989 507385
5819 507385 367082 305153 453074 367329 786960 733048 655244 557865 416539 672981 687100
5808 687100 628747 530410 684716 529743 384309 374464 178813 288457 274267 246294 284737
5797 284737 193225 500197 681594 573087 133814 420899 442612 379473 457256 277462
5787B77462J82372P3886m6679n3914j69979K90184m4170N0474j35506K05588j46281
5776D83437j0069j04119O7977J35814k9762J70304k00731j7215k722N8171l7523
5765E13562J1154J1218N048p2005j18326o6648L87480K5514k96066l3317J00477
5754D68091o2201j32757P2852L2553J18230l10891J31465M0775j7525Q3461j77074
5743B46979J7526K47537j08883j41449K33067l2397j38116R834J52978K55014
5733G42090k15140j1519J10633l90861j524J56520J06641R3344m9694J90686k1903
5722G09273j63932j56631p9725J35969J73120M3009k4754j45570J13230J48425
5712G52414p6189j28462j76738J39114J08745L0960J9180R8833j85538q3452Q7546
$$ plain form
5787 277462 459834 533720 487041 433127 263148 553332 509162 559636 424130 629718 483437
5776 483437 473368 369249 437226 573040 543278 713582 512851 495636 492914 551085 513562
5765 513562 524716 535934 540982 468977 350651 284003 671483 696997 400931 367614 468091
5754 468091 405890 273133 345985 378538 496768 185877 317342 358117 340592 424053 246979
5743 246979 264505 512042 403159 261710 494777 462380 324264 334098 487076 742090
5733 742090 526950 515431 626064 235203 233679 390199 496840 590184 540490 731176 709273
5722 709273 545341 388710 308985 444954 618074 661083 636329 490759 603989 752414
5712 752414 676225 547763 371025 510139 618884 649844 669024 767857 582319 498867 586413
5701E86413O1333L4396Q2127k8461O4661j37205n821k9294J54746Q8060j57809
5690G13146l4950q163j00574j12862n6563j57618K3248K27714R8038j09380K03980
5679F86016J29816K2335j73086L4383J04089l23813q654Q6436L2825J07660K33381
5668I31388k0881j00166j62826J0162R4977k17265l8641J43549N5626L1413j66277
5657E61059p8113K6073J8012k1406J7050Q7487J43595O508j69271m375J79677
5646G66296K414k29558K0980M1588P3256j30642M5693J79729P8868k19352K8154
5635F57426j30649n3877L04484K18043j26559k92293k7863R5708J28526r9473
5625F73473p7659J12487J20354m4132K8092q0304R045L8201j38932n5412Q3555
$$ plain form
5701 586413 647746 682142 764269 735808 800469 663264 657443 628149 782895 870955 713146
5690 713146 678196 670033 569459 456597 400034 242416 265664 493378 591416 482036 686016
5679 686016 815832 838167 665081 699464 803553 479740 471086 557522 590347 698007 931388
5668 931388 910507 810341 647515 657677 752654 535389 496748 640297 695923 727336 561059
5657 561059 482946 509019 527031 505625 522675 610162 753757 760265 590994 586619 766296
5646 766296 768710 539152 560132 601720 674976 544334 590027 769756 848624 629272 657426
5635 657426 526777 472900 777384 995427 868868 576575 548712 644420 772946 673473
5625 673473 595814 708301 828655 784523 812615 732311 741356 779557 640625 585213 668768
5614F68768J02385L8014J91873n1590j55940K0001o9404q4899j00468j207K51870
5603H09403O684k9441O352j16855K8497P7156j38690k5023K4923J9298K38261
5592I00565j86967L3222J232j44732j07627J79642J37985K78036k42968j96363
5582F52025J07253K44929l8304k2682q1077o8338J40108J58k63885j39437J92694
5571G23444L8989K14617j1183l5035J1570K26272k16672J1279K6129r703l3311
5560I46396P5551o856k5833Q45J98998j49407k3387j40974o90J91765M1084j17296
5548I90196k39347K33476L1734J284J28393j88659j00549R4592j42583J91680
5538A000217J58038j93572J57864j2207p7425J29185P5311M1326j88262J18432
$$ plain form
5614 668768 771153 809167 1001040 949450 793510 813511 744107 659208 558740 557533 809403
5603 809403 816087 786646 792998 676143 704640 781796 643106 618083 643006 662304 900565
5592 900565 713598 746820 748052 603320 495693 675335 813320 1091356 848388 652025
5582 652025 759278 1004207 965903 943221 862144 793806 933914 934072 670187 530750 723444
5571 723444 762433 977050 965867 930832 942402 1168674 952002 963281 989410 979707 946396
5560 946396 1021947 1015091 989258 990103 1189101 1039694 1016307 875333 874643 1066408 1107492 990196
5548 990196 750849 984325 1016059 1017343 1145736 957077 856528 951120 808537 1000217
5538 1000217 1158255 964683 1122547 1110340 1032915 1162100 1237411 1278737 1090475 1208907
5528A208907P9086k100R5082P7180M5459q7245j31654j84903j82207J93414O9483
5517A180502P2742j571j1571j03665q4722p2241J00403K17386j09633J44932Q7729
5506A420291p0752J25268q307j15109Q5957j1912J01559j56697J11280o3333j00305
5495A317940J24241L1140J35922P1381J73165p6496N7823J34894r3941p2183l8607
5484A765279L2815j38570q618M9684L5294K7654N0961r567L8819J24913K1240
5473A989904M43842j42375j50243K34160j26577j02118J13797j08527K94328O7788
5463B513979l2401n7938J62307N3837J575R6566K22479J02303j19893Q011K34690
5452C185515Q3555J7837M5879K0975J04995J45014N7599K27328L52570m154J80869
$$ plain form
5528 1208907 1287993 1285893 1380975 1458155 1503614 1416369 1284715 1099812 917605 1111019 1180502
5517 1180502 1253244 1251673 1240102 1136437 1051715 979474 1079877 1297263 1187630 1332562 1420291
5506 1420291 1349539 1474807 1466500 1351391 1437348 1425436 1526995 1370298 1481578 1418245 1317940
5495 1317940 1442181 1473321 1609243 1680624 1853789 1777293 1835116 1970010 1876069 1803886 1765279
5484 1765279 1798094 1659524 1650906 1700590 1735884 1763538 1814499 1804932 1843751 1968664 1989904
5473 1989904 2433746 2291371 2141128 2375288 2248711 2146593 2260390 2151863 2446191 2513979
5463 2513979 2481578 2423640 2585947 2639784 2641359 2737925 2960404 3062707 2942814 2950825 3185515
5452 3185515 3269070 3286907 3332786 3353761 3458756 3603770 3661369 3888697 4241267 4237113 4417982
5441D417982L2018J35090L2953K93984J96533K28891L99717J14339L96846J96457
5431F444810K99253N84540M06302O66811O55878N71560N22867L49900M35291K66750
5421A1203962j93150q8050k60023p7254j99214j30455J32328J46127o7602O6665
5411A0533334J78593M86177M30039N09302O45596N54415N62212P26545J066275
5402A5692488J178536Q10791R49355O54426J91202j95815k58870n31077q41044
5393A7649992p31830r35256n57502p35651n42767l71867n70087j97273q6988k22321
5383A2698450J59315K16624L11661k59143o4711M01991M09783M43903L58448J45006
5373A4821327K32018M3334m5504l81424m05376j69434o29509q45707n54078o23866
$$ plain form
5441 4417982 4450000 4585090 4618043 4912027 5108560 5337451 5737168 5851507 6248353 6444810
5431 6444810 6744063 7328603 7734905 8401716 9057594 9629154 10152021 10501921 10937212 11203962
5421 11203962 11010812 10922762 10662739 10585485 10386271 10255816 10388144 10534271 10466669 10533334
5411 10533334 10711927 11198104 11628143 12137445 12783041 13337456 13899668 14626213 15692488
5402 15692488 16871024 17681815 18631170 19285596 19476798 19280983 19022113 18491036 17649992
5393 17649992 16918162 15982906 15425404 14689753 14146986 13775119 13205032 13007759 12920771 12698450
5383 12698450 12857765 13074389 13386050 13126907 13062196 13464187 13873970 14317873 14676321 14821327
5373 14821327 15053345 15096679 15051175 14669751 14264375 14094941 13465432 12619725 12065647 11441781
5363A1441781m52639m20269n11582k20040j58934k92586n29577q8036k90230j91031
5353H286857k58405l37182M0983M7780q2361k04198n0903M2084M9232M5030j10976
5342G467941N268N6466k66244J12480Q5348J62891l02019k83776P1854L7467n23218
5331F624458l33079O8454l32766M3132j49957k55324q7659K7834j82128p0628
5321E352337K408J85079K4184j10041P6537k8719J32332n589O1968J96312L1648
5310E918456p8064k05361k84474p9219K48356o2216k50843q1904J0636O1522j39126
5299E057763k30947K16813o8883j24410q8269j56191K36752r2665J38491L5802
5289D924256O3017J61491O8315J0907K31151R5641m8285K84927J51628K41963
$$ plain form
5363 11441781 10989142 10568873 10057291 9837251 9678317 9385731 8856154 8768118 8477888 8286857
5353 8286857 8028452 7691270 7732253 7780033 7697672 7493474 7442571 7484655 7533887 7578917 7467941
5342 7467941 7473209 7529675 7263431 7375911 7461259 7624150 7322131 7038355 7110209 7147676 6624458
5331 6624458 6291379 6359833 6027067 6070199 5920242 5664918 5577259 5605093 5422965 5352337
5321 5352337 5354745 5539824 5564008 5453967 5530504 5501785 5634117 5628528 5690496 5886808 5918456
5310 5918456 5840392 5635031 5350557 5271338 5519694 5457478 5206635 5124731 5135367 5196889 5057763
5299 5057763 4826816 5043629 4974746 4850336 4762067 4605876 4842628 4749963 4888454 4924256
5289 4924256 4987273 5148764 5217079 5227986 5459137 5554778 5506493 5791420 5943048 6185011
5279F185011o7724j8089J00299L23925J13475M28150M19838R3677K14613K06790
5269G999965N5226K28405K77504K04996l04331O4861j87635k74193J97979k546
5259H260231R3416J1069L01361p2462K82970K96377O9381L98162N36362N24080
5249A0700947N34742K37308L36117L21965J19093k12650k89162k80772k87003
5240A1180585l24942k41274r058m04106m54432M269J03382j28775j84055p4007
5230I467587Q2382J16881m91q076J28565k8138Q5554K54365L2055J26190j19488
5219A0137386j7694j29812j44216k65566j43146k50915r5359k17070j13151K22125
5209H982582O9417j50670K750j31038k75433j32956k90693k97858j83571l98877
$$ plain form
5279 6185011 6117287 6099198 6199497 6523422 6636897 7065047 7484885 7578562 7793175 7999965
5269 7999965 8055191 8283596 8561100 8766096 8461765 8526626 8338991 8064798 8262777 8260231
5259 8260231 8353647 8364716 8666077 8593615 8876585 9172962 9242343 9640505 10176867 10700947
5249 10700947 11235689 11472997 11809114 12131079 12250172 12037522 11748360 11467588 11180585
5240 11180585 10855643 10614369 10605311 10201205 9746773 9751042 9854424 9725649 9541594 9467587
5230 9467587 9549969 9666850 9666359 9658283 9786848 9758710 9844264 10098629 10130684 10256874 10137386
5219 10137386 10119692 9989880 9845664 9580098 9436952 9186037 9090678 8873608 8760457 8982582
5209 8982582 9051999 8901329 8904079 8773041 8497608 8364652 8073959 7776101 7592530 7193653
5199G193653n22768J18043o3072n6484R7469P127j6800R3397k68483J89940n8700
5188F713322L6390k92672j71439r4021k4969M4702J4887j86155M021L6001j62244
5177E917823k962j57713N1534r3357m5134k62743j15805p4285m8993L9775j38907
5166E069233r3234O861O8353R6743o0513Q0671j69807m7825J13953J3744N4791
5155E132970K8428j32795J90836K7070k34486j3042K62283k33519j40026J96277
5145E083996Q6645J62788K49388J94760l86931j09048J47067j01682L61236K02420
5135E890639o0146J29715J90451O205J29637k7096J12532K48007o6865K98011
5125F851090J34611L0764N4618L56493J60595L55739L71502R7868J00612J13530
$$ plain form
5199 7193653 6670885 6788928 6725856 6669372 6766841 6773968 6757168 6850565 6582082 6772022 6713322
5188 6713322 6749712 6457040 6285601 6191580 6166611 6211313 6226200 6040045 6044066 6080067 5917823
5177 5917823 5914861 5757148 5808682 5715325 5670191 5407448 5291643 5217358 5168365 5208140 5069233
5166 5069233 4975999 4982860 5051213 5147956 5087443 5168114 4998307 4950482 5064435 5078179 5132970
5155 5132970 5161398 5028603 5219439 5246509 5012023 4998981 5261264 5027745 4887719 5083996
5145 5083996 5170641 5333429 5582817 5777577 5390646 5281598 5428665 5326983 5688219 5890639
5135 5890639 5830493 5960208 6150659 6156864 6286501 6259405 6371937 6619944 6553079 6851090
5125 6851090 6985701 7016465 7071083 7427576 7588171 7943910 8315412 8413280 8513892 8627422
5115H627422j76937Q4206K29346J92794j13240j03447O8677Q2767q9248O0381
5105H862721P6699K18419K28605l0292L29889L67967J76986J6382N85617M14793
5095A1247786L48642O41562O77858L68867M49992P07286P23964M53332N36335
5086A6155624J08096m7189q0477l48200j38327j20156J10794R0501J52574K02699
5076A6085939K73238L98306P25144K25692M83385M67470O59833O31245M00470
5067B0350722O84816L67294N20823O21470N96498K37289M33134M57194L39630
5058B4608870M29838J07145K15502K03007k41451j32749J52782L87914L13629
5049B6044487P25465K49243N51222N24245P16533N01634L27596M94642J74256
$$ plain form
5115 8627422 8450485 8534691 8764037 8956831 8843591 8740144 8808821 8891588 8802340 8862721
5105 8862721 8939420 9157839 9386444 9356152 9686041 10054008 10230994 10247376 10832993 11247786
5095 11247786 11596428 12237990 12915848 13284715 13734707 14441993 15165957 15619289 16155624
5086 16155624 16263720 16216531 16136054 15787854 15649527 15529371 15640165 15730666 15883240 16085939
5076 16085939 16359177 16757483 17482627 17708319 18191704 18659174 19319007 19950252 20350722
5067 20350722 21035538 21402832 21923655 22545125 23141623 23378912 23812046 24269240 24608870
5058 24608870 25038708 25145853 25361355 25564362 25322911 25190162 25342944 25730858 26044487
5049 26044487 26769952 27019195 27570417 28094662 28811195 29312829 29640425 30135067 30309323
5040C0309323L9014k14067l691J0307o9053r1360J01741L18512L06533L34009
5030C1041268j18024j58504M01489K52437J72395M569M69310M14807R9804J33576
5020C2713127J37354N56022N0096L11061L71390q2402J90159J99130k26114R695
5010C4229518L1346j20062J21892k65297j62047M31156K54151J56493Q8871j03030
5000C4662991L56525J46635O6588L5758n6933l24973O1878R378l4450j22974p617
4989C4792806O5286K27805K08226k04265M0023j04788o7267N1305K58449O5268
4979C5332848m117K29525Q4685J61760J04272R3328j8694L9110K24329J8987k4410
4968C6241623N9908J41483P4473l5025J34354J75775o4986K53085K59909K75269
$$ plain form
5040 30309323 30348337 30134270 30130579 30140886 30071833 29980473 30082214 30400726 30707259 31041268
5030 31041268 30923244 30764740 31166229 31418666 31591061 31595630 32064940 32479747 32579551 32713127
5020 32713127 32850481 33406503 33456599 33767660 34139050 34056648 34246807 34445937 34219823 34229518
5010 34229518 34260864 34140802 34262694 33997397 33835350 34266506 34520657 34677150 34766021 34662991
5000 34662991 35019516 35166151 35232739 35268497 35211564 34886591 34948469 34957847 34923397 34800423 34792806
4989 34792806 34858092 35085897 35294123 35089858 35129881 35025093 34957826 35009131 35267580 35332848
4979 35332848 35328731 35558256 35642941 35804701 35908973 36002301 35983607 36022717 36247046 36266033 36241623
4968 36241623 36301531 36443014 36517487 36482462 36616816 36792591 36727605 36980690 37240599 37515868
4958C7515868K83009J08002J26313K69685M99729M00836M65994L03322N48690
$$ plain form
4958 37515868 37798877 37906879 38033192 38302877 38802606 39203442 39669436 39972758 40521448
$$ [...]
##END NTUPLES=NMR SPECTRUM
##END=
