##TITLE=1H_EC-3257(II-1)
 CDCl3, 8 sc, 
 4.08.2021
##JCAMPDX= 6.0         $$ Bruker NMR JCAMP-DX V2.0
##DATA TYPE= NMR SPECTRUM
##DATA CLASS= NTUPLES
##ORIGIN= UXNMR, Bruker Analytische Messtechnik GmbH
##OWNER= root
$$ XWIN-NMR		Version 3.5
$$ Wed Aug  4 09:19:03 2021 Russian Standard Time (UT+4h)  she@DPX200
##.OBSERVE FREQUENCY= 200.131506
##.OBSERVE NUCLEUS= ^1H
##.ACQUISITION MODE= SIMULTANEOUS
##.ACQUISITION SCHEME= undefined
##.AVERAGES= 8
##.DIGITISER RES= 18
##SPECTROMETER/DATA SYSTEM= spect
##.PULSE SEQUENCE= zg30
##.SOLVENT NAME= CDCl3
##.SHIFT REFERENCE= (INTERNAL, CDCl3, 0, 17.4971)
##AUDIT TRAIL= $$ (NUMBER, WHEN, WHO, WHERE, WHAT)
$$ ##TITLE= Audit trail, XWIN-NMR		Version 3.5
$$ ##JCAMPDX= 5.01
$$ ##ORIGIN= Bruker BioSpin GmbH
$$ ##OWNER= she
$$ F:/spectra/data/she/nmr/H-F/1/pdata/1/auditp.txt
$$ ##AUDIT TRAIL=  $$ (NUMBER, WHEN, WHO, WHERE, WHAT)
(   1,<2021-08-04 09:17:51.34 +0400>,<she>,<DPX200>,
      <created by zg, POWCHK disabled, PULCHK disabled
       configuration hash MD5:
       00 E9 B6 7A A2 85 ED C7 34 08 36 98 17 FE 4E 26
       data hash MD5: 16K
       AD 33 91 2B A9 BF AF 19 0D FE 24 99 E5 F9 0C 64>)
(   2,<2021-08-04 09:17:54.09 +0400>,<she>,<DPX200>,
      <Start of raw data processing
       efp BC_mod = 2 LB = 0.24 FT_mod = 6 PKNL = 1 PHC0 = -13358.07 PHC1 = 16.80099 SI = 16K 
       data hash MD5: 16K
       F2 67 1F 6B F8 BD 31 69 91 59 82 47 14 8C 12 A6>)
(   3,<2021-08-04 09:18:10.95 +0400>,<she>,<DPX200>,
      <pk PHC0 = 0.321834 PHC1 = -1 
       data hash MD5: 16K
       07 C4 C8 65 EC 68 07 C4 A4 C2 37 9F 08 BC C0 6F>)
(   4,<2021-08-04 09:18:14.09 +0400>,<she>,<DPX200>,
      <abs ABSG = 5 
       data hash MD5: 16K
       40 1A 6A 22 65 2A 7B 63 80 16 54 04 5D 82 31 5B>)
$$ ##END=
$$ 
$$ hash MD5
$$ 3B 4D 82 56 1B 4B CD EC 67 09 01 CC B7 16 47 41
##$RELAX= 
##$RELAX= 
##$RELAX= 
##$RELAX= 
##$RELAX= 
##$RELAX= 
$$ Bruker specific parameters
$$ --------------------------
##$DU= <F:/spectra>
##$EXPNO= 1
##$NAME= <H-F>
##$PROCNO= 1
##$TYPE= <nmr>
##$USER= <she>
##$AMP= (0..31)
100 100 100 100 100 100 100 100 100 100 100 100 100 100 100 100 100 100 
100 100 100 100 100 100 100 100 100 100 100 100 100 100 
##$AQSEQ= 0
##$AQ_mod= 1
##$AUNM= <au_zg>
##$AUTOPOS= <>
##$BF1= 200.13
##$BF2= 200.13
##$BF3= 200.13
##$BF4= 200.13
##$BF5= 200.13
##$BF6= 200.13
##$BF7= 200.13
##$BF8= 200.13
##$BYTORDA= 1
##$CFDGTYP= 0
##$CFRGTYP= 5
##$CHEMSTR= <none>
##$CNST= (0..31)
1 1 145 1 1 1 1 1 1 1 1 1 1 1 1 1 1 1 1 1 1 1 1 1 1 1 1 1 1 1 1 1 
##$CPDPRG= <>
##$CPDPRG1= <>
##$CPDPRG2= <>
##$CPDPRG3= <>
##$CPDPRG4= <mlev>
##$CPDPRG5= <mlev>
##$CPDPRG6= <mlev>
##$CPDPRG7= <mlev>
##$CPDPRG8= <mlev>
##$CPDPRGB= <>
##$CPDPRGT= <>
##$D= (0..31)
0 1.2 0 0 0 0 0 0 0 0.06 0 0.03 0 0 0 0 0.0002 0 0 0 0 0 0 0 0 0 0 0 0 
0 0 0 
##$DATE= 1628054270
##$DBL= (0..7)
120 120 120 120 120 120 120 120 
##$DBP= (0..7)
150 150 150 150 150 150 150 150 
##$DBP07= 0
##$DBPNAM0= <>
##$DBPNAM1= <>
##$DBPNAM2= <>
##$DBPNAM3= <>
##$DBPNAM4= <>
$$ [...]
##$SUBNAM3= <"">
##$SUBNAM4= <"">
##$SUBNAM5= <"">
##$SUBNAM6= <"">
##$SUBNAM7= <"">
##$SUBNAM8= <"">
##$SUBNAM9= <"">
##$SW= 20.0188882624521
##$SWIBOX= (0..15)
0 0 2 0 0 0 0 0 0 0 0 0 0 0 0 0 
##$SW_h= 4006.41025641026
##$TD= 16384
##$TD0= 1
##$TE= 0
##$TE2= 300
##$TE3= 300
##$TEG= 300
##$TL= (0..7)
0 120 120 120 120 120 120 120 
##$TP= (0..7)
150 150 150 150 150 150 150 150 
##$TP07= 0
##$TPNAME0= <>
##$TPNAME1= <>
##$TPNAME2= <>
##$TPNAME3= <>
##$TPNAME4= <>
##$TPNAME5= <>
##$TPNAME6= <>
##$TPNAME7= <>
##$TPOAL= (0..7)
0.5 0.5 0.5 0.5 0.5 0.5 0.5 0.5 
##$TPOFFS= (0..7)
0 0 0 0 0 0 0 0 
##$TUNHIN= 0
##$TUNHOUT= 0
##$TUNXOUT= 0
##$USERA1= <user>
##$USERA2= <user>
##$USERA3= <user>
##$USERA4= <user>
##$USERA5= <user>
##$V9= 5
##$VALIST= <valist>
##$VCLIST= <CCCCCCCCCCCCCCC>
##$VD= 0
##$VDLIST= <DDDDDDDDDDDDDDD>
##$VPLIST= <PPPPPPPPPPPPPPP>
##$VTLIST= <TTTTTTTTTTTTTTT>
##$WBST= 1024
##$WBSW= 4
##$XGAIN= (0..3)
0 0 0 0 
##$XL= 0
##$YL= 0
##$YMAX_a= 184568
##$YMIN_a= -266958
##$ZGOPTNS= <>
##$ZL1= 120
##$ZL2= 120
##$ZL3= 120
##$ZL4= 120
##$ABSF1= 17.50077
##$ABSF2= -2.518269
##$ABSG= 5
##$ABSL= 3
##$ALPHA= 0
##$AQORDER= 0
##$ASSFAC= 0
##$ASSFACI= 0
##$ASSFACX= 0
##$ASSWID= 0
##$AUNMP= <proc_1d>
##$AZFE= 0.1
##$AZFW= 0.1
##$BCFW= 0
##$BC_mod= 2
##$BYTORDP= 0
##$COROFFS= 0
##$CY= -3
##$DATMOD= 1
##$DC= 0
##$DFILT= <>
##$DTYPP= 0
##$F1P= 0
##$F2P= 0
##$FCOR= 1
##$FTSIZE= 16384
##$FT_mod= 6
##$GAMMA= 0
##$GB= 0
##$INTBC= 1
##$INTSCL= 1.334414e-10
##$ISEN= 128
##$LB= 0.24
##$LEV0= 0
##$LPBIN= 0
##$MAXI= 10000
##$MC2= 0
##$MEAN= 0
##$ME_mod= 0
##$MI= 1.114404
##$NCOEF= 0
##$NC_proc= -7
##$NLEV= 6
##$NOISF1= 3.799351
##$NOISF2= 2.8
##$NSP= 0
##$NTH_PI= 0
##$NZP= 0
##$OFFSET= 17.49711
##$PC= 1
##$PHC0= -13357.75
##$PHC1= 15.80099
##$PH_mod= 1
##$PKNL= yes
##$PPARMOD= 0
##$PSCAL= 0
##$PSIGN= 0
##$REVERSE= no
##$SF= 200.130007508548
##$SI= 16384
##$SIGF1= 3
##$SIGF2= 2
##$SINO= 5.538805
##$SIOLD= 16384
##$SREGLST= <1H.CDCl3>
##$SSB= 0
##$STSI= 16384
##$STSR= 0
##$SW_p= 4006.41025641026
##$SYMM= 0
##$S_DEV= 0
##$TDeff= 16384
##$TDoff= 0
##$TI= <>
##$TILT= no
##$TM1= 0
##$TM2= 0
##$TOPLEV= 0
##$USERP1= <user>
##$USERP2= <user>
##$USERP3= <user>
##$USERP4= <user>
##$USERP5= <user>
##$WDW= 1
##$XDIM= 16384
##$YMAX_p= 291218313
##$YMIN_p= -566097
$$ End of Bruker specific parameters
$$ ---------------------------------
##NTUPLES= NMR SPECTRUM
##VAR_NAME=  FREQUENCY,     SPECTRUM/REAL,   SPECTRUM/IMAG
##SYMBOL=    X,             R,               I
##VAR_TYPE=  INDEPENDENT,   DEPENDENT,       DEPENDENT
##VAR_FORM=  AFFN,          ASDF,            ASDF
##VAR_DIM=   16384,         16384,           16384
##UNITS=     HZ,            ARBITRARY UNITS, ARBITRARY UNITS
##FACTOR=    0.24454680195387, 1,            1
##FIRST=     3501.69682908984, 0,            0
##LAST=      -504.713427320422, 0,           0
##MIN=       -504.713427320422, -566097,     0
##MAX=       3501.69682908984, 291218313,    0
$$ Real data points
##PAGE= N=1
##DATA TABLE= (X++(R..R)), XYDATA
$$ [...]
6875f3035j32478J09378l4664R3906K54488p6297r529j73547L5193j49966J970
6864a44581J71028K3314m4091O4183J07832r7326j01689o0801q6677O7335J74294
6853G2821K20662j67886q2405K40174J54097k0021k65434j97775O8760K28718
6843B51711J48734j95365k64957R3679J8555O3600j15586J6468J11618j37978
6833i521l32903M08357O421k55695O4360j2210K26317k23518O2095J16035L2167
6822H1905P3428j22859k08895J99352M4903J81508P4995r5591N1971k51554l5341
6811f178o2272J0054R4103P7858p7742k72280K6863J00775K29610j86892k21928
6800b88029j4497j15887L29023j04308k22979K05020J65887Q054r4665k24294
$$ y = [-63035, -195513, -86135, -120799, -26893, 227595, 151298, 141769, -31778, 3415, -146551, -144581, 26447, 49761, 5670, 69853, 177685, 80359, -21330, -82131, -168808, -101473, 72821, 293483, 125597, 43192, 283366, 437463, 417442, 152008, -45767, 22993, 251711, 400445, 205080, -59877, 33802, 52357, 115957, 371, 16839, 128457, -9521, -342424, 65933, 72354, -183341, -118981, -131191, 95126, -128392, -66297, 49738, 81905, 155333, 32474, -176421, 22931, 67834, 249342, 324337, 228746, 280717, 29163, -6178, -68450, -58396, 35707, 113565, 35823, -236457, -209594, -108819, 120791, -66101, -288029, -302526, -418413, -89390, -193698, -416677, -211657, -45770, -37716, -132381, -356675]
6790c56675J0144J40601M898k83024K7848K80113P8423O9988J74306j85437O3721
6779B4906J00670j8795q524r100l4609j39955k4378k16374O2158K08009n0375
6768a06367l8440K252m1697J5349P0418L5562J61318j08934K8873R5297J5669
6757A29300k54183N4874j74671J54313J0140o9561J5589r9795J24049m4996J86875
6746C1934J7541O2474j07458L5730p9p5285L7684R9505j6292K20318o4416k97000
6734e5344k76598K1533J57702r7929l8196J26507n685J4453r9111l0368K280J62495
6722a18261k05683r8486J43342J88259J49914R0020J32636k32219L1487j3653
6712F7356P8095M9375Q0235J15007R8890k84182k64140O8437Q2924j43072J16122
$$ y = [-356675, -346531, -205930, -201032, -484056, -456208, -176095, -97672, -27684, 146622, -38815, 24906, 125576, 106781, 98257, 89157, 54548, -85407, -109785, -326159, -264001, -55992, -106367, -144807, -142555, -184252, -168903, -98485, -62923, 98395, -10539, 18334, 113631, 129300, -124883, -70009, -244680, -90367, -80227, -149788, -134199, -233994, -109945, -154941, 31934, 49475, 111949, 4491, 40221, 40142, -35143, 2541, 102046, 85754, 306072, 241656, -55344, -331942, -310409, -152707, -250636, -288832, -162325, -168010, -153557, -252668, -283036, -280756, -118261, -323944, -422430, -279088, -90829, 59085, 149105, 281741, 49522, 81009, 67356, 145451, 194826, 275061, 390068, 488958, 204776, -59364, 9073, 91997, -51075, 65047]
6701F5047N3268k53740R493J27397J56962K9721K0581j58928j3019J74941J93773
6690D05496m5847p6182r229J00292j73808j60422l1591n1284Q340K60963p3831
6679A52897r5677o6133J67050j06709j65558K49308L8224j0728K0662M29624k69889
6668C43071k36668J1114R0951K11337J607J4052R7347M4950p9412l3086M6225
6657E11488R3246j71072j24966L3377R1956R0970j29287K8137m4821N9116j13058
6646C25086k2882k867L3664M2072J50900o9552k80316l4050L48070J41997k6174
6635F05948P4705O8076Q7346n4850k160k51174n3696r4645J82648l098J81958
6624G41058J38395L9652M9476q8134J89671J9712j78318n089M2322K74169J24852
$$ y = [65047, 118315, -135425, -125932, 1465, 158427, 188148, 208729, 49801, 36782, 211723, 405496, 359649, 283467, 274238, 374530, 200722, 40300, 8709, -42575, -34235, 226728, 152897, 57220, -8913, 158137, 51428, -114130, 135178, 173402, 162674, 183336, 612960, 343071, 106403, 117517, 208468, 419805, 421412, 435464, 532811, 577761, 498349, 465263, 511488, 604734, 433662, 308696, 342073, 434029, 524999, 395712, 423849, 379028, 438144, 325086, 302204, 299337, 333001, 375073, 525973, 456421, 176105, 142055, 490125, 632122, 605948, 680653, 748729, 836075, 781225, 779065, 527891, 474195, 379550, 562198, 559100, 741058, 879453, 919105, 968581, 880447, 1070118, 1089830, 911512, 906423, 948745, 1222914, 1347766]
6613A347766j24609J29582j01021L16872j32630J22756L07158j88389J57715O6674
6603A901874r9599l20343O2110K38885J56406O2860J31674J58817N23P2374j41462
6592B224119K38618P9565J50868L97096j42281r9784J43278J13487K8438R1019
6582C224423R3629K68967J73323K20790J36159J00580Q3973J94895j9231Q3685
6572D561193J96900J06872L78498M51071L55267R5376P9836O12929P17082L98041
6562G953065N08796O53602K68610Q11766O93624P81384R92899J173076J368239
6553A5205061J539979J955861K059825K552047K909665L395422M040226M872199
6545C8530285N336576N545374N670655N920000O060575N469493L203033m35945
$$ y = [1347766, 1223157, 1352739, 1251718, 1568590, 1435960, 1558716, 1865874, 1677485, 1835200, 1901874, 1802275, 1481932, 1544042, 1782927, 1939333, 2002193, 2133867, 2292684, 2293207, 2365581, 2224119, 2462737, 2542302, 2693170, 3090266, 2947985, 2848201, 2991479, 3104966, 3133404, 3224423, 3318052, 3587019, 3760342, 3981132, 4117291, 4217871, 4301844, 4496739, 4477508, 4561193, 4758093, 4864965, 5243463, 5694534, 6049801, 6145177, 6225013, 6837942, 7555024, 7953065, 8461861, 9115463, 9384073, 10195839, 10889463, 11670847, 12663746, 13836822, 15205061, 16745040, 18700901, 20760726, 23312773, 26222438, 29617860, 33658086, 38530285, 43866861, 49412235, 55082890, 61002890, 67063465, 72532958, 75735991, 75300046]
6537G5300046m742171p573312q700833p977314o495046n076912m086762l105416
6529B7542280k367643j968029j768600j320108j345115r65173q64990q14008n97614
6520A5531000p21390q37685q36697p80053o85639o59236o30587k75672j55317
6511I948724l53813O7480P9927K03968J7793K01270J68270L34186K62149K84187
6501A1214141N08199K97562J022751P98515J583927J455815J311228J095466k19215
6492A9068389j471811j817804j891965j772463j251409j216878j049154o30043
6484G966862m75061o95982m52289k85762p0351j82960l95014j68732k20495j33014
6474D887202j30582K8437j69637l1423J62568J48554j56595q7403J06055j7405
$$ y = [75300046, 70557875, 62984563, 54283730, 46306416, 39811370, 34734458, 30647696, 27542280, 25174637, 23206608, 21438008, 20117900, 18772785, 17807612, 16942622, 16128614, 15531000, 14809610, 13971925, 13135228, 12355175, 11669536, 11010300, 10379713, 10104041, 9948724, 9594911, 9662391, 9742318, 9946286, 9964079, 10165349, 10333619, 10667805, 10929954, 11214141, 11722340, 12019902, 13042653, 13841168, 15425095, 16880910, 18192138, 19287604, 19068389, 17596578, 15778774, 13886809, 12114346, 10862937, 9646059, 8596905, 7966862, 7491801, 6795819, 6343530, 6057768, 5987417, 5804457, 5409443, 5240711, 5020216, 4887202, 4756620, 4785057, 4615420, 4583997, 4746565, 4895119, 4738524, 4651121, 4757176, 4739771]
6464D739771L92981K41065J48619L70150L07625N26697K43897J50132j6396j64728
6454F939813l39006o02586o97009l78367n09864k80356k09958l22661m8219k23391
6444C328396K1492O3535R1168n3130k82628R1988j27523j57136P4929j9853k05694
6433B825544N0016j32950n9709R4578J99408j5498q6323N49426J25111j00518
6423C449085p1015K26124j10614O5053K71038O040L37418r9494o8492K08572j89211
6412D024504J20695j22021j47185R4613O8235k75048m3567K01580M2622j33046
6402C831382P0390K03963j1219J70304P6038j08189l18753j55672K30322O861
6392C995427J77839n1407k38965j01464k00030k08754l93793j83378K8989l10953
$$ y = [4739771, 5132752, 5373817, 5522436, 5892586, 6200211, 6726908, 6970805, 7120937, 7104541, 6939813, 6600807, 5998221, 5301212, 4922845, 4412981, 4132625, 3922667, 3600006, 3551787, 3328396, 3349888, 3413423, 3504591, 3451461, 3168833, 3260821, 3133298, 2976162, 3051091, 3031238, 2825544, 2875560, 2742610, 2682901, 2777479, 2976887, 2961389, 2875066, 3424492, 3549603, 3449085, 3378070, 3604194, 3493580, 3558633, 3829671, 3835711, 4173129, 4073635, 4005143, 4213715, 4024504, 4145199, 4023178, 3875993, 3970606, 4038841, 3763793, 3720226, 3921806, 3964428, 3831382, 3901772, 4105735, 4094516, 4264820, 4340858, 4232669, 3913916, 3758244, 3988566, 3995427, 4173266, 4121859, 3882894, 3781430, 3581400, 3372646, 2978853, 2795475, 2824464, 2513511]
6382B513511p1865P6111l76800l2555n0863j00027k38756N4867N5180j62496K03045
6371A869352j58213J77665l28129j87139q7998j93468j6497J43701l9554j88445
6361I91275q173k8762K09871j32589J5987j83720O4914j68203O4077J04004o7351
6350H61330m975R6965j25427j85972J50874M7251j04485o8837k6063j84114j72131
6339B84416q0684J91009K81607L3633J16209l14342M288K6035R5257J69420l52221
6328D54627J19498N9616r0789o4084J38164K30122L9248n0478j77470r5466N211
6317E68199R3221l8425m6447O8631j21113o2368Q4600K0125m0020P7781k74710
6306C29474P1563O1469J21797j84423J72040L0739j05930n4599O4089M9971o2723
$$ y = [2513511, 2441646, 2517757, 2140957, 2108402, 2057539, 1957512, 1718756, 1773623, 1828803, 1666307, 1869352, 1711139, 1888804, 1560675, 1373536, 1285538, 1092070, 1075573, 1219274, 1179720, 991275, 983102, 954340, 1164211, 1031622, 1047609, 863889, 928803, 760600, 824677, 928681, 861330, 856355, 953320, 827893, 641921, 792795, 840046, 735561, 666724, 640661, 456547, 284416, 203732, 394741, 676348, 709981, 826190, 511848, 516136, 542171, 637428, 806848, 454627, 574125, 633741, 542952, 478868, 617032, 847154, 886402, 835924, 658454, 562988, 568199, 661420, 622995, 576548, 645179, 524066, 461698, 546298, 566423, 526403, 604184, 329474, 401037, 462506, 584303, 399880, 571920, 602659, 496729, 442130, 506219, 556190, 493467]
6295D93467q6230P4145P9057J02017N7744k74869K52409j31786j90200K04587
6285E80341J00455M0664j0412k94694K962J24741J12674M7885K25532j71255k57221
6274E01672k37378J33044p8362J30449N2714o1397K7059m5854j63525J08373K33636
6263F00431P5026o6819j07035Q0384j45725n3036J03238l6359J11762o3836q6649
6252D11382J2106J09585Q2124k42844j72229m229K30432k82734N6358o7476N3996
6241A86471j5872O6958k5247J62260k4678R8471M2752p5857j33294R977J07088
6230C99029k17654r4543K15302k16034M502J84958J83968q7172k0850K76716j75336
6219D52886j39304j63860J45902K66004L6567q7494l21337l0480J71049j2868
$$ y = [493467, 407237, 481382, 560439, 662456, 720200, 445331, 697740, 565954, 375754, 580341, 680796, 721460, 711048, 416354, 419316, 544057, 656731, 704616, 930148, 758893, 501672, 264294, 397338, 318976, 449425, 502139, 440742, 467801, 421947, 258422, 366795, 600431, 675457, 608638, 501603, 581987, 436262, 383226, 486464, 450105, 561867, 498031, 411382, 423488, 533073, 615197, 372353, 200124, 195895, 426327, 143593, 199951, 132475, 186471, 170599, 237557, 212310, 374570, 349892, 448363, 491115, 415258, 281964, 291941, 399029, 181375, 86832, 302134, 86100, 90602, 275560, 459528, 372356, 351506, 628222, 452886, 313582, 149722, 295624, 561628, 598195, 510701, 189364, 158884, 329933, 317065]
6209C17065N662n8043K05239k16055J10664k11898n8858J93226K1092N1026J57505
6198E16625j93527L3687K1669r0727J34974j17496P8337L2296j26712J45825J11788
6187E46739j02160K04485m5636J01172m3457j23894j06738k1831K82767K47767
6177I39214j36266l30681j73475J20249J83922j94225q810j34596L3875N9923
6167C59130j09038m284K26001q3866J803J0042k53747J5773J56266O6265k10587
6156A73758j54327O7095k1532o5765R4023J92932J65640r8365j17004k23373J52721
6145A65803J38849N1269m1819k44753J90724j7570N4669r8997p4119N7927L8736
6134B20719l6122m2652L9353R6068q5161k65117j55381L41388j7813k71979Q334
$$ y = [317065, 322727, 264684, 469923, 253868, 364532, 152634, 93776, 287002, 308094, 359120, 516625, 323098, 356785, 378454, 287727, 422701, 305205, 383542, 415838, 289126, 434951, 546739, 444579, 649064, 603428, 704600, 661143, 537249, 430511, 408680, 691447, 939214, 802948, 472267, 298792, 419041, 602963, 408738, 399928, 265332, 299207, 359130, 250092, 245808, 471809, 387943, 389746, 399788, 146041, 161814, 318080, 384345, 173758, 19431, 86526, 64994, -771, 93252, 286184, 451824, 353459, 236455, 13082, 165803, 304652, 355921, 314102, 69349, 260073, 242503, 297172, 198175, 124056, 181983, 220719, 184597, 141945, 181298, 277366, 192205, -72912, -228293, 113095, 95282, -176697, -168363]
6123a68363J10244K22438L6512j19220K1700j17298n9625K67562p5500l3086R6543
6112A81907j14848M4722j76508P513R1776N4678n1640l31194K40017J79279j07012
6101A8690J52940K4946j02254j31195K7036J26580o8426N290L5754j12518r6415
6090a19572L5224J43723J2945k86029P4274J96730L2K5537N3856j40597R4067
6079I0190K1920P9432R91r0048j17153j26167N573J55826J67828J16048j50550
6068A53890j07005j00282M3113l578J50736l9367l05829J02213p3498o2580J53146
6057h9041q8142K60668J10773j94530l6818O9526j44962K12107J39561j9183k32375
6046a2416l3222q9144J19884K9938O0518J24512q5881j90500J35538n4860j2850
$$ y = [-168363, -58119, 164319, 200831, 81611, 103311, -13987, -73612, 193950, 118450, 85364, 181907, 67059, 111781, -64727, -57214, 34562, 89240, 37600, -293594, -53577, 125702, 18690, 171630, 196576, 94322, -36873, -9837, 116743, 48317, 53607, 89361, -23157, -119572, -84348, 59375, 72320, -213709, -139435, 57295, 57327, 82864, 136720, -3877, 90190, 112110, 191542, 192533, 102485, -14668, -140835, -135262, 20564, 188392, 304440, 153890, 46885, -53397, -10284, -13862, 136874, 97507, -208322, -106109, -179607, -242187, -89041, -177183, 83485, 194258, -272, -37090, 32436, -112526, 99581, 239142, 219959, -12416, -45638, -134782, -14898, 15040, 75558, 200070, 114189, -76311, 59227, 4367, -8483]
6035h483M1670k1836J7691j7966j41849k44556L75141J30271R2784j61316p9660
6024a8109J62892j58491k23196P2339j39408J09746J74424J38474J4083J9472
6014A52226k58105L14403q7681p1783k38361J35353R8065j15195R0352p2503P1685
6003A8456j06415m9642N9965j1075Q0283m3562o6894j7362j0018O1994k06369
5992b90639L08678n3084n9607J07331J3421L4014r5211j34709J18520p4094J8230
5981a07150L27512j07743J20781j69622N0496j35417p8748J77757m3630j61329
5971a27093P4918o0069J7080K305R4607K15313l0622K7437j08265k74372n5984
5960b24745j1452q9031K04039n1304p3980j65950J05212J98375q7412j81667J20728
$$ y = [-8483, 33187, 11351, 29042, 11076, -130773, -375329, -188, 130083, 222867, 61551, -18109, 144783, -13708, -236904, -164565, -303973, -194227, -19803, 118671, 132754, 152226, -105879, 208524, 120843, 49060, -189301, -53948, 44117, -71078, 19274, -53229, 18456, -87959, -137601, -77636, -88711, -8428, -51990, -118884, -136246, -146264, -84270, -290639, 18039, -35045, -94652, 12679, 26100, 60114, -35097, -169806, -51286, -125380, -107150, 220362, 112619, 233400, 63778, 114274, -21143, -99891, 77866, 34236, -127093, -52175, -112244, -95164, -92859, 1748, 217061, 186439, 213876, 105611, -168761, -224745, -236197, -325228, -121189, -172493, -246473, -412423, -307211, -108836, -196248, -377915, -257187]
5949b57187J78476p3662L8960j01952J40622J8173R1564J05323j06067l3518N3055
5938E3787l17632J4549P9418q3728J54361Q7559p3341o2098o5937k09639K86701
5927a36000K11421Q1777q1289k6328j59573P0554L9244L3463j90298P091J09901
5916d0037q871j06523J01208j99501J69748J4631p636K02951k99229p488J51195
5905b9552O0446j05666j14147o562M0689J83081p5686j63258Q7081J58534N5859
5894I0819n1854L659J4682J64726j09627j58545J21332j38392J59627L3302l25975
5883a96246R2352j90857j74635M78241K04314j02037J8711q4888j6483k35212
5873b06740J32576k6807K8315L7486R796m5901J10767J39302R728m136j26761
$$ y = [-257187, -78711, -152373, -113413, -215365, -74743, -56570, 34994, 140317, 34250, 732, 53787, -263845, -249296, -169878, -253606, -99245, -11686, -85027, -147125, -213062, -422701, -136000, 75421, 157198, 75909, 49581, -109992, -39438, -194, 33269, -157029, -149938, -40037, -48908, -155431, -54223, -253724, -83976, -69345, -76981, 125970, -173259, -180747, -29552, 30894, -74772, -188919, -195481, -154792, 28289, -47397, -210655, -123574, 34960, 90819, 38965, 42624, 57306, 222032, 112405, -46140, 75192, -63200, 96427, 129729, -196246, -103894, -294751, -469386, 8855, 213169, 111132, 129843, 44955, 28472, -206740, -74164, -100971, -72656, -35170, -25374, -71275, 39492, 178794, 188522, 184386, 57625]
5862E7625M2983j14841r2636l2348L1853L8459n6655n2806J08288O4430k06015
5851b11663L6665m3809K01118j17694o6417J08430k46541Q4577K33097m260j89627
5840b16124p6119J54344J90854j56201k3762K67569q5806k11354j14829J17912
5830a53516J07205q6994J72259K19687k95355J4555l7668Q9687n3406L3227L435
5819A3116j57449J03204l47851Q7477J85682j55367j36837K95123k7940m1786
5809a82628P5778K1904P2791N9387j41520l5532j52J88889n7581M301j43970J85180
5797D6847r0511j41733K27540k01848j74611J56318K88384m4964k81341k01858
5787d17777L85137K08986j72114j26196O027J44139j08396J60227j5002j19925
$$ y = [57625, 100608, -14233, -106869, -139217, -107364, -68905, -125560, -178366, -70078, -5648, -211663, -174998, -218807, -17689, -135383, -201800, -93370, -339911, -255334, -22237, -26497, -216124, -292243, -137899, 52955, -103246, -127008, 140561, 54755, -156599, -271428, -153516, -46311, -133305, 38954, 258641, -36714, -22159, -59827, 29860, -23546, 9681, 13116, -144333, -41129, -388980, -301503, -115821, -271188, -408025, -112902, -140842, -182628, -106850, -84946, -12155, 47232, -94288, -129820, -129972, 58917, 1336, 5637, -138333, 46847, -43664, -185397, 42143, -159705, -334316, -177998, 110386, 65422, -215919, -417777, -32640, 176346, 4232, -121964, -115937, 28202, -80194, 80033, 65031, -54894]
5777e4894O4481P4747k9595l51186J25614K45622O7635q4862J18729q2355k04175
5766a10239j19959q6963K49937J64912K079Q1873n6278m9242J32962J15536j94567
5755A30051j34364J0536k4149J28924j38948P8950l8386J3133P188N8943j84506
5744i2628K53637k5995j28679J68377m0644j18596j9244P2798P9952K174k11341
5733f0189R993o456P8169q5080J76820Q6919k26347R4618M8642r5412Q4735K7098
5721A33510J41601N4106K33915r2542O2907l63605J4219K90590M8876j69067o2740
5710B91770J9593k01595n6209M5603J8435J98061L0065n3851J42217j02409j1936
5699C19744J90148k3732r2351j8228l5574k19040N0363K85377p7351l96063P4832
$$ y = [-54894, 9587, 84334, 54739, -296447, -170833, 74789, 142424, 57562, 176291, 93936, -110239, -230198, -317161, -67224, 97688, 99767, 181640, 125362, 76120, 209082, 324618, 130051, -4313, 6223, -17926, 110998, -27950, 51000, 12614, 25747, 32935, 91878, -92628, 161009, 135014, 6335, 174712, 134068, 15472, -3772, 69026, 148978, 151152, -60189, -50196, -56652, 21517, -63563, 113257, 200176, -26171, 68447, 117089, 21677, 106412, 133510, 275111, 329217, 563132, 470590, 533497, 169892, 184111, 474701, 523577, 354510, 291770, 311363, 109768, 53559, 99162, 117597, 315658, 345723, 291872, 434089, 331680, 319744, 509892, 486160, 393809, 375581, 340007, 120967, 171330, 456707, 379356, -16707, 58125]
5688E8125J25243Q4381o6041J56606k04614j04759j6483J56162j07691J40064
5678B20993J12450q9287r5816R5949K68826M8886p3285j92765J59310J26985j19826
5667D62420k39883r2637L21408K7078l68552K27287o1794k24254L01602Q3731
5657D36406j57753J5356k01134K85448m64737N4446P2602O3937J54293q3549j15317
5646E9998J09827K29272p5933j07516L444J30480j08880m11336J80388Q7954j3626
5635H4072j38080j20754J28008Q7838R1157K09070l0309Q7775r095o4198N7887
5624C83371J12523k05057J94611j18439j00779P6071J53253k15914m7116p3863
5614A58661j96596J90153o9533K25240k4714O2110J01747R2124J06357q4601k30789
$$ y = [58125, 183368, 267749, 201708, 358314, 153700, 48941, 32458, 188620, 80929, 220993, 333443, 244156, 148340, 244289, 513115, 562001, 488716, 295951, 455261, 582246, 462420, 222537, 129900, 451308, 478386, 109834, 337121, 275327, 51073, 352675, 436406, 278653, 294009, 92875, 378323, -86414, -31968, 40634, 104571, 258864, 175315, 59998, 169825, 399097, 323164, 215648, 219092, 349572, 240692, -170644, 9744, 97698, 84072, -54008, -174762, -46754, 41084, 132241, 341311, 311002, 398777, 389682, 325484, 383371, 495894, 290837, 485448, 367009, 266230, 342301, 495554, 279640, 232524, 158661, -37935, 152218, 82685, 307925, 283211, 345321, 447068, 539192, 645549, 560948, 330159]
5603C30159O2948J27178K08736j74348j17842J13142n0184r4099j53395N3786
5593C06081K43217j88573N609M5794J7233p7513l1758K07238q0141O4086j37836
5582C73437o2068J08316p2305K17703l1197j62130J08472n2285o603n2463j26336
5571B42541J76145J01197j26401R306P7667j74319K08541J17273K12334Q7701
5561I31985j54633j19761j22460K13600N5582q9820M7782k0170R2025j08517K4502
5550G50115K30252k02712J08948o9060n5020k5564R6578j42955R8121L2089Q0252
5539I01044K12846O5605M0270j05430J57048k00432j1687Q5372K73483r960o7646
5528A340513l1459n2046N9171O4116j9208Q6577J1334K32356Q7082m61914o7239
$$ y = [330159, 393107, 520285, 729021, 554673, 436831, 549973, 499789, 405690, 252295, 306081, 549298, 360725, 366334, 412128, 429361, 351848, 320090, 527328, 447187, 511273, 373437, 311369, 419685, 347380, 565083, 533886, 371756, 480228, 427943, 421340, 368877, 242541, 418686, 519883, 393482, 402788, 480455, 306136, 514677, 631950, 844284, 931985, 777352, 657591, 535131, 748731, 804313, 714493, 762275, 742105, 834130, 725613, 750115, 980367, 777655, 886603, 817543, 762523, 736959, 833537, 690582, 788703, 820792, 901044, 1113890, 1179495, 1219765, 1114335, 1271383, 1070951, 1059264, 1144636, 1418119, 1408159, 1340513, 1309054, 1257008, 1316179, 1380295, 1361087, 1447664, 1458998, 1691354, 1778436, 1316522, 1249283]
5517A249283K31638m8976J16371O5546k2109r3686K71449N4070J6224J22025J61859
5506B123694l2780j7848p9523l4143J63183K18266J5189m9826K66988J6708K02181
5495B792089m4559j94671L30044K06251J50522P8264N1821j01939L1095K21728
5485C520645j8820J11687N6099K02979J12961R1606M7484K65475N1646K32494
5475D674256L65841L92815L47649k4236L2256l7614N45453n496K41992L14703
5465F847619L79211L83222L92723P7535L88671O44104N69235N12586K83023Q00656
5455A1278585O15028O42428Q49224J303281P98976J145196J129782P60236O85427
5446A9208163L17361N27334J82518L44409P73151R25664J422215J348764J684874
$$ y = [1249283, 1480921, 1431945, 1548316, 1613862, 1591753, 1498067, 1769516, 1823586, 1839810, 1961835, 2123694, 2090914, 2073066, 1993543, 1959400, 2122583, 2340849, 2356038, 2306212, 2573200, 2589908, 2792089, 2747530, 2552859, 2882903, 3089154, 3239676, 3317940, 3369761, 3267822, 3298917, 3520645, 3501825, 3613512, 3669611, 3872590, 3985551, 4077157, 4124641, 4390116, 4441762, 4674256, 5040097, 5432912, 5780561, 5756325, 5788581, 5750967, 6296420, 6290924, 6532916, 6847619, 7226830, 7610052, 8002775, 8080310, 8468981, 9113085, 9682320, 10194906, 10477929, 11278585, 11893613, 12536041, 13385265, 14688546, 15487522, 16632718, 17762500, 18522736, 19208163, 19525524, 20052858, 20235376, 20579785, 21352936, 22278600, 23700815, 25049579, 26734453]
5437B6734453J911256K392724K454845K478763K547836K733755K814489L028452
5429D7096573L708250L190079K850060K262337J065038j59204j000838j632972
5421E7379323j859914j561805j053837m73260k75929L73327O16168J468197J972273
5412E6584543K368554K177905K446546K932214K530637K160413K972123L256416
5404G7429351M000500M414789L620461J099469j378586l833097n576312o518164
5396G3258411o032461n231668m259163l568497k954070k080710j571253j155240
5388D6405349q24251m76338j49085J4561K84926K99524K06496M23833Q61148J545021
5378D8591184J713813J791322J519248L73302j544006k577124l534332l607253
$$ y = [26734453, 28645709, 31038433, 33493278, 35972041, 38519877, 41253632, 44068121, 47096573, 50804823, 53994902, 56844962, 59107299, 60172337, 60013133, 59012295, 57379323, 55519409, 53957604, 52903767, 52430507, 52154578, 52527905, 53144073, 54612270, 56584543, 58953097, 61131002, 63577548, 66509762, 69040399, 71200812, 74172935, 77429351, 81429851, 85844640, 89465101, 90564570, 89185984, 85352887, 79776575, 73258411, 67225950, 61994282, 57735119, 54166622, 51212552, 49131842, 47560589, 46405349, 45581098, 45104760, 44955675, 44970236, 45255162, 45554686, 45761182, 46185015, 47046163, 48591184, 50304997, 52096319, 53615567, 53988869, 52444863, 49867739, 46333407, 42726154]
5370D2726154l441212l262191k744955k290861k207811j794390j637833j045252
5362B4301649r36142j092381j196835o19257o02351n72743n53319m78364l60056
5353A7890201l44265j82397l09868k13541r474P7165j47749k51587L9966m68224
5343A6080227k72342m99375o44792n57058l52538l88558l55774m83720l27707
5334A2198363o3208j41410k78557k73972k66767r5057l99714k81396J25093N6672
5324A0580047l03438p4555J58197J85164j46671q0118M7501j67606k03969k87656
5314I706896j13555l48312k16876j20118m12462l25019m3662j67434j84739j90787
5304G583932L6029j50205o9786k84700l2978L8743o1258j15117k73833l3944K75016
$$ y = [42726154, 39284942, 36022751, 33277796, 30986935, 28779124, 26984734, 25346901, 24301649, 23365507, 22273126, 21076291, 20457034, 19854683, 19281940, 18728621, 18250257, 17890201, 17545936, 17363539, 17053671, 16840130, 16830656, 16907821, 16760072, 16508485, 16548451, 16080227, 15807885, 15308510, 14663718, 14106660, 13754122, 13365564, 13009790, 12526070, 12198363, 12135155, 11993745, 11715188, 11441216, 11174449, 11079392, 10679678, 10398282, 10523375, 10580047, 10276609, 10202054, 10360251, 10545415, 10398744, 10318626, 10366127, 10198521, 9994552, 9706896, 9593341, 9245029, 9028153, 8908035, 8495573, 8170554, 8126892, 7959458, 7774719, 7583932, 7619961, 7469756, 7399970, 7115270, 7082292, 7121035, 7059777, 6944660, 6670827, 6636883, 6911899]
5293F911899J19623k05104k76367j66592l3701J81896p1057j03298j4725j33526
5283F209048m5515j00317k75710j78108K60247Q3682J42997P5136O5329R6193
5273F332982R4616J10189J91659L588p6114K15490j61620k03253j29382Q9823
5263F467978Q5130J52689J42169M5012Q9331R6570L60745L76497J05565K36263
5253H157949J87083N535M71547M17807K23296J00172j18532M55956R7776n5705
5243I942884j21832J74090k40640k64984R6743J6583k21226o933J34731K18489
5233I727905J41935M7987M17299l3481m3023l66264j97454k59633j75212N9080
5223I319139l364j28056k43196R98m4342k7019j49771j38204K51009k88963k18952
$$ y = [6911899, 7031522, 6826418, 6550051, 6383459, 6349758, 6531654, 6460597, 6357299, 6342574, 6209048, 6163533, 6063216, 5787506, 5609398, 5869645, 5953327, 6096324, 6171460, 6236789, 6332982, 6427598, 6537787, 6729446, 6733034, 6656920, 6872410, 6710790, 6507537, 6378155, 6467978, 6553108, 6705797, 6847966, 6892978, 6982309, 7078879, 7439624, 7816121, 7921686, 8157949, 8345032, 8350567, 8822114, 9239921, 9463217, 9563389, 9444857, 9900813, 9998589, 9942884, 9821052, 9995142, 9754502, 9489518, 9586261, 9602844, 9381618, 9374685, 9509416, 9727905, 9869840, 9917827, 10335126, 10301645, 10258622, 9892358, 9694904, 9435271, 9260059, 9319139, 9315775, 9187719, 8944523, 8945521, 8901179, 8874160, 8724389, 8586185, 8837194, 8548231, 8329279]
5212H329279P6783n7172j32057M4086k4991j77818r0864n3357m47663l40994l03028
5201F822204n01751p5574j23463j67571j43776l04930j03384j26529j12206p0642
5191E092378j31175M0530j51708K6181l3430j4889m120p9115j17293L1353Q1540
5180D740252k21492m44212o2019m4751m0428k3798N860j37994l0405m6681J55924
5169C850256j41420r8184Q542k1404p4885J54540k34332j71717K39160k2538j4166
5158C473852L6651j8856J2308J04517k3108o9780k85878J34890J21785J72156
5148C658537K9747K4202k43431k6231L05601L2000J3004J3526k35700J89203K4572
5137C785030k30428L20424J76992J1637M7950L9354K75901M8454L0394l8658R0147
$$ y = [8329279, 8406062, 8348890, 8216833, 8260919, 8235928, 8058110, 7967246, 7913889, 7466226, 7125232, 6822204, 6320453, 6244879, 6121416, 5953845, 5810069, 5505139, 5401755, 5275226, 5163020, 5092378, 4961203, 5001733, 4850025, 4876206, 4842776, 4827887, 4823767, 4744652, 4627359, 4658712, 4740252, 4518760, 4074548, 4012529, 3967778, 3927350, 3903552, 3909412, 3771418, 3741013, 3694332, 3850256, 3708836, 3610652, 3619194, 3597790, 3522905, 3677445, 3443113, 3271396, 3510556, 3488018, 3473852, 3510503, 3491647, 3503955, 3608472, 3585364, 3515584, 3229706, 3364596, 3486381, 3658537, 3688284, 3712486, 3469055, 3442824, 3748425, 3780425, 3793429, 3806955, 3571255, 3760458, 3785030, 3554602, 3875026, 4052018, 4063655, 4111605, 4150959, 4426860, 4475314, 4505708, 4467050, 4557197]
5126D557197J13109j06700K9938K77668K06344p9796N5078K10027q6941N6126
5116E232050J17081l6782l85K36593M1226R9744J66188R5044M0639O6818L69746
5105F427962K95025L73978K59885J16289J22149K16809P5085K29753P45336L66731
5095I229002M24444L11412L13650N39946L62315P98440R39586O84679R45486J012117
5085A5561077R97981J512854J563068J519200J743547J876871J822554J583852
5077B8181004R78978K86053n21518j013357j001403r84510q36316l96709m25606
5068B4266616k18745K31568L18261L14916N39047Q38956J294877J627538J624623
5059C0837657J802189K353067K760984K543565L000121L015998K915319K146623
$$ y = [4557197, 4670306, 4563606, 4593544, 4871212, 5077556, 4997760, 5052838, 5262865, 5175924, 5232050, 5349131, 5312349, 5311964, 5548557, 5589783, 5689527, 5855715, 5950759, 5991398, 6058216, 6427962, 6722987, 7096965, 7356850, 7473139, 7595288, 7812097, 7887182, 8116935, 8862271, 9229002, 9653446, 9964858, 10278508, 10818454, 11180769, 11979209, 12918795, 13603474, 14548960, 15561077, 16559058, 18071912, 19634980, 21154180, 22897727, 24774598, 26597152, 28181004, 29159982, 29446035, 28924517, 27911160, 26909757, 25925247, 25088931, 24692222, 24266616, 24047871, 24279439, 24597700, 24912616, 25451663, 26290619, 27585496, 29213034, 30837657, 32639846, 34992913, 37753897, 40297462, 43297583, 46313581, 49228900, 51375523]
5051E1375523J235667j79371j609198k466826k796801k468418k584556k359567
5043C8146453j863214j644967j437771r96391o00785o23094j09325r2665R2084
5034C0870325N82610N62715N99331J016581J162613J052968J319149Q17990J63104
5025C8147386j03364p25488j156788j126551j587654j690618j822799j788630
5017B8145494j488592j412049j431923q92776p40702r42798q97313p51591p18700
5008A8869050q11894n02011j91271m75477k54281l71885m04442k34491j81446
4999A5441852k06909n6235k49674l04529m83899l64205k31234q2249k82366k34727
4989A2945825k76313j66950j08598j14140j20793p7463k24373l39339j43319j49113
$$ y = [51375523, 52611190, 52431819, 50822621, 48355795, 45558994, 43090576, 40506020, 38146453, 36283239, 34638272, 33200501, 32204110, 31603325, 30980231, 30870906, 30778241, 30870325, 31452935, 32015650, 32614981, 33631562, 34794175, 35847143, 37166292, 37984282, 38147386, 38044022, 37318534, 36161746, 35035195, 33447541, 31756923, 29934124, 28145494, 26656902, 25244853, 23812930, 22920154, 22179452, 21236654, 20339341, 19587750, 18869050, 18057156, 17555145, 17363874, 16888397, 16634116, 16262231, 15857789, 15623298, 15441852, 15234943, 15178708, 14929034, 14624505, 14140606, 13776401, 13545167, 13462918, 13180552, 12945825, 12669512, 12502562, 12393964, 12279824, 12159031, 12081568, 11857195, 11517856, 11374537, 11225424]
4979A1225424J8706j00600N8013q5542L22660j47664J84461J31996k9079K6005
4969A1604380r8373J07492k6060J80223K07082o491r902P442r7505P4101q4881
4958A1857508K53839j1501j23565J96059K3183k04629L08511K64907J43333j91167
4948A2516478R3692L15387J68602J06505N0387L1657K60205K9848J12843P1470
4938A3757074M2034J16435R6972K19212J54110j636L35959K44575K07037K87128
4928A5458900R2994M68492K43606M58588J92349N48448j0830j55148m35783l05634
4918A6555982O3004m62411o2454j5800r3265j14680o4660K24153K35225M88849
4908A6753943K12822J93149M52955N08171K99590Q30230N85501Q50025Q38860
$$ y = [11225424, 11244130, 11143530, 11201543, 11116001, 11438661, 11290997, 11475458, 11607454, 11578375, 11604380, 11506007, 11613499, 11587439, 11767662, 11974744, 11968253, 11958351, 11965793, 11868288, 11942389, 11857508, 12111347, 12099846, 11976281, 12172340, 12195523, 11990894, 12299405, 12564312, 12707645, 12516478, 12610170, 12925557, 13094159, 13200664, 13251051, 13282708, 13542913, 13572761, 13685604, 13757074, 13799108, 13915543, 14012515, 14231727, 14385837, 14384201, 14720160, 14964735, 15171772, 15458900, 15551894, 16020386, 16263992, 16722580, 16914929, 17463377, 17452547, 17297399, 16861616, 16555982, 16618986, 16156575, 16094121, 16078321, 15985056, 15870376, 15805716, 16029869, 16265094, 16753943, 16966765, 17159914, 17612869, 18121040, 18420630, 19250860, 19836361, 20686386, 21525246]
4899B1525246O39503P48674M66804L502L4863n19302j56398q8978l33684j58341
4889B2161889k60541K8111q6629Q0782J47016J51306M24885O87812Q87146N76698
4879B4798475N62465Q93960Q55039P38805J009480J183395J154666J011959J175598
4870C3383842J516697J261500J679058J976206K123957K142330J808234K429965
4862D8321789K848301K731941L017605L139290K527244J412839M28957p75889
4854F3652077j862966k744154l946235m178175l787099l737268l333781k872935
4846C7189464k665337k145891j609738j694004j659991j600133j502434j318574
4838B2993362j147316j002507q66049j110544o72716n31535m77634n56294n75226
$$ y = [21525246, 22164749, 22913423, 23380227, 23383729, 23418592, 22899290, 22742892, 22653914, 22320230, 22161889, 21901348, 21929459, 21842830, 21923612, 22070628, 22221934, 22646819, 23334631, 24221777, 24798475, 25360940, 26254900, 27109939, 27848744, 28858224, 30041619, 31196285, 32208244, 33383842, 34900539, 36162039, 37841097, 39817303, 41941260, 44083590, 45891824, 48321789, 51170090, 53902031, 56919636, 60058926, 62586170, 63999009, 64427966, 63652077, 61789111, 59044957, 55098722, 50920547, 47133448, 43396180, 40062399, 37189464, 34524127, 32378236, 30768498, 29074494, 27414503, 25814370, 24311936, 22993362, 21846046, 20843539, 19977490, 18866946, 18194230, 17662695, 17185061, 16628767, 16053541]
4829A6053541m53174m37616n85756l51067n48562l67978k67486k54875n31010
4820A2256017k15921k59346l77606l32795m09329j70751k29259l73240m5229j43365
4810I699176q0733k41951k06359n89367j20937L6837l1518O7121J8001j18876
4800H431394k60715k79605p3677P541J1692l3479l14763P2814m19856o4791m17465
4789F659090k37752K27735J01168J33834J35273k35113l23911j19959M3403L1754
4779F415522r5384M1274J22456Q089p1382k25085k999L4395O4387r6849j062l8407
4767F154955J57013j34429q5402J81646R138j94847M5543R0846j9254k51695q0200
4756E873314j15928k29760O5709K43123P0752N8568j60531p5226l27200K09841
$$ y = [16053541, 15600367, 15162751, 14576995, 14225928, 13677366, 13309388, 13041902, 12787027, 12256017, 12040096, 11780750, 11403144, 11070349, 10661020, 10490269, 10261010, 9887770, 9842541, 9699176, 9618443, 9376492, 9170133, 8580766, 8459829, 8496666, 8465148, 8532269, 8550270, 8431394, 8170679, 7891074, 7817397, 7824938, 7836630, 7803151, 7488388, 7561202, 7141346, 7076555, 6659090, 6421338, 6649073, 6750241, 6884075, 7019348, 6784235, 6460324, 6340365, 6383768, 6415522, 6320138, 6361412, 6483868, 6491957, 6420575, 6195490, 6192491, 6226886, 6291273, 6194424, 6193362, 6154955, 6311968, 6177539, 6092137, 6273783, 6282921, 6088074, 6133617, 6224463, 6205209, 5953514, 5873314, 5757386, 5527626, 5593335, 5836458, 5907210, 5965778, 5805247, 5730021, 5402821, 5612662]
4746E612662k4262J90365K43621k06840l7445J34608K72624q2428l17128l07440
4736E478337l2011j6387Q3216j30517J97757j55682q6972j50508J52652r1932
4726E247953k35926K9947K386j06103n4603n4121J67171k15224j37127J04216
4716D748569L3297p2790j70719n0974l23636n4712L53402K306J13974P3531m96026
4705D156222l22995K76541n9865J30469L1926j14699J35212j27430j18764q642
4695C977975j9363J76469J95740o009r5094m2k13750j0526M6526j44438R2924
4684D000412j48328j85229j22352j51918q8278l1335j58745k7188n2397j1146
4674C023496L8297j89791P4122j18471j50720o1005N6448R6795o3867j00075k19639
$$ y = [5612662, 5588400, 5778765, 6022386, 5815546, 5778101, 5912709, 6185333, 6102905, 5785777, 5478337, 5446326, 5429939, 5513155, 5382638, 5580395, 5424713, 5337741, 5187233, 5339885, 5247953, 5012027, 5041974, 5044360, 4938257, 4883654, 4829533, 4996704, 4781480, 4644353, 4748569, 4781866, 4709076, 4538357, 4487383, 4163747, 4109035, 4462437, 4464743, 4578717, 4652248, 4156222, 3833227, 4109768, 4049903, 4180372, 4212298, 4097599, 4232811, 4105381, 3986617, 3977975, 3958612, 4135081, 4330821, 4324812, 4229718, 4229676, 4015926, 4005400, 4051926, 3907488, 4000412, 3852084, 3666855, 3544503, 3392585, 3304307, 3272972, 3114227, 3087039, 3034642, 3023496, 3061793, 2872002, 2946124, 2827653, 2676933, 2615928, 2672376, 2769171, 2705304, 2605229, 2385590]
4663B385590j01465P9206j41563P6002J15517J02830p2515k35822L3860j73553
4653B068087K32750r6101O1865k43531p3972n9504r2048n2550K32958n8249j38419
4642A781286J46744R2928j40164j17561N1465P5352j66414j44593M0609n6464
4632A563188j2260r938j19467O3406J39706J90084j19597k08934q1087j05516
4622A299585L28348J4033k39496O5676J44080j37395p4308j29439j6776L3121
4612A287429m0083L1819q2935K38789J97975k20188K0126j08309j24756r8671
4602A101196o6003K73892p8564K7527j65609J022J05025J4814q6818r8089M1487
4591A069880l368K34499m9241J44835j18749j74460j3355K54864J44652O2698
$$ y = [2385590, 2284125, 2363331, 2221768, 2297770, 2413287, 2516117, 2443602, 2207780, 2241640, 2068087, 2300837, 2204736, 2266601, 2023070, 1949098, 1889594, 1797546, 1744996, 1977954, 1919705, 1781286, 1928030, 2020958, 1880794, 1763233, 1814698, 1890050, 1723636, 1579043, 1619652, 1563188, 1550928, 1540990, 1421523, 1484929, 1624635, 1814719, 1695122, 1486188, 1405101, 1299585, 1627933, 1641966, 1402470, 1468146, 1612226, 1474831, 1400523, 1271084, 1254308, 1287429, 1247346, 1279165, 1196230, 1435019, 1632994, 1412806, 1432932, 1324623, 1199867, 1101196, 1035193, 1309085, 1230521, 1258048, 1092439, 1093461, 1198486, 1213300, 1126482, 1028393, 1069880, 1066512, 1301011, 1251770, 1396605, 1277856, 1103396, 1090041, 1344905, 1489557, 1552255]
4581A552255l16008L9999r8581j20425j8642q8267L4060K80184j26777l7033j11919
4570I88846J5391K48504J32848k42255n7077J84936k46524j7934J79124m4162
4560A141697j27363k2210J24893p8694j04948J4768n4727J71404p9288M6414r338
4549A022608N1837l896j43441J54403J31358l61312Q8005j59399p719J58769K0890
4538I52103R413J4882n3990J01772J05869l88109R3920j6303J84076L917M6412
4527A053962L1361k87105K81787p0489k14775R3597j8293L4626J27699j88620
4517H43750O264L2700j84069m387p3855J4586J46572O6263l9160j52694J29076
4506G85046Q5009J6858M2926J06384q9899m0026m1682j29172Q8765J97208k4353
$$ y = [1552255, 1236247, 1276246, 1177665, 1057240, 1038598, 950331, 984391, 1264575, 1137798, 1100765, 988846, 1004237, 1252741, 1385589, 1143334, 1086257, 1271193, 1024669, 1006735, 1185859, 1141697, 1014334, 992124, 1117017, 1038323, 933375, 948143, 893416, 1064820, 985532, 1031946, 1022608, 1074445, 1070549, 927108, 1081511, 1212869, 851557, 939562, 780163, 772444, 931213, 952103, 961516, 976398, 922408, 1024180, 1130049, 741940, 835860, 819557, 1003633, 1007550, 1053962, 1085323, 798218, 1080005, 1009516, 794741, 888338, 870045, 904671, 1032370, 843750, 850014, 882714, 698645, 694258, 620403, 634989, 781561, 847824, 808664, 655970, 785046, 870055, 886913, 929839, 1036223, 946324, 906298, 864616, 735444, 824209, 1021417, 997064]
4495I97064j85010Q1493J01156j21727l5652l042r300K23622j38877m1215J2618
4484H81130L3431N7807K503L18959k2028p6043j70644M9501k2563j11610k50217
4473F90226K12099J8280l3132K53419j53054J1621j7631k45889o166J61072K3108
4462I13953k0223j14880J83470n751L2796j67106j12128R4180l7361K13206J00411
4451A080567J7445K5173N0300P0768n2695o6917n1650l63845J25425M0800M3600
4440I18971m2116N9271k1334r5546N6404m3122J88939k28999Q9101j00803K21524
4429A002290o6880q7657N7210J33611q2275p4823R4366j64756L37877p604m83728
4418F57631K84614J28388j05215l5634j05095N3655J85311j73604J41240r7436
$$ y = [997064, 812054, 893547, 994703, 872976, 837324, 834282, 824982, 1048604, 909727, 868512, 881130, 914561, 972368, 974871, 1293830, 1271802, 1195759, 1025115, 1074616, 1052053, 940443, 690226, 902325, 920605, 887473, 1140892, 987838, 999459, 981828, 735939, 729773, 890845, 913953, 893730, 778850, 962320, 956569, 989365, 822259, 710131, 804311, 766950, 980156, 1080567, 1098012, 1123185, 1173485, 1244253, 1191558, 1124641, 1072991, 709146, 834571, 875371, 918971, 876855, 936126, 914792, 819246, 875650, 832528, 1021467, 792468, 881569, 780766, 1002290, 935410, 847753, 904963, 1038574, 956299, 881476, 975842, 811086, 1148963, 1141359, 657631, 942245, 1070633, 965418, 929784, 824689, 878344, 1063655, 890051, 1031291, 933855]
4408I33855J1409J93091j23746j26134K447J22550J6683J6415n0988O4315k8770
4397A031127n6822j29985K35806r1173q0323j11548J94395K57811j62569j77493
4387I09226p5076N5088J44908M0840q3696Q0790j34665L8934j73904M1176K1099
4376H64720L40755L7581j30376J91453l54354j00667K430N6830J88633N0880N5342
4365A203227m0153j96156Q791J13294P3850m9419p941l6043M9162p9186j50692
4354H88734l28934J57922J96882k05444K45368J0584o0710M09232o1297q3197
4344A169140j85479N155L7113J61364k26728J38530k3260p0698J85114P3734r7041
4333A166944J83498j53851j3123l5478n1118Q7047r1520J79037o7789j54954K57112
$$ y = [933855, 945264, 1138355, 1014609, 888475, 890922, 1013472, 1030155, 1046570, 995582, 1059897, 1031127, 974305, 844320, 1080126, 988953, 908630, 797082, 991477, 1249288, 1086719, 909226, 834150, 889238, 1034146, 1074986, 991290, 1072080, 937415, 976349, 802445, 843621, 864720, 1205475, 1243056, 1112680, 1304133, 949779, 849112, 851542, 908372, 1097005, 1147885, 1203227, 1163074, 966918, 975709, 1089003, 1162853, 1113434, 1105493, 1069450, 1118612, 1039426, 888734, 559800, 717722, 914604, 709160, 954528, 965112, 904402, 1313634, 1252337, 1169140, 983661, 988816, 1025929, 1187293, 960565, 1099095, 1075835, 1005137, 1190251, 1263985, 1166944, 1350442, 1196591, 1183468, 1147990, 1096872, 1183919, 1092399, 1271436, 1203647, 1048693, 1305805]
4322A305805p3635j29733J64180k92103R1508L71681q0505m7679J16679j52147
4312A274051O2655j8339k71835r2857L64758j32637j23228J43352J92032j96410
4302A201542m5492K3925K43868R7657r5330k61178j09795J94795j2249N424j0982
4291A232185J09774n086p8397k5777p6147K45677j42005K40999j08632J41304
4281A533895K0023J05053j02693K0408j17502J18856K4856L1938J65877k11755
4271A588956P051j85855j52472k5117L69948J61509j52981n6163o59L2721M6202
4260A633140J01291q4340j38481p9377J43937J02433j2107j9169j22163O6054
4250A591218l5359j0120R5881K02900q0992k6967K28966j35603j89116J66269
$$ y = [1305805, 1232170, 1102437, 1266617, 974514, 1066022, 1437703, 1357198, 1309519, 1426198, 1274051, 1336706, 1318367, 1046532, 953675, 1318433, 1185796, 1062568, 1205920, 1397952, 1201542, 1156050, 1179975, 1423843, 1521500, 1426170, 1164992, 1055197, 1249992, 1237743, 1243167, 1232185, 1341959, 1336873, 1258476, 1232699, 1156552, 1402229, 1260224, 1501223, 1392591, 1533895, 1553918, 1658971, 1556278, 1576686, 1459184, 1578040, 1602896, 1634834, 1800711, 1588956, 1596007, 1410152, 1257680, 1232563, 1602511, 1764020, 1611039, 1554876, 1554217, 1586938, 1633140, 1734431, 1650091, 1511610, 1432233, 1576170, 1678603, 1666496, 1647327, 1525164, 1591218, 1555859, 1545739, 1641620, 1844520, 1763528, 1736561, 1965527, 1829924, 1640808, 1807077]
4240A807077j51151J18920K7612J36081j69198K24558N8272k02273j13353J0646
4230A747191O352K13117M8193r8746O3065p688L8271R4272k85135P5099R8987
4219A992978J94473Q4714J20273K98013o4516n9655p4154J50735J73563J35773
4209B952197J78540K36111L04423J71738o1757L75800M21651O57553P27707O87683
4199F651646L85852O089j10377n94855n14824q88427l75316l60987l12796k40042
4189C645963q7375j79654K776P3603l7012Q601J54493J22885j5785k59295J12821
4178C542021K00679l003K78421n6170O6128p8546p264j58008k21571r0648Q8521
4167C560560k53275M3692j09203M4227k88510J95668j6951j40776n1922R0222
$$ y = [1807077, 1655926, 1774846, 1802458, 1938539, 1769341, 1993899, 2052171, 1849898, 1736545, 1747191, 1753543, 1966660, 2014853, 1916107, 1979172, 1971484, 2009755, 2104027, 1818892, 1893991, 1992978, 2187451, 2272165, 2392438, 2690451, 2625935, 2566280, 2492126, 2642861, 2816424, 2952197, 3130737, 3366848, 3671271, 3843009, 3781252, 4157052, 4578703, 5236256, 5963963, 6651646, 7037498, 7043587, 6933210, 6338355, 5823531, 4935104, 4559788, 4198801, 3886005, 3645963, 3558588, 3378934, 3381710, 3455313, 3418301, 3426902, 3581395, 3704280, 3688495, 3429200, 3542021, 3742700, 3739697, 4018118, 3961948, 4028076, 3949530, 3942266, 3784258, 3562687, 3472039, 3560560, 3307285, 3350977, 3241774, 3286001, 2997491, 3193159, 3176208, 3035432, 2983510, 3073732]
4157C073732P4688K14337j6458k49187L218q6459j4187J53627n0435N4069j93663
4146B963282N1465J63762j51012n6590J08593N0895J08013J21369Q2412k7787
4136C414402l03744j4165q7304J76409j25001o7404P4317K13956j19970j61937
4126B999559L27812Q1191j0059K4772J28408K17333j23556k44083Q6590R008n3202
4115C443773K45428N6477m8269L3661K38735J34322m3086k92337O444j35641J43596
4104C783103M1942j61948M7158K60762J07942r9730Q4085J73602o8035r4692l6780
4093D037409K99617k5580J04495J57603J48730j30560l2040L2957L2101n0718
4083D574014q9300J54939J45143K36250P9287Q1262j9260J64300J71390K67456
$$ y = [3073732, 3148420, 3362757, 3346299, 3097112, 3100330, 3013871, 2999684, 3153311, 3102876, 3156945, 2963282, 3014747, 3178509, 3027497, 2970907, 3079500, 3130395, 3238408, 3359777, 3442189, 3414402, 3110658, 3096493, 3009189, 3185598, 3060597, 2993193, 3067510, 3281466, 3161496, 2999559, 3327371, 3408562, 3398503, 3423275, 3551683, 3769016, 3645460, 3401377, 3487967, 3496975, 3443773, 3689201, 3745678, 3697409, 3731070, 3969805, 4104127, 4061041, 3768704, 3775148, 3639507, 3783103, 3825045, 3663097, 3710255, 3971017, 4078959, 3979229, 4063314, 4236916, 4168881, 4074189, 4037409, 4337026, 4311446, 4415941, 4573544, 4722274, 4591714, 4559674, 4592631, 4624732, 4574014, 4484714, 4639653, 4784796, 5021046, 5100333, 5181595, 5162335, 5326635, 5498025, 5765481]
4073E765481l3282K38698J03085L03552J37534k12855K11555l2457K47793K21296
4063F950400J00454J08432K88032K74472J29542K45577r2957L52481K63463M52693
4053I072589K17626O5701L18424K61210p7652R4301J56320J03463K66508K43193
4043A0721683K64079N18816N33729P37948O99882J037977P45071Q47085K3399
4034A6129669o5915k32177n51695n20846n89398P2781J51507J94481K36202K25148
4024A5049757Q6519K88632M88636K22394N16615P19517N81329R51514J349744
4015B0254657J417863J215092J593422K340222K423569K389819K941981L702471
4007C8279096M723743N843137O899366O470203J897297k896826n357492p059082
$$ y = [5765481, 5732199, 5970897, 6073982, 6377534, 6515068, 6302213, 6513768, 6481311, 6729104, 6950400, 7050854, 7159286, 7447318, 7721790, 7851332, 8096909, 8003952, 8356433, 8619896, 9072589, 9290215, 9355916, 9674340, 9935550, 9857898, 9952199, 10108519, 10211982, 10478490, 10721683, 10985762, 11504578, 12038307, 12776255, 13476137, 14514114, 15259185, 16106270, 16129669, 16063754, 15831577, 15279882, 14759036, 14169638, 14242419, 14393926, 14588407, 14824609, 15049757, 15136276, 15424908, 15913544, 16135938, 16652553, 17372070, 17953399, 18904913, 20254657, 21672520, 22887612, 24481034, 26821256, 29244825, 31634644, 34576625, 38279096, 43002839, 48845976, 55745342, 62215545, 64112842, 61216016, 55858524, 48799442]
3999D8799442o255925m552683l424393k697480j634173j082372j082443o97983
3991B7371990J35952k25673l03561q38000q17838j030860q64182p61723n29380
3982B2136725l49062m22855n60542k96401j73730J91056j696J434L9653Q5186
3972B0649768K24568J47112J31842J55426J14664J76676j6371J80857M81544J57874
3962B2403960L45442J45791R8037K74349K57700L95843M84521N59392N39365N58781
3952B6063181O35511Q59050O11919O20774Q16299Q56990J013475R51668R67992
3943C3396859J481431J442857J366732J382341J578981J542427J551265J889291
3935D5632184J907486K017583K387519L144249L484503M178450M624570N637606
$$ y = [48799442, 42543517, 37990834, 34566441, 31868961, 30234788, 29152416, 28069973, 27371990, 27507942, 27282269, 26978708, 26140708, 25322870, 24292010, 23427828, 22666105, 22136725, 21787663, 21364808, 20804266, 20507865, 20334135, 20525191, 20523495, 20524929, 20564582, 20649768, 20874336, 21021448, 21153290, 21308716, 21423380, 21600056, 21583685, 21764542, 22246086, 22403960, 22749402, 22895193, 22993230, 23267579, 23525279, 23921122, 24405643, 24965035, 25504400, 26063181, 26698692, 27557742, 28169661, 28790435, 29606734, 30463724, 31477199, 32428867, 33396859, 34878290, 36321147, 37687879, 39070220, 40649201, 42191628, 43742893, 45632184, 47539670, 49557253, 51944772, 55089021, 58573524, 62751974, 67376544, 73014150]
3927G3014150O670539Q021614Q991048J0570975J2403995J4422608J7051340K0390953
3919A71537222K4645626K8317774K9214136K5078398J2425157m499413j7725394
3912B68993506k3213117k4671419k3108278k1049775j8028765j4926050j1628632
3905A32367470q886876p149281n482228m562958m766163n079438n101275n007005
3897H6332246m826341m156001l583695l512670l496516k817491k217906j965168
3889E9756458j416819r22434o47326n21211j38755L12855L89731J03834P8642
3880E6994975j97102j79236l12815o8562k00106l09224j58392K79094J32283j14777
3870E5866138o01216o70223r84162n69900j36981R2546M34061P18120R59615J462099
$$ y = [73014150, 79684689, 87706303, 96697351, 107268326, 119672321, 134094929, 151146269, 171537222, 196182848, 224500622, 253714758, 278793156, 291218313, 286718900, 268993506, 245780389, 221108970, 198000692, 176950917, 158922152, 143996102, 132367470, 123480594, 116331313, 110849085, 106286127, 101519964, 96440526, 91339251, 86332246, 81505905, 77349904, 73766209, 70253539, 66757023, 63939532, 61721626, 59756458, 58339639, 57417205, 56769879, 56248668, 56109913, 56422768, 56812499, 56916333, 56994975, 56797873, 56618637, 56305822, 56237260, 56037154, 55727930, 55569538, 55848632, 55980915, 55866138, 55264922, 54594699, 53610537, 53040637, 52903656, 52996202, 53430263, 54148383, 55107998, 56570097]
3860E6570097J797249K254154K917108L476961M420353N478841O738471P754965
3852I1408199R205055R205769Q362687N783208O14400m080680p623144j0123111
3844A02752383j0361273r422772p972375o571858n019025l882129l301314k373181
3836E3848456k275042j388684j240049r96794j086477l65275N2116P2176j33652
3827D6486775k33197p49819j338194j757489j854003j444481j056390r49403p56472
3818C6347327l42301k93133l77061j71079j41184r6930j52672K8252J76050n5442
3808C4921827K08245k25719m4663K52893M20792M37816N22845R61023J106690
3799C8561749J394984J459853J778387K535028K648500L045083L661892M550875
$$ y = [56570097, 58367346, 60621500, 63538608, 67015569, 71435922, 76914763, 83653234, 91408199, 100613254, 109819023, 118181710, 123964918, 124579318, 120498638, 112875494, 102752383, 92391110, 82968338, 74995963, 68424105, 63405080, 59522951, 56221637, 53848456, 51573414, 50184730, 48944681, 47947887, 46861410, 46496135, 46548251, 46620427, 46486775, 46253578, 45503759, 44165565, 42408076, 40554073, 39109592, 38053202, 37103799, 36347327, 36005026, 35711893, 35334832, 35163753, 35022569, 34925639, 34772967, 34801219, 34977269, 34921827, 35130072, 34904353, 34859690, 35112583, 35533375, 35971191, 36494036, 37455059, 38561749, 39956733, 41416586, 43194973, 45730001, 48378501, 51423584, 55085476, 59636351]
3791E9636351N711810O935218Q664503M917131j962047m681776p148692p074112
3783F4998386n480269m410541l539021k824755k055845k002059j474956j340282
3775D1870658q93258n47186p38031k85005j11477j58512j33446J86928J81546
3766C9372217L36172L51586M86183P99985J032434J373035J371419J515563J680380
3757D8318974J581341J358162M39851l17659n59269r18803j091036l04069O6660
3748D8574152L38866M46833P09569J379050J399961J762827J714600J526288J525734
3739E9377880K184046L184113M665935O037399P199137L891237j075643l809063
3731H1655041n691019n460665m012846k909328k334682j911087j231708o24099
$$ y = [59636351, 65348161, 72283379, 80947882, 85865013, 83902966, 79221190, 72072498, 64998386, 59518117, 55107576, 51568555, 48743800, 46687955, 44685896, 43210940, 41870658, 40977400, 40430214, 39692183, 39407178, 39295701, 39137189, 39003743, 39190671, 39372217, 39708389, 40059975, 40546158, 41346143, 42378577, 43751612, 45123031, 46638594, 48318974, 49900315, 51258477, 51698328, 51380669, 50821400, 49902597, 48811561, 48507492, 48574152, 48913018, 49359851, 50069420, 51448470, 52848431, 54611258, 56325858, 57852146, 59377880, 61561926, 64746039, 69411974, 75449373, 82648510, 86539747, 85464104, 81655041, 75964022, 70503357, 66490511, 63581183, 61246501, 59335414, 58103706, 57479607]
3723E7479607o3177O39022R13164J569478L40129j395901k567244k542919k838074
3714E1534085k397492k091157j742267j379542j031788o24422n92945m55752l78654
3705D0840066j65384K66118O89446M70909M85233O22149Q92192J016388J127615
3696D6244732J155594Q73055O94828K93920o54130j048676j339399j114068r62172
3687D4143684n80052L9266K37034M98293R27857J188642J585185J636445O84000
3678E0360354q29320j846255k553857k531828j756759j573626j300880o45443
3670C7322386p46804k13399l68754k56019m6025J70586K16028L22083P77848P56721
3660C7934651L39637K88054J93988j75254m1117K83971N7139j16497k96959k71775
$$ y = [57479607, 57416430, 58055452, 58968616, 60538094, 60878223, 59482322, 56915078, 54372159, 51534085, 49136593, 47045436, 45303169, 43923627, 42891839, 42267417, 41674472, 41218720, 40840066, 40674682, 40940800, 41630246, 42101155, 42586388, 43208537, 44100729, 45117117, 46244732, 47400326, 48273381, 48968209, 49262129, 48607999, 47559323, 46219924, 45105856, 44143684, 43563632, 43602898, 43839932, 44338225, 45266082, 46454724, 48039909, 49676354, 50360354, 49531034, 47684779, 45130922, 42599094, 40842335, 39268709, 37967829, 37322386, 36575582, 36362183, 35993429, 35737410, 35691385, 35861971, 36077999, 36400082, 37177930, 37934651, 38274288, 38562342, 38756330, 38581076, 38539959, 38823930, 38881069, 38764572, 38467613, 38195838]
3650C8195838l19782n41107m03991n51212j4977n5727j00160K90992J2093J5047
3640C6527014L91626L45682O39394O20303M48596O20517R36360J053799J298771
3631D2882062J199910Q52648R63953Q83225O67362L53746l2558r310p1064k70170
3621D7419804m00162l24731l64929m30579J04840J86689M69772K72520N52386
3612D7485610Q20627P23255N89965P54166J174797J162884J060218J141190J033812
3603E5946524J087183J192227P62478O44797L44799J48327k27616K17905P259
3594F0123883k08310J56912J26256k3210L25366J9159k84009l48673k28860l05097
3584E9353417l39780q75699p25221L4682M00245K81489N04553P63287O13621P42780
$$ y = [38195838, 37876056, 37334949, 36930958, 36379746, 36364769, 36309042, 36208882, 36499874, 36511967, 36527014, 36918640, 37264322, 37903716, 38524019, 38972615, 39593132, 40529492, 41583291, 42882062, 44081972, 44934620, 45898573, 46781798, 47449160, 47802906, 47770348, 47761038, 47689974, 47419804, 47019642, 46694911, 46329982, 45899403, 46004243, 46190932, 46660704, 46933224, 47485610, 48306237, 49029492, 49619457, 50373623, 51548420, 52711304, 53771522, 54912712, 55946524, 57033707, 58225934, 58988412, 59633209, 59978008, 60126335, 59898719, 60116624, 60123883, 59915573, 60072485, 60198741, 60175531, 60500897, 60520056, 60236047, 59887374, 59658514, 59353417, 59013637, 58137938, 57412717, 57447399, 57847644, 58129133, 58633686, 59396973, 60010594, 60753374]
3574F0753374J96318J25986L86537O41461N08315K95964L5360k81099l55748q90936
3564F1415532j144171j528167j616781j480682j131277j579430j809575j231375
3556D9894074j225264j053679j028150q21244j011569o03225l88553l30255j36143
3547D3295992k36449l8991j62541j50009j71233m5777p50673j067900r08866j277090
3537C8486463r58403j201163j076908p64582m60352p39576l05593n34351m20942
3528C2024593k22696k78691l52115k75659j22505k14920j24322l20230l99516
3519B9713939j09701m3184m26577n31997o9275k73348m88749k43916k59824m2501
3509B7224867j08840j35906j08850K40980M03873M41033K05388m4739J88735K88958
$$ y = [60753374, 60949692, 61075678, 61462215, 62103676, 62611991, 62907955, 62943315, 62662216, 62306468, 61415532, 60271361, 58743194, 57126413, 55645731, 54514454, 52935024, 51125449, 49894074, 48668810, 47615131, 46586981, 45765737, 44754168, 44150943, 43762390, 43432135, 43295992, 43059543, 43020552, 42858011, 42708002, 42536769, 42490992, 41740319, 40672419, 39763553, 38486463, 37528060, 36326897, 35249989, 34485407, 34025055, 33285479, 32979886, 32445535, 32024593, 31801897, 31523206, 31171091, 30895432, 30772927, 30558007, 30433685, 30113455, 29713939, 29604238, 29561054, 29134477, 28602480, 28533205, 28259857, 27771108, 27527192, 27267368, 27224867, 27116027, 26980121, 26871271, 27112251, 27516124, 27957157, 28162545, 28117806, 28306541, 28595499]
3499B8595499n1361Q3994L78660J90239N71045N58675J87517N93907N02514L63381
3489C1974070L00543L84085J93665J77233Q5742J7214L5816k210K5962r9120J33215
3478C3226215K71268l20777M5154L21559N06593M17440L43134J182437J002601
3469C6995624J082668J205683J186728R54501J015120J035329J096426J086040
3461D5658119Q42092N70094M31050J66074k39611l31214j94722m14179k53739
3452D6233964N4845j54292j75770Q3513K20013K06883J77970P70522P10705P38296
3442D8866649Q39659M52610M39975L18256K62593N62384N27175M57489N61090
3433E3287880M80451O04181M17050L72742N33917J93026K28789K09545J28282
$$ y = [28595499, 28544138, 28628132, 29006792, 29197031, 29768076, 30326751, 30514268, 31108175, 31610689, 31974070, 32274613, 32658698, 32852363, 33029596, 33115338, 33132552, 33168368, 33166158, 33192120, 33093000, 33226215, 33497483, 33176706, 33221860, 33543419, 34050012, 34467452, 34810586, 35993023, 36995624, 38078292, 39283975, 40470703, 41425204, 42440324, 43475653, 44572079, 45658119, 46500211, 47070305, 47501355, 47667429, 47427818, 47096604, 46901882, 46487703, 46233964, 46288809, 46134517, 45958747, 46042260, 46262273, 46469156, 46647126, 47417648, 48128353, 48866649, 49706308, 50158918, 50598893, 50917149, 51179742, 51742126, 52269301, 52726790, 53287880, 53768331, 54372512, 54789562, 55162304, 55696221, 55889247, 56118036, 56327581, 56455863]
3424E6455863j81484m61287j62924m53084l40493l36643l35302l68745j13400
3415E3702501q83792n46292n58987n85014k07518m8055J75878K17460J99164O31091
3405E2096436K39676K26772K17002M2451k69365l5395m14247m99150l70368m56955
3395E0776857r52037j398082j162180j381305j438945j445239j234498j049893
3387D0714678j029100p92907m77342q37121m43698m65736o06142l12736k72320
3378C5477576l77659k08942l16443j54897r8087j72394o27532l30612k85465o13870
3368C2291675q25941n93160p59213n93081n41079m89678k56497n52519o18961
3359B7061546k46747m75743m18631p5772k34608o04869k45562n85141k43556l19192
$$ y = [56455863, 56274379, 55813092, 55650168, 55197084, 54856591, 54519948, 54184646, 53815901, 53702501, 52818709, 52272417, 51713430, 51128416, 50920898, 50872843, 51048721, 51266181, 51465345, 52096436, 52336112, 52562884, 52779886, 52822337, 52552972, 52517577, 52103330, 51604180, 51233812, 50776857, 49824820, 48426738, 47264558, 45883253, 44444308, 42999069, 41764571, 40714678, 39685578, 38892671, 38415329, 37578208, 37134510, 36668774, 36062632, 35749896, 35477576, 35099917, 34890975, 34574532, 34419635, 34321548, 34149154, 33521622, 33191010, 32905545, 32291675, 31465734, 30872574, 30113361, 29520280, 28979201, 28489523, 28233026, 27680507, 27061546, 26814799, 26339056, 25920425, 25844653, 25610045, 25005176, 24759614, 24174473, 23930917, 23611725]
3349B3611725k69940p31k69312j04767j56399l90505n1988q3632m39480k85813
3339B1559158L6242j82258j23877j96724k66492l42548k97060j45335n02012k32794
3329A9306300k98172l74803q6515m18124j74737k67578j63748j32139l44408j50652
3319A6895424q0254l53284l34020j14819q7390k31580k40615P619k75194o3643
3309A5122244J11311Q2672k19504l63287l01572J43625l90789J09171j69341L4234
3299A4158764l15250k66269j15389j25498j67100k43177k85294j07443p2425j92864
3289A2268055K5545q2456k98625j58550k76298r5683k9033M9347j20584j1544
3279A1270174j16377L6272J91759j24953j09923n8077J30252k83396J75708N7028
$$ y = [23611725, 23341785, 23341054, 23071742, 22966975, 22810576, 22420071, 22368083, 22284451, 21844971, 21559158, 21595400, 21413142, 21289265, 21092541, 20826049, 20483501, 20186441, 20041106, 19539094, 19306300, 19008128, 18633325, 18546810, 18128686, 17953949, 17686371, 17522623, 17390484, 17046076, 16895424, 16815170, 16461886, 16127866, 16013047, 15925657, 15694077, 15453462, 15461081, 15185887, 15122244, 15233555, 15316227, 15096723, 14733436, 14431864, 14575489, 14184700, 14293871, 14124530, 14158764, 13843514, 13577245, 13461856, 13336358, 13169258, 12926081, 12640787, 12533344, 12460919, 12268055, 12293600, 12211144, 11912519, 11753969, 11477671, 11381988, 11352955, 11402302, 11281718, 11270174, 11153797, 11190069, 11381828, 11256875, 11146952, 11088875, 11219127, 10935731, 11111439, 11168467]
3269A1168467R2916j79203j5160l02613l1689o3817p225Q2400l07910m3217k02940
3258A0190009k41017L2116J18504N4746J61775J43505K4112q4205j36277P8968
3248A0342236L11740k9178J37082P2680K23388J59975O4641J41102R5403j40077
3238A1378992q0796K99744O2943J09550r1494j45946p7180Q0659k17312K8010
3228A1347170j01279j14644P5190j7228K22515j05950J1846R8629J67638l441
3218A1580446J03225K55352M0528K6286O7467J37201L19047j2208J57205J65145
3208A2839694J16321K1495J35821j9937r1333J54918j67319q9191J4690O5052
3198A2980211p6423j31120o6523r0802p1337k9290J86927M8064n4717J60861o7771
$$ y = [11168467, 11261383, 11082180, 11067020, 10764407, 10732718, 10668901, 10661676, 10744076, 10436166, 10392949, 10190009, 9948992, 9981108, 10099612, 10154358, 10316133, 10459638, 10483750, 10399545, 10263268, 10342236, 10653976, 10624798, 10761880, 10834560, 11057948, 11217923, 11282564, 11423666, 11519069, 11378992, 11298196, 11597940, 11660883, 11770433, 11678939, 11532993, 11455813, 11536472, 11319160, 11347170, 11245891, 11131247, 11206437, 11189209, 11411724, 11305774, 11317620, 11416249, 11583887, 11580446, 11683671, 11939023, 11979551, 12005837, 12073304, 12210505, 12529552, 12517344, 12674549, 12839694, 12956015, 12977510, 13113331, 13093394, 13002061, 13156979, 12989660, 12900469, 12915159, 12980211, 12903788, 12772668, 12706145, 12615343, 12544006, 12514716, 12701643, 12749707, 12694990, 12855851, 12788080]
3187A2788080q6264L8955L0288p9871k5143J1331K66390k56578J75901J06652
3177A2969741k32279k6740Q9104k06182N5489j23911k92391J14626j82765q3695
3167A2080997J64254j00997k15879J57848o1162j26931J04907j57697j95206m8604
3157A1601530J99327k46512M3816J35677J56520J70998j9156j45329l32983k12084
3147A1351804k5984M3446j85391m7370l44050k57866o3196j45776l5865K96185
3137A0585937J2133l05643j86954k34502k6773L5307j12660P1843k70765p1085
3127I496838j60812K5588k2888P3541J76447j75425j00695n9214p6615m327N6481
3116I228919j00969O131J07797Q8099R1720j93820m0364J91585J06185j12158
$$ y = [12788080, 12701816, 12740771, 12771059, 12691188, 12666045, 12677376, 12943766, 12687188, 12863089, 12969741, 12737462, 12710722, 12799826, 12593644, 12649133, 12525222, 12232831, 12347457, 12164692, 12080997, 12245251, 12144254, 11928375, 12086223, 12025061, 11898130, 12003037, 11845340, 11650134, 11601530, 11800857, 11554345, 11598161, 11733838, 11890358, 12061356, 12042200, 11896871, 11563888, 11351804, 11325820, 11369266, 11183875, 11136505, 10792455, 10534589, 10471393, 10325617, 10289752, 10585937, 10598070, 10292427, 10105473, 9870971, 9844198, 9879505, 9766845, 9838688, 9567923, 9496838, 9336026, 9361614, 9338726, 9412267, 9588714, 9413289, 9312594, 9253380, 9176765, 9172438, 9228919, 9127950, 9134081, 9241878, 9329977, 9421697, 9227877, 9187513, 9379098, 9485283, 9373125]
3106I373125n6912J63406p801j44217K18280K64518o6320Q3031J57383L60980
3096A0345473J61014J52162Q7726K7617N5109l27700o0123K4127k48238k81792
3086I935375k93520j83542J44715l74800k85441j13458j14807j21747N1798j38317
3076H506256o0765j23841N4275l0398k98793N8621P2306n3664j06015J2990J13438
3065H144410J2894o2007L58942J77859L2825K30087M05716L07186K81243J45958
3055A0035113L20797M78152R54230Q54474Q32220O39056k33993p71143r78894
3046A2130012o27288n95447m63036l73091j66629M7490j90372j0426k5738j03118
3036I622357J23394K81774J23456J96225N59612K82570M15662P08956O11396P40657
$$ y = [9373125, 9316213, 9479619, 9471818, 9327601, 9545881, 9810399, 9744079, 9827110, 9984493, 10345473, 10506487, 10658649, 10746375, 10773992, 10829101, 10501401, 10441278, 10465405, 10217167, 9935375, 9641855, 9458313, 9603028, 9228228, 8942787, 8829329, 8714522, 8592775, 8644573, 8506256, 8445491, 8321650, 8375925, 8345527, 8046734, 8105355, 8177661, 8123997, 8017982, 8030972, 8144410, 8157304, 8095297, 8454239, 8632098, 8664923, 8895010, 9300726, 9607912, 9889155, 10035113, 10355910, 10834062, 11788292, 12642766, 13474986, 14114042, 13880049, 13108906, 12130012, 11502724, 10907277, 10444241, 10071150, 9904521, 9952011, 9761639, 9751213, 9725475, 9622357, 9745751, 10027525, 10150981, 10347206, 10906818, 11189388, 11605050, 12314006, 12925402, 13666059]
3026A3666059J130515M23402n72153p66762q23329j114729o22798n81296l28425
3017A0410484k5075j96219K18050q8293n5249J78365M22201N2659q4547m04839
3007A0427537l84691j96915l03186j22133k762o4396k36338J03868l67688l19903
2997H533393L5362J6154j0541o7498J44786R9680N2737J7011M0860J07958J29177
2986I099079J24028J85393k70944k08508n11104k85910l92992l4186k84770o6879
2976G353207q4926k32737J4646k62636l4631j30308L2986m8267m1768j76797k13300
2965F175469n29J02722k65080q8974m7037q1214l01388J09265M07719q4065k32927
2954E693961j24773L0146q6173j17338J61897l3039r8275l40797j0050K73612
$$ y = [13666059, 14796574, 15219976, 14647823, 13881061, 13057732, 11943003, 11320205, 10738909, 10410484, 10385409, 10189190, 10407240, 10318947, 10263698, 10442063, 10864264, 10916923, 10832376, 10427537, 10042846, 9845931, 9542745, 9420612, 9417850, 9353454, 9117116, 9220984, 8853296, 8533393, 8568755, 8584909, 8574368, 8506870, 8651656, 8751336, 8804073, 8821084, 8861944, 8969902, 9099079, 9223107, 9408500, 9137556, 8929048, 8417944, 8132034, 7739042, 7704856, 7420086, 7353207, 7268281, 7035544, 7050190, 6787554, 6752923, 6622615, 6655601, 6607334, 6565566, 6388769, 6175469, 6174940, 6277662, 6012582, 5923608, 5876571, 5795357, 5493969, 5603234, 6010953, 5926888, 5693961, 5569188, 5599334, 5513161, 5395823, 5557720, 5524681, 5426406, 5085609, 5075559, 5349171]
2944E349171j80772r0004n1477M71359j81954k96034J01114j87861k5966j29425
2934D778151J19280q7617j36789P518j08351Q8000j3109N6315J38984j79259J1276
2923D674399J27228q4015j23190l7041m9598J08559k03107p4789p3083j78374
2913D086989K06415n4576j75694k03544R5241j74242j40642j41807K129L10188
2903C810457j468k25772n6690L8809q2840j11974N5933K22889j12465j08365j1090
2892C417424j43134m5370K06448k23505j52487j52775p6675m26308J12369K09009
2882B724996L3177K6202N5520j94557m9708k12583Q1617O7491j24577J62652N2175
2871B622405j10536k08554p3716K32099j11975k820j33123j09650N5737r6321
$$ y = [5349171, 5168399, 5078395, 5026918, 5498277, 5316323, 5020289, 5121403, 4933542, 4907576, 4778151, 4897431, 4809814, 4673025, 4680543, 4572192, 4660192, 4647083, 4703398, 4842382, 4663123, 4674399, 4801627, 4717612, 4594422, 4557381, 4507783, 4616342, 4413235, 4338446, 4265363, 4086989, 4293404, 4238828, 4063134, 3859590, 3954831, 3780589, 3639947, 3498140, 3500269, 3810457, 3808989, 3583217, 3526527, 3565336, 3482496, 3370522, 3426455, 3649344, 3536879, 3428514, 3417424, 3274290, 3228920, 3435368, 3211863, 3059376, 2906601, 2829926, 2403618, 2515987, 2724996, 2758173, 2784375, 2839895, 2645338, 2595630, 2383047, 2464664, 2532155, 2407578, 2570230, 2622405, 2511869, 2303315, 2229599, 2461698, 2349723, 2346903, 2213780, 2104130, 2159867, 2063546]
2861B063546j51226q2974L31639Q2781J1509o0680P3875j23879Q4109l9704j0744
2850B178252j50922J33439M2327k1474j44783p9878m5718R1358l6427J77094N0782
2839B194050j8781k13500o5545J77114j97806J16149J5263o5507K04673k70875
2829A875235K7750J74530j68445k6020l7279r6942J96377j41906n4794J7812J71063
2818A937381J83236j46252j74829O6353R6053j0925k3055R7239k1976J26221K58254
2807B387700j27267P3829p7304k44575K9394l42133n3220M09632J11230J64734
2797B332020j9450j32448k54641j39011N9288O6580J694K45989p237k3367q9034
2786B040383J2973l0406J9432J1621J1951l6391n9249k52309j53217J72463M9065
$$ y = [2063546, 1912320, 1829346, 2160985, 2243766, 2255275, 2194595, 2268470, 2144591, 2228700, 2188996, 2178252, 2027330, 2160769, 2203096, 2181622, 2036839, 1956961, 1911243, 2002601, 1966174, 2143268, 2194050, 2175269, 1961769, 1896224, 2073338, 1875532, 1991681, 2006944, 1941437, 2146110, 1875235, 1902985, 2077515, 1909070, 1883050, 1845771, 1748829, 1945206, 1803300, 1748506, 1766318, 1937381, 2120617, 1974365, 1799536, 1865889, 1961942, 1951017, 1927962, 2025201, 2003225, 2129446, 2387700, 2260433, 2334262, 2256958, 2012383, 2041777, 1699644, 1646424, 2056056, 2167286, 2332020, 2312570, 2180122, 1925481, 1786470, 1845758, 1912338, 1914032, 2160021, 2152784, 2129417, 2040383, 2053356, 2022950, 2042382, 2054003, 2065954, 2029563, 1970314, 1718005, 1564788, 1737251, 1786316]
2775A786316j38508J55528K60365k02801m1502N7101L8246j19073Q1317O204j43084
2764A740109p1761r6197L55665j0664k09066j04267M0808j38923J36688k7695
2754A614697j5716J08362j79181K90728j92237P5476J82422l57079P3728q8947
2744A512253j35668M3006P1124J20432Q8930j66849k42970N3259j15398K15340
2734A443459J21935n2898r7600j17976P4436N7297j34438K5749k02936M4572K88207
2723A449807k13678N2094P093L1403k12981J54649K8141J5638K9961m4597k6236
2712A271294K511J6786l63995K91822K46920l37588q79j6415o9048o5116k45800
2701G30492o3681J82023K52762l81019j63772o084J30034J59230J0895J02533
$$ y = [1786316, 1647808, 1803336, 2063701, 1860900, 1819398, 1876499, 1914745, 1795672, 1876989, 1883193, 1740109, 1668348, 1572151, 1927816, 1917152, 1708086, 1603819, 1644627, 1505704, 1642392, 1614697, 1598981, 1707343, 1528162, 1818890, 1626653, 1702129, 1884551, 1527472, 1601200, 1512253, 1376585, 1419591, 1490715, 1611147, 1700077, 1533228, 1290258, 1343517, 1228119, 1443459, 1565394, 1512496, 1414896, 1296920, 1371356, 1428653, 1294215, 1319964, 1117028, 1161600, 1449807, 1236129, 1288223, 1295316, 1326719, 1113738, 1268387, 1296528, 1312166, 1342127, 1297530, 1271294, 1273805, 1290591, 926596, 1218418, 1465338, 1127750, 1126871, 1110456, 1041408, 976292, 730492, 666811, 848834, 1101596, 720577, 556805, 550721, 680755, 839985, 850880, 953413]
2691I53413Q0195K10413o1144l21309k58054P2891P6112n0146J69508o8409N1215
2680H54685j25860l73674J16465K8691J72873J58992k58355L3881J39667j23744
2670F23621p1791M0291J33092N5882O4468j99462J4491J18757o5857j95222m763
2659E13507j31459P965l1372K6765K16470l8316p3305N7151R598J87444r8520
2648F45928k09746K77313q7261j27910l4299J06604J07857n8513J01217j11083
2638F10107j41145J70502j01240j37854j54190J65731M658j01769L7378k13839
2628A38339j06958J82460P1290J57233j36712O4277J2566n9376K9801J95998j78709
2617C70209l43057J84336L67671j96706K931L8465M7675J16494r3548l1177q989
$$ y = [953413, 1033608, 1244021, 1182877, 861568, 603514, 676405, 752517, 702371, 871879, 803470, 854685, 728825, 355151, 471616, 500307, 673180, 832172, 573817, 607698, 747365, 623621, 551830, 592121, 725213, 781095, 845563, 646101, 660592, 779349, 713492, 518270, 513507, 382048, 390013, 358641, 385406, 601876, 563560, 490255, 547406, 557004, 744448, 645928, 436182, 713495, 626234, 498324, 464025, 570629, 678486, 619973, 721190, 610107, 468962, 639464, 538224, 400370, 246180, 411911, 416569, 314800, 352178, 138339, 31381, 213841, 285131, 442364, 305652, 369929, 382495, 323119, 352920, 548918, 370209, 27152, 211488, 579159, 382453, 385384, 423849, 471524, 588018, 494470, 463293, 454304]
2606D54304J0173p8971R114p0661o9770K70801n7188j46949j59569j88682L23740
2595B96342K15037n5270j09850O9399O5137J58196l52382q6782K592J2686J51914
2584C67019L0208O9798j74142J6832L0497p0969Q2411l3801m5422j81012k26517
2573a35098L87066r007j97438J86532J07012Q7426r0277j42162N8756K9357J33943
2562D16110j39444K3571L18843k34182j47975Q8094o663q5109p5515j28123r71
2551B8636q6779K48837j09667k5821K26723Q0078k37952J65885J8333j03955P1783
2540B76101q4654J08926J07354j99116l9993L22276m6598j16738j50250l18715
2530a41407J97806r1396l9163K99612p2210j6875P1274K42272J21901j29108r5315
$$ y = [454304, 464477, 385506, 394620, 323959, 254189, 524990, 467802, 320853, 161284, -27398, 296342, 511379, 456109, 346259, 415658, 480795, 638991, 286609, 199827, 202419, 215105, 367019, 397227, 467025, 292883, 309715, 340212, 269243, 351654, 317853, 272431, 91419, -135098, 251968, 242961, 45523, 232055, 339067, 426493, 336216, 194054, 252810, 282167, 416110, 276666, 300237, 619080, 384898, 236923, 325017, 318354, 233245, 157730, 29607, 28636, -58143, 190694, 81027, 55206, 281929, 362007, 124055, 289940, 308273, 204318, 276101, 191447, 300373, 407727, 208611, 168618, 490894, 444296, 327558, 177308, -141407, 56399, -34997, -74160, 225452, 153242, 136367, 207641, 449913, 571814, 442706, 347391]
2519C47391j22942j2277P0641j15178j18705m1531K01172j17920j83689K15724
2509A22686P0232N8127j84319l7634Q2833j68020j27502J64831K99463M9741m9912
2498B80526J4209o8908m4175k4756n6406n9482J63021J8510K1015P5211j69338
2487A49427j2457j17170J18103l7267J11530j51707j7247P7534K5327j3489k95821
2476a63237J40034J37997j78697Q3533M7699n7614o7443j09463R6375R1213J40610
2465A61007j15983l0887r0956l3489M12257J17339o5388j90512j28794J43542
2455A78136L6007L2758m4868j6435J60426K6431k05240P0722J28089j40445o6291
2444A59290r2986K800q2522J0592M9019o9923J36978J11645p8028J08605J5467
$$ y = [347391, 224449, 212172, 282813, 167635, 48930, 7399, 208571, 90651, -93038, 122686, 192918, 251045, 66726, 29092, 111925, -56095, -183597, -18766, 280697, 330438, 280526, 294735, 225827, 181652, 156896, 100490, 41008, 204029, 222539, 243554, 318765, 149427, 136970, 19800, 137903, 100636, 212166, 60459, 43212, 120746, 146073, 132584, -163237, -23203, 114794, -63903, 19630, 67329, 9715, -57728, -167191, -70816, 20397, 161007, 45024, 14137, -76819, -110308, 301949, 419288, 353900, 163388, 34594, 178136, 214143, 246901, 202033, 185598, 346024, 372455, 167215, 237937, 366026, 225581, 159290, 66304, 69104, -13418, -2826, 46193, -23730, 113248, 224893, 146865, 255470, 270937]
2433B70937j3149n8497p8825J31427R3312r8338k22318N629J26775j8436J61285
2422B99802P5915P400L9956k49976j21749j5167p0154K52635L2791j22101n5883
2411G3469q3576j92966K35070j10556P4124j06996j21135J44677K30825p3378
2401F9558R9272J9847l86006L83345Q1762J3609j69919q5860J05846J29001q6591
2390A73864n0148n5703K46822k9014o8287j03834j48256j029o7387J47732l6657
2379H103M7676K82480j43221j22519n5484j44854K57254J31595m1252j61464j15668
2368e7354n9235J10715j33634m2560J94180J10493j81728j03411r3582M7175K48359
2357C9418l4134R0060k5119k65344j05792K97728J29919J1755k2504m4282k05345
$$ y = [270937, 257788, 199291, 120466, 251893, 345205, 246867, 24549, 30178, 156953, 138517, 299802, 375717, 383117, 423073, 173097, 51348, 36181, -33973, 218662, 251453, 129352, 73469, -10107, -203073, 31997, -78559, -4435, -111431, -232566, -87889, 142936, 69558, 168830, 188677, -197329, 186016, 267778, 281387, 111468, 25608, 131454, 260455, 173864, 123716, 68013, 314835, 285821, 217534, 113700, -34556, -35585, -102972, 44760, 8103, 55779, 338259, 195038, 72519, 17035, -127819, 129435, 261030, 219778, 58314, -57354, -116589, -5874, -139508, -182068, 12112, 122605, -59123, -162534, -256116, -208941, 39418, 5284, 95344, 70225, -195119, -300911, -3183, 126736, 138491, 115987, 71705, -133640]
2346a33640K03812j294m1657J73863J7904k26876K2147J38757r2134O2955L3355
2335A57192l2572M5969l2902k62316r1641K80313J6530J55640J96263k34764P3628
2324B71340O2830n2115N233j52256J0439r0109p5852Q5947M27366O7751j20019
2313D40555j13958r6269Q5835j39831O8182K97897J72640j41781q9384Q6475J80755
2302G51116p178j85159p5593l34079j40922j47996K13101J87860o7057K9408k23170
2291C31J01001J17911k5356j48590p3371l9353K17770j54307j81318J26269j86245
2280b45258k1907K80671j72896L36567j51615k91863L30855J90960r1328J018
2270A65204J19271J07241k10672k74866J53029j27819R1686o1611K8024K8562
$$ y = [-133640, 70172, 68878, 27221, 201084, 218988, -7888, 14259, 153016, 60882, 123837, 157192, 124620, 170589, 137687, -124629, -216270, 64043, 80573, 236213, 432476, 197712, 271340, 334170, 282055, 287288, 135032, 145471, 55362, -20490, 65457, 492823, 560574, 440555, 326597, 230328, 316163, 176332, 244514, 542411, 715051, 573270, 483886, 570361, 751116, 743938, 558779, 483186, 149107, 8185, -139811, 73290, 261150, 194093, 223501, 331, 101332, 219243, 193887, 45297, -28074, -67427, 150343, -3964, -185282, -59013, -245258, -267165, 13506, -159390, 177177, 25562, -266301, 64554, 255514, 164186, 165204, 284475, 391716, 181044, -93822, 59207, -68612, 23074, -38537, -10513, 18049]
2260A8049r0580J57323n9294k91125K56920J72512J07425K8979l5014n2519J50450
2249C63126o6948k00215o6849K0213K71471M4197K24565k46644j76306J91294
2239C57904k03500M5430o3249M4050K79407j43644j83044j6233m3380Q7807J4093
2228A75641J99557p0936L5759K3933j65785Q0572J72825O3814l790j10260J59556
2217E60886r302j33237J2407O3851J07220l11944M0269q5915j3563P8310j1402
2206B97580j00920P5804k09867L22502j5610o7134m1431J01794j2710K24310k96946
2195B77372r2871J5750J49349P8794k72531J04355J12413j08801N6108j39930
2185A80008P5338J19292K76940r071r1794J0677q9910j19129M0238R3484J89505
$$ y = [18049, -72531, 84792, 25498, -265627, -8707, 163805, 271230, 300209, 265195, 212676, 363126, 296178, 95963, 29114, 49327, 320798, 364995, 589560, 342916, 166610, 357904, 154404, 199834, 136585, 180635, 460042, 316398, 133354, 117121, 73741, 161548, 175641, 375198, 304262, 340021, 363954, 198169, 278741, 451566, 515380, 511590, 401330, 560886, 551584, 418347, 430754, 494605, 601825, 289881, 330150, 244235, 230672, 308982, 297580, 196660, 272464, 62597, 385099, 369489, 302355, 260924, 362718, 350008, 574318, 277372, 184501, 200251, 349600, 428394, 155863, 260218, 372631, 263830, 319938, 180008, 255346, 374638, 651578, 642507, 550713, 561390, 471480, 352351, 392589, 486073, 675578]
2174F75578J43825k37573j31439N1394Q4699K3170K1041p0093L82206o6320j95501
2163F80987m4059K09522J29941j53029K023r3603R3159K15237m1082l9662j86884
2152G72550N9048K0715J78931L5997l0604m4604L2138J12624J25548k32382Q4388
2141A114349J35771K72549l2926Q1689K1539J65320J1549K66924l2180j30342
2131A874242J68657j1887L5116J2734j07661L48177J33553O329m9923J41308j06254
2120B444391o610L38060L31815j52732P9185J15361K70597K55274J48708n4263
2110C769786J71345J46575K33331J49400J4805K31831J75879L4562J32974k0288
2100E040200M11412K98707N08594K20108J50156K71430M28449M44404L69959M28550
$$ y = [675578, 819403, 581830, 450391, 501785, 586484, 609654, 630695, 560602, 942808, 876488, 680987, 636928, 846450, 976391, 823362, 825385, 731782, 824941, 1040178, 999096, 959434, 772550, 831598, 852313, 1031244, 1067241, 1036637, 992033, 1024171, 1136795, 1262343, 1029961, 1114349, 1250120, 1522669, 1489743, 1571432, 1592971, 1758291, 1769840, 2036764, 2004584, 1874242, 2042899, 2031012, 2066128, 2078862, 1971201, 2319378, 2452931, 2459260, 2409337, 2550645, 2444391, 2437781, 2775841, 3107656, 2954924, 3034109, 3149470, 3420067, 3675341, 3824049, 3769786, 3941131, 4087706, 4321037, 4470437, 4485242, 4717073, 4892952, 4927514, 5060488, 5040200, 5451612, 5750319, 6258913, 6479021, 6629177, 6900607, 7329056, 7773460, 8143419, 8571969]
2090H571969Q86138Q20106L28890N12790P35270Q80813J104309J023310J204132
2081A6067727J657955K007489K359756K599435K606328K460998K871362L537774
2073C6168824M834753N727205O833858P648516R402889J3142753J7060849K4295734
2065A25115381K8034453M62470j5600816k1648684k4764594j7912444j3049229
2058F0636537q781453o875246m810373l748281l225419k549661j445887j592428
2050B7607789k022049k176719k141093k040313j431409j294417r99448r26684
2042A4575657p92773p50739p48771o01483k45761l11552k34141n81262m52889
2033I856286l44974n18465l07968j4791m41875l87296j77839k73762n50921j37918
$$ y = [8571969, 9458107, 10278213, 10607103, 11119893, 11855163, 12735976, 13840285, 14863595, 16067727, 17725682, 19733171, 22092927, 24692362, 27298690, 29759688, 32631050, 36168824, 41003577, 46730782, 53564640, 61213156, 70616045, 83758798, 100819647, 125115381, 153149834, 153612304, 138011488, 116362804, 91598210, 73685766, 60636537, 51855084, 44979838, 40169465, 36421184, 33195765, 30646104, 29200217, 27607789, 25585740, 23409021, 21267928, 19227615, 17796206, 16501789, 15502341, 14575657, 13782884, 13032145, 12283374, 11681891, 11436130, 11124578, 10890437, 10309175, 9856286, 9511312, 8992847, 8684879, 8670088, 8228213, 7840917, 7663078, 7389316, 6838395, 6700477]
2023F700477m05702k20926l09557l66834J2548k46779j26616m583k23916k77446
2013D530666k75522j9591M2557n8341o1009j19058q1588j55653k28951R133m70062
2002C112581R8604p5326R3863k7039j18036j04481k2583k95737K53678k35209
1992B680315k56068K58790j4260r2155k60333J06227J15680K2872k47769J5372
1982B328671j71258l0400j28048l58057k8155J14385K40266j24139q3001n391
1972A754873M6934j46929l4888j28780m395o5915j58711O9842j60721j2679J74274
1961A332905P5318L6706l24569k1744Q4976J0985N8901J81155k8369k323r84j98886
1949A204071k13968J19813J68885p8555j23302m6309n9770J15917J67183j20101
$$ y = [6700477, 6294775, 6073849, 5764292, 5397458, 5410006, 5163227, 5036611, 5032028, 4808112, 4530666, 4255144, 4235553, 4278110, 4219769, 4158760, 4039702, 3958114, 3802461, 3573510, 3582643, 3112581, 3211185, 3135859, 3229722, 3202683, 3084647, 2980166, 2957583, 2661846, 2915524, 2680315, 2424247, 2683037, 2668777, 2576622, 2316289, 2422516, 2538196, 2561068, 2313299, 2328671, 2157413, 2127013, 1998965, 1640908, 1612753, 1727138, 1967404, 1843265, 1760264, 1754873, 1801807, 1654878, 1619990, 1491210, 1486815, 1420900, 1262189, 1332031, 1171310, 1158631, 1332905, 1408223, 1444929, 1120360, 1098616, 1183592, 1194577, 1253478, 1434633, 1406264, 1403941, 1402957, 1204071, 990103, 1109916, 1278801, 1200246, 1076944, 1030635, 970865, 1086782, 1253965, 1133864]
1939A133864l2403j15913k9717j36162J61901k27432M9701q9957j69277l413Q0768
1928F21960o0611K07878j1221K1169O5025j50726n4154k63964R0218J42716J1463
1917F19753J66740J26733l00038k04469M0217J30766L8475O3092p5307j5025j72032
1906D18905N6563N0597J06116J47727j18760j51275j50760K14898J14652j89797
1896D98866k05053Q5256Q6937J35223j7767J37649j000O5119l63528n2066K630
1885C72266q0583l6944J25876J17699J9737j93949R1254Q4791j43458J29472j34215
1874C51946J14560N6424k78530R9961k45270Q1849K05899o3632N7079K30925j19229
1863D91982q9103j47204p9659M5950j42537N6692j59506J70354J9145J27035J64747
$$ y = [1133864, 1101461, 985548, 955831, 819669, 981570, 754138, 803839, 713882, 544605, 541192, 621960, 561349, 769227, 758006, 779175, 844200, 693474, 639320, 375356, 465574, 608290, 619753, 786493, 913226, 613188, 408719, 448936, 579702, 618177, 681269, 605962, 590937, 418905, 475468, 526065, 632181, 779908, 661148, 509873, 359113, 574011, 688663, 498866, 293813, 379069, 466006, 601229, 583462, 721111, 720111, 785230, 421702, 369636, 372266, 291683, 254739, 380615, 498314, 518051, 324102, 415356, 500147, 356689, 486161, 351946, 466506, 522930, 244400, 344361, 99091, 180940, 386839, 323207, 380286, 611211, 491982, 402879, 255675, 176016, 221966, 79429, 136121, -23385, 146969, 166114, 293149, 457896]
1852D57896L4796j24181J70288k93096q598O3318k18092J43039J56157O3806j19831
1841C25502q0897J37505R38K1991N4466j45061J21420J47343l24313j52198J48889
1830B55585k4356j64455K20569K00720J37100P6215L56625K6687m6698J9074j74156
1819H82910l1608j42361m7017j01057j97414o1621P5073L8652j16049K1889N7187
1808C78584Q3759j6628k25102k48k3586K21424Q1767j72969j13444j18731M3689
1797A38515J13691r0186J14310j7793K9117K1759p5790j46366O4664Q9798J08162
1786C49881j36818r6138K7696J92036j31426k38182J76669p3309m1384Q7313R8433
1775B14771j15358J04654r0709P5661Q650j4900L1010L7205k03025o5393J5655
$$ y = [457896, 492692, 368511, 538799, 245703, 237105, 300423, 82331, 225370, 381527, 445333, 325502, 244605, 382110, 383048, 405039, 459505, 314444, 435864, 583207, 258894, 106696, 255585, 231229, 66774, 287343, 488063, 625163, 701378, 1058003, 1084690, 1037992, 1057066, 882910, 851302, 708941, 661924, 560867, 363453, 301832, 376905, 415557, 299508, 321397, 378584, 462343, 445715, 220613, 220365, 196779, 418203, 499970, 327001, 213557, 94826, 138515, 252206, 162020, 276330, 258537, 287654, 309413, 233623, 87257, 151921, 241719, 349881, 213063, 116925, 144621, 336657, 205231, -32951, 143718, 70409, 29025, 116338, 214771, 99413, 204067, 113358, 189019, 197669, 182769, 213779, 250984, 47959, -17434, -1779]
1764a779p7269J28362J92485J39780k34072J46537j6861k10860j13850K17496
1754A69969j5334J21465j21131k22515J15057k55235K75340k44253K71134J87550
1744B82047k54930R8568J28144j52095j03167N3292n8857J39957q9132j22327
1734g8500L39028k8982J60282J35037k48616j41317L7693o2076o2637O431j87501
1723a31158n782K09946K22545J84058m24258j16282J02586k2258Q7775J9208J28182
1712B54562j22068m4500j80719Q8957J03062m8971J801L5924p759L269j51253
1701f7695N2763j8571q160j2231j4009j53859M1218J60075R2775k12744Q2782
1690e7656J00605p906J33903q2903r0740J7669R5838j44551J49759J65927m9191
$$ y = [-1779, -79048, 49314, 241799, 381579, 147507, 294044, 277183, 66323, -47527, 169969, 154635, 276100, 154969, -67546, 47511, -207724, 67616, -176637, 94497, 282047, 27117, 125685, 253829, 101734, -1433, 51859, -6998, 132959, 43827, -78500, 260528, 231546, 391828, 526865, 278249, 136932, 174625, 112549, 49912, 56343, -131158, -136940, 73006, 295551, 479609, 55351, -60931, 41655, 19397, 107172, 126380, 254562, 132494, 87994, -92725, -3768, 99294, 50323, 52124, 88048, 80289, 83558, -67695, -14932, -33503, -41663, -53894, -67903, -221762, -180544, -20469, 72306, -140438, -57656, 42949, 35043, 168946, 86043, -4697, 12972, 108810, -35741, 114018, 279945, 230754]
1679B30754j57497M2275p4304k08730L01184L3606Q9350j27057k11846j54884
1669b37149K64496J4775l6053J54481k8757Q3707L2819k58291l3822J06832l8609
1658B4429j75390K05700J00756k38431p2236J33412J98456J65808k28701l74541
1648b60738J68575J79650J96007k64871l5569R138J13424k2374P4764j17341P8092
1637A18757P413p1515j62386J65589N9060m9057P0318q4519J72744q3916j49883
1626g395J83880p3698p5702J71382p6514j74541P129K12110j3754m7900P674P8286
1614A90957k10126M2251j49584p4100m0381J02760J23016K58023q1459K7022J95675
1603C84054o2050O292k08311J35691p5095k72529j4992J05115l46638K64179J54948
$$ y = [230754, 73257, 115532, 41228, -167502, 133682, 167288, 256638, 129581, -82265, -237149, 27347, 42122, 6069, 160550, 131793, 215500, 248319, -9972, -43794, 63038, 24429, -150961, 54739, 155495, -82936, -155172, -21760, 176696, 342504, 113803, -260738, -92163, 87487, 283494, 18623, -16946, -7808, 105616, 83242, 158006, 40665, 118757, 126170, 54655, -107731, 57858, 116918, 67861, 138179, 53660, 226404, 142488, -7395, 176485, 102787, 27085, 198467, 121953, -52588, -45459, 166651, 152897, 104997, 112671, 190957, -19169, 23082, -126502, -200602, -240983, -138223, -15207, 242816, 161357, 188379, 384054, 322004, 328296, 119985, 255676, 180581, -91948, -106940, -1825, -348463, -84284, 70664]
1592G0664m7583k06519J89875j54630p5117K4943j85110M13131J13743j28776
1582A4621q1374R3760Q477p8489Q1492l130n5456J40788k15627Q725P5444p1600
1570h2369k9646M2728N8524k34434J4786K00894J23657M6355Q9953p1824Q8145
1559B46769j46223r9398j05056L587J87911j12304k0200M0427R0371L5045r0639
1548C0290j38027K3876j20860P0703R4308J73403q2113O3912k9550q3987j30559
1537a28604J23615j67171O8283J77023k25114R9248j37303J26855p5793j34124
1527b73085L2958J47513P8858p4499M2363j35193J8966j07966L6929J70036L0025
1516c3095j14182p4220K76059K3736O5121r1475j74901r569J20450l4963M7267
$$ y = [70664, 23081, -183438, 6437, -148193, -223310, -198367, -383477, 29654, 143397, 14621, -66753, 27007, 35484, -43005, 38487, 35357, -20099, 120689, -94938, -86213, -10769, -82369, -112015, -69287, -10763, -245197, -230411, -29517, 94140, 140495, 230448, 158624, 246769, 100546, 1148, -103908, -100321, 87590, -24714, -44914, -4487, 85884, 120929, 30290, -107737, -83861, -204721, -134018, -39710, 133693, 51580, 115492, 85942, 1955, -128604, -4989, -172160, -103877, 73146, -151968, -52720, -190023, -63168, -138961, -273085, -240127, -92614, -13756, -88255, -45892, -181085, -162119, -270085, -233156, -63120, -33095, -147277, -221497, 54562, 78298, 143419, 51944, -122957, -132526, -12076, -47039, 228]
1505B28J16352Q0330l9138N1153o9619j46986k54878o2522L03137j72340O1551
1494a32732J04477K5743j26812K06845R8529q3644r7741j76597Q8918J07757j13900
1483i9157n0028R9768j92396P963J71491J63707j03027j30862J63818J7102J38548
1472A86927k7198r1334o7298q8692j18319K83664K1662j43065k35075N7657J16191
1461a04880j63912K51406j39107L166J1197Q3546j1383j76953K27566j62418k6626
1450b08398L7307k36721J06041L04274m8351N6527N7761j70565R5300m318q8875
1439a00018M2412j71159l7572K14815J19425q6386p7352O9394j62129K91159j35160
1428c2571j54338M7622K35367o186j32115j78607j3896J41294j07113m0662N6353
$$ y = [228, 116580, 196910, 157772, 208925, 139306, -7680, -262558, -325080, -21943, -194283, -132732, -28255, -2512, -129324, 77521, 176050, 92406, -5335, -181932, -93014, 14743, -99157, -149185, -49417, -241813, -233850, -62359, 101348, -1679, -132541, 31277, 48379, 186927, 159729, 68395, 1097, -87595, -205914, 77750, 99412, -43653, -278728, -221071, -104880, -268792, -17386, -156493, -153327, -142130, -58584, -69967, -246920, -19354, -181772, -208398, -171091, -407812, -301771, 2503, -45848, 10679, 68440, -102125, -6825, -11143, -100018, -57606, -228765, -266337, -51522, 67903, -18483, -95835, -26441, -188570, 102589, -32571, -186909, -139287, 96080, 89894, -42221, -220828, -234724, -93430, -200543, -241205, -184852]
1417a84852J26321J16801k9314j6521O3673J02862k88752m3379J46705K00315
1407A93859n2003j22722K9128Q2247j26253R4152o7826j13688l8894P6359K36421
1396A90780k88594N8801j24333J08701o0543q0190K5803K47748j03353r5142j60706
1385b81028R237J43175J50385J0308m0955j07989j99972P6244K31232p5791L5750
1374d9404p6739J7853R7943n7718l7913J74637j796J2211J16760o9069R8206q6066
1362A38905j94100j9116J07721k86085J20601M2323k7728Q283m8532J39904L5447
1351A7623o0421j25236k4432k1866K37243P0460j63108j42641P5716K00879L5265
1340I9482J81099j22319l524j07052J98588k65837P8209j30814M0322J04572k2449
$$ y = [-184852, -58531, 58270, 28956, 12435, 76108, 178970, -109782, -153161, -6456, 193859, 141856, 19134, 48262, 130509, 4256, 98408, 30582, -83106, -122000, -45641, 190780, -97814, -39013, -163346, -54645, -115188, -195378, -169575, 78173, -25180, -120322, -281028, -271791, -128616, 21769, 32077, -8878, -116867, -316839, -240595, -9363, -85154, -49404, -126143, -108290, -10347, -68065, -105978, 68659, 66863, 79074, 195834, 126765, 224971, 138905, -55195, -74311, 33410, -252675, -132074, -89751, -117479, -109196, -157728, -17824, 17623, -42798, -168034, -192466, -214332, 22911, 93371, -69737, -212378, -136662, 64217, 99482, 280581, 158262, 154738, 47686, 246274, -19563, 58646, -72168, -31846, 72726, 50277]
1329E0277J50430j21779j37369R6070L1997j4293j5859j63945j06332m6765K33828
1318d3740p9261j06813J79613O1270o0059L57163j11795k30823L6934q183K1621
1307A5927k7156j2923J881O639j01742N4313J7626J07628K3821j25355O7865J04248
1295A32772j31044l8132K4766J08272m5497m329J07251j15721q5405o2008K08702
1284I9627j52193J36966n3484J58022j10037j24328K89522j45127j80807k345
1274h4184j6554J20127k53997L53706P3514j56468j16443J9385M9735M2533J34488
1263A65842j28255N041m9806j99343J9277J34713k63788j47164J87999K08380
1253f7104N496K4048p2512l198J47656J72962j55551J08128M8680k31782j84943
$$ y = [50277, 200707, 78928, -58441, 37629, 69626, 55333, 39474, -124471, -230803, -277568, -43740, -123001, -229814, -50201, 11069, -48990, 308173, 196378, -34445, 2489, -5694, 15927, -11229, -24152, -22271, -15632, -117374, -63061, -45435, 62193, 86014, -39341, 28524, 132772, 1728, -36404, -11638, 96634, 51137, 46808, 154059, 38338, -47067, -109075, 99627, -52566, 84400, 30916, 188938, 78901, -45427, 244095, 98968, -81839, -84184, -100738, 19389, -234608, 119098, 192612, 36144, -80299, -60914, -11179, 31354, 165842, 37587, 42628, -7178, -206521, -187244, -52531, -316319, -463483, -275484, -67104, -61608, -37560, -110072, -113270, 34386, 207348, 51797, 159925, 208605, -23177, -208120]
1242b08120o083J25334J09884L5676L1581Q8726k41116n4150q7495J33641Q2093
1231I971j47838k895J8203J00676J7015l50664J77985K31429j63845k2479J21105
1220a1337J50533q6001o491k8228M1351J98012P17k23170P4253K9501r3083K03777
1208B49834k31954J01382J32365j67896j16462N0229M6598k1126R8253k38387
1198i7164m1115j40502J61562N3319n5440P7020J06940k10687m9066m6246K20245
1187b1134j5427q8239J83077N2703O310O3962j88845m9829P3863J24202j80787
1176d0144M8996K7263n094q3299J35196j82828k5917k9876j7588J60007Q9367
1165G6083K0894l519J11282k07074q0550J95418L74398k21674p3807m17103r264
$$ y = [-208120, -214203, -88869, 21015, 56691, 88272, 176998, -64118, -118268, -205763, -72122, 9971, -137867, -140762, -122559, -21883, -4868, -355532, -177547, 53882, -109963, -132442, -11337, 139196, 53195, 46704, 18476, 59827, 257839, 258556, 35386, 109639, 139140, 46057, 249834, 17880, 119262, 251627, 83731, -32731, 17498, 64096, 42970, 141223, -97164, -138279, -278781, -117219, -63900, -119340, -42320, 64620, -146067, -195133, -241379, -21134, -36561, -124800, 58277, 110980, 117290, 181252, -7593, -57422, 16441, 140643, -40144, 8852, 36115, 31021, -52278, 82918, -99910, -125827, -155703, -173291, -13284, 76083, 96977, 93458, 204740, -2334, -82884, 112534, 486932, 265258, 191451, -225652, -234916]
1154b34916R062R9453M8941j31908K05477r0256K1658j449j08139J57143J24111
1143I9177k20946N7004Q6015j77342M8596K80032J2896o4981j77897p6314J61032
1132B7272J07740j63404M9541J14528n1052m4971p8750N465m556N4922n6797J0922
1120b9140J29841l9035Q7038r5329j75040K06533M5847j55041o6911J14635n0488
1109b7090J8817k37824l7412J39352J23046J55144N7305k421K9989j83010J62559
1098A98455o3460l841j52115j32381P6541J52752j82592m2541j27804M2556K26230
1087h200J46889j26953j81466q4383m30p1249K1837J41637K2967j42217j97514
1076d79082M15929J39413l2981j2255J53256l71970k4381L7596L5103K12675K04218
$$ y = [-234916, -225854, -126401, -77460, -209368, -3891, -94147, -72489, -73938, -182077, -24934, 99177, -121769, -64765, 21250, -156092, -107496, 172536, 185432, 120451, -57446, -133760, 27272, 135012, -28392, 21149, 135677, 84625, 39654, -39096, -33631, -38187, 16735, -40062, -29140, 100701, 61666, 148704, 53375, -121665, 84868, 130715, -24326, -91237, 23398, -27090, -8273, -246097, -283509, -144157, -21111, 134033, 191338, 188917, 218906, 35896, 198455, 134995, 131154, -20961, -153342, -76801, 75951, -106641, -149182, -276986, -234430, -8200, 138689, 11736, -169730, -254113, -254543, -325792, -303955, -162318, -139351, -281568, -479082, -63153, 76260, 43279, 31024, 184280, -187690, -212071, -174475, -139372, 73303, 277521]
1065B77521j43037k33483Q182J17349m975j30502J35001J40701j7828j51079j42787
1054a44937k4947R3958O6681q4157o9572K7430l3670N5258K1892J22057N1392
1043H1385n1147j60395J58528J22054J2543k06624j49548J59382J19896l24232
1033b38158J53583p8677o2016P7869j76815n8182J83571J70323K5733l3917j55389
1022a92075J99226n4497K73246k49698p0125N8085k38417J14546j4382o2106P2430
1011a63767Q2925R8273M1057k85716L3851J05826J07918J70136J8911j68343j18092
1000g7021M4600J48525j93434j5170J09145j22439K05779Q3483L1273l25849k38138
989c49246j04096L31810O3505K22077O6015j31212l706j72408J13199K4425k9121
$$ y = [277521, 134484, -98999, -90817, 26532, 21557, -108945, 26056, 166757, 148929, -2150, -144937, -169884, -75926, -9245, -93402, -162974, -135544, -169214, -113956, -92064, 29993, 81385, 30238, -130157, 28371, 150425, 162968, -43656, -193204, -33822, 86074, -238158, -84575, -163252, -225268, -147399, -324214, -382396, -198825, -28502, -2769, -36686, -192075, 7151, -47346, 225900, -23798, -93923, -35838, -274255, -159709, -174091, -236197, -163767, -80842, 17431, 58488, -227228, -193377, -87551, 20367, 190503, 209414, 41071, -77021, -32421, 116104, -77330, -92500, 16645, -105794, 99985, 183468, 214741, -111108, -349246, -453342, -121532, -58027, 164050, 230065, 98853, 95147, -77261, 35938, 60363, 31242]
978C1242N3930j6067j32538K2460J28574k27701M9716J45529K9820k9065j6669
967C9231l70598J64548j3869n1050L5809J79880n7765M5822m1219K31968n2020
956A10737q3191R2294K4233N6258j49364j29534J04956R0934n394o0873k8957
945B2099J29012j33711j47021Q680J43578p1868r3790k8721K05771j2992J72241
934A93278o3884Q6396j19256k00884M3156J46022j71361k49011m8277K71096o5975
$$ y = [31242, 85172, 69105, -63433, -40973, 87601, -140100, -90384, 55145, 84965, 55900, 39231, -331367, -166819, -180688, -231738, -195929, -16049, -73814, -27992, -69211, 162757, 110737, 27546, 119840, 144073, 200331, 50967, -78567, 26389, 117323, 111929, 51056, 22099, 151111, 17400, -129621, -120941, 22637, -49231, -143021, -171742, 34029, 21037, 193278, 129394, 215790, 96534, -104350, -61194, 84828, -86533, -335544, -383821, -112725, -178700]
$$ [...]
##END NTUPLES=NMR SPECTRUM
##END=
