##TITLE=1H_EC-3257(5)
 CDCl3, 8 sc, 
 29.07.2021
##JCAMPDX= 6.0         $$ Bruker NMR JCAMP-DX V2.0
##DATA TYPE= NMR SPECTRUM
##DATA CLASS= NTUPLES
##ORIGIN= UXNMR, Bruker Analytische Messtechnik GmbH
##OWNER= root
$$ XWIN-NMR		Version 3.5
$$ Thu Jul 29 09:55:47 2021 Russian Standard Time (UT+4h)  she@DPX200
##.OBSERVE FREQUENCY= 200.131506
##.OBSERVE NUCLEUS= ^1H
##.ACQUISITION MODE= SIMULTANEOUS
##.ACQUISITION SCHEME= undefined
##.AVERAGES= 8
##.DIGITISER RES= 18
##SPECTROMETER/DATA SYSTEM= spect
##.PULSE SEQUENCE= zg30
##.SOLVENT NAME= CDCl3
##.SHIFT REFERENCE= (INTERNAL, CDCl3, 0, 17.502)
##AUDIT TRAIL= $$ (NUMBER, WHEN, WHO, WHERE, WHAT)
$$ ##TITLE= Audit trail, XWIN-NMR		Version 3.5
$$ ##JCAMPDX= 5.01
$$ ##ORIGIN= Bruker BioSpin GmbH
$$ ##OWNER= she
$$ F:/spectra/data/she/nmr/H-F/1/pdata/1/auditp.txt
$$ ##AUDIT TRAIL=  $$ (NUMBER, WHEN, WHO, WHERE, WHAT)
(   1,<2021-07-29 09:54:31.73 +0400>,<she>,<DPX200>,
      <created by zg, POWCHK disabled, PULCHK disabled
       configuration hash MD5:
       00 E9 B6 7A A2 85 ED C7 34 08 36 98 17 FE 4E 26
       data hash MD5: 16K
       FE 64 45 E3 70 AD 43 39 EE A7 D6 4B 82 65 0F FF>)
(   2,<2021-07-29 09:54:34.56 +0400>,<she>,<DPX200>,
      <Start of raw data processing
       efp BC_mod = 2 LB = 0.24 FT_mod = 6 PKNL = 1 PHC0 = -12995.4 PHC1 = 12.20099 SI = 16K 
       data hash MD5: 16K
       82 17 D8 0E 72 EF 4B 2C 96 D1 42 F6 86 94 6F 01>)
(   3,<2021-07-29 09:54:54.56 +0400>,<she>,<DPX200>,
      <pk PHC0 = 0.1751599 PHC1 = 1.4 
       data hash MD5: 16K
       A2 7A 95 8F 45 BD 0C B4 81 7B 0B 77 20 51 AD 6B>)
(   4,<2021-07-29 09:54:57.98 +0400>,<she>,<DPX200>,
      <abs ABSG = 5 
       data hash MD5: 16K
       8F 72 BE D2 A7 FB 55 4D 17 88 9D A8 AC 42 D1 CA>)
$$ ##END=
$$ 
$$ hash MD5
$$ 31 9F FB 1E 8E 9D A7 6F 03 9F 54 92 C1 32 2E AC
##$RELAX= 
##$RELAX= 
##$RELAX= 
##$RELAX= 
##$RELAX= 
##$RELAX= 
$$ Bruker specific parameters
$$ --------------------------
##$DU= <F:/spectra>
##$EXPNO= 1
##$NAME= <H-F>
##$PROCNO= 1
##$TYPE= <nmr>
##$USER= <she>
##$AMP= (0..31)
100 100 100 100 100 100 100 100 100 100 100 100 100 100 100 100 100 100 
100 100 100 100 100 100 100 100 100 100 100 100 100 100 
##$AQSEQ= 0
##$AQ_mod= 1
##$AUNM= <au_zg>
##$AUTOPOS= <>
##$BF1= 200.13
##$BF2= 200.13
##$BF3= 200.13
##$BF4= 200.13
##$BF5= 200.13
##$BF6= 200.13
##$BF7= 200.13
##$BF8= 200.13
##$BYTORDA= 1
##$CFDGTYP= 0
##$CFRGTYP= 5
##$CHEMSTR= <none>
##$CNST= (0..31)
1 1 145 1 1 1 1 1 1 1 1 1 1 1 1 1 1 1 1 1 1 1 1 1 1 1 1 1 1 1 1 1 
##$CPDPRG= <>
##$CPDPRG1= <>
##$CPDPRG2= <>
##$CPDPRG3= <>
##$CPDPRG4= <mlev>
##$CPDPRG5= <mlev>
##$CPDPRG6= <mlev>
##$CPDPRG7= <mlev>
##$CPDPRG8= <mlev>
##$CPDPRGB= <>
##$CPDPRGT= <>
##$D= (0..31)
0 1.2 0 0 0 0 0 0 0 0.06 0 0.03 0 0 0 0 0.0002 0 0 0 0 0 0 0 0 0 0 0 0 
0 0 0 
##$DATE= 1627538071
##$DBL= (0..7)
120 120 120 120 120 120 120 120 
##$DBP= (0..7)
150 150 150 150 150 150 150 150 
##$DBP07= 0
##$DBPNAM0= <>
##$DBPNAM1= <>
##$DBPNAM2= <>
##$DBPNAM3= <>
##$DBPNAM4= <>
$$ [...]
##$SUBNAM3= <"">
##$SUBNAM4= <"">
##$SUBNAM5= <"">
##$SUBNAM6= <"">
##$SUBNAM7= <"">
##$SUBNAM8= <"">
##$SUBNAM9= <"">
##$SW= 20.0188882624521
##$SWIBOX= (0..15)
0 0 2 0 0 0 0 0 0 0 0 0 0 0 0 0 
##$SW_h= 4006.41025641026
##$TD= 16384
##$TD0= 1
##$TE= 0
##$TE2= 300
##$TE3= 300
##$TEG= 300
##$TL= (0..7)
0 120 120 120 120 120 120 120 
##$TP= (0..7)
150 150 150 150 150 150 150 150 
##$TP07= 0
##$TPNAME0= <>
##$TPNAME1= <>
##$TPNAME2= <>
##$TPNAME3= <>
##$TPNAME4= <>
##$TPNAME5= <>
##$TPNAME6= <>
##$TPNAME7= <>
##$TPOAL= (0..7)
0.5 0.5 0.5 0.5 0.5 0.5 0.5 0.5 
##$TPOFFS= (0..7)
0 0 0 0 0 0 0 0 
##$TUNHIN= 0
##$TUNHOUT= 0
##$TUNXOUT= 0
##$USERA1= <user>
##$USERA2= <user>
##$USERA3= <user>
##$USERA4= <user>
##$USERA5= <user>
##$V9= 5
##$VALIST= <valist>
##$VCLIST= <CCCCCCCCCCCCCCC>
##$VD= 0
##$VDLIST= <DDDDDDDDDDDDDDD>
##$VPLIST= <PPPPPPPPPPPPPPP>
##$VTLIST= <TTTTTTTTTTTTTTT>
##$WBST= 1024
##$WBSW= 4
##$XGAIN= (0..3)
0 0 0 0 
##$XL= 0
##$YL= 0
##$YMAX_a= 189255
##$YMIN_a= -280236
##$ZGOPTNS= <>
##$ZL1= 120
##$ZL2= 120
##$ZL3= 120
##$ZL4= 120
##$ABSF1= 17.50811
##$ABSF2= -2.510929
##$ABSG= 5
##$ABSL= 3
##$ALPHA= 0
##$AQORDER= 0
##$ASSFAC= 0
##$ASSFACI= 0
##$ASSFACX= 0
##$ASSWID= 0
##$AUNMP= <proc_1d>
##$AZFE= 0.1
##$AZFW= 0.1
##$BCFW= 0
##$BC_mod= 2
##$BYTORDP= 0
##$COROFFS= 0
##$CY= -3
##$DATMOD= 1
##$DC= 0
##$DFILT= <>
##$DTYPP= 0
##$F1P= 0
##$F2P= 0
##$FCOR= 1
##$FTSIZE= 16384
##$FT_mod= 6
##$GAMMA= 0
##$GB= 0
##$INTBC= 1
##$INTSCL= 1.334414e-10
##$ISEN= 128
##$LB= 0.24
##$LEV0= 0
##$LPBIN= 0
##$MAXI= 10000
##$MC2= 0
##$MEAN= 0
##$ME_mod= 0
##$MI= 1.114404
##$NCOEF= 0
##$NC_proc= -8
##$NLEV= 6
##$NOISF1= 3.799351
##$NOISF2= 2.8
##$NSP= 0
##$NTH_PI= 0
##$NZP= 0
##$OFFSET= 17.502
##$PC= 1
##$PHC0= -12995.23
##$PHC1= 13.60099
##$PH_mod= 1
##$PKNL= yes
##$PPARMOD= 0
##$PSCAL= 0
##$PSIGN= 0
##$REVERSE= no
##$SF= 200.130006530551
##$SI= 16384
##$SIGF1= 3
##$SIGF2= 2
##$SINO= 5.538805
##$SIOLD= 16384
##$SREGLST= <1H.CDCl3>
##$SSB= 0
##$STSI= 16384
##$STSR= 0
##$SW_p= 4006.41025641026
##$SYMM= 0
##$S_DEV= 0
##$TDeff= 16384
##$TDoff= 0
##$TI= <>
##$TILT= no
##$TM1= 0
##$TM2= 0
##$TOPLEV= 0
##$USERP1= <user>
##$USERP2= <user>
##$USERP3= <user>
##$USERP4= <user>
##$USERP5= <user>
##$WDW= 1
##$XDIM= 16384
##$YMAX_p= 499056441
##$YMIN_p= -1214155
$$ End of Bruker specific parameters
$$ ---------------------------------
##NTUPLES= NMR SPECTRUM
##VAR_NAME=  FREQUENCY,     SPECTRUM/REAL,   SPECTRUM/IMAG
##SYMBOL=    X,             R,               I
##VAR_TYPE=  INDEPENDENT,   DEPENDENT,       DEPENDENT
##VAR_FORM=  AFFN,          ASDF,            ASDF
##VAR_DIM=   16384,         16384,           16384
##UNITS=     HZ,            ARBITRARY UNITS, ARBITRARY UNITS
##FACTOR=    0.24454680195387, 1,            1
##FIRST=     3502.67553614601, 0,            0
##LAST=      -503.734720264254, 0,           0
##MIN=       -503.734720264254, -1214155,    0
##MAX=       3502.67553614601, 499056441,    0
$$ Real data points
##PAGE= N=1
##DATA TABLE= (X++(R..R)), XYDATA
$$ [...]
6733B68403L19918l36006k02491k10320M34774m04315j35788P3647J69722J22568
6723A00112l40735K15468j70007M8076L32012J72686K6291L9056m3352n1329j75465
6712A52813k25860L91045k61051k3281N58383j77061q9048L23601k07292k01055
6702B41194j3711Q6093K19506m14962J77416m1831J69182j2729k61165j49947
6692i54L18411m28323k66124J42715L67381q2775J17589N33301n70589J34390
6682B65022M0187K50045O631j22003n0746J10582R3564l89548R4437J97893l90650
6671A05414K68942K74142J72686k4541o96162J13108N29822j73601l79840j97405
6661g435R17505J07863j84145L9915j92233m7347r4768L36459L02716o22572N4254
$$ plain form
6733 268403 588321 252315 49824 -160496 274278 -130037 -265825 -192178 -22456 100112
6723 100112 -240623 -25155 -195162 -147086 184926 357612 383903 422959 379607 328278 152813
6712 152813 -73047 317998 56947 33666 592049 414988 325940 649541 442249 241194
6702 241194 227483 313576 533082 118120 295536 253705 422887 410158 148993 -954
6692 -954 317457 -110866 -376990 -234275 133106 50331 167920 701221 130632 265022
6682 265022 305209 555254 561885 439882 389136 499718 593282 203734 298171 496064 105414
6671 105414 374356 648498 821184 796643 100481 213589 743411 569810 189970 -7435
6661 -7435 910070 1017933 833788 873703 681470 634123 539355 875814 1178530 555958 610212
6650F10212J10961N50408m3234m34261q6977j91736N24842K61972J59032j42005
6640A319214O0865J03141k25337j86901j28414l64517K83095K68226L34731J16176
6630A580279l49932J44156K01289m42958j12031q6755k82550J24778O04285P3906
6620A454467j18672m8141M90591N07660m80667L75001j367j77441M38369K15839
6610B655639q227J9373q2281J89105J60376M2503J96342J50939L18947J11426
6600C754142M88752j85407l83027j69955N46640j78872J91815r1330N85373k82777
6590D275354k63248P30508o00792L98347r0491J42562q0575L4342M3744P50868
6580E340619N33498L03923l8951J04904q584M8532k35100l3165O29227J93898
$$ plain form
6650 610212 721173 1271581 1228347 794086 707109 515373 1040215 1302187 1461219 1319214
6640 1319214 1380079 1483220 1257883 1070982 942568 578051 861146 1129372 1464103 1580279
6630 1580279 1230347 1374503 1575792 1132834 1020803 934048 651498 776276 1380561 1454467
6620 1454467 1335795 1287654 1778245 2285905 1805238 2180239 2178872 2001431 2439800 2655639
6610 2655639 2647412 2666785 2584504 2773609 2933985 2976488 3172830 3323769 3642716 3754142
6600 3754142 4242894 4057487 3674460 3504505 4051145 3872273 4064088 3972758 4558131 4275354
6590 4275354 4012106 4742614 4141822 4540169 4449678 4592240 4511665 4546007 4589751 5340619
6580 5340619 5874117 6178040 6139089 6243993 6235409 6283941 6048841 6015676 6644903 6838801
6570F838801q3773P11620J69259Q1893L10566Q84341P22586j70193P22891M23416
6560A0611407R41835L40463O72744O40781P20601J234544J229798J293770J249177
6551A8935120J334513J414301K505766K435116K573204M025207M182639M387183
6543D1793049N357596O701772P579638Q967211J0920578J3126698J5062421J4844801
6535A24353764J1499219L101576o613412j4814241j7838517j6876862j3600383
6528F9211144j0497285p289713n932325m934275l728390l346216k799974k161165
6520B8521801k389003j853964j373892j372333q22445j688929q60547q94558j726858
6511A5539272j174985k33364p46000p15330j17588n07765q35873K8548k02067
$$ plain form
6570 6838801 6755028 7466648 7635907 7717800 8028366 8912707 9635293 9465100 10187991 10611407
6560 10611407 11553242 11893705 12566449 13207230 13927831 15162375 16392173 17685943 18935120
6551 18935120 20269633 21683934 24189700 26624816 29198020 33223227 37405866 41793049
6543 41793049 47150645 53852417 61432055 70399266 81319844 94446542 109508963 124353764
6535 124353764 135852983 138954559 132341147 117526906 99688389 82811527 69211144
6528 69211144 58713859 51424146 45491821 40557546 36829156 33482940 30682966 28521801
6520 28521801 26132798 24278834 22904942 21532609 20710164 19021235 18160688 17266130 15539272
6511 15539272 14364287 14130923 13384923 12669593 12552005 12044240 11208367 11236915 11034848
6502A1034848n44374O8878k79775k30643O47051m58840m09335j74959n40855j06612
6492I005384j2407l81778O13162p80302l84993Q711m28404l82799O4604k34288
6482G086890J73045O1568n66263M03850K10951J3187J03516l91939L36510j10958
6472G320357L53520Q94144m00803P25606R65831J73367J046416R31504M80421
6463A2490363J200181J145454K100570K256247J881473J400472Q95522r49049
6455B2421233k066650k343030j853527k182371j221371o53666j492426j047854
6447I560338j75173m16101p78023L22206K83899m94149l92134j55018n1036M483
6437G709292J86689N39592J93518j46897j08687M15812O76106K60535k41176R74383
$$ plain form
6502 11034848 10490474 10559352 10279577 10048934 10695985 10237145 9827810 9652851 9111996 9005384
6492 9005384 8992977 8611199 9224361 8444059 8059066 8067777 7639373 7256574 7321178 7086890
6482 7086890 7259935 7321503 6755240 7159090 7370041 7383228 7486744 7094805 7431315 7320357
6472 7320357 7673877 8568021 8167218 8892824 9858655 10032022 11078438 12009942 12490363
6463 12490363 13690544 14835998 16936568 19192815 21074288 22474760 23370282 22421233
6455 22421233 20354583 18011553 16158026 13975655 12754284 12100618 10608192 9560338
6447 9560338 9385165 8969064 8191041 8513247 8797146 8302997 7910863 7755845 7704809 7709292
6437 7709292 7895981 8435573 8629091 8482194 8373507 8789319 9465425 9725960 9484784 10459167
6427A0459167K35710N19687J354278O20617Q50559J067153J658984O09466J024026
6418A8399647P58839Q67408P28261M55706K30028k6656o90412j27474k38038n40473
6408A9816836j14603m94396J14757l07407J071947R37932L95885O39023R23845
6399B2983819O09662j17530K25795N70530m48827r22421m45360j078404p71863
6390B0605401j157272j192697p18378q56670o95887q79430p81182o40630m53205
6381A3230050L43970q5492p55772j15989l17423n16342k83275p67067n13715p83149
6371I435796k18964n05134l43873m66214n19002n17265l10114k36540m79126n83792
6361E255772l66134l17384L00715N19247k41051l30716o71175j76715k7781J38
$$ plain form
6427 10459167 10694877 11214564 12568842 13189459 14040018 15107171 16766155 17375621 18399647
6418 18399647 19158486 20025894 20754155 21209861 21439889 21413233 20722821 20595347 20357309 19816836
6408 19816836 19702233 19207837 19322594 19015187 20087134 21025066 21420951 22059974 22983819
6399 22983819 23593481 23475951 23701746 24272276 23823449 22901028 22455668 21377264 20605401
6390 20605401 19448129 18255432 17537054 16680384 15984497 15105067 14323885 13683255 13230050
6381 13230050 13574020 13488528 12732756 12616767 12299344 11783002 11499727 10732660 10218945 9435796
6371 9435796 9216832 8711698 8367825 7901611 7382609 6865344 6555230 6318690 5839564 5255772
6361 5255772 4889638 4572254 4872969 5392216 5151165 4820449 4149274 3972559 3944778 3944916
6351C944916l09755K94496J06242n36556J03224J35068p23004l8808J1517k59697
6341B727643R4487J78081N8075m32373J55003l15487n29241J75222j16966L38883
6331B333327K10666k63783J0403K60972k87190k20552o6445M50039J37299n80083
6321A984653M43928M3949l3067l58400j71653M9091j67584j36546K96258j91816
6311A758813M03586K43131m93500N41045k22960m83212m58578K51467N25807K59326
6301B324925k25830k67746K40323J15512l18078J73170j89654L44943l11099L39320
6291B225786J57948K75306K1250p16858N3562M55691j83363m62627L22633M43211
6281B592539K30294j75138j32646k24547J20804l64776l93342j07546n028Q4154
$$ plain form
6351 3944916 3635161 3929657 4035899 3499343 3602567 3737635 3014631 2975823 2987340 2727643
6341 2727643 2822130 3000211 3058286 2625913 2780916 2465429 1936188 2111410 1994444 2333327
6331 2333327 2543993 2280210 2290613 2551585 2264395 2043843 1977398 2427437 2564736 1984653
6321 1984653 2428581 2472530 2439463 2081063 1909410 1958501 1790917 1654371 1950629 1758813
6311 1758813 2162399 2405530 1912030 2453075 2230115 1746903 1288325 1539792 2065599 2324925
6301 2324925 2099095 1831349 2071672 2187184 1869106 2042276 1852622 2197565 1886466 2225786
6291 2225786 2383734 2659040 2680290 1963432 2016994 2472685 2289322 1826695 2149328 2592539
6281 2592539 2822833 2647695 2515049 2290502 2411306 2046530 1653188 1545642 1540614 1624768
6271A624768l39000J37827L96711l82160N424K48656l93270K77379k97475k72472
6261A006388J42717L81981J59758n29672Q2834j6560k72330K39922m77519j42959
6251E74560M78341r9611p1421j53153L98327l52309k55504K63468J64696M8847
6241I96241j59714p33826J22463M88030j77278k40292K93187K16824l19521q7908
6231C98206M31488k559k31873k87139J29777l36784K95177j60099L00148J58781
6221F95123j68663k12775K2962L85110k92203k62205k61545O62408l7100L0549
6211E61661L56149j68720l33167k35035l69591K34455R1618L99290j76522m56140
6201i6002M98011J51220j03997L7628J13673l44897k83128K91730k69883M0842
$$ plain form
6271 1624768 1285768 1423595 1820306 1438146 1443570 1692226 1298956 1576335 1278860 1006388
6261 1006388 1149105 1531086 1690844 1161172 1244006 1227446 955116 1195038 717519 574560
6251 574560 1052901 953290 881869 728716 1127043 774734 519230 782698 947394 996241
6241 996241 836527 102701 225164 713194 535916 295624 588811 805635 486114 398206
6231 398206 829694 827135 595262 308123 437900 101116 396293 236194 536342 695123
6221 695123 526460 313685 336647 721757 429554 167349 -94196 568212 531112 561661
6211 561661 917810 749090 415923 180888 -188703 45752 137370 536660 360138 -96002
6201 -96002 402009 553229 449232 486860 600533 255636 -27492 264238 -5645 35197
6191C5197N3341j39235N4187R2128M52875J74429L21444n51206k36120j63304
6181I3736k92607Q2579K30175J01467J73641N25269m41251K94065M28710j56832
6171A038952k8876r1043J26779k09714j13433K32579j67933K23181n95371J887
6161D17008N341L30447P4975m93162j15054J44774K98612r5378N7025p8634k2930
6150E23024J97370j42957k70108j30736K41276m30284K60486q288l40893M75548
6140C74438J10187j63775k77440M6599K00554n1811j30936M48244l31640j91539
6130C2881l50607M7847j11176M77510L03468l4706n85600o617L1841n7781j4845
6119b67785J08701N74690J70921n83166j74177m1060L5019J60800K59338J0453
$$ plain form
6191 35197 88538 -50697 3490 95618 548493 722922 1044366 493160 257040 93736
6181 93736 -198871 -116292 113883 215350 388991 914260 473009 767074 1195784 1038952
6171 1038952 1010076 919033 1045812 836098 722665 955244 787311 1010492 415121 417008
6161 417008 422349 752796 827771 334609 219555 364329 662941 567563 624588 545954 523024
6150 523024 720394 577437 307329 176593 417869 -12415 248071 239783 -101110 374438
6140 374438 484625 320850 43410 90009 290563 238752 107816 556060 224420 32881
6130 32881 -317726 -269879 -381055 96455 399923 365217 -220383 -227000 -195159 -252940 -267785
6119 -267785 -159084 415606 586527 3361 -170816 -211876 -176857 -16057 243281 253734
6109B53734l50826j47061L62467K5658M8676r773J11210J89217m95441k11661
6099b23800J48915R0287J18872j50800P6722K60734l42259k11675k74406J62571
6089c44839K7086J13529j50169M8265Q9463J73423L0139K67569M4156p2114j25450
6078A01058l41527M08398o933k55941O3514k27049O11145r499r0946j00503K4058
6067A75775j88918N01726K98940m67920k20559j46610j90922J43308j21926M21277
6057B04171q5737n29414L04193Q1018n8324j13447J39941K9080R6650j29761J91205
6046A29575L8868q7460M8657r7335q9676J72968M4711q7018j56989P7467M80449
6035D74217j45876k93674J20104J00612L47014J3216l33081m17703k94267N4699
$$ plain form
6109 253734 -97092 -244153 118314 143972 192648 182875 294085 483302 -12139 -223800
6099 -223800 -74885 15402 134274 -16526 60196 320930 -21329 -233004 -507410 -344839
6089 -344839 -317753 -204224 -354393 -306128 -216665 -43242 -13103 254466 298622 226508 101058
6078 101058 -240469 167929 160996 -94945 -31431 -258480 352665 343166 252220 151717 175775
6067 175775 -13143 488583 787523 319603 99044 -47566 -238488 -95180 -217106 204171
6057 204171 118434 -410980 -106787 -25769 -84093 -197540 -57599 -28519 68131 -61630 129575
6046 129575 168443 80983 129640 32305 -57371 115597 160308 73290 -83699 -6232 474217
6035 474217 328341 34667 154771 255383 602397 615613 282532 -135171 -429438 -374739
6025c74739J54286K88993K27159p280J96189K74097n29500k76220j29496M6155
6015a30356M43835P6218L9330j82217k21729j5423n4865K99843m12742l86288
6005e44394L32102J79563m06034K77953K01968q4983L91455L34702L10303J5455
5995A008090m72587j96640k6038j02207K4251K40792k11425J92427n30468j01728
5985a75533N28070l89807K00640K13313j47382n45179O0605M25480L082m14360
5975b41071L5359M0526K53557K03672k86183j15952L92978J4148L2994K05828
5965E35856K59294j17837k33249o62196q5821K49489J60775J26453m416j19513
5955A08835J75468j96708K2847j40055K6083L34988J74174o29383O6587N29327
$$ plain form
6025 -374739 -220453 68540 295699 288419 484608 758705 229205 -47015 -176511 -130356
6015 -130356 313479 389697 429027 246810 25081 9658 -45207 254636 -158106 -544394
6005 -544394 -212292 -32729 -438763 -160810 41158 -43825 347630 682332 992635 1008090
5995 1008090 535503 338863 312825 210618 234869 475661 264236 456663 -73805 -175533
5985 -175533 352537 -37270 163370 376683 229301 -315878 -255273 170207 173289 -241071
5975 -241071 -205712 -165186 88371 292043 5860 -110092 282886 297034 330028 535856
5965 535856 795150 677313 444064 -218132 -303953 -54464 106311 232764 228348 108835
5955 108835 284303 87595 110442 -29613 -3530 331458 505632 -123751 -57164 472163
5945D72163n02347L67508M8956n00274J92663l90565L1848O05608k45761k87878
5935b08079j27016N8594R8501p7081J22776J82354J12234K52199J57739j89850
5925C82371k28080j5678n6276m04291O05267N1746j85821J04550K32700l04598
5915A81890m34490L0013K12054K87827k83459K02153J90962j68993o17369J04190
5905b95222M66881j99871P1976J99591k10538j95484L05337K90123k35664k40591
5895d3462k64569q0551K16601L25815J2018k77092l78684O66328J92091m55662
5885h7167m69976P11086n4756Q3201K71265k35635J11872M0969m04578m84973
5875e18692J11396J70082J96770M24666k34536j7570j22647R0880k84018l85936
$$ plain form
5945 472163 -30184 337324 386280 -113994 78669 -311896 -280048 325560 79799 -208079
5935 -208079 -335095 -276501 -178000 -255081 -132305 50049 162283 414482 572221 382371
5925 382371 154291 138613 82337 -321954 283313 335059 149238 253788 486488 181890
5915 181890 -252600 -222587 -10533 277294 -6165 195988 386950 217957 -399412 -295222
5905 -295222 171659 -28212 43764 243355 32817 -162667 142670 432793 197129 -43462
5895 -43462 -308031 -388582 -171981 153834 165852 -111240 -489924 176404 368495 -87167
5885 -87167 -557143 153943 99187 182388 453653 218018 329890 370859 -33719 -518692
5875 -518692 -407296 -237214 -40444 384222 149686 132116 9469 100349 -183669 -569605
5865e69605l5955J12882M89598M6423M2253j56540r6161k67599J9642M86890p6436
5854d608J30402n1605J99391j90541k03540m06220K2365J50559o930L59429M80372
5843D79074Q5997o99116j60247P2407K11877J22624k10543M562N13238k60881
5833A58992l21541K66150J328k12959K56272k64974L59482M7839l12142j40972
5823a62525K25475j37206j67101j18014j35831j02885Q51359q6920n09199K83215
5813e9632J56420O39420J60166r3364j80351k35750j69314j12035k6007j19323
5803c9770P01743l48128P4164l980n11540m7860J50605K12141K09961J01784l59604
5792A39516K12109K66197k01885K8951p9196k17883p8552j17568K46483l658q4107
$$ plain form
5865 -569605 -605560 -492678 -3080 43343 85596 -70944 -167105 -434704 -415062 71828 -4608
5854 -4608 125794 74189 273580 83039 -120501 -526721 -504356 -353797 -360727 -1298 479074
5843 479074 565071 -134045 -294292 -221885 -10008 112616 -97927 -93365 419873 158992
5833 158992 -162549 103601 104929 -108030 148242 -116732 242750 290589 -21553 -162525
5823 -162525 62950 -74256 -241357 -359371 -495202 -598087 253272 166352 -342847 -59632
5813 -59632 96788 736208 896374 803010 622659 386909 217595 105560 79553 -39770
5803 -39770 661973 313845 388009 384029 -127511 -175371 -24766 187375 397336 499120 139516
5792 139516 351625 617822 415937 444888 365692 147809 69257 -48311 198172 194514 110407
5781A10407K83205K4970m97641O04386n2988M7683p55573n0972N45187R4253m26824
5770g3907l1547K61405j1682l6612l8863K83368k82685P0799q4944K2261J74296
5759B51889l12456L04036J06304J80981l85193j8775J22548N9219l09428j84118
5749a84993J00026J51218L04028k78621j39494k16380J57484o3437J88851J20683
5739A39365P23718j76707m70611J85400j51885k0659L50388q2246l60471O17027
5729G53319o7716l26492j86855j03699M1785M6574K19575j95015L55149K36029
5719G72654j38916k78662M02604J46738k57934l4422L5164k12651K26321l97655
5709B63241K31560M41103k61009j64836l4997l72064M90424N62014n06023j25334
$$ plain form
5781 110407 393612 418582 -79059 525327 472339 520022 -235551 -286523 258664 352917 -73907
5770 -73907 -105454 155951 144269 107657 68794 352162 69477 140276 55332 77593 251889
5759 251889 -60567 243469 349773 530754 145561 126786 249334 308553 -875 -184993
5749 -184993 -84967 66251 370279 91658 -47836 -264216 -106732 -170169 18682 139365
5739 139365 863083 686376 215765 401165 249280 228621 579009 496763 136292 753319
5729 753319 685603 359111 172256 68557 110342 156916 376491 181476 536625 772654
5719 772654 633738 355076 757680 904418 646484 612062 647226 434575 660896 263241
5709 263241 494801 935904 674895 510059 475062 102998 593422 1155436 649413 524079
5699E24079J40165l99526N69172L11110n8587J77667j98691l63156k19561L21294
5689H03966J25510K03271j07274k7830R9804j60158q82390l1366K92496j25429
5679A90600Q6766N87430j42039k42040j0070K20421J77727O8754j53636J6486
5669H00399o6917K98910P2096L23907j46985n75418L44414K14492j98230l01954
5659G64714j12379n6546J28687M41785j69661l86543K45059m19254l6564M44988
5649H44286r8502J67647J21159j56028R1230k73953p6415k00822K96613J08543
5639H23758J19242J18826J32720m25691l02408K67335K77183r9705J46387J99566
5629A257213J78502K9919p05498J66042n47773k14465L7862J74724N08538j04697
$$ plain form
5699 524079 664244 264718 833890 1145000 1086413 1264080 1065389 702233 482672 803966
5689 803966 929476 1132747 1025473 997643 1097447 937289 54899 23533 316029 190600
5679 190600 277366 864796 722757 480717 470647 691068 868795 937549 783913 800399
5669 800399 733482 1032392 1104488 1428395 1281410 705992 1050406 1264898 1066668 764714
5659 764714 652335 595789 724476 1166261 996600 610057 855116 435862 399298 844286
5649 844286 745784 913431 1034590 878562 969792 695839 619424 418602 715215 823758
5639 823758 943000 1061826 1194546 768855 466447 733782 1010965 911260 1057647 1257213
5629 1257213 1435715 1465634 760136 926178 378405 163940 201802 376526 885064 780367
5619G80367k35417o56297p9629J73770L88933k34004K38237L16785p67872K51720
5609A76593k6827M53723K81507k60448J81294L06407l27342o0340p5939K26576
5599H75204L20038k37536M608p43600L71673j09910J00343J38117l0668p6665
5589F11604J62152J63492l36908L17464J66613k86700K87340L34786m05654J83004
5579A197193K76069P7816M6148l24376q5070p6094j0426N65784k56994K98379
5569A708429j2214J97131k84350M16259m66109M1506L13981m78648l9712L90888
5559A787161l51201j9315J65098j95972m32526N77883K53274m9041M97430j70230
5549B062561j70777j55490K09584J26222l62968m19663k4042M23561O92549m50559
$$ plain form
5619 780367 544950 -111347 -190976 -17206 371727 137723 375960 692745 -75127 176593
5609 176593 149766 603489 884996 624548 805842 1112249 784907 724567 648628 875204
5599 875204 1195242 957706 962314 218714 590387 480477 580820 718937 688269 611604
5589 611604 773756 937248 600340 917804 1084417 797717 1085057 1419843 1014189 1197193
5579 1197193 1473262 1551078 1597226 1272850 1187780 1111686 1101260 1667044 1410050 1708429
5569 1708429 1696215 1893346 1608996 2025255 1559146 1600652 1914633 1435985 1396273 1787161
5559 1787161 1435960 1416645 1581743 1385771 953245 1531128 1784402 1735361 2232791 2062561
5549 2062561 1891784 1736294 1945878 2072100 1709132 1289469 1265427 1688988 2381537 1930978
5539A930978J3503n5573k11507j33468R3843n09488R9025N12816O73782l39570
5529B074341k79930L93786j70010K28658k4477j39332J98234l521K57013K396
5519B537158m08098Q5828k15531J86603K75133m34177M05907R5474q287O22025
5509C142035k90161m37017L71389K80979J56377p3465J37180m54446K66013K9514
5499C128398M29994K90404m09397r587J30646K18118j48326m89109M72139L20032
5489C933312J89806N3512J69903K79109J90701J72453m36918m0982K92244K80011
5479E083151P19957j60307k27493K95362m1659L45352N4330K24781M38558l56840
5469F375192j43284O73345M47313M39362M808N8714j36661N00784K82073K88706
$$ plain form
5539 1930978 1944481 1888908 1677401 1543933 1637776 1128288 1227313 1740129 2413911 2074341
5529 2074341 1794411 2188197 2018187 2246845 2222368 2083036 2281270 2277749 2534762 2537158
5519 2537158 2129060 2214888 1999357 2185960 2461093 2026916 2432823 2528297 2520010 3142035
5509 3142035 2851874 2414857 2786246 3067225 3223602 3150137 3287317 2832871 3098884 3128398
5499 3128398 3558392 3848796 3439399 3429812 3560458 3778576 3630250 3141141 3613280 3933312
5489 3933312 4123118 4176630 4346533 4625642 4816343 4988796 4551878 4510896 4803140 5083151
5479 5083151 5803108 5642801 5415308 5710670 5669011 6014363 6068693 6293474 6732032 6375192
5469 6375192 6231908 6905253 7352566 7791928 7796736 7855450 7718789 8219573 8501646 8790352
5459H790352L36002j32049N07447O16909M52678M07881L29895K13654K87720P26043
5449A2536532K57983L81059O61372L60414K92812Q26052P89179O15476R32490
5440A7653369Q54662O17175J179740R80887J339051J762934J682027K439549K511536
5431C1020930K496370L519726L409936L653536M488462M451409N733163O010094
5423F4783626N329558M417676J854179j373140l800007m819963m334839l524523
5415E8532567k146393j819153r67268j00885R17992P41892J589744K310468L030546
5406F2089510M049337N565681O205223O504555Q402121Q571815J0061471J0239701
5398A21689414J0477041R549301N159525k317396r765105j3064873j3573205j2024246
$$ plain form
5459 8790352 9126354 8994305 9501752 10118661 10571339 10979220 11309115 11522769 11810489 12536532
5449 12536532 12794515 13175574 13836946 14197360 14490172 15316224 16105403 16720879 17653369
5440 17653369 18508031 19125206 20304946 21285833 22624884 24387818 26069845 28509394 31020930
5431 31020930 33517300 37037026 40446962 44100498 48588960 53040369 58773532 64783626
5423 64783626 70113184 74530860 76385039 75011899 71211892 66391929 62057090 58532567
5415 58532567 56386174 54567021 53599753 53498868 54416860 55158752 56748496 59058964 62089510
5406 62089510 66138847 71704528 77909751 84414306 92816427 101388242 111449713 121689414
5398 121689414 132166455 141715756 146875281 144557885 134792780 121727907 108154702 96130456
5390I6130456q742232p120101n238897m510588k514199k532929k202849j573278
5382F1695383k96122k6825P36735J552951K196269K980088L247962L965987M829054
5373H0881482M571482M658908M974846K163810j817485n330231o994729p636620
5365G5471463o669642n368245m316028l655210l348960l734538l379530l275542
5357D1723768k431087k304903j658157j658156j294808o38117r94021m44923p33666
5348B9565930n19137j51975n88983M63016J86534k33278K8449R85326J52990K90580
5338C0179452k701M3888k83154o01718j848356j676893k041972j548356o06654
5329B1613536j320841r08594m7087j40571r03008j90277j86141j70114l99401
$$ plain form
5390 96130456 87388224 80268123 75029226 70518638 68004439 65471510 63268661 61695383
5382 61695383 61399261 61372436 62109171 63662122 65858391 68838479 72086441 76052428 80881482
5373 80881482 85452964 90111872 95086718 97250528 95433043 90102812 83108083 75471463
5365 75471463 68801821 63433576 59117548 55462338 52113378 48378840 44999310 41723768
5357 41723768 39292681 36987778 35329621 33671465 32376657 31738540 30744519 30299596 29565930
5348 29565930 29046793 28894818 28305835 28768851 28955385 28722107 28750556 29735882 29888872 30179452
5338 30179452 30176751 30220639 29937485 29335767 27487411 25810518 23768546 22220190 21613536
5329 21613536 20292695 19384101 19337014 19196443 18293435 18103158 17917017 17746903 17347502
5320A7347502K54872R6181k11191K80456K04956K22353N56909Q87369N17129K22150
5310B0378686k46674j039781r56303q02895n13988o97444p94642m584l25387k27351
5300A4769637j32690o57101l0653k88319L01705J24197m05878L56902N48985M82118
5290A5068903K01662J28647P09195j18180P00112O99914j83541k95909J03124
5281A7013927N2362M51840P61502O56990J075223J441692J354524J341925J188663
5272B5338648J389552j96664J75559N66082k64686j70477o14158p20382p19446
5263B4784028p84027j7758O62631L51101Q63505J161384N70353O40536J525399
5254B9757152J707539J803223K257537K173347K674001K060174J243911K07948
$$ plain form
5320 17347502 17602374 17698555 17487364 17767820 17972776 18195129 18752038 19639407 20156536 20378686
5310 20378686 20132012 19092231 18135928 17333033 16819045 16121601 15326959 15322375 14996988 14769637
5300 14769637 14636947 13979846 13949193 13660874 13962579 14086776 13680898 14037800 14586785 15068903
5290 15068903 15270565 15399212 16108407 15990227 16690339 17390253 17206712 16910803 17013927
5281 17013927 17066289 17518129 18279631 18936621 20011844 21453536 22808060 24149985 25338648
5272 25338648 26728200 26531536 26707095 27273177 27008491 26838014 26223856 25503474 24784028
5263 24784028 24000001 23982243 24644874 24995975 25859480 27020864 27591217 28231753 29757152
5254 29757152 31464691 33267914 35525451 37698798 40372799 42432973 43676884 43884832
5246D3884832j282760j618450k969327l056541k179828j854098j761055j678939
5238B7483834j384167j098866l32097j32064o60697M25242M12295J72930q1701
5229B4804709Q02683L57682P38159J102128Q67975N04303O6637o06719j222410
5220B7415147j851517j921500j356728q50726m93121r65657q98762o00235p51548
5211A7725353m07802N6973p23045l01804n61241p02728p54870l59036m87896n34747
5201A2949157k56278k03789o57471k36810L54695l72869L255k60951l05106j75478
5191A0838355l64609n84384N30704M17k61106l0809P0020L11623k43367l62712
5181I904132k04773J25529k46089m35281J26536p44589J99028j17607m87485j9685
$$ plain form
5246 43884832 42602072 40983622 38014295 34957754 32777926 30923828 29162773 27483834
5238 27483834 26099667 25000801 24668704 24536640 23875943 24301185 24713480 24886410 24804709
5229 24804709 25607392 25965074 26703233 27805361 28673336 29177639 29244276 28637557 27415147
5220 27415147 25563630 23642130 22285402 21434676 20941555 19975898 19077136 18476901 17725353
5211 17725353 17317551 17374524 16651479 16349675 15788434 15085706 14330836 13971800 13483904 12949157
5201 12949157 12692879 12489090 11831619 11594809 11949504 11576635 11579890 11318939 11013833 10838355
5191 10838355 10473746 9889362 10420066 10420483 10159377 10128568 10198588 10510211 10266844 9904132
5181 9904132 9699359 9824888 9578799 9143518 9270054 8525465 8724493 8606886 8119401 8099716
5171H099716k63266m1029J46315j15991j30134L15106l71419J74193J5480Q3331
5161G912302k29919n80016J18940r5453J88070M43707j20996m2783M00183k84910
5151G709125j24674M54463L34323l16504K4154K66457J33236N077j8316J57591
5141H624932m0004J29970p0491K16484m5122K20115N154O35909j18670O7567M77025
5130A0102869M14443J81830J29569K85258J66373K20133N27145Q5862O73697J7097
5120A2804276L17644O03463K25316J56427J24387n13631l94641O08953m71850
5111A3460344J25682J07609J20905K2991O15265j06751L24235P46742O22939P2225
5101A6112186J73647J121039J097808Q75837L76394J022602N92776J440610R86323
$$ plain form
5171 8099716 7836450 7795421 7941736 7825745 7695611 8010717 7639298 7813491 7828971 7912302
5161 7912302 7682383 7102367 7221307 7125854 7313924 7757631 7636635 7593852 7994035 7709125
5151 7709125 7584451 8038914 8373237 8056733 8080887 8347344 8480580 8485657 8467341 8624932
5141 8624932 8584928 8714898 8644407 8860891 8815769 9035884 9041038 9676947 9558277 9625844 10102869
5130 10102869 10517312 10699142 10828711 11113969 11280342 11500475 12027620 12113482 12787179 12804276
5120 12804276 13121920 13725383 13950699 14107126 14231513 13717882 13323241 13932194 13460344
5111 13460344 13586026 13693635 13814540 13837531 14452796 14346045 14670280 15417022 16039961 16112186
5101 16112186 16285833 17406872 18504680 19380517 19756911 20779513 21372289 22812899 23799222
5092B3799222J559975J577843J133688J820503P61358l57291j36084L53296R84770
5083C1497280K46286L54133J529612J979979J906005K781306K923228K936698
5075D6154527L391679M188046M845007N513528N594685N236190K510310m90967
5067G6943005k432606l381732l428006k796981j721450q55549L1319M2597L21640
5058F2722237p82613J1896J155570J458007K387842L048296L776483M901840N129724
5049H3809282O854270P764201Q706909R356302R294541O800012K621202k529460
5041A32677259p116822r103858q991325q062609o764021n039620m043338l394982
5033H0160684k543905j606725q60076o06122K96395J77674J187060J787981J630463
$$ plain form
5092 23799222 25359197 26937040 28070728 29891231 30652589 30295298 30159214 30512510 31497280
5083 31497280 31743566 32097699 33627311 35607290 37513295 40294601 43217829 46154527
5075 46154527 49546206 53734252 58579259 64092787 69687472 74923662 77433972 76943005
5067 76943005 74510399 71128667 67700661 64903680 63182230 62326681 62358000 62400597 62722237
5058 62722237 61939624 61951520 63107090 64565097 66952939 70001235 73777718 78679558 83809282
5049 83809282 90663552 98427753 107134662 116490964 125785505 132585517 135206719 132677259
5041 132677259 125560437 116456579 107465254 99402645 92638624 87599004 83555666 80160684
5033 80160684 77616779 76010054 75149978 74543856 74840251 75017925 76204985 77992966 79623429
5024G9623429K588681L104672L255927M211262L915276L180188J470947l25142
5016A01025240k786672m613937n277666n242793n087369m570638l531314k337084
5008F7577767k641550k461485j585880j093777r56135j044476o49638q78637j010466
4999E5255723j302638j013498n42143q82434m21522j17081k6943J73830j39133
4990E0984161m58140o57471j007125l61471l72317n69145l04539j76250N44115
4981D7621818J39831J42521L90106M08375Q98062P88451P3105K41454J04825n36508
4971E0272040n39115l63289l51687J29370N6539m82690n25418m48151j7246n13359
4961D7216994m12713o4889r9492Q29033K11588N5026Q35734J380876Q17807N95480
$$ plain form
5024 79623429 82212110 85316782 88572709 92783971 96699247 99879435 101350382 101025240
5016 101025240 98238568 93624631 88346965 83104172 78016803 73446165 69914851 67577767
5008 67577767 64936217 62474732 60888852 59795075 58838940 57794464 57144826 56266189 55255723
4999 55255723 53953085 52939587 52397444 51515010 51093488 50976407 50949464 51123294 50984161
4990 50984161 50526021 49868550 48861425 48499954 48127637 47558492 47253953 47077703 47621818
4981 47621818 47761649 47904170 48294276 48702651 49600713 50389164 50462269 50703723 50808548 50272040
4971 50272040 49732925 49369636 49017949 49147319 49203858 48721168 48195750 47747599 47730353 47216994
4961 47216994 46804281 46739392 46639900 47468933 47680521 47735547 48571281 49952157 50769964 51365444
4951E1365444J023671J529695O81485R08637J343713J346703O56994M10536j70677
4942E9096201K14069L87514j8250j45590k52439k91907k78740k49176p29650o12123
4932E7119909J80318k7901n6408l7886l21810l95946M46162O85589N58465N11110
4922E8661602N22966J134225J146643O73007N37596l96232r37012p41120q20352
4913E9781323j041586o71269k76364j81419o45655J42608J45336Q939K6368K87918
4903E7576199O268K5842M23036R6935R04066R85398J527287J570511J876362J322571
4893F6314475L61799o55378m10991p71264o48341P3272O3495N59657M48050L58325
4883F5693099M15577J602022J232503J799866K007004K438575K502576K824026
$$ plain form
4951 51365444 52389115 53918810 54600295 55508932 56852645 58199348 58856342 59266878 59096201
4942 59096201 59310270 59697784 59679534 59533944 59281505 58989598 58710858 58461682 57732032 57119909
4932 57119909 57300227 57272326 57215918 57178032 56856222 56460276 56906438 57592027 58150492 58661602
4922 58661602 59184568 60318793 61465436 62138443 62676039 62279807 61342795 60601675 59781323
4913 59781323 58739737 58068468 57792104 57610685 56965030 57107638 57252974 57261913 57288281 57576199
4903 57576199 57582467 57608309 58031345 58128280 59032346 60017744 61545031 63115542 64991904 66314475
4893 66314475 66676274 66020896 65609905 64838641 64190300 64263572 64327067 64886724 65334774 65693099
4883 65693099 66108676 67710698 68943201 70743067 72750071 75188646 77691222 80515248
4875H0515248L662909L334206M552660M549479N511705N546512O213830O867235
4867A20753784O516292Q076824R340633J1305013J3292626J5545324J6513279
4860B01343775J6827232J6624683J5796412J1599906N020540j664474q568226
4853B56979848j5017431j9092645k0461393k1733615j9087189j6727610j4513238
4846A30346727j1509140r224506p312825o746654n740596n283867m544923l385919
4838G6598297m177938l375824l228576l149938l212944j991112j248563k193311
4830E4020091k332430j402566j420847j388579j263223j177146j222941j058532
4822D2753827j204893j162294q42179q33666r12457j326590j409856p56757o26616
$$ plain form
4875 80515248 84178157 87512363 92065023 96614502 102126207 107672719 113886549 120753784
4867 120753784 127270076 135346900 144687533 155992546 169285172 184830496 201343775
4860 201343775 218171007 234795690 250592102 262192008 267212548 265548074 256979848
4853 256979848 241962417 222869772 202408379 180674764 161587575 144859965 130346727
4846 130346727 118837587 109613081 102300256 95553602 89813006 84529139 79984216 76598297
4838 76598297 72420359 69044535 65815959 62666021 59453077 57461965 56213402 54020091
4830 54020091 51687661 50285095 48864248 47475669 46212446 45035300 43812359 42753827
4822 42753827 41548934 40386640 39544461 38710795 37798338 36471748 35061892 34305135 33678519
4813C3678519j105566o27992l03501r82862o81998n77718l52315k96323o77348
4804B8072896k28870L71707j28683n9197P0654q6926o50249m66402n56152K4714
4794B6363492l71425l77640J61036m27680k00743k29405N66031Q4231p3578l21974
4784B5172345L24153M74985j9959l56586N29929P32690J14634L30522j80220R820
4774B7132313n5979o15191o81110o40833l52763j06937r2418n90688K98868P6590
4764B4371852k98782L42200n3044M59344k26373k18046m39291k47129R9895j37018
4754B3653608j81964n6305L5097n69562l60997l46077l19101k81073Q41313K5636
4744B2440575n17688J64612L22829P22646R0500k50926N15312j26784K38322p2817
$$ plain form
4813 33678519 32572953 31944961 31641460 30658598 29976600 29398882 29046567 28750244 28072896
4804 28072896 27844026 28215733 28087050 28027853 28098507 28011581 27361332 26894930 26338778 26363492
4794 26363492 25992067 25614427 25775463 25347783 25147040 24917635 25483666 25567897 25494319 25172345
4784 25172345 25496498 25971483 25951524 25594938 26124867 26857557 26972191 27302713 27122493 27132313
4774 27132313 27076334 26461143 25780033 25139200 24786437 24679500 24587082 23996394 24295262 24371852
4764 24371852 24073070 24415270 24362226 24821570 24595197 24377151 23937860 23690731 23790626 23653608
4754 23653608 23471644 23415339 23450436 22880874 22519877 22173800 21854699 21573626 22414939 22440575
4744 22440575 21922887 22087499 22410328 23132974 23223474 22972548 23487860 23361076 23599398 23526581
4734B3526581j66866j86008p03173j77728o31926k09142Q8847j90530l63684j62277
4724B0824094J43520L45586k11987K43169k93898l30695P93393m68357k42379
4715B0802446k86098n70588n07379J44558m48166n65911m38786j96312m4132j83865
4705A7705767q43539k49783K5546p23723P1074n95193m93862o8357n13683n9995
4695A4254252j09618m53836K26394l67037n80021o4607J19203k98598o870m97353
4685A2221909j11412k70728j61833N42404q43066j78501K9681r1712m51199j04701
4675A0580842m38188m63609J04992N5519p2968J34702n20738m41588j23448k75485
4665H540031l77860j376j95161l27401K01281q5127p3221j17368o11483K84792
$$ plain form
4734 23526581 23359715 23173707 22470534 22292806 21660880 21451738 21540585 21350055 20986371 20824094
4724 20824094 20967614 21313200 21101213 21344382 21050484 20719789 21513182 21044825 20802446
4715 20802446 20516348 19945760 19438381 19582939 19134773 18568862 18130076 17933764 17889632 17705767
4705 17705767 16862228 16612445 16637991 15914268 15985342 15390149 14896287 14827930 14314247 14254252
4695 14254252 14144634 13690798 13917192 13550155 12970134 12905527 13024730 12726132 12719262 12221909
4685 12221909 12110497 11839769 11677936 12220340 11377274 11198773 11228454 11136742 10685543 10580842
4675 10580842 10142654 9679045 9784037 9839556 9766588 9901290 9380552 8938964 8815516 8540031
4665 8540031 8162171 8160795 7965634 7638233 7839514 7754387 7681166 7563798 6952315 7237107
4655G237107K14497o67896k43041M31784J8060l39730l19160j75876L74586K29372
4645F759703k10866k27485j39080O14l46836J65532J1220n07488m41800J69113
4635E232627M21603l73805J88749q1429J33841m1743O0374l69218L7500J44097
4625E352596o30549j65190O24263k48018j58737l07781M32984o490q9893R960
4615D813145J55676L73352j05999J25942o02506j79183n5341p8636K61883k2019
4605D686314j12629K14283O2812m56867Q01419J38186k80181K69102l58687k73254
4595D690498P3323R5555r6353k33049J39504O71377o50384k73513L60539n5980
4585D721517N42477J78361k33075q8357j3124M5784q9409J48896l18202m77713
$$ plain form
4655 7237107 7451604 6783708 6540667 6972451 6990511 6650781 6331621 6155745 6530331 6759703
4645 6759703 6548837 6321352 6182272 6182886 5836050 6001582 6012802 5505314 5063514 5232627
4635 5232627 5654230 5280425 5469174 5387745 5521586 5479843 5540217 5170999 5208499 5352596
4625 5352596 4722047 4556857 5181120 4933102 4774365 4466584 4899568 4893078 4803185 4813145
4615 4813145 4968821 5342173 5236174 5362116 4759610 4580427 4525086 4446450 4708333 4686314
4605 4686314 4573685 4787968 4850780 4393913 5195332 5333518 5053337 5322439 4963752 4690498
4595 4690498 4763821 4859376 4763023 4529974 4669478 5340855 4690471 4416958 4777497 4721517
4585 4721517 5263994 5442355 5209280 5120923 5107799 5153583 5064174 5213070 4894868 4417155
4575D417155L36281j36423m50089j77837J06473p50846O6243K44983O6648P29400
4565D451988J20168O0798n47705j25798K9236k15656q8337n57463m2653q4045
4555C000533p0192L28883K28098K87520M24708l91698N4184J28903J79257j74975
4545C995221J70503l39727l66099l38077j76107N42387J70619j82276j6202l25765
4535C134477J38690L37462k82245J3883j95572J48398J51066J99727O0068j29462
4525C576492j42718j69280P8884q3601o7145k6593O5318L23436r6746l3941q4179
4514C339927R6356j36541l26695L71542N35888l88788l86501L79796j23193l67098
4504B994693M63071M51232L46399l26426k70845Q5863k58747r6046J58168l21260
$$ plain form
4575 4417155 4753436 4617013 4166924 3989087 4095560 3344714 3410957 3655940 3722588 4451988
4565 4451988 4572156 4632954 4085249 3959451 3988687 3773031 3684694 3127231 3084578 3000533
4555 3000533 2930341 3259224 3487322 3774842 4199550 3807852 3862036 3990939 4170196 3995221
4545 3995221 4165724 3825997 3459898 3121821 2945714 3488101 3658720 3476444 3460242 3134477
4535 3134477 3273167 3610629 3328384 3342267 3146695 3295093 3446159 3645886 3705954 3576492
4525 3576492 3433774 3264494 3343378 3259777 3192632 3166039 3231357 3554793 3458047 3424106 3339927
4514 3339927 3436283 3299742 2973047 3344589 3880477 3491689 3105188 3484984 3361791 2994693
4504 2994693 3457764 3908996 4255395 3928969 3658124 3743987 3485240 3389194 3547362 3226102
4494C226102M57050l7118j84899K64001L52622j93162j33185M7089Q6964k50850
4484C634614J52174p1715l21333k94469N2311p7067j18257K12054K01633M7313
4474C417258K83757o49627K15913J1919j28961n54728M74036r8281N1709J14796
4464C137791m6021k48187J50999j91968P30648K57656K66634n4354k60007O21908
4454D365099j92289n7217N519M12394o70972j34436n92814K96917J1901O34626
4444D078728P82369m80604k37213L6604o27372K49108K3959J81422O242J56195
4434D169438J77790k13607m12051q9347j7298L2410j1426P1055j5945K25993q7171
4423C829841j07101K59060j7511j43791O0575k0190K16588m01020O26377n5981
$$ plain form
4494 3226102 3683152 3646034 3461135 3725136 4077758 3884596 3751411 3798500 3885464 3634614
4484 3634614 3786788 3715073 3393740 3099271 3151582 3074515 2956258 3168312 3369945 3417258
4474 3417258 3701015 3051388 3267301 3279220 3150259 2595531 3069567 2971286 3022995 3137791
4464 3137791 3091770 2843583 2994582 2802614 3533262 3790918 4057552 4003198 3743191 4365099
4454 4365099 4172810 4115593 4121112 4533506 3862534 3728098 3135284 3432201 3444102 4078728
4444 4078728 4861097 4380493 4143280 4179884 3552512 3801620 3825579 4007001 4013243 4169438
4434 4169438 4347228 4133621 3721570 3632223 3614925 3647335 3635909 3706964 3691019 3917012 3829841
4423 3829841 3722740 3981800 3964289 3820498 3881073 3860883 4077471 3676451 4302828 4246847
4413D246847n17731L66026l30808l00856L67106j24985k6206J42447J27825j90495
4403C759170l2083k01367O19335J14179J20299j10181r7551k2339k94459j7060
4393C837943R7595n6669j64670K87856j13045K43047J52077k87248j36702L47769
4383D207953l52850R5685j4305l36551K64015m8150K00319r3267j69713L30355
4373D083491k15304J15995k26381k32097L27035R971L16718n5113n00163L87560
4363D011712j78888o3692P04028l58375l46845J96372J37155o5588k80865L03081
4353D058095K89994J15036k92803k97634P8394k02543J43987m68691M99960N31595
4343D455390j70864j70000j60127k61554O6751K33350k7726r2516k18500N59159
$$ plain form
4413 4246847 3729116 4095142 3764334 3463478 3830584 3705599 3679393 3821840 3949665 3759170
4403 3759170 3727087 3525720 4145055 4259234 4379533 4269352 4171801 4149462 3855003 3837943
4393 3837943 3935538 3878869 3714199 4002055 3889010 4132057 4284134 3996886 3860184 4207953
4383 4207953 3855103 3950788 3936483 3599932 3863947 3815797 4016116 3922849 3753136 4083491
4373 4083491 3868187 3984182 3757801 3525704 3852739 3862710 4179428 4124315 3624152 4011712
4363 4011712 3832824 3769132 4473160 4114785 3767940 3964312 4101467 4035879 3755014 4058095
4353 4058095 4348089 4463125 4170322 3872688 3951082 3748539 3892526 3423835 3923795 4455390
4343 4455390 4284526 4114526 3954399 3692845 3759596 3992946 3965220 3872704 3654204 4213363
4333D213363o41003J28643R0647m01302M31778k3375l31606J38725N15007K74702
4323D395579m08834L43475o8408j51128L35548l64394O1570M68242k76995r3130
4313D241525k63137k60435K13192M32889r3178j610l18943J37617l19113K32883
4303D001690L08534l5970l226n1550K09720o6719N8627n9353o2543j9623J44581
4292D424168j81437J31262m02396k55806Q2035j13j8128R44331K06377l15968
4282D614325k89060k0981R0676j66597K56934k37360M6520K21289M7159R1807
4272D654712o62060k32491N04556K30867L16955k83207L68661j22572j58432K69110
4262D886099k87424r0013L4628P9994m40114L93297J01573J27215k61185m82329
$$ plain form
4333 4213363 3572360 3701003 3791650 3390348 3822126 3798751 3467145 3605870 4120877 4395579
4323 4395579 3986745 4330220 4261812 4110684 4446232 4081838 4143408 4611650 4334655 4241525
4313 4241525 3978388 3717953 3931145 4364034 4270856 4269246 3950303 4087920 3768807 4001690
4303 4001690 4310224 4274254 4271028 4219478 4429198 4362479 4421106 4361753 4299210 4279587 4424168
4292 4424168 4242731 4373993 3971597 3715791 3797826 3797713 3779585 4723916 4930293 4614325
4282 4614325 4325265 4304284 4394960 4228363 4485297 4247937 4294457 4515746 4562905 4654712
4272 4654712 3992652 3760161 4264717 4495584 4812539 4529332 4897993 4775421 4616989 4886099
4262 4886099 4598675 4508662 4543290 4623284 4183170 4576467 4678040 4805255 4544070 4061741
4252D061741K49853R7325l888J76979l34342K38454L16241j24690L09898j60695
4242D826876k84935K25403L40521M3665j43184j81418k33059l04917N68653k36020
4232D621585j36828N16761j81759n02457K25328N0135J49042o3027K24970m4221
4222D859529J17360l724O0307l230J7246j82573p286l78648k51089M05642J42372
4211D775906j32404L87014n4589L11410N31723o60918M15043r8031m63762K05221
4201E216613J31496J84662Q2313J03312O2119j26302k24878K16933l5548J92309
4191E803029j34959p8903L38800l46533L6445j21742n9788L2740K84142P7524
4181E830755p5630p5391K34243o45116K86776P85029K94273P2085o0350L9895
$$ plain form
4252 4061741 4311594 4408919 4405031 4582010 4247668 4486122 4802363 4677673 4987571 4826876
4242 4826876 4541941 4767344 5107865 5151530 5008346 4826928 4593869 4288952 4857605 4621585
4232 4621585 4484757 5001518 4819759 4317302 4542630 4592765 4741807 4678780 4903750 4859529
4222 4859529 4976889 4973165 5033472 5030242 5047488 4864915 4857629 4478981 4227892 4633534 4775906
4211 4775906 4643502 5030516 4975927 5287337 5819060 5158142 5573185 5475154 5011392 5216613
4201 5216613 5348109 5532771 5615084 5718396 5780515 5654213 5429335 5646268 5610720 5803029
4191 5803029 5668070 5589167 5927967 5581434 5617879 5496137 5436349 5469089 5753231 5830755
4181 5830755 5755125 5679734 5913977 5268861 5555637 6340666 6634939 6707024 6646674 6686569
4171F686569Q02770L90904L58681J32941j70964j05454n29333j27644k15859l98051
4161F824560r3232k79771m41430L32880K94332m53037j1509m4874J50250k24352
4151F053817L2232P3174L78307m72589N50323K10978j93312o0887n0645l94830
4141F126568K87438j70575J91115K40577L0915J0201j52199J25225j67680R3777
4131F615362O33898J74152o11370K98635K08121K14417k11112l98710j4556K70802
4121G179639o9365O12517k17897l62431M87552N17376K06349J77429O0377J27268
4111H718814R1195K03237Q1431l06792l70665K65723J19107k9062n44406k26036
4101H002546m6651N47260j73205l15937r2511k12956L53096q9820n79803M27244
$$ plain form
4171 6686569 7489339 7880243 8238924 8371865 8200901 8095447 7566114 7438470 7222611 6824560
4161 6824560 6731328 6451557 6010127 6343007 6637339 6184302 6172793 6127919 6278169 6053817
4151 6053817 6086049 6159223 6537530 6064941 6615264 6826242 6632930 6572043 6521398 6126568
4141 6126568 6414006 6243431 6434546 6675123 6706038 6716239 6564040 6689265 6521585 6615362
4131 6615362 7249260 7423412 6812042 7110677 7318798 7533215 7322103 6923393 6908837 7179639
4121 7179639 7110274 7722791 7504894 7142463 7630015 8147391 8353740 8531169 8591546 8718814
4111 8718814 8810009 9013246 9094677 8787885 8417220 8682943 8802050 8772988 8228582 8002546
4101 8002546 7955895 8503155 8329950 8014013 7921502 7708546 8061642 7971822 7392019 7819263
4091G819263K61990k56179N26566n3810j51197k8684M14353J11651m8176M98730
4081I094507j78329r6358l43685j5735J03012p5344N25998j20953n97358J69710
4071H465465M27947K25668j20592J43797L27309J66929k62342L91934J67687l48023
4061I585779M82367K66173J15458r282k566O60476L12341j57683k64793J49666
4051A1137936M81135K92565p9280O08748l918L78230J08364k21261J44659M15629
4041A3262807R8097j09035M4629K38585M6369m6987L11883M73462L79060k79684
4031A4419186j51685L41413L30221j10437J00554N20722k5438N10614N37370p5730
4021A6396790J96651L9266j5620Q09273L1577L7367L34081L57540L06694J28540
$$ plain form
4091 7819263 8081253 7825074 8351640 8297830 8146633 8117949 8532302 8643953 8595777 9094507
4081 9094507 8916178 8819820 8476135 8460400 8563412 8488068 9014066 8893113 8295755 8465465
4071 8465465 8893412 9119080 8998488 9142285 9469594 9636523 9374181 9766115 9933802 9585779
4061 9585779 10068146 10334319 10449777 10440495 10437929 11098405 11410746 11253063 10988270 11137936
4051 11137936 11619071 11911636 11832356 12441104 12437186 12815416 12923780 12702519 12847178 13262807
4041 13262807 13360904 13251869 13296498 13535083 13581452 13534465 13846348 14319810 14698870 14419186
4031 14419186 14267501 14608914 14939135 14828698 14929252 15449974 15424536 15935150 16472520 16396790
4021 16396790 16593441 16632707 16617087 17426360 17457937 17495304 17829385 18186925 18493619 18622159
4011A8622159L69460j02761J91933M06548m94711K05000J161844M24708P2635
4002B0856815M42182J87571l26789J30386j46596J98599n31104j37014P6185R0504
3992B0840739J04745N29228L36086M84149M16517j31851J84064O07904M79260
3983B3850841O53826M3640M50266J78053J41560N57205N20688L76974R4639M48131
3973B7315823K11157K3058J046567O44617P66423M61695M12541N54681Q07378
3964C2243940K84757O68845M74994N93283O26037P57514P81599L07826M56994
3955C7195789R90821R01215P52723O21126O99861Q67701O66044J359109J452933
3946D5507322P49180P46114J400487J585533J352128J098888J663850J813697
$$ plain form
4011 18622159 18991619 18888858 19080791 19487339 18992628 19197628 20359472 20784180 20856815
4002 20856815 21298997 21486568 21159779 21290165 21143569 21342168 20811064 20674050 20750235 20840739
3992 20840739 20945484 21474712 21810798 22294947 22711464 22579613 22763677 23371581 23850841
3983 23850841 24504667 24548307 24998573 25176626 25318186 25875391 26396079 26773053 26867692 27315823
3973 27315823 27526980 27550038 28596605 29241222 30007645 30469340 30881881 31436562 32243940
3964 32243940 32528697 33197542 33672536 34265819 34891856 35649370 36430969 36738795 37195789
3955 37195789 38186610 39087825 39840548 40461674 41161535 42029236 42695280 44054389 45507322
3946 45507322 46256502 47002616 48403103 49988636 51340764 52439652 54103502 55917199
3938E5917199J501777K389449J936829J777201K504314J852035K661619K903012
3930G3443435L599962L738754L821457M412815M906777N407430O406567P220224
3922A12957421Q630692R913287J1019934J2397610J5481660J7722860K0585775
3915B08709239K3713453K9099063L5136866M4043366N4398500N9605974M2413540
3908D97120001J936440l9401718o0715270n9143936m8264045l3143273k1621138
3901B36767061j3948656q150457m640570k515021j941016n754764j0080372j2266110
3893A77470095j2563733j1616002q643112p031554n124956l733105l368871k266313
3885A23122449j565257n35549R1230J367590J786240K933978L399268M246933
$$ plain form
3938 55917199 57418976 59808425 61745254 63522455 66026769 67878804 70540423 73443435
3930 73443435 77043397 80782151 84603608 89016423 93923200 99330630 105737197 112957421
3922 112957421 121588113 131501400 142521334 154918944 170400604 188123464 208709239
3915 208709239 232422692 261521755 296658621 340701987 395100487 454706461 497120001
3908 497120001 499056441 459654723 398939453 339795517 291531472 258388199 236767061
3901 236767061 222818405 214667948 210027378 207512357 205571341 199816577 189736205 177470095
3893 177470095 164906362 153290360 144647248 137615694 132490738 128757633 125388762 123122449
3885 123122449 121557192 121021643 121112873 122480463 124266703 127200681 130599949 134846882
3877A34846882O374592O792467Q141127R039511Q655372O736073L594684q422
3869A84172286m375445n822223n229290n257889l646890k082161n86259J020175
3861A58192304K848971M758180O569773Q969209J0965144J3332221J6171538J9945733
3853B41753073K3611295K9183931L4770739L8599435L6691628L1281451K1013055
3846D56904607L14741k1252465l3550773m1409329m3341053l8786070l1984193
3839B46895465k5335606j8711210j4371989j0854115r109434q264904p240477
3832A53007730o536102n711623m850520m114555k893172j044476k87840m80929
3824A27088513m98746j918147k897415m173124n231623n320725n122341l654845
$$ plain form
3877 134846882 141221474 148013941 156155068 165194579 173849951 180586024 184180708 184172286
3869 184172286 179796841 173974618 168745328 163487439 159840549 157758388 157172129 158192304
3861 158192304 161041275 165799455 172369228 181338437 192303581 205635802 221807340 241753073
3853 241753073 265364368 294548299 329319038 367918473 404610101 435891552 456904607
3846 456904607 457219348 435966883 402416110 361006781 317665728 278879658 246895465
3839 246895465 221559859 202848649 188476660 177622545 168513111 160248207 153007730
3832 153007730 146471628 140760005 135909485 131794930 128901758 127857282 127569442 127088513
3824 127088513 126589767 124671620 121774205 117601081 112369458 107048733 101926392 98271547
3816I8271547l265013l495932l245333k517969k409029j727057j734354j419893
3808G8456967j576846p36144j119369j464325j108357q78127j035852p45782k30455
3799F9561710N70329K25245P47343J463195J894902J157425K310217K947117L039581
3790H3917064L835444M299000M519580L983682K649272J316220q80953l348537
3782A00290772m073745m203179l069558k503861j984497m47497n84008o09622
3774H2814805l08043p2202M06998o50820k97460m27933k4940M8398P86501J020560
3764H3295864P00363J531232J815352K429652K223137K545336K598488J661972
3756I8801396J663247N9865q6176r73828j927553j918169j695681k072034k584027
$$ plain form
3816 98271547 95006534 91510602 88265269 85747300 83338271 81611214 79876860 78456967
3808 78456967 76880121 76143977 75024608 73560283 72451926 71573799 70537947 69792165 69561710
3799 69561710 70132039 70357284 71104627 72567822 74462724 75620149 77930366 80877483 83917064
3790 83917064 87752508 92051508 96571088 100554770 103204042 104520262 103639309 100290772
3782 100290772 96217027 92013848 88944290 86440429 84455932 84008435 83424427 82814805
3774 82814805 82506762 82434560 82841558 82190738 81893278 81465345 81440405 81488803 82275304 83295864
3764 83295864 83996227 85527459 87342811 89772463 91995600 94540936 97139424 98801396
3756 98801396 100464643 100524508 100438332 99464504 97536951 95618782 93923101 91851067 89267040
3747H9267040k853120k067286j941407k145170j937393k332304j841758p91648
3739G3356954n7050J40286P31497N96714J330020L32817j81673k81649j409983
3730G4557933j116820o55678l28075j351324j078539p56120j083426l01133j20122
3721F7766696P71726J809218K387034L200554M542107N034287K882415j484221
3713H6909816l347321n278674n735889m990023m314646l776831k670432j989167
3705E4806833j267813j149121o12276q54074l75538J65372J44833L72819l06182
3696E0924853K15833R41704J300862J565291K253091K315502L090418L252800
3688F5860354L134657L587388L484705M025145O051808Q171276R612888R942603
$$ plain form
3747 89267040 86413920 84346634 82405227 80260057 78322664 75990360 74148602 73356954
3739 73356954 73299904 73440190 74171687 74768401 76098421 76431238 76249565 75967916 74557933
3730 74557933 73441113 72785435 72457360 71106036 70027497 69271377 68187951 67886818 67766696
3721 67766696 68538422 70347640 72734674 75935228 80477335 85511622 88394037 86909816
3713 86909816 83562495 78283821 72547932 67557909 63243263 59466432 56796000 54806833
3705 54806833 53539020 52389899 51777623 50923549 50548011 50713383 50858216 51231035 50924853
3696 50924853 51140686 52082390 53383252 54948543 57201634 59517136 62607554 65860354
3688 65860354 68995011 72582399 76067104 80092249 86144057 94315333 103928221 113870824
3680A13870824K338456p775529j0677276j1064019r004599o089821n699830m362708
3672F1535498l753968l622260k307152k648622k019188j280702j048246j122851
3664D3732509o65499n15604o87945l92162l29794k29401N4184k87579P13093P24578
3654D2116380K0261P27964Q17802Q20570P45753N82778P52013J22356k5291l70957
3644D6309629n05189q45197j571329r54166q53370J11413k6679M95246L68242
3635D2528600Q85724M65563O30944J116430J692493J683413J485629K278093K555595
3626E5322484K780301K529092L166054J249520J294181P42627P39159o10940o10673
3617F6601805j263350j666767j279784j320487o14183p69028k47691J423481P48471
$$ plain form
3680 113870824 116209280 108433751 97756475 86692456 77687857 71598036 65898206 61535498
3672 61535498 57781530 54159270 51852118 49203496 47184308 45903606 44855360 43732509
3664 43732509 43067010 42551406 41863461 41471299 41141505 40912104 40966288 40678709 41391802 42116380
3654 42116380 42136641 42864605 43682407 44502977 45248730 45831508 46583521 46705877 46680586 46309629
3644 46309629 45804440 44959243 43387914 42433748 41580378 41691791 41665112 42160358 42528600
3635 42528600 43414324 43879887 44510831 45627261 47319754 49003167 50488796 52766889 55322484
3626 55322484 58102785 60631877 63797931 65047451 66341632 67084259 67823418 67212478 66601805
3617 66601805 65338455 63671688 62391904 61071417 60457234 59688206 59440515 60863996 61612467
3608F1612467J048359J685697J040883J136118J540772J629559J636360K009484
3600G3339699K436277L276869L104324L234828J955726J295814N35587j02956
3592H9076168M51648j41303l58172l39146p6886o90264m01042q3580j27553m77789
3582H6832081k87041L33760o26160j467981j463932j469564p74297J89025P15111
3573H1981002J440543J799579J741987J829609K500481K480648K063446K497647
3565I8334942L145472K650858K604769M96544j095361k134747l175282l831927
3557I6995268l958382m226078m217933l766701l295074l773371l357426l507792
3549F6892511k959357k185900k114921j722058p09137r48484l78289K15035j58979
$$ plain form
3608 61612467 62660826 64346523 65387406 66523524 68064296 69693855 71330215 73339699
3600 73339699 75775976 79052845 82157169 85391997 87347723 88643537 89179124 89076168
3592 89076168 89527816 89386513 89028341 88689195 88612309 87922045 87521003 87437423 87309870 86832081
3582 86832081 86545040 86878800 86252640 84784659 83320727 81851163 81076866 81265891 81981002
3573 81981002 83421545 85221124 86963111 88792720 91293201 93773849 95837295 98334942
3565 98334942 101480414 104131272 106736041 107232585 106137224 104002477 100827195 96995268
3557 96995268 93036886 88810808 84592875 80826174 77531100 73757729 70400303 66892511
3549 66892511 63933154 61747254 59632333 57910275 57201138 56252654 55874365 56089400 55930421
3540E5930421L04137j46670Q9414o7317r22496q47160j055231j586768j578803
3531E0119527j644079j007168j202666j454253j644661j394505q82232j794660
3523C9095303n36208m67040m80274m37952l48892l76871j34468K69371m02080
3514C6180889k76457k29582j10441m13620m4052o49325l32159J10540m09359R0690
3504C3917124k31304K03507l3269N11475O25893N58517P23384Q43073L28913J130381
3494C8577694J027811L91701Q03277J394255Q06863J896679J686643N8234J467246
3485D8110403Q65159P12880N95014J489697N93585J312209N17917k77099J38643
3476E4058408R0158J14201l64984r4942K0768L41294P07866O48010R63793J422159
$$ plain form
3540 55930421 56234558 56087888 56177302 56109985 55187489 54340329 53285098 51698330 50119527
3531 50119527 48475448 47468280 46265614 44811361 43166700 41772195 40889963 39095303
3523 39095303 38559095 38092055 37611781 37173829 36824937 36448066 36313598 36582969 36180889
3514 36180889 35904432 35674850 35564409 35150789 35106737 34457412 34125253 34235793 33826434 33917124
3504 33917124 33685820 33889327 33856058 34367533 34993426 35551943 36275327 37118400 37447313 38577694
3494 38577694 39605505 39997206 40800483 42194738 43001601 44898280 46584923 46643157 48110403
3485 48110403 48975562 49688442 50283456 51773153 52366738 53678947 54196864 53919765 54058408
3476 54058408 54148566 54262767 53897783 53802841 53823609 54164903 54872769 55520779 56484572 57906731
3466E7906731K214106K433485K291304K642988L146423K636493K756399K638956
3458G8666885K014409K344649K819369K367375J445519P63842k13936j132192
3450H9075920p47806j522363r63646n49398n67358J54371k44066j29682P0063
3441H4576035M60262R09652J398804J503348K227281J798954K400011K164698
3433I7439045J461300J226242J411690K383762J423144J802728J366564J511631
3425A10026106J385465R20643Q06472Q47481P84360Q25580L73778m63358o00947
3416A14905580j301608j516541j239449j346177j554272o22410r19397j161372
3408A05244354L0528Q4925n90764O59803R38839M94322J058263J639080J789129
$$ plain form
3466 57906731 60120837 62554322 64845626 67488614 70635037 73271530 76027929 78666885
3458 78666885 80681294 83025943 85845312 88212687 89658206 90422048 90208112 89075920
3450 89075920 88328114 86805751 85842105 85292707 84725349 84879720 84635654 84505972 84576035
3441 84576035 85036297 85945949 87344753 88848101 91075382 92874336 95274347 97439045
3433 97439045 98900345 100126587 101538277 103922039 105345183 107147911 108514475 110026106
3425 110026106 111411571 112332214 113138686 113986167 114770527 115596107 115969885 115506527 114905580
3416 114905580 113603972 112087431 110847982 109501805 107947533 107325123 106405726 105244354
3408 105244354 105274882 105359807 104769043 105428846 106367685 106862007 107920270 109559350 111348479
3399A11348479J519021R62653N12670J67944j66831J90836L20948p26075j013381
3390A13116264j852028k979521k474759l609432k710061j915581k004702j361957
3382I4208223j048636r63428r69309k10322k98724k0922l64811l90542l85943
3373H9555586r9506m3560q4076O6149n12757n04432l87124k93519n66832j553652
3363H5576277q43965p18012j098974j301535q46107l62752m15305l54244o59558
3354G8975825l51408k49668o58084r21976j050244r01835j398249j092907q66357
3345G1485097j2203m59950q17304o31618r41614j229412o44218p07866j220184
3336F4820728p30241n82036p07549p45544q91384j190100o10353n24307q47693
$$ plain form
3399 111348479 112867500 113830153 114342823 114510767 114343936 114534772 114855720 114129645 113116264
3390 113116264 111264236 108284715 105809956 102200524 99490463 97574882 95570180 94208223
3382 94208223 93159587 92196159 91226850 91016528 90717804 90696882 90332071 89941529 89555586
3373 89555586 89456080 89412520 89328444 89394593 88881836 88377404 87990280 87696761 87129929 85576277
3363 85576277 84732312 84014300 82915326 81613791 80767684 80404932 79989627 79635383 78975825
3354 78975825 78624417 78374749 77716665 76794689 75744445 74842610 73444361 72351454 71485097
3345 71485097 71472894 71012944 70195640 69564022 68622408 67392996 66748778 66040912 64820728
3336 64820728 64090487 63508451 62800902 62055358 61163974 59973874 59363521 58839214 57991521
3327E7991521q24022o31630l59711l00051p71293m50464n70845p87599n15868
3318E2780038l37608r39635p43358n23856j210805j159245m24738r32326l63739
3309D6144728n97636n05906o53745m89791q91519o60938l44298k09440m34120
3300D1357335k74518K29556j085142k71118j62903n50607o61888n88769m34605
3291C7557341o06429p87757p30295n88087L9019o50612p20764n0648J94669k09592
3281C3446845m72480j83439j74631r7355L8520L44043k09975P8818j44933j42009
3271C2483404l67379m11368k66169K2030m12460J61885M75740o58369J342j02378
3261C0926278J85701L10845k79085k26056l08298k88078O4153J14145M73126J51572
$$ plain form
3327 57991521 57167499 56535869 56176158 55876107 55104814 54654350 54083505 53295906 52780038
3318 52780038 52442430 51502795 50759437 50235581 49024776 47865531 47440793 46508467 46144728
3309 46144728 45547092 45041186 44387441 43897650 43006131 42345193 42000895 41791455 41357335
3300 41357335 41082817 41312373 40227231 39956113 39793210 39242603 38580715 37991946 37557341
3291 37557341 36950912 36163155 35432860 34844773 34883792 34233180 33512416 33461768 33656437 33446845
3281 33446845 32974365 32790926 32616295 32518940 32557460 32901503 32691528 32770346 32625413 32483404
3271 32483404 32116025 31704657 31438488 31460518 31048058 31209943 31685683 31027314 31028656 30926278
3261 30926278 31111979 31422824 31143739 30917683 30609385 30321307 30385460 30499605 30972731 31124303
3251C1124303m036M07664K72420q5328M13172R7042k06087M53261l0934j52791
3241C2288686K903j01224K52816l19577M97550K55567l9710L2055J81405M4965
3231C3095436Q65971K84562J3035k76757J85724J115495J57686N78426L67326
3222C6386904Q43348P28304m0596N15531K83348l0015J81466J07181p7064k8715
3212C8869692j80212m4025N86369M32204M61421j07831M77487N80433P79011N02179
3202D2356728M45520P45815Q35707N86185K76432K99088M21821P6616J78602l57396
3192D5865118p4416K71529j44939M91375J90732m25231o5368o7906K1188k01779
3182D5860303k7644k80573k52631M13555L12029R2232j68032q0326j0114O6944
$$ plain form
3251 31124303 31120267 31527931 31800351 31715023 32128195 32225237 32019150 32472411 32441477 32288686
3241 32288686 32291589 32190365 32443181 32123604 32621154 32876721 32837011 32869066 33050471 33095436
3231 33095436 33961407 34245969 34259004 33982247 34167971 35283466 35441152 36019578 36386904
3222 36386904 37230252 37958556 37917960 38433491 38716839 38686824 38868290 38975471 38898407 38869692
3212 38869692 38689480 38645455 39231824 39664028 40125449 40017618 40495105 41075538 41854549 42356728
3202 42356728 42802248 43548063 44383770 44969955 45246387 45545475 45967296 46043912 46222514 45865118
3192 45865118 45790702 46062231 45917292 46408667 46599399 46174168 46108800 46040894 46062082 45860303
3182 45860303 45832659 45552086 45299455 45713010 46025039 46117271 45949239 45868913 45858799 45925743
3172D5925743m99218j17307j20504k67948k45140k93678q24125o7571K11465j14943
3162D3586774R3161L68060j74074J71421K23714m05280l05523n54700R749m43582
3152D2569720n22196k31204j67789m44449k88105j2252m02042o11367m13817l80679
3142C9095820k33306o07864p60594j55494K52098j00734l67301M7643R1748p26718
3132C6535298l5225J4909l73970m58545k84836l62719j7226n48645L1728q7479
3122C4413290k93563l9176m19303j78506k10100n98973k5793r5969j52400Q3582
3112C2483089n77987j29167P0235K24334J38142N9459q2255o31357m7165k41931
3102C1265397l64686j0905k05626K6629J00341J21929l75203O24837L9012O97814
$$ plain form
3172 45925743 45426525 45309218 45188714 44920766 44675626 44381948 43557823 43490252 43701717 43586774
3162 43586774 43679935 44047995 43873921 44045342 44269056 43863776 43558253 43003553 43013302 42569720
3152 42569720 42047524 41816320 41648531 41204082 40915977 40903725 40501683 39890316 39476499 39095820
3142 39095820 38862514 38254650 37494056 37338562 37590660 37489926 37122625 37170268 37262016 36535298
3132 36535298 36500073 36514982 36141012 35682467 35397631 35034912 35017686 34469041 34500769 34413290
3122 34413290 34119727 34080551 33661248 33482742 33272642 32673669 32647876 32551907 32399507 32483089
3112 32483089 31905102 31775935 31846170 32070504 32208646 32268105 32185850 31554493 31507328 31265397
3102 31265397 30900711 30889806 30684180 30710809 30811150 30933079 30557876 31182713 31221725 31919539
3092C1919539K89472N52085J12734M53020M06796M25047L93966K49369O40387
3083C5442415P30390Q02601Q89946O1788p83779j518247r53684r27110j069269
3074C2675051K2562m61825l18043J65402m60428j81949N92731l4171M86948L43804
3064C2830082Q30690O58611J160480K137886J484015J885406K658962L177694
3056D6823826L383406M231976N473331O118442N808700L372146L736235M632057
3048H3580119O380972R307281J2282371Q021336o252032j3599812j4196780j2385336
3040G3138119q832676n747668l503851k146528k044841j390250p60570J20428
3032D8832163N75801J353585J801412K458954L068610M203682M776698N497295
$$ plain form
3092 31919539 32209011 32761096 32873830 33326850 33733646 34158693 34552659 34802028 35442415
3083 35442415 36172805 36975406 37865352 37927140 37143361 35625114 34671430 33744320 32675051
3074 32675051 32697613 32235788 31917745 32083147 31622719 31440770 32033501 31999330 32486278 32830082
3064 32830082 33660772 34319383 35479863 37617749 39101764 40987170 43646132 46823826
3056 46823826 50207232 54439208 59912539 66030981 71839681 75211827 78948062 83580119
3048 83580119 89961091 99268372 111550743 119572079 113320047 99720235 85523455 73138119
3040 73138119 64305443 58557775 55053924 52907396 50862555 49472305 48711735 48832163
3032 48832163 49407964 50761549 52562961 55021915 58090525 62294207 67070905 72568200
3024G2568200P675869R128723R917959J0943717O960734o895929j4614735j5192689
3016H0491849j3450240r672659o795615m469399l335787k790945j917897k112053
3008C5947254k508604j884185j204533j207649j043267r86555q31721p67970q37046
2999B4675724n97596M06505K12607q14577j071598l81283r93732m37957q49999
2990B0148094q06902n72680n46520k78707L36174J420m25046o0469l56600k46524
2980A7192240k75788m68440n04196m96511n17689n77618m1908k4317n90671j31480
2970A3563622k4608N52901l29843p50924p4804P0824L75276m03724p84274M37827
2960A2632273L06336n58871q2388o56834L14367J84628j85794o26975n10396M45347
$$ plain form
3024 72568200 80244069 89372792 99290751 110234468 117195202 110299273 95684538 80491849
3016 80491849 67041609 57368950 50573335 46103936 42768149 39977204 38059307 35947254
3008 35947254 33438650 31554465 30349932 29142283 28099016 27112461 26280740 25512770 24675724
2999 24675724 24078128 24484633 24697240 23882663 22811065 22429782 21436050 20998093 20148094
2990 20148094 19341192 18768512 18221992 17943285 18279459 18280879 17855833 17795364 17438764 17192240
2980 17192240 16916452 16448012 15943816 15447305 14929616 14351998 14310090 14285773 13695102 13563622
2970 13563622 13539014 14091915 13762072 13011148 12936344 13007168 13382444 12978720 12194446 12632273
2960 12632273 12938609 12379738 12297350 11640516 11954883 12139511 11953717 11326742 10816346 11261693
2950A1261693J99996o46899p1668n40053K33345m65192k94310L30663j86408P7204
2940I898371j53983J08652J05654P3293k06475L00203l41782r7139k06420J40405
2930I620779L8100k3272L1080n08519n53253N65425j53243N75955o4127r03m63073
2919I064949J04327l40916Q4510m3235M81848J38398J03467j38610l80880q5409
2909H988449l69828L26373j50024k80856k1176m1740M70194O35916K16751P7892
2899I851951K72318l62199o22910K76483j60397o39179m36490N2916r6133l42288
2889G794072k47088J92752j69673k14751l8459j52240k62521j80271m9702j46373
2879F525746n63820J37775l22101J84113J08397J1854m35197l33523M78680R8214
$$ plain form
2950 11261693 11461689 10814790 10743122 10203069 10436414 9971222 9676912 10007575 9821167 9898371
2940 9898371 9744388 9853040 9958694 10031987 9825512 10125715 9783933 9686794 9480374 9620779
2930 9620779 9658879 9635607 9666687 9158168 8604915 9170340 9017097 9593052 9528925 9528022 9064949
2919 9064949 9169276 8828360 8912870 8869635 9351483 9489881 9593348 9454738 9073858 8988449
2909 8988449 8618621 8944994 8794970 8514114 8492938 8451198 8921392 9557308 9774059 9851951
2899 9851951 10124269 9762070 9139160 9415643 9255246 8616067 8179577 8232493 8136360 7794072
2889 7794072 7546984 7739736 7570063 7355312 7316853 7164613 6902092 6721821 6672119 6525746
2879 6525746 5961926 6099701 5777600 5961713 6070110 6081964 5646767 5313244 5791924 5890138
2869E890138m93844k9744R3958J06690k51004j82836r8986k56125J74260K94250
2859E246757m22485j08857K8049r959j66519l13964n20814K78742J22873j5341
2849D118482L78516j77230j6161L7035K02018k22015K9695o49735L2205N6176
2839C788986K77522j33143p22006Q1397K2882J33322M94817k38917m08551P5760
2829C372069p0847J42582J45641J9748k60979j99669L74568k95581j4490O0791
2819C273833q2479L13010l79580l97450L35219O8807j18852J19155p4689k127
2809C054847L03754K0694P4602j42803k02784j06430j21612K28140l26412J82468
2799B964464j28677k52151Q1528L64567m14932K14293O6538L22116l93374L60840
$$ plain form
2869 5890138 5396294 5366550 5460508 5567198 5316194 5133358 5034372 4778247 4952507 5246757
2859 5246757 4824272 4715415 4743464 4733505 4566986 4253022 3732208 4010950 4133823 4118482
2849 4118482 4496998 4319768 4303607 4340642 4542660 4320645 4350340 3700605 3732810 3788986
2839 3788986 4066508 3933365 3211359 3292756 3315638 3448960 3943777 3704860 3296309 3372069
2829 3372069 3301222 3443804 3589445 3609193 3348214 3148545 3523113 3227532 3213042 3273833
2819 3273833 3191354 3504364 3124784 2727334 3062553 3131360 3012508 3131663 3056974 3054847
2809 3054847 3358601 3379295 3453897 3311094 3108310 3001880 2880268 3108408 2781996 2964464
2799 2964464 2835787 2583636 2665164 3029731 2614799 2829092 2895630 3217746 2824372 3185212
2789C185212J7305m15372Q2777J60023K61897k55140Q3186O0244l64535J55680
2779B971277n06044J27995l54614K66725L01714k82766J83745n02321N14338J25718
2769B845767K06338n27669o953J18546k29572J25836P67073l84126k5486k12421
2759B677333j77180k20884L80777K79810q22988j47540O58140N3152j98870l472
2749B478278m9459N2176j9949o86787k05758M03008J54822M9598k23319j05895
2739A846715K89868k56318l39756k07996J20603J4286P91676J52959l47547J29478
2729B193968Q7072k13788J30917j12070l44000Q4027k37535k10894N99877N25608
2719B503182m28358o3108n21061j02075O57892K38397o79784q918l6101m86397
$$ plain form
2789 3185212 3202517 2787145 2869922 3029945 3291842 3036702 3119888 3180132 2815597 2971277
2779 2971277 2465233 2593228 2238614 2505339 2807053 2524287 2708032 2205711 2720049 2845767
2769 2845767 3052105 2524436 2517483 2636029 2406457 2532293 3299366 2915240 2889754 2677333
2759 2677333 2500153 2279269 2660046 2939856 2116868 1969328 2627468 2680620 2481750 2478278
2749 2478278 2428819 2480995 2461046 1774259 1568501 1971509 2126331 2175929 1952610 1846715
2739 1846715 2136583 1880265 1540509 1332513 1453116 1467402 2259078 2412037 2064490 2193968
2729 2193968 2281040 2067252 2198169 2086099 1742099 1826126 1588591 1377697 1977574 2503182
2719 2503182 2074824 2011716 1490655 1388580 2046472 2284869 1605085 1596167 1560066 1073669
2709A073669M04028J48760j59921L48063q5538j77853l22441L01852l54917J30182
2699A305884N18097j27505j21917p7200k06693M1479k57542P08577j55771m1609
2689A585800j66463j09330K26267k56223l06978J77090O4765l2225K28836l52842
2679A058697q9324m33345M78089J55181K26940n62756P4715M34613k20898l19522
2669H02390N8075N35945p8159m90344L50285J89647J11977j92392J5313J75428
2659A478165J82561l99618p3742p2672l33858R2299k2530k40782M9715L5426K33434
2648I28398K44514L89836L01584j230163j81033J00304j96856O80869l7510o34707
2638C65236Q0851L39429J63539M0799N690o59567M11129J9810j4411j89295l62024
$$ plain form
2709 1073669 1477697 1626457 1466536 1814599 1729061 1551208 1228767 1530619 1175702 1305884
2699 1305884 1823981 1696476 1574559 1497359 1290666 1332145 1074603 1783180 1627409 1585800
2689 1585800 1419337 1310007 1536274 1280051 973073 1150163 1214928 1182703 1411539 1058697
2679 1058697 969373 536028 1014117 1169298 1396238 833482 908197 1342810 1121912 802390
2669 802390 860465 1396410 1318251 827907 1178192 1367839 1479816 1287424 1302737 1478165
2659 1478165 1660726 1261108 1187366 1114694 780836 873135 850605 609823 659538 694964 928398
2648 928398 1172912 1562748 1864332 634169 453136 553440 356584 1037453 999943 365236
2638 365236 446087 785516 949055 989854 995544 335977 747106 766916 752505 563210 201186
2627B01186O17160K62323J81739j90271j91186k7931o16426K42162l3650K51959
2617F97065L9713m41034J84260L5297j04371j94457J89462K36943K42662m50896
2607D34644L04050J35983l41816M29138K4370k10422l18299n6257M11842l08151
2597E05082q9226j39234j23232O91387l54669j87113O6299J2310K41729p2590
2587E50743j03245k26134L7100j96407P85199K90517o64616Q8675m07140j15589
2577C9103j27600j73967k31267O75865j85944J19666J49707j535l29850R3904
2567B8082j00808R0357L08142M332p6916j68949M70851j52890L29020j08810K7509
2556F49920J16287P3685n58400J91329k97725L36660r6866K56225K90896j13045
$$ plain form
2627 201186 818346 1080669 1262408 1072137 880951 853020 236594 478756 445106 697065
2617 697065 736778 295744 480004 515301 410930 216473 405935 642878 885540 434644
2607 434644 738694 874677 532861 961999 986369 775947 457648 401391 813233 505082
2597 505082 415856 276622 153390 844777 490108 302995 369294 381604 623333 550743
2587 550743 447498 221364 258464 62057 847256 1137773 473157 561832 154692 39103
2577 39103 -88497 -262464 -493731 182134 -3810 115856 265563 264028 -65822 28082
2567 28082 -72726 17631 325773 330105 253189 84240 555091 402201 731221 622411 649920
2556 649920 766207 839892 281492 472821 175096 511756 414890 671115 962011 848966
2546H48966p72436n37997L11554M05866N13878p90361k0226K77800J60040J04592
2536E01676o7122o72724Q437M33320o7899r3524o3036L76270K54404j04906j31297
2525C73599k04935m0841K9548k62857J17145M22756k39763j23894p1765l79425
2515c80432J80055N71636J10124M6488j51964J67067K3454j22768k08291j35679
2505I9690M0138K1037J95207n2230j16278m31604r6097N24107k45012K79752K89722
2494E08432l38403K27565J87046j55843l22449K53712N0979k28756l8309M38620
2484E82594P3123J17732m99257k25757j79227l2928K01322j63191m2304J35115
2474c2778N0637m8105K77580N07512n64401n83096J37031q7906J12610J29226
$$ plain form
2546 848966 76530 -461467 -149913 255953 769831 -20530 -40756 237044 397084 501676
2536 501676 434554 -238170 -229733 203587 135688 42164 -20872 355398 609802 504896 373599
2525 373599 168664 127823 157371 -105486 11659 434415 194652 70758 -1007 -380432
2515 -380432 -200377 371259 481383 527871 375907 542974 566428 443660 235369 99690
2505 99690 139828 160865 356072 303842 187564 -244040 -340137 183970 -61042 218710 508432
2494 508432 170029 397594 584640 428797 106348 360060 411039 182283 143974 582594
2484 582594 655717 773449 274192 48435 -130792 -163720 37602 -125589 -167893 -32778
2474 -32778 17859 -30246 247334 754846 190445 -392651 -255620 -343526 -230916 -101690
2464a01690O1727L21988q912N3817p4772j02233J08012o9534k94569J71723J40267
2453B05824l50942r3841o4233N626L53028M32321p8539k70935j20399j75546N06126
2442C48490J65086l20604J51618k07747l85108k11467K27130J3294K09983J21972
2432A12647P06742m24501k90457j24446J97570j43827Q1479M45827M4975l26863
2422B79146J43220k73466l0351K37397l6782L16072j81049m49689L938K79682
2412B88118p92538K23969Q1822M3840L5380k28327K195q3603M41788K46516K13804
2401D72964R8558k24494N3741M17287l94846k09394m72807l98227O58829J04151
2391A05762j48103N41598j59703k7334j26906l51493j82700M38531Q8110j89410
$$ plain form
2464 -101690 -39963 282025 273113 326930 252158 149925 257937 188403 -106166 65557 205824
2453 205824 -145118 -238959 -303192 -297566 55462 487783 409244 138309 17910 -157636 348490
2442 348490 513576 192972 344590 136843 -248265 -459732 -232602 -219308 -9325 112647
2432 112647 819389 394888 104431 -20015 177555 33728 115207 561034 606009 279146
2422 279146 422366 148900 118549 355946 319164 635236 454187 4498 8436 288118
2412 288118 -504420 -280451 -198629 -154789 -119409 -347736 -345541 -429144 12644 259160 472964
2401 472964 571522 347028 400769 818056 423210 213816 -258991 -657218 1611 105762
2391 105762 -42341 499257 339554 312220 185314 -166179 -348879 89652 177762 -11648
2381a1648K55300l68716j18960O5074L09898l41913K53048m2475O67914m96735
2371A70787L3351J26917n76893M78261o9897j0784Q3359j8904j31379j70887m44192
2360e30261L04149J99177n7693K11984m44926Q7485J17640R060K66114J44732
2350C07461l6782K45180R9907n01066L92778p1754n52879l20716J74663L43737
2340H0529K23956L88524l29098l14082j00605J35042K51328k5874m28564J8172
2330a00672K23146M66746j51488j19529K64066k31547J0491j21008r3801q7267
2320E9137K18803K8417j55002j01464L79001L61854j89218j83235J67545K39192
2310H25030n27606K7588K43131K99315M85362m14090J985J00573k10574J33904
$$ plain form
2381 -11648 243652 -125064 -244024 -178950 130948 -210965 42083 -392 667522 170787
2371 170787 204138 331055 -245838 232423 162526 151742 235101 216197 84818 -86069 -530261
2360 -530261 -226112 -26935 -84628 127356 -317570 -230085 -112445 -103385 162729 307461
2350 307461 270679 515859 615766 114700 507478 435724 -117155 -437871 -263208 80529
2340 80529 304485 693009 363911 49829 -50776 84266 335594 309720 -118844 -100672
2330 -100672 122474 589220 437732 318203 582269 350722 361213 240205 146404 59137
2320 59137 277940 306357 151355 49891 428892 790746 601528 418293 585838 825030
2310 825030 297424 325012 568143 867458 1352820 938730 940715 1041288 830714 964618
2300I64618K8608Q6321J01284j71070l06943n0200R1723k18006J68195K19690
2290I14220j84578j35283j51767Q9169J85110k18497K99006Q210m34035p9858
2280B91697j19451L00137J04372J27058J385j81495L11857K01648k32024m6494
2270G58690m73606l86043k4507J51055O8858L69961K83386j42850m58749j89439
2260d3244L97689N72092j01027q7062j78460k34679M01499l43086L24732K66978
2250I75432k11532j79031n1161R6849K10527p2808j47382k35264N5599K63323
2240G04552l52565j35010n26306q7952L49614n8488L03336q1779N4851P2144K39707
2229D82104M181L9298j44226K05532l46924J4391N08701j64149M0652J20087P2956
$$ plain form
2300 964618 993226 1079547 1180831 1009761 702818 652618 744341 526335 694530 914220
2290 914220 729642 594359 442592 531761 716871 498374 797380 805590 371555 291697
2280 291697 172246 472383 576755 703813 705198 523703 835560 1037208 805184 758690
2270 758690 285084 -100959 -125466 25589 94447 464408 747794 604944 146195 -43244
2260 -43244 354445 926537 825510 738448 559988 325309 726808 383722 708454 975432
2250 975432 763900 584869 533708 630557 841084 768276 620894 385630 441229 704552
2240 704552 351987 216977 -309329 -397281 -47667 -106155 197181 115402 170253 242397 482104
2229 482104 486285 525583 381357 586889 239965 254356 763057 598908 639560 759647 832603
2218H32603J2524j58537r2903k70353k44036O4948Q3430K44440K96003K07292
2208I75411K01471k13412n60417M28659J21916p84714N71421o2852R5290K0735
2198G93508k22238L13334k09332J56822K58195j8303j42950K17150l97580M184
2188G52790J10199M76090J73340k00987j60356j23094p731N4834p1873J79429
2178A182641o7329l48321P4390K17890K68620n1096J01126J26187l38569L83395
2168A548934M33297l91400k15410N15165Q3688j04038k96998k95455K59928n1720
2158A485991K3610j48712L91468M3687K90307J23935K52315j05508k09677R0434
2148B237850J31245K16468n32982K20308L48139L09616L13105R2464N2254K02485
$$ plain form
2218 832603 845127 686590 593687 323334 79298 144246 227676 472116 768119 975411
2208 975411 1176882 963470 403053 831712 953628 168914 740335 677483 772773 793508
2198 793508 571270 884604 675272 832094 1090289 1071986 929036 1146186 748606 752790
2188 752790 862989 1339079 1512419 1311432 1151076 1027982 1020251 1075085 1003212 1182641
2178 1182641 1115312 766991 841381 1059271 1327891 1276795 1377921 1504108 1165539 1548934
2168 1548934 1982231 1590831 1375421 1890586 1974274 1870236 1573238 1277783 1537711 1485991
2158 1485991 1509601 1360889 1752357 1796044 2086351 2210286 2462601 2357093 2147416 2237850
2148 2237850 2369095 2585563 2052581 2272889 2621028 2930644 3243749 3336213 3388467 3590952
2138C590952L46691J91262k05527n49638N16941M27481l78750Q42821j86350J92311
2128D788194O39202P2563j00714n3514K76421L55651k030M12451L9512q0387K85988
2117F633337N12994M1236J44683M73732k95358L58023N62490K2535n9466L15520
2107H709726l76234L19070P30983M08651N5838K95836M12289l72226N09383P23202
2097A1416518M49760O00809M89702k809O40156Q04975R95784P81390J297991O98127
2087A8172403J114363P57570J027712J401816J287708J430881J963576K051520
2079B9207549K175851K584747L111767L657918M317693N297316N353058N154262
2071F0860161N278935O435566P856912J0911151J3209677J5148966J8943416K4081015
$$ plain form
2138 3590952 3937643 4128905 3923378 3373740 3890681 4318162 3939412 4782233 4595883 4788194
2128 4788194 5427396 5499959 5399245 5345731 5622152 5977803 5975773 6388224 6427736 6347349 6633337
2117 6633337 7146331 7187567 7332250 7805982 7510624 7868647 8431137 8453672 8394206 8709726
2107 8709726 8333492 8652562 9383545 9792196 9848034 10143870 10556159 10183933 10693316 11416518
2097 11416518 11866278 12467087 12956789 12953980 13594136 14399111 15394895 16176285 17474276 18172403
2087 18172403 19286766 20044336 21072048 22473864 23761572 25192453 27156029 29207549
2079 29207549 31383400 33968147 37079914 40737832 45055525 50352841 55705899 60860161
2071 60860161 66139096 72574662 80431574 91342725 104552402 119701368 138644784 162725799
2063A62725799K9983244L7299544N3811987M0423365k6653930n0298771n0217631
2056A97073607m4515575k8049601k0409513j3789731j1324266p496730o800542
2049F4687649m896961m132010k869130l143842m483115m200337l630511l145213
2041C4186530k015713k373935j587529j406521j332198j530909j098991j013111
2033B1827623r43630n50312j131263j197785m99118n57252m88246q96166m31362
2024A5132489m82766n63944j104635n00470k86566n57084K16041q73905n45394
2015A0433766n75868j65499m52331n06864j57628n66599k25720m94869L51230
2006G639618k18441m60479l82462K14847l78083m79273K13340P1198K50112k98957
$$ plain form
2063 162725799 192709043 230008587 283820574 324243939 297590009 247291238 197073607
2056 197073607 152558032 124508431 104098918 90309187 78984921 71488191 64687649
2049 64687649 59790688 55658678 52789548 49645706 45162591 40962254 37331743 34186530
2041 34186530 32170817 29796882 28209353 26802832 25470634 23939725 22840734 21827623
2033 21827623 20883993 20333681 19202418 18004633 17505515 16948263 16460017 15563851 15132489
2024 15132489 14649723 14085779 12981144 12480674 12194108 11637024 11853065 10979160 10433766
2015 10433766 9857898 9692399 9240068 8733204 8575576 8008977 7783257 7288388 7639618
2006 7639618 7421177 6960698 6578236 6793083 6415000 5935727 6149067 6220265 6470377 6171420
1996F171420m1433M46711l56369p00143j80169J24405j00631L9654j75512m2286
1986E185647k04539Q2902k37995o30226j70831m0174L5646P0002Q4682k0429l84479
1975C770206l89894J5006k17964L52012p05351p4366L95692k15610k85816P3479
1965B717394K77939k09116K8508L6941l51573J83059K36319l93211K13845l13843
1955B426262j87643R8646K20668m74343R5369J03430K55672L19381m45100n8465
1945B353877n68006J93109j43994J1246J23398n8507L3492k82924J99919K35614
1935B097224j33684m07758j1356Q4884K80764N7263J3834l54387j47946m77253
1925A001585L94176J4678r2231n5137o2660N04461n12005K09600L57609j89261
$$ plain form
1996 6171420 6129987 6576698 6220329 5520186 5340017 5464422 5363791 5403445 5227933 5185647
1986 5185647 4981108 5064010 4826015 4195789 4024958 3984784 4020430 4090432 4175114 4154685 3770206
1975 3770206 3380312 3395318 3177354 3529366 2824015 2749649 3145341 2929731 2643915 2717394
1965 2717394 2995333 2786217 2814725 2851666 2500093 2683152 2919471 2526260 2740105 2426262
1955 2426262 2238619 2337265 2557933 2083590 2178959 2282389 2538061 2857442 2412342 2353877
1945 2353877 1785871 1978980 1834986 1846232 1969630 1911123 1944615 1661691 1861610 2097224
1935 2097224 1963540 1555782 1544426 1629310 1910074 1967337 1981171 1626784 1478838 1001585
1925 1001585 1395761 1410439 1318208 1263071 1200411 1704872 1192867 1402467 1760076 1570815
1915A570815m45918L63390J601K11013m80578k79789K68807J93997j66046n5553
1905A181739L2879l37232K41142R8158m00052j25644j40429k02404J13128K95048
1895G56333j02877j29256K41138K8217O3741j36651M2918N02535L07908j25135
1885A448871l56110q3167l82150K43494L18244n4948R9253J64553m76333j08106
1875H13601K34829j48520k61938K10208l59058n24557K06236N6543K53836N1033
1865E32213j54723j69875l1053Q555J83612K97495q8676l2660L05495m96435L01341
1854F55289K08476k55469k16723J08298K12842j04312l69879K5497K97121J81500
1844G42640j10270K68508j37112J28993L8349j56225j35460o9920K65358k42334
$$ plain form
1915 1570815 1124897 1488287 1489888 1700901 1220323 940534 1209341 1403338 1237292 1181739
1905 1181739 1214618 877386 1118528 1216686 816634 690990 550561 348157 461285 756333
1895 756333 653456 524200 765338 793555 857296 720645 763563 1266098 1574006 1448871
1885 1448871 1092761 1009594 627444 870938 1189182 1134234 1233487 1398040 921707 813601
1875 813601 1048430 899910 637972 848180 489122 -35435 170801 227344 481180 532213
1865 532213 377490 207615 176562 185117 368729 666224 577548 544888 850383 353948 655289
1854 655289 863765 608296 391573 499871 712713 608401 238522 264019 561140 742640
1844 742640 632370 900878 763766 892759 931108 774883 639423 569503 834861 592527
1834E92527j51307J05341m59930Q276R10859l3670k19977K90316j75883m01750
1824D64802O83447l18675K00389l5721K22170j6516K82205K47759l09253J74189
1814A594796j02299k9619J94155j59756k74649l5678n7975k77152l49646k61464
1804B40713L60593J28162l82908P08297K59661l26884n0575l42874m85407M04244
1794E13022j13237l6579P5522j42144l0411J43378j40552j81499l7456M2544L67377
1783D59965j68819k15950K02347K94272L83203k98871l41818J6707L25463k13909
1773D42590k75877L78816N2531k42047J62784k2120l97896N577L47674O0510k02095
1762C10447l48573L25109M5602l516k81399L74596l57528J42463J31432O9623
$$ plain form
1834 592527 441220 546561 86631 94907 1005766 972096 752119 1042435 866552 464802
1824 464802 1148249 829574 1029963 994242 1216412 1199896 1482101 1729860 1420607 1594796
1814 1594796 1492497 1462878 1657033 1497277 1222628 1186950 1128975 851823 502177 240713
1804 240713 601306 729468 346560 1054857 1314518 987634 937059 594185 108778 513022
1794 513022 399785 363206 438728 296584 266173 409551 268999 87500 50044 92588 459965
1783 459965 291146 75196 277543 571815 955018 656147 314329 331036 656499 442590
1773 442590 166713 545529 598060 356013 518797 496677 98781 104358 452032 512542 310447
1762 310447 -38126 286983 332585 329069 47670 422266 64738 207201 338633 408256
1752D08256l6282j92861P54118m58853m21019j63896M27273l06382Q350J4982
1742C3686j83544n0214L07670M45644l5490j64597j23754r4690k1161L50748O26423
1731A090721k58969l08185l82974j54951N24927o38459M13074L18087l63104k7809
1721B12358m18904K47367n5351M595N14036k49665r1296j11407J251K83228J54411
1710D90623J55391p23521j59333O5710K01858J29078J05093l40767M9915k82364
1700c08317L9662M3221J1400O36982j17928j46744j89744J4155J70265l40823
1690a87871j92564K61190L16290k36196J74509J57111l45562K01079K55508j16983
1680B86511K87493R9773o06688j35965J76507l0663J10309M84470k55777k39533
$$ plain form
1752 408256 371974 179113 933231 474378 53359 -110537 316736 10354 18704 33686
1742 33686 -149858 -200072 107598 553242 517752 353155 229401 134711 113550 464298 1090721
1731 1090721 831752 523567 140593 -14358 510569 -127890 285184 603271 240167 212358
1721 212358 -206546 40821 -14530 -9935 504101 254436 163140 51733 52984 336212 490623
1710 490623 646014 -77507 -236840 -171130 30728 159806 264899 -75868 -25953 -308317
1700 -308317 -268655 -225434 -214034 422948 305020 158276 -31468 -17313 152952 -187871
1690 -187871 -380435 -119245 197045 -39151 135358 292469 -53093 147986 403494 286511
1680 286511 574004 673777 67089 -68876 107631 76968 187277 671747 415970 176437
1670A76437M08134J00685J0612n94905l5826M39374K11884r8865n10093N2412
1660A59849L5415k33487J38623j67617j01297O36921l44775l8768J83573J80306
1650D48743k48873m64594l14143O95037K86972l91914j01005K52893k72804L19671
1640B09983J34052l96958M04302q9570Q4590J42219m12639k59384Q9511N29206
1630D35312m36180m40593K88543J27608j6533K02499K34156k9153P1906p17698
1620b80133K0884O131O23735k50128l67581L08573l22468J1199J72630L58989
1610B81831j6099K77165R0331r3642k5838j85263k67103l7506Q3243k45371j20215
1599b58467M56893q8614l09030J66328K1892j82512J89722J96213n5963M25326
$$ plain form
1670 176437 584571 685256 695868 100963 65137 504511 716395 617530 107437 159849
1660 159849 195264 -38223 100400 -67217 -168514 468407 123632 84864 268437 448743
1650 448743 199870 -264724 -578867 116170 403142 11228 -89777 163116 -109688 209983
1640 209983 344035 -52923 351379 261809 346399 488618 75979 -183405 -93894 435312
1630 435312 -868 -441461 -152918 -25310 -41843 160656 394812 365659 437565 -280133
1620 -280133 -259249 -253118 370617 120489 -247092 61481 -260987 -249788 -77158 281831
1610 281831 265732 542897 633228 539586 513748 328485 61382 23876 107119 -138252 -258467
1599 -258467 198426 109812 -199218 -32890 -10998 -193510 -3788 192425 136462 561788
1589E61788L1420m28035R4509j65069k74986O3244o6888Q1152j43855J52754J98964
1578A04998J03349j85184l41776Q0388L88057j53024k35518M04035p0420j18044
1568b3139L86728o36543K60266l7756k6295L07602j58844J02176n6672Q3785k82424
1557h1116Q4941Q4049k17077j23001J43771Q9193j20784j2855j0146k30653J91449
1546b02229L0394L32532j03082j4313j68720M9284Q0437J28533l43668J27188
1536h3644O9388m20239L1379K87495L95388k65303J47879O6506p999k47094Q2845
1525E6601m16593p2790K24199j32966J11976L633K20300K44458l0576J40668j91106
1514A57804l0387k12059J74737J78507j77198l46353K77392O1042k73875j26562
$$ plain form
1589 561788 593208 165173 259682 94613 -180373 -117129 -184017 -102865 -246720 -93966 104998
1578 104998 208347 23163 -318613 -238225 149832 -3192 -238710 165325 94905 -23139
1568 -23139 363589 -272954 -12688 -50444 -76739 230863 72019 174195 117523 201308 -81116
1557 -81116 3825 87874 -129203 -252204 -108433 -19240 -140024 -152879 -163025 -393678 -202229
1546 -202229 -171835 160697 57615 43302 -125418 -76134 4303 132836 -210832 -83644
1536 -83644 -14256 -434495 -403116 -115621 279767 14464 162343 228849 220850 -26244 56601
1525 56601 -359992 -432782 -208583 -341549 -229573 -225940 -5640 238818 208242 348910 157804
1514 157804 127417 -84642 90095 268602 91404 -254949 22443 83485 -190390 -316952
1504c16952j83980K72647j06191R2293K41700j78722M85369l8954j14707l61769
1494b09266k38316K64741K93400j544n27729k14135L23515L53649J03393l57337
1484b09629K0432J86610r9979j17055R0775N20436k2233j93418K27341l46254
1474E7026j59736M03495q6528k27144m3608K38604j39762j64130J90344Q1657
1464A50218l41482K90461J04509N926k61364K980K1161J26739m7055l5834n98833
1453e82574K27491J14524j28515K91201L34791o7984m1731j30793m2801k62432
1443b88823L67301r0654K67153L37066p8752m12658m92198j1181M92135r1022
1433a633k54846p35960j9223M07997L83900P6392n04468K47594L41070K88877
$$ plain form
1504 -316952 -500932 -228285 -334476 -242183 -483 -179205 306164 267210 152503 -209266
1494 -209266 -447582 -182841 110559 109015 -418714 -632849 -309334 44315 147708 -209629
1484 -209629 -189197 -2587 -102566 -219621 -128846 391590 369357 175939 403280 57026
1474 57026 -102710 300785 214257 -12887 -56495 182109 42347 -121783 68561 150218
1464 150218 -191264 99197 203706 209632 -51732 -48752 -27591 99148 52093 16259 -582574
1453 -582574 -355083 -240559 -369074 -77873 256918 188934 147203 16410 -26391 -288823
1443 -288823 78478 -12176 254977 592043 513291 100633 -391565 -402746 89389 -1633
1433 -1633 -256479 -992439 -1011662 -603665 -219765 -143373 -647841 -400247 -59177 229700
1423B29700n51732J6311J73579J82575k729N1657n24687P2872J38856K5388K47723
1412E9513P2242o35170J59286L182K97238j41320j08742J77544m5260P0986L48424
1401B57923j19724k18593l80770m05895M98672j66098j75731K85296K08573q9700
1391c06047n17922L44982J79934J09055j13285K13288Q1256n09774M90693p9210
1381a07030l71243L69020O28104R3607o91277K08832j6242J55705j19994o1518
1371H7964j33365Q4925k46340M59584k41997l39549K86787r9305j65528K33159
1361g3665M60225J22222l17123l15455L19117k99433q775J7041L3278k13032j92292
1350d67892l7315K66932k39791O82609j30490j3256J09984J01171j85780o9742
$$ plain form
1423 229700 -322032 -305721 -132142 50433 47704 99361 -425326 -352454 -213598 -188210 59513
1412 59513 131755 -503415 -344129 -340947 -43709 -185029 -293771 -116227 -161487 -90501 257923
1401 257923 138199 -80394 -461164 -867059 -368387 -534485 -710216 -424920 -216347 -306047
1391 -306047 -823969 -478987 -299053 -189998 -303283 -89995 -8739 -518513 -27820 -107030
1381 -107030 -478273 -109253 518851 612458 -78819 130013 113771 269476 149482 87964
1371 87964 -45401 39524 -206816 252768 10771 -328778 -41991 -141296 -306824 -73665
1361 -73665 386560 508782 191659 -123796 195321 -104112 -112887 -95846 -62568 -275600 -467892
1350 -467892 -505207 -238275 -478066 204543 74053 60797 170781 271952 86172 16430
1340A6430k1073l96219q0892K51875K39420o6654k35485j72646M38165Q4365k55266
1329a97980j9618K17242J33407O5561p5293j58292k7688j89619K81144N03995
1319E32859o71149M9607L49544n30616K57159Q7674K23583j26529m20614J95874
1309e2608R0190j9523j76849J39707J36605O5880o8204j60346q2082K97645q2067
1298H8348k83503K77144K35490J04237J19976q1254k21323J159k33310K41164
1288B48128J38761L6509l04427m71268q3292J18338n7078J8910R9680M60229J72285
1277C76775m78079l29171j50183M7357N76811P2007j56610q5312K89483K29512
1267C92590M7793P9503k92768k48114j07027l39399j18020O14534K47402n49291
$$ plain form
1340 16430 -4643 -400862 -481754 -229879 9541 -57113 -292598 -465244 -27079 57286 -197980
1329 -197980 -217598 -356 133051 198612 123319 -34973 -62661 -252280 28864 532859
1319 532859 -138290 -88683 260861 -269755 -12596 75078 298661 172132 -248482 -52608
1309 -52608 37582 18059 -158790 -19083 117522 183402 115198 -45148 -127230 170415 88348
1298 88348 -195155 81989 317479 421716 541692 460438 239115 240274 6964 248128
1288 248128 386889 423398 118971 -352297 -435589 -317251 -374329 -355419 -255739 204490 376775
1277 376775 -101304 -430475 -580658 -533301 43510 115517 -41093 -126405 163078 392590
1267 392590 440383 519886 227118 -20996 -128023 -467422 -585442 29092 276494 -272797
1257b72797K79111J57857j38752K15254l21363j42645M54185M46695n19967j72558
1247a4980m02430j63240J55139M19350N50685k34944l49037j70416K31656K06857
1237B28640m22619L77372k85876m7075j66865k04809P979M98966J95402j27261
1227E3854o2090J65218M9482J50451k89659k85328J32444j26116K69549m59168
1217d01363K44186K2536j46871L35467J43025l14178p9040J82453K04500j89605
1207A110Q5460j86177L30275j67828l11936M03287J10093k57874l44944K21582
1197a16952j16463m0436K44963k70630M95153J74857l04248o19275L15044j73750
1187d11737j6676K07873k40061M6934n5490L38107k9081P7565L3830K59037k85424
$$ plain form
1257 -272797 6314 164171 25419 240673 -80690 -223335 230850 677545 157578 -14980
1247 -14980 -417410 -580650 -425511 -6161 544524 309580 -39457 -209873 21783 228640
1237 228640 -193979 183393 -102483 -149558 -316423 -521232 -513253 -14287 181115 53854
1227 53854 -8236 156982 206464 356915 67256 -218072 -85628 -211744 57805 -401363
1217 -401363 -157177 -134641 -281512 53955 196980 -117198 -196238 -13785 190715 1110
1207 1110 86570 -99607 230668 62840 -249096 154191 264284 6410 -338534 -116952
1197 -116952 -233415 -273851 -28888 -299518 195635 370492 66244 -553031 -237987 -411737
1187 -411737 -428413 -220540 -460601 -413667 -469157 -131050 -160131 -82566 -48736 210301 -75123
1176g5123j62564J00595j15893J55593j2965J13593r5877L7111l38652O23460
1166B29278m511j24570J71718p48566Q2577N67017j13851n54947K40814l91757
1156f46798K04256r1746P71158j02213M26903r6477j26509K0532l14772L7202
1146H1536k4237j63062L5440J41632K42643J07127n80755j17085M07854J86614
1136C17707J51595m89672j54331j48584k93970j74049N93574J04311k35618O9906
1126b59131R465K1485J41348K33824j29488J73284J61882l68322P6309K02000
1116B62656j57453l69652p5097J81219j69632j80257l9031M73335j99845j97102
1106d70859L48326k24428m04065L38680L86520K36592l28799j55897K66739m571
$$ plain form
1176 -75123 -237687 -137092 -252985 -97392 -110357 3236 -92641 -55530 -394182 229278
1166 229278 224767 100197 271915 -476651 -394074 172943 59092 -495855 -255041 -646798
1156 -646798 -442542 -534288 236870 134657 561560 465083 338574 359106 44334 81536
1146 81536 57299 -105763 -70323 71309 313952 421079 -159676 -276761 131093 317707
1136 317707 469302 -20370 -174701 -323285 -617255 -791304 -197730 -93419 -329037 -259131
1126 -259131 -249666 -228181 -86833 146991 17503 190787 352669 -15653 60656 262656
1116 262656 105203 -264449 -339546 -158327 -327959 -508216 -547247 -73912 -273757 -470859
1106 -470859 -122533 -346961 -751026 -412346 -25826 210766 -118033 -273930 -7191 -11762
1096a1762n30375K72674K16431M50813l89958J00332N9302l09658M0629m0982
$$ plain form
1096 -11762 -542137 -269463 -53032 397781 7823 108155 167457 -142201 -101572 -142554
$$ [...]
##END NTUPLES=NMR SPECTRUM
##END=
