##TITLE=1H_EC-3257(4)
 CDCl3, 8 sc, 
 29.07.2021
##JCAMPDX= 6.0         $$ Bruker NMR JCAMP-DX V2.0
##DATA TYPE= NMR SPECTRUM
##DATA CLASS= NTUPLES
##ORIGIN= UXNMR, Bruker Analytische Messtechnik GmbH
##OWNER= root
$$ XWIN-NMR		Version 3.5
$$ Thu Jul 29 10:02:49 2021 Russian Standard Time (UT+4h)  she@DPX200
##.OBSERVE FREQUENCY= 200.131506
##.OBSERVE NUCLEUS= ^1H
##.ACQUISITION MODE= SIMULTANEOUS
##.ACQUISITION SCHEME= undefined
##.AVERAGES= 8
##.DIGITISER RES= 18
##SPECTROMETER/DATA SYSTEM= spect
##.PULSE SEQUENCE= zg30
##.SOLVENT NAME= CDCl3
##.SHIFT REFERENCE= (INTERNAL, CDCl3, 0, 17.5008)
##AUDIT TRAIL= $$ (NUMBER, WHEN, WHO, WHERE, WHAT)
$$ ##TITLE= Audit trail, XWIN-NMR		Version 3.5
$$ ##JCAMPDX= 5.01
$$ ##ORIGIN= Bruker BioSpin GmbH
$$ ##OWNER= she
$$ F:/spectra/data/she/nmr/H-F/1/pdata/1/auditp.txt
$$ ##AUDIT TRAIL=  $$ (NUMBER, WHEN, WHO, WHERE, WHAT)
(   1,<2021-07-29 10:01:31.17 +0400>,<she>,<DPX200>,
      <created by zg, POWCHK disabled, PULCHK disabled
       configuration hash MD5:
       00 E9 B6 7A A2 85 ED C7 34 08 36 98 17 FE 4E 26
       data hash MD5: 16K
       D7 F9 21 8B D4 9A 52 59 C8 5C 15 8D 5B F5 F1 25>)
(   2,<2021-07-29 10:01:33.59 +0400>,<she>,<DPX200>,
      <Start of raw data processing
       efp BC_mod = 2 LB = 0.24 FT_mod = 6 PKNL = 1 PHC0 = -12995.23 PHC1 = 13.60099 SI = 16K 
       data hash MD5: 16K
       7F 65 CD 1D 8E 55 5B 05 11 0C 70 DC 1D E8 86 1C>)
(   3,<2021-07-29 10:01:53.01 +0400>,<she>,<DPX200>,
      <pk PHC0 = 0.9216356 PHC1 = -1.6 
       data hash MD5: 16K
       09 15 3D 5B BF A7 D1 29 B7 5B B5 E4 8E BE 72 FD>)
(   4,<2021-07-29 10:01:56.60 +0400>,<she>,<DPX200>,
      <abs ABSG = 5 
       data hash MD5: 16K
       38 6F 08 93 9A CF F0 E2 B0 CC 07 91 E6 89 B2 08>)
$$ ##END=
$$ 
$$ hash MD5
$$ 6B 70 BB B5 82 77 2B 09 41 4E D1 66 10 06 FD FD
##$RELAX= 
##$RELAX= 
##$RELAX= 
##$RELAX= 
##$RELAX= 
##$RELAX= 
$$ Bruker specific parameters
$$ --------------------------
##$DU= <F:/spectra>
##$EXPNO= 1
##$NAME= <H-F>
##$PROCNO= 1
##$TYPE= <nmr>
##$USER= <she>
##$AMP= (0..31)
100 100 100 100 100 100 100 100 100 100 100 100 100 100 100 100 100 100 
100 100 100 100 100 100 100 100 100 100 100 100 100 100 
##$AQSEQ= 0
##$AQ_mod= 1
##$AUNM= <au_zg>
##$AUTOPOS= <>
##$BF1= 200.13
##$BF2= 200.13
##$BF3= 200.13
##$BF4= 200.13
##$BF5= 200.13
##$BF6= 200.13
##$BF7= 200.13
##$BF8= 200.13
##$BYTORDA= 1
##$CFDGTYP= 0
##$CFRGTYP= 5
##$CHEMSTR= <none>
##$CNST= (0..31)
1 1 145 1 1 1 1 1 1 1 1 1 1 1 1 1 1 1 1 1 1 1 1 1 1 1 1 1 1 1 1 1 
##$CPDPRG= <>
##$CPDPRG1= <>
##$CPDPRG2= <>
##$CPDPRG3= <>
##$CPDPRG4= <mlev>
##$CPDPRG5= <mlev>
##$CPDPRG6= <mlev>
##$CPDPRG7= <mlev>
##$CPDPRG8= <mlev>
##$CPDPRGB= <>
##$CPDPRGT= <>
##$D= (0..31)
0 1.2 0 0 0 0 0 0 0 0.06 0 0.03 0 0 0 0 0.0002 0 0 0 0 0 0 0 0 0 0 0 0 
0 0 0 
##$DATE= 1627538490
##$DBL= (0..7)
120 120 120 120 120 120 120 120 
##$DBP= (0..7)
150 150 150 150 150 150 150 150 
##$DBP07= 0
##$DBPNAM0= <>
##$DBPNAM1= <>
##$DBPNAM2= <>
##$DBPNAM3= <>
##$DBPNAM4= <>
$$ [...]
##$SUBNAM3= <"">
##$SUBNAM4= <"">
##$SUBNAM5= <"">
##$SUBNAM6= <"">
##$SUBNAM7= <"">
##$SUBNAM8= <"">
##$SUBNAM9= <"">
##$SW= 20.0188882624521
##$SWIBOX= (0..15)
0 0 2 0 0 0 0 0 0 0 0 0 0 0 0 0 
##$SW_h= 4006.41025641026
##$TD= 16384
##$TD0= 1
##$TE= 0
##$TE2= 300
##$TE3= 300
##$TEG= 300
##$TL= (0..7)
0 120 120 120 120 120 120 120 
##$TP= (0..7)
150 150 150 150 150 150 150 150 
##$TP07= 0
##$TPNAME0= <>
##$TPNAME1= <>
##$TPNAME2= <>
##$TPNAME3= <>
##$TPNAME4= <>
##$TPNAME5= <>
##$TPNAME6= <>
##$TPNAME7= <>
##$TPOAL= (0..7)
0.5 0.5 0.5 0.5 0.5 0.5 0.5 0.5 
##$TPOFFS= (0..7)
0 0 0 0 0 0 0 0 
##$TUNHIN= 0
##$TUNHOUT= 0
##$TUNXOUT= 0
##$USERA1= <user>
##$USERA2= <user>
##$USERA3= <user>
##$USERA4= <user>
##$USERA5= <user>
##$V9= 5
##$VALIST= <valist>
##$VCLIST= <CCCCCCCCCCCCCCC>
##$VD= 0
##$VDLIST= <DDDDDDDDDDDDDDD>
##$VPLIST= <PPPPPPPPPPPPPPP>
##$VTLIST= <TTTTTTTTTTTTTTT>
##$WBST= 1024
##$WBSW= 4
##$XGAIN= (0..3)
0 0 0 0 
##$XL= 0
##$YL= 0
##$YMAX_a= 345810
##$YMIN_a= -497649
##$ZGOPTNS= <>
##$ZL1= 120
##$ZL2= 120
##$ZL3= 120
##$ZL4= 120
##$ABSF1= 17.502
##$ABSF2= -2.517038
##$ABSG= 5
##$ABSL= 3
##$ALPHA= 0
##$AQORDER= 0
##$ASSFAC= 0
##$ASSFACI= 0
##$ASSFACX= 0
##$ASSWID= 0
##$AUNMP= <proc_1d>
##$AZFE= 0.1
##$AZFW= 0.1
##$BCFW= 0
##$BC_mod= 2
##$BYTORDP= 0
##$COROFFS= 0
##$CY= -3
##$DATMOD= 1
##$DC= 0
##$DFILT= <>
##$DTYPP= 0
##$F1P= 0
##$F2P= 0
##$FCOR= 1
##$FTSIZE= 16384
##$FT_mod= 6
##$GAMMA= 0
##$GB= 0
##$INTBC= 1
##$INTSCL= 1.334414e-10
##$ISEN= 128
##$LB= 0.24
##$LEV0= 0
##$LPBIN= 0
##$MAXI= 10000
##$MC2= 0
##$MEAN= 0
##$ME_mod= 0
##$MI= 1.114404
##$NCOEF= 0
##$NC_proc= -6
##$NLEV= 6
##$NOISF1= 3.799351
##$NOISF2= 2.8
##$NSP= 0
##$NTH_PI= 0
##$NZP= 0
##$OFFSET= 17.50077
##$PC= 1
##$PHC0= -12994.31
##$PHC1= 12.00099
##$PH_mod= 1
##$PKNL= yes
##$PPARMOD= 0
##$PSCAL= 0
##$PSIGN= 0
##$REVERSE= no
##$SF= 200.130006776027
##$SI= 16384
##$SIGF1= 3
##$SIGF2= 2
##$SINO= 5.538805
##$SIOLD= 16384
##$SREGLST= <1H.CDCl3>
##$SSB= 0
##$STSI= 16384
##$STSR= 0
##$SW_p= 4006.41025641026
##$SYMM= 0
##$S_DEV= 0
##$TDeff= 16384
##$TDoff= 0
##$TI= <>
##$TILT= no
##$TM1= 0
##$TM2= 0
##$TOPLEV= 0
##$USERP1= <user>
##$USERP2= <user>
##$USERP3= <user>
##$USERP4= <user>
##$USERP5= <user>
##$WDW= 1
##$XDIM= 16384
##$YMAX_p= 273942467
##$YMIN_p= -304411
$$ End of Bruker specific parameters
$$ ---------------------------------
##NTUPLES= NMR SPECTRUM
##VAR_NAME=  FREQUENCY,     SPECTRUM/REAL,   SPECTRUM/IMAG
##SYMBOL=    X,             R,               I
##VAR_TYPE=  INDEPENDENT,   DEPENDENT,       DEPENDENT
##VAR_FORM=  AFFN,          ASDF,            ASDF
##VAR_DIM=   16384,         16384,           16384
##UNITS=     HZ,            ARBITRARY UNITS, ARBITRARY UNITS
##FACTOR=    0.24454680195387, 1,            1
##FIRST=     3502.42933252918, 0,            0
##LAST=      -503.980923881085, 0,           0
##MIN=       -503.980923881085, -304411,     0
##MAX=       3502.42933252918, 273942467,    0
$$ Real data points
##PAGE= N=1
##DATA TABLE= (X++(R..R)), XYDATA
$$ [...]
9076 85992 5008 17501 111553 25432 75322 71733 27283 109437 81341 36839 153190 115987
9064 115987 14418 42470 79444 112258 -13081 -34042 -44731 -101796 -26214 18970 57780
9053 57780 -39160 -73116 -78652 14207 35783 25339 -28420 -64155 8818 37287 31826 -67914
9041 -67914 -25082 39972 -4266 108091 133253 181276 156843 58027 43003 92960 73366 90184
9029 90184 62552 20669 129609 83658 -56671 -10926 -45058 -69052 86915 71428 74631
9018 74631 94448 152529 186834 81016 18928 30244 177686 111039 -90939 -150088 1458
9007 1458 -29667 -81994 26671 12886 21254 49449 98272 131817 122451 43863 4057 30404
8995 30404 118854 57892 78202 126369 29206 22527 166748 -10698 -29606 -7970 -122306
8984 -122306 -62158 15059 -50389 -82296 -88342 -30979 -41968 -93881 -77582 11301 42843 4489
8972 4489 23811 136290 105645 18180 -8205 -57589 81401 70011 36214 -694 58869 129304
8960 129304 115876 33787 63974 91505 22262 -1468 73550 71199 87523 139438 85602 -8585
8948 -8585 43349 93380 64165 65896 103340 66290 78163 93713 5083 -51552 -31295 43397
8936 43397 37326 -19586 -36996 121287 51741 -77761 20561 156753 130684 24114 91434
8925 91434 -16291 -22126 -83762 -108853 30808 35002 43673 121819 171602 122741 133779 182633
8913 182633 202249 194589 186305 147735 78742 85157 115707 96611 116058 53409 38415 150648
8901 150648 75476 103127 180133 204711 90757 153511 228842 216861 219539 174451 165472 141936
8889 141936 239037 252202 53919 2339 131513 144291 178206 275482 337360 387026 320024
8878 320024 278686 318116 242023 359003 273508 196375 154469 226756 197429 192605 171315 195785
8866 195785 246607 340431 314273 272492 292072 339635 362020 528511 363365 260049 153294
8855 153294 239230 316245 362010 483502 309453 328445 248861 415099 471480 487198 471135
8844 471135 432119 461758 519243 412742 464104 548178 529431 395827 409850 458137 464297
8833 464297 549836 455282 496148 424022 460022 410027 375252 510060 428103 352321 393403
8822 393403 384309 313877 406453 384639 344492 245756 247046 313710 426491 416594 290870 311406
8810 311406 429018 421340 539292 567462 585342 636952 562060 517255 509512 482987 554213 543267
8798 543267 499084 509474 601565 491711 372442 305021 301248 298249 276013 326711 310997 293289
8786 293289 277323 342843 376415 278921 392072 431135 288012 159206 195321 256643 277967
8775 277967 270249 301926 318871 321051 262917 266872 272354 255770 233103 342571 308084 278055
8763 278055 386693 318947 291578 292212 417747 276970 294092 365676 383568 373339 391453
8752 391453 301789 441562 400475 437031 464092 450806 372982 423538 475114 472582 451798 374758
8740 374758 366369 360322 432777 387881 451570 489543 531092 550707 476976 473471 410793 486982
8728 486982 521403 515030 487550 541585 532149 431495 463648 429783 480340 595579 610878 491954
8716 491954 513977 618329 578064 608691 709227 758308 718999 719788 663151 680694 647911 640647
8704 640647 687827 679341 674182 648776 712357 750142 838449 758674 692381 722972 772793 848563
8692 848563 873664 848652 925352 869031 986032 1101819 1116695 1122852 1098157 1228967 1223048
8681 1223048 1197893 1180774 1162677 978949 1086976 1154139 1134679 1055802 1061563 1199570 1178104
8670 1178104 1134657 1157840 1281387 1304758 1349357 1288614 1255474 1277016 1317289 1246530 1327177
8659 1327177 1400911 1331629 1423094 1446979 1395627 1411461 1370470 1429542 1566201 1593078 1500029
8648 1500029 1525987 1489536 1427265 1484978 1603011 1583537 1660268 1766098 1643142 1780809 1860904
8637 1860904 1818089 1858564 1807683 1777590 1778456 1892508 1790364 1786654 1862602 1920567 2015328 2044574
8625 2044574 2026049 2045430 1910759 2041265 2214752 2229427 2187555 2212954 2124325 2119078 2297561
8614 2297561 2317075 2322618 2381592 2411974 2403683 2560973 2640426 2588343 2687542 2797639 2732968
8603 2732968 2901978 2976523 2968178 3038600 3094678 3197064 3258346 3344437 3364592 3490652 3538392
8592 3538392 3585339 3819826 3914480 3990228 4134996 4180989 4171110 4249841 4463848 4605669 4734337
8581 4734337 5056689 5221113 5375135 5530297 5649456 5947258 6138225 6350819 6717478 7053376
8571 7053376 7278404 7545487 7900979 8308099 8783100 9244149 9794606 10311720 11038160 11802343
8561 11802343 12799960 13622917 14470889 15566198 16734055 18092150 19696693 21049845 22276079
8552 22276079 23249479 24325228 25463090 26507832 27237341 27358925 27123931 26933740 26159168
8543 26159168 25640246 25067024 24136396 23390530 22754538 22360718 22183992 22266545 22472324 22727238
8533 22727238 23036381 23603699 24266963 25159310 25986999 27024269 28080900 29413381 30667150
8524 30667150 32090654 33863950 35715013 37469935 39386101 41478646 43481800 45521739
8516 45521739 47538918 49839672 52377462 54944726 57152365 59072381 60953332 63022213
8508 63022213 65849897 69554331 72362829 73359658 73981465 74537208 76375004 78157302 78498496
8499 78498496 76396779 71021828 64942570 59139624 54307994 51110158 49042890 47082235
8491 47082235 44846961 42753448 40610941 38888827 37795862 37356463 37236791 37452230 38254271
8482 38254271 39548526 41352503 43874602 47168021 50811714 54480452 58292170 61966496
8474 61966496 64909114 67540575 70559677 74405386 77531322 79076961 79422413 77824337
8466 77824337 75557184 71412568 64962218 57494809 49583732 42942915 38042488 34666303
8458 34666303 32200908 30398164 28800072 27058766 25361963 23545063 21825119 20440752
8450 20440752 19365195 18390110 17316884 16559756 15892611 15239389 14667339 14171986 13666288
8441 13666288 13195649 12966897 12667190 12352073 12117090 11862256 11729474 11401055 11121495
8432 11121495 10933259 10741599 10532204 10196743 9980070 9769476 9588493 9476826 9343017
8423 9343017 9173210 9033432 9034322 8951460 8909739 8769944 8656083 8432406 8346559 8339911 8306649
8412 8306649 8295195 8233658 8066640 8092595 8188961 8118460 8063569 8069026 8030582 8043819 8107248
8401 8107248 8252059 8343996 8342079 8370726 8379411 8584924 8657386 8650743 8694613 8858467 8937707
8390 8937707 9035621 9163021 9272811 9382173 9472685 9691964 9938407 10086524 10454202 10682406
8380 10682406 10853097 11154919 11445926 11675803 11994925 12322272 12706930 13122966 13509829
8371 13509829 13952222 14576003 15253892 15941982 16740646 17680331 18718527 19971027 21484405
8362 21484405 23076670 24866515 26744952 29112530 31825491 34653843 37437165 40416806
8354 40416806 43632342 47102398 50698568 53378020 55043781 55862474 56794270 58320468
8346 58320468 59721492 59992580 58488828 55383626 51681255 48483598 46267382 45257605
8338 45257605 44901249 44827372 44734157 44428019 43928169 43927037 44577583 45745469 47094736 48427681
8328 48427681 49586489 50871865 52581159 54865321 57657779 60788692 64016531 67167697
8320 67167697 69751358 71732653 73703771 76095342 78281861 79613248 79681978 78530866
8312 78530866 76753310 73879224 69444080 64046851 58449412 53319286 49526103 46818096
8304 46818096 44977378 43588777 42826967 42399587 41814178 41024837 39978521 38864627 37697170
8295 37697170 36218129 34395586 32430994 30712333 29113729 27892889 26853068 26053975
8287 26053975 25250689 24568112 23848302 23171499 22581077 21858871 21312025 20545873 19740005
8278 19740005 19082005 18456264 17653404 16890569 16114544 15458725 14948371 14442389 14138449
8269 14138449 13837528 13435395 13194151 13031008 12829107 12664919 12545786 12245938 12045151
8260 12045151 12052880 11883012 11784573 11658208 11419698 11341565 11253943 11032501 10764565 10615037
8250 10615037 10589111 10495148 10284745 10129861 9995742 9818733 9600834 9428346 9218141 8994720
8240 8994720 8766203 8375125 8151989 8023936 7990733 7803934 7623273 7546552 7593409 7508956
8230 7508956 7457141 7362505 7275644 7253557 7268981 7251713 7228760 7219047 7068833 6992490 7018630
8219 7018630 7041700 7016035 7058977 6996164 7062837 7078684 7028224 7116482 7290633 7339756 7510980
8208 7510980 7582569 7750979 7779663 7896291 7869886 8053223 8150875 8208439 8351028 8599264
8198 8599264 8707706 9066003 9130572 9613115 9822482 10962344 10719704 9172039 9963827
8189 9963827 10272200 10938514 11228276 11609616 12215503 12769081 13199886 13888173 14472221 14967572
8179 14967572 15440475 15841417 16122340 16265894 16176169 16012589 15961849 16030326 16386857 16712248
8169 16712248 16973102 17209354 17505692 17795164 18134498 18615912 19075939 19718413 20531747
8160 20531747 21252225 22308002 23264292 24443335 25698986 26991260 28460807 30160663
8152 30160663 32145309 34389950 36718492 39043243 41213174 43226846 45090232 46884872
8144 46884872 48946117 51390573 54439177 57427486 60437950 63196928 66288693 69710074
8136 69710074 73906852 78653668 83409052 88173645 91272265 92407044 91967537 89968123
8128 89968123 87153008 84154547 81408609 79578857 78325116 77698237 77439667 77488426 77605229
8119 77605229 78116866 79083064 80489742 82716486 85551938 88702447 92234804 96062511
8111 96062511 100001039 104283689 108877728 114112671 120189616 127389320 135959946 144760620
8103 144760620 153008335 159624117 163535616 164760014 162791018 158502715 152640668 145635737
8095 145635737 137704569 129730302 122441229 115325471 109077257 103638620 98882231 94914604
8087 94914604 91914425 89505346 87460305 85546155 84002742 82988471 82944328 83684871 84836249
8078 84836249 86564916 88873215 91606465 94050580 96211026 98372701 100635132 103376877
8070 103376877 106518153 109906844 111958638 112186622 109641474 104397762 97775620 90286034
8062 90286034 83270742 77220134 72317958 68439214 65430895 62954276 60839929 58856818
8054 58856818 57168093 55178620 53117666 50898617 48899359 46926314 45361861 44022911
8046 44022911 42839615 42162120 41673201 41231868 40684716 40179322 39826577 39418507 39149245
8037 39149245 38833107 38428581 37997426 37613564 37202910 37106373 36872046 36608266 36419925 36586870
8027 36586870 36884088 37326109 38064289 38971760 40250045 42053152 43813338 45872689 48453705
8018 48453705 51577148 55324291 59629345 64311869 70424487 78420370 88751607 102212642
8010 102212642 120656165 132594120 129273266 118453168 99800334 82205758 70663822
8003 70663822 62965347 57920201 54367575 51820234 49963792 48630686 47427697 46635755
7995 46635755 46448716 46622945 47014172 47734960 48470457 48897066 49210688 49641051 49885245
7986 49885245 50151623 49661964 48717763 47642229 46354099 45361909 44220091 43079852 42015791
7977 42015791 41001302 40275588 39811767 39732693 39889620 40457627 41411601 42732571 44510213
7968 44510213 46491579 48810740 51233276 53308805 55106029 56523962 57912119 59867161
7960 59867161 62669869 65801535 68818127 71178049 72710351 73437489 72287002 68960955
7952 68960955 64755508 60434740 56950752 54234126 51690800 48989366 46152024 43805910
7944 43805910 42222551 41059820 40349594 40160277 40250241 40551964 41094688 41864190 43049679
7935 43049679 44274529 45674474 47470568 49549872 51260277 52534345 53921031 55462345
7927 55462345 57647049 60371193 62458854 63230260 61886595 58546701 54089622 49310060
7919 49310060 45054757 41753854 39419635 37414497 35593502 33910834 32276138 30950823
7911 30950823 29922185 29279603 28895337 28930197 29125330 29064877 28876112 28532049 28129469 27743306
7901 27743306 27417893 27581501 27958292 28003408 27760665 27475731 27502399 27289374 26532841 25481382
7891 25481382 24160219 22782897 21770743 20464264 19140130 17792362 16733705 15807793
7883 15807793 15134836 14740636 14320443 14164954 13959647 13654229 13388810 13316960 13029249 12664269
7873 12664269 12114910 11490947 10983613 10496385 10045593 9588565 9074090 8674470 8245095
7864 8245095 7798456 7429225 7124880 6794490 6610875 6545926 6370957 6064140 5941323 5772608
7854 5772608 5565901 5377648 5271894 5252091 5130361 4991112 4972684 4910343 4958536 4790397
7844 4790397 4743000 4665161 4489663 4259087 4281591 4537052 4153638 3983315 3874245 3589532
7834 3589532 3419672 3440594 3485615 3444247 3393151 3331445 3221462 3114161 3198280 3136967 3007267
7823 3007267 2893175 2849135 2864709 2715590 2787812 2690595 2680001 2661953 2669933 2579296 2535750
7812 2535750 2599716 2655867 2604484 2625211 2564682 2570943 2609749 2499849 2435758 2427978 2479156 2480580
7800 2480580 2408163 2444262 2472444 2464730 2330934 2244505 2073679 2080225 2122005 2177990 2135780
7789 2135780 1977220 1951476 1959882 1938293 1837469 1941603 2034959 2004169 1937003 1905771 1944291
7778 1944291 2086399 2053621 2015794 2038214 2112262 2109302 2218316 2151753 2153768 2022562 1937524
7767 1937524 1976272 1902133 1962022 1906157 1860866 1795841 1714922 1669183 1671715 1576601 1532239 1539424
7755 1539424 1405647 1446207 1508782 1452914 1364960 1291045 1415111 1332788 1304068 1343526 1371030
7744 1371030 1391272 1316862 1353117 1408444 1409277 1276918 1178395 1212659 1135048 1142272 1160950 1051953
7732 1051953 1215101 1273548 1225608 1079654 1075336 1127974 1001554 1014747 1163288 1132683 1110889
7721 1110889 976089 878093 905337 1007800 939043 903578 899389 896369 915305 812644 750519
7710 750519 773992 773265 810934 750274 782615 792033 870284 841183 850451 864284 830208 792354
7698 792354 652598 685044 782710 802495 760467 700480 691960 582638 637980 702777 735615
7687 735615 763790 784535 764206 773727 808608 807784 884753 674889 705218 624056 625021 549691
7675 549691 693186 830356 837070 813616 882271 814544 676625 695250 692297 661004 796811
7664 796811 824032 861391 807464 792051 770131 850010 886654 816872 814018 927769 892745 771224
7652 771224 739902 679466 779920 828739 839466 907704 860458 753924 825659 753747 706665
7641 706665 755374 655956 726912 759584 811611 789195 674300 722095 803738 898210 932429
7630 932429 898070 890379 959300 988986 992646 1013272 1004772 931408 831817 887171 863557 755227
7618 755227 780007 724564 770861 754446 756531 657724 737469 803156 835660 763915 662520 658141
7606 658141 705416 676003 772094 802989 753453 792961 813253 866556 873996 870713 841039 797635
7594 797635 763767 764870 827546 772630 870167 783688 762940 873707 915484 774906 814715
7583 814715 814574 866360 796166 863277 1098122 1145764 1103323 1045150 950796 847562 958916
7572 958916 938431 948954 763709 792182 783891 677366 593668 640614 725472 661536 550067
7561 550067 560660 512011 568224 692480 648163 416546 423596 373008 385383 590192 569842
7550 569842 513045 488710 407092 507563 541756 356342 335769 464288 479394 509994 509359
7539 509359 541706 562218 476374 549351 606527 649811 613190 621468 619389 584854 580486 441016
7527 441016 505771 545655 615295 578189 481796 568602 510982 396443 365095 293082 392728
7516 392728 522356 515018 453414 390155 322541 285615 378799 381511 359093 363199 468439 376465
7504 376465 439674 345227 390563 454027 429274 313958 347392 414701 381217 504628 431160
7493 431160 529939 488540 528594 390596 425804 433214 322366 241035 307559 348481 277927
7482 277927 200435 137978 161668 173418 285099 137700 93136 145015 173040 58106 137279
7471 137279 223185 171739 94049 190787 183437 67739 173813 196274 72997 -27631 26537
7460 26537 190454 101238 126822 135504 3105 55637 92449 117356 129062 97176 77367 143919
7448 143919 -8690 -5243 -19080 133309 116785 37885 -23622 -75042 61994 121517 190963
7437 190963 133247 41297 107694 41109 28994 -17718 -84215 101315 112338 59577 92130
7426 92130 42792 49116 155450 128678 27524 58721 129216 38579 -22366 -11922 -5636 -95084
7414 -95084 -29201 50489 75463 49603 -7812 63611 74326 14962 39604 105788 66132 38758
7402 38758 28881 -38397 -54570 5981 -12934 -31579 -51464 -96729 -52819 -63671 9779 -72577
7390 -72577 -39271 -19182 5582 1330 15812 -52726 -37171 34815 8320 43461 14924 -40741
7378 -40741 12432 96391 59413 -35446 -105391 -59065 -125860 -39090 39104 -79726 -29188 -1574
7366 -1574 72578 85042 -116215 -116298 -59320 -61875 -85610 -35163 -73347 -158480 -171401 -18783
7354 -18783 103705 24179 -19991 -107758 17007 -25035 -125535 -64988 -66643 55701 39800
7343 39800 -40084 -102133 -103071 -108927 -65722 1423 -30448 -29262 -30806 -46700 -66816 -23580 45941
7330 45941 19578 -20104 -125826 -125043 -101820 -122441 -123348 -119653 -28494 19534 30271 64915 86198
7317 86198 37989 -41305 7745 70725 51788 -1839 -43307 18091 -68223 39851 -60991
7306 -60991 -108343 12303 33699 119128 19183 7214 -74785 -141142 -19594 45180 34019
7295 34019 -59069 -165916 -34588 -51931 -66822 -48591 8169 12738 -45190 -66084 68033
7284 68033 34206 28714 35130 -113472 -164608 51906 96223 70785 41555 -33263 12923 48261
7272 48261 -7446 -34029 -54260 -67370 -80988 -51569 10680 25417 49585 49082 63072 33070
7260 33070 56776 -3356 111539 140007 50326 -37529 -36683 1389 -148537 -192528 -75483 -13138
7248 -13138 -70963 -52382 -112289 -70695 -52979 13743 -29414 -62109 -106790 -80394 -28847 -75127
7236 -75127 38219 -94865 -31612 -70050 -131786 -127086 8740 136230 9281 -84370 -3853
7225 -3853 14574 30097 -12656 -86497 -44395 -37085 22260 -76665 -129905 -52093 -68488 -87546
7213 -87546 -38339 36118 21302 15174 -35767 -133229 -3955 30487 -60982 -51915 -94385 35446
7201 35446 13141 -65944 -143959 -23913 -22307 -87323 -52422 -48135 -85400 -147091 23140 103859
7189 103859 -20674 -42016 -101711 -235506 -304411 -174086 -144936 -114789 -111526 -113379 -164459
7178 -164459 -139698 -109424 -72973 -16854 -53862 -23479 13161 791 19263 85217 -71215
7167 -71215 -88097 29399 13935 87764 25736 -58738 -60059 -99841 -28772 -90211 -129896 -117509
7155 -117509 -89249 -15949 -71499 -83322 80781 48492 -57144 -131864 -40953 25905 1361
7144 1361 -12391 -59859 -228354 -145010 -26725 36136 85510 -97414 -158520 -36688 -100285
7133 -100285 -159915 -124744 -59172 -27 -94616 -196108 -225022 -145737 -106955 -25563 -43317
7122 -43317 47916 -18194 -142120 32012 14570 51057 12983 -15068 -131683 -97453 -127577
7111 -127577 -51892 80408 52786 8567 -101331 15102 87730 38177 77006 50924 -69313
7100 -69313 -78340 -34273 120259 50809 41432 6320 -108432 -69891 39325 127708 58308 -28103
7088 -28103 -101430 -137598 -24655 74623 60520 122539 22194 20372 -13838 24131 110390 57253
7076 57253 72307 44272 48575 182631 177156 222651 316672 279506 160266 -26843 79190
7065 79190 70376 50387 -39114 -74898 -53847 -190232 -51003 55705 50186 26527 -100792
7054 -100792 -112318 -43657 59517 42377 44783 34626 -43146 95771 145314 99093 -14619
7043 -14619 16512 16910 124904 45312 27492 13204 32117 123708 41390 84410 96192 27869
7031 27869 -18954 -27473 36084 48669 29865 -12014 -99771 -63970 36941 51119 -2381 22027
7019 22027 43597 45127 33134 94551 -96570 -234397 -86479 -48431 -42250 34455 -46810 -76991
7007 -76991 -3399 39771 93496 63316 29131 37410 43763 3268 53394 79715 38812 151099
6995 151099 183763 85213 49111 75519 17245 56521 -2373 63546 39428 79367 63934 -23980
6983 -23980 -52087 39387 5615 -40140 -76967 12494 87874 -78782 -121051 -120962 -76921 -27684
6971 -27684 33073 42125 34422 60134 84145 29702 -31303 -18257 -6143 123218 13385 -50766
6959 -50766 1105 39117 28546 46640 120986 56002 18659 75688 12825 -74936 -61879 -97884
6947 -97884 -69926 -58247 -106595 -58646 -117943 -17749 -30315 74992 43554 -59940 64198
6936 64198 1387 -32560 -1402 -104743 -137477 -79619 -100499 -96731 -83736 -28122 -103231 -80091
6924 -80091 -153535 -165191 -84662 -75012 -28173 -99540 -171802 -97665 -146035 -57629 -31928 28170
6912 28170 49791 17341 50248 44292 -34480 3780 -82794 -132729 -123640 -56295 -18649 58905
6900 58905 73802 89188 84525 67469 130934 77440 131334 151480 170395 283158 272125 359299
6888 359299 319497 390918 364613 469779 417588 273460 302973 281038 280783 262496 298256 318893
6876 318893 229175 164464 163828 234124 149359 114528 154290 192966 171891 203651 180338 114824
6864 114824 74222 61783 79048 110609 239387 221237 238124 162692 112956 69491 128016
6853 128016 74026 42696 42812 115226 68711 115309 119427 75032 177688 176129 147179 40006
6841 40006 54748 169516 151283 30403 29193 77244 126940 111678 54809 62560 131003 17456
6829 17456 -18525 84598 51086 -17381 -108086 190 72732 47656 -24137 -63117 44508
6818 44508 27381 -40915 25077 -53704 87625 133198 34773 -23405 7541 -127934 -48595
6807 -48595 7592 126626 197123 112446 59699 68014 134954 124798 77207 89884 38191 -6819
6795 -6819 -3731 -91285 -63751 30677 163756 174039 82623 87575 114982 107908 99075 92920 228816
6782 228816 201035 18576 10136 -63519 -44386 76704 125964 132313 92534 24553 16264 79784
6770 79784 56346 123626 70899 13126 36693 114720 102213 70598 98804 66831 66099 110116
6758 110116 52500 8542 -63027 -71942 28615 -51446 52235 30300 19964 117343 103833
6747 103833 95327 101152 181324 142245 28587 16286 63940 51435 -32454 23796 97642 -22270
6735 -22270 54819 50732 34867 35839 170025 62241 -1823 181966 279046 199025 49520 72655
6723 72655 86813 135669 215472 254140 204912 224166 84462 24986 183766 144994 27287
6712 27287 142023 144348 86767 199936 104550 172697 166458 -53991 96108 173699 161597
6701 161597 270656 336715 170789 155633 205208 229983 208288 169360 193999 221365 286115
6690 286115 248436 178954 252727 295629 307040 271042 196926 194424 288142 358129 401966 463895
6678 463895 384915 321984 263726 312526 300468 392520 298520 405530 432510 297594 237946
6667 237946 249605 235830 270967 221262 221893 274033 376545 354078 348213 398718 395207 365163
6655 365163 500639 464315 458453 488854 526352 527994 494472 528012 401720 475331 460409 555977
6643 555977 486305 409785 375800 460720 441077 465853 601413 603274 674602 691590 594749 605488
6631 605488 625493 660568 658567 685787 621304 648755 754842 717585 793570 810930 751098 876909
6619 876909 940096 874238 879472 816216 829661 871904 798680 919232 906059 848894 934970 1005114
6607 1005114 1100012 1105513 1059758 1248251 1313334 1244987 1219461 1366980 1308357 1369084 1483285
6596 1483285 1535406 1667562 1730491 1704939 1827318 2016961 2064306 2130787 2078845 2189111 2371535
6585 2371535 2264935 2264251 2243112 2365489 2450157 2542979 2681207 2619658 2670777 2674003 2730911
6574 2730911 2766343 2903991 3010742 3197175 3299663 3459484 3569291 3672233 3669184 3798678
6564 3798678 4034726 4253174 4382495 4523413 4830763 4915836 5150434 5353579 5651285 6068413
6554 6068413 6343905 6642238 7046486 7510820 8008361 8608188 9270614 10047982 10946761 11912941
6544 11912941 13033685 14303005 15769510 17520368 19625016 22053966 24901709 28463323
6536 28463323 32484462 36664946 40516018 43375821 45202941 46455227 47698038 49964726
6528 49964726 53683371 58312144 62055583 63344611 60920760 55090761 47503174 39890867
6520 39890867 33653216 28889486 25464986 23012153 20955783 19351227 18055711 16853898
6512 16853898 15899094 14971885 14073168 13178081 12405764 11641239 10896158 10282798 9890822
6503 9890822 9453070 9110226 8934316 8767579 8714440 8744883 8852838 9078664 9262610 9543600
6493 9543600 9887693 10164288 10643686 11150788 11741274 12640145 13742350 15039965 16547260
6484 16547260 18118848 19164725 19167394 18080141 16192044 13998978 11921327 10347617 9139620
6475 9139620 8065448 7448908 6929988 6509521 6039943 5765465 5479483 5140177 4908929
6466 4908929 4758257 4585950 4368436 4270116 4262206 4174787 4070800 4053270 4012034 4120086 4234700
6455 4234700 4407241 4490718 4633938 4836900 4784995 4556958 4312519 4005618 3745166 3525521
6445 3525521 3357304 3199095 3204926 3132230 3112940 3065287 3026836 3017375 3032467 3074932 2991090
6434 2991090 2911118 2861806 2890189 2899140 2810832 2763196 2629794 2668071 2613200 2566051 2509349
6423 2509349 2587226 2652393 2530675 2632572 2712648 2736856 2714451 2791612 2878925 3015116 2943902
6412 2943902 2848091 2797071 2794242 2816389 2634011 2463516 2251948 2145531 2081922 1983540 1880490
6401 1880490 1804574 1730269 1686306 1656427 1470706 1399363 1412398 1369037 1353522 1317846 1275468
6390 1275468 1126467 1117319 1159074 1123639 1034307 987404 1017768 906188 803528 742227 755595
6379 755595 865694 900257 880517 860693 776970 786602 766095 691252 701022 650614 638979 679325
6367 679325 694503 660236 691302 725324 691873 612323 658121 654346 574586 573304 568871 661564
6355 661564 583933 450424 501929 552105 487068 508184 551877 600713 595500 617522 565905 563744
6343 563744 593492 696457 608769 666466 655497 554998 590235 565479 486386 443342 431179
6332 431179 459001 493906 471765 619540 635169 501621 577059 659083 525194 682597 688850
6321 688850 771378 763048 701290 715984 726554 764669 841363 892894 971026 1132286 1046380 1123175
6309 1123175 1238656 1387724 1462886 1645730 1814388 1939985 2106906 2190963 2446084 2491629
6299 2491629 2607163 2727010 2658232 2722947 2623721 2351928 2138889 1982799 1741111 1535352
6289 1535352 1435833 1355071 1308145 1248049 1131729 958173 919040 823033 816978 853081 727180
6278 727180 719796 642072 655432 626894 553065 615155 557556 559796 721176 691662 600820 593625
6266 593625 552484 586821 584979 549840 493567 439435 425399 418012 471542 446581 450040 362169
6254 362169 334726 318026 397005 354842 353285 363565 386100 330774 257529 366268 397861 392499
6242 392499 399512 372014 332268 310979 305536 184972 228824 242458 199725 186866 282091 243285
6230 243285 222341 300856 330431 236845 139419 260668 184153 220727 379796 346378 237030
6219 237030 283292 240687 272133 171507 120461 85792 74502 137364 119917 124582 213743 257674
6207 257674 176882 260349 208054 29577 80596 190349 158326 46298 138898 14558 10908
6196 10908 48221 91665 176616 214637 257873 273350 173429 99807 113452 192352 188072 194172
6184 194172 271271 352070 215185 331209 329803 311325 319416 367387 359070 434561 386423 268892
6172 268892 323295 405393 392909 356709 274793 276986 353953 410255 479044 454975 480433 434473
6160 434473 318046 184902 290643 245570 106984 148788 252353 276688 184369 49093
6150 49093 -7404 156630 187536 234349 188655 146007 113352 208275 263317 142816 232950
6139 232950 197145 72212 161114 199844 141806 277895 126606 97678 47232 190942 239005
6128 239005 222826 192164 107305 130492 106189 92889 147642 66556 70563 119331 172719 132463
6116 132463 220873 200366 247951 227333 153690 140139 134491 125424 161696 106229 -34517 15112
6104 15112 192788 100554 188699 174737 94181 141924 108703 27927 37605 82223 52053 59250
6092 59250 271903 213438 72423 123379 -43086 -68052 -141942 -98206 -134335 -45530 42699
6081 42699 76083 62793 -60711 -88631 -12720 7168 -24774 76339 -2838 5103 -23689 -7608
6069 -7608 -77493 -23103 -29016 -20489 22520 -490 -41667 59204 45581 25063 -11194 10932
6057 10932 37318 -97104 44771 -61538 -67496 49468 114778 19335 18537 -26783 -44004 -53357
6045 -53357 -65211 -8834 24073 15453 34150 19838 -18125 -38640 -23464 -75969 -141031 -99035
6033 -99035 5091 1595 12381 -25025 75673 46521 122641 111204 19215 -52710 25308 57782
6021 57782 -145281 -12830 54905 -62324 -56056 21973 5828 -31985 17853 -18362 74323
6010 74323 118923 -23204 8226 74627 5127 -90882 -30139 -2634 -8248 -96795 -66476 -13119
5998 -13119 -106275 -86681 -23391 40532 -102240 -78576 45130 20249 -18615 82646 80437
5987 80437 6710 -43670 7267 -68797 -13399 73690 79528 -76140 -88824 -68956 -2207 -33573
5975 -33573 -67588 -17406 -70728 -132976 21053 44983 -92302 -172226 -150203 -43933 105774
5964 105774 105109 -60686 45873 29018 -25297 -34042 75089 76283 -63066 -10901 -46189 69462
5952 69462 141883 58552 177096 -30219 -69938 25796 7471 -5160 52725 -4549 51709
5941 51709 119678 125927 17873 -18616 -7420 33135 49707 -1475 -11968 13530 3636 28435
5929 28435 17235 101108 112253 -10819 -90470 26415 107304 4762 -93020 -10510 66482
5918 66482 16945 46595 1810 -54602 29918 -138268 -182411 -63959 -62975 13336 36679 -196697
5906 -196697 -173834 -159028 -142552 -75413 22274 32958 -70048 19212 -46013 -3562 41639
5895 41639 15676 45533 129462 94723 21894 63535 119643 16263 37601 82185 47155 184886
5883 184886 129208 -18365 -35395 18438 -74966 -25489 -113043 -97945 -83257 -61782 48289
5872 48289 -15502 -12372 -38360 223 75239 44689 53311 48469 14613 -91149 -134144 -101923
5860 -101923 -57163 -76480 -120997 -28479 -21298 -62569 -55209 6379 73249 -31892 -99000 -50898
5848 -50898 -18901 -17408 -52066 -226 60286 46935 -68976 -30311 -10274 45553 -20168 -35987
5836 -35987 -67921 -3997 -33681 -66704 -58815 -51724 25906 -39056 24942 68867 -7677 76415
5824 76415 65629 -47277 -12730 -2169 -76366 -79266 54353 151729 50203 -173829 -150952
5813 -150952 -123681 -133170 -31562 -105394 -30180 -67079 -66123 -36345 -58000 18690 -58038 -164195
5801 -164195 -40865 -10624 1802 -23279 -155914 -113775 41843 -44228 -146592 -61921 -91787
5790 -91787 -39974 -5060 48879 -70897 -28091 126742 26966 -75116 -116944 -135648 -137454
5779 -137454 14828 -96040 -43476 55999 25389 -36613 -15858 76595 59620 -29469 103632
5768 103632 109673 -10978 82960 97341 -13895 -82881 -20849 81874 15383 70285 76122
5757 76122 42983 59016 78457 204132 182983 133085 103545 -101662 -3467 83561 21403
5746 21403 116748 103798 72784 33923 85700 23381 68278 99018 -2279 -66757 140864
5735 140864 83746 2620 55704 147374 217645 169233 97114 80484 12933 33250 111633 4270
5723 4270 81525 97672 108429 154894 80784 62742 200538 176506 117555 251261 260594 182504
5711 182504 196580 211516 239819 313961 223980 281206 266952 304100 436799 396503 419078
5700 419078 413745 386900 374772 303419 339897 314320 362868 360048 489264 413564 369206 331488
5688 331488 240275 333206 459419 412585 413711 404702 480015 450092 529812 546827 524007 545239
5676 545239 480784 555867 623652 616300 489283 434499 338074 424231 506844 518966 482320 472453
5664 472453 424877 431388 392700 392906 357143 386032 358206 396591 324063 401200 481575 427140
5652 427140 416981 388605 334305 410528 468264 369250 360337 457104 362263 376837 475104 421434
5640 421434 462482 290867 252661 266084 259296 342753 305356 308169 314716 287499 253816 266602
5628 266602 214134 250403 334441 387336 439382 269711 241486 313591 285164 338089 442978
5617 442978 422265 406748 398494 351268 285535 304712 362244 364996 461790 428889 429742 482236
5605 482236 438698 394066 305569 441568 355688 361929 335767 422422 562136 538265 538611 509629
5593 509629 619327 577582 573365 599402 590839 559866 484219 397299 421821 604091 595733 555335
5581 555335 595240 437481 490349 453107 371307 449278 468244 578446 578848 649336 678401 581718
5569 581718 567661 636095 660818 562945 491944 566506 568749 599885 701924 647519 705731 645735
5557 645735 644843 695197 737005 709446 768736 741947 740878 727733 776282 879999 855007 811781
5545 811781 822781 869551 807714 812092 944018 979501 894883 831110 835449 911175 968455 862652
5533 862652 1032863 1159478 1087960 1046574 1050555 1054215 1103575 1107756 1126996 1179181 1226280 1285995
5521 1285995 1229943 1199102 1227738 1290897 1331025 1341837 1253175 1439097 1428591 1459057 1496954
5510 1496954 1559774 1629900 1641816 1606717 1615482 1619240 1686695 1648253 1587047 1793003 1781515 1827324
5498 1827324 1931329 1929041 2039970 1987088 2016714 2135291 2106480 2237343 2294850 2262763 2374292
5487 2374292 2540319 2667585 2732686 2675043 2746519 2761520 2843755 2963464 3076252 3120320 3135497
5476 3135497 3288802 3417155 3510741 3591279 3775410 3925452 3974776 4228087 4228706 4263765 4366021
5465 4366021 4553521 4612598 4817732 5043055 5138548 5256055 5239887 5574724 5739780 5904174
5455 5904174 6143217 6421210 6619704 6983199 7268549 7631970 8026223 8273388 8745299 9317665
5445 9317665 9824720 10424224 11072965 11824450 12614079 13427781 14511519 15653637 16347287
5436 16347287 16850152 17058298 17013983 17015621 17072514 17164177 17497590 17889078 18529454 19240628
5426 19240628 20133609 21231082 22583541 24177728 26007644 28062511 30220912 32535445
5418 32535445 34970610 37261026 39111699 40885429 42705948 44597323 46451922 48032752
5410 48032752 49139569 49967303 50770765 52264365 54167719 56187992 57761695 58220758 57779888
5401 57779888 56775410 55979137 55780030 56078085 57084140 58427112 60064306 61483139 62486901
5392 62486901 63021443 62865414 62323882 61657405 61261196 61105723 61356004 61999430 63004641
5383 63004641 64568555 67152044 70763188 74662124 77592634 78087665 75385298 70347213
5375 70347213 64616829 59392781 55316390 52393388 50279792 48653014 47251074 46015208
5367 46015208 44885595 43572616 42538521 41723750 40893292 40087533 39455644 38854571 38438502
5358 38438502 38304233 38601274 39561717 41016978 42722228 43762251 43555302 41773254 38724888
5349 38724888 35163817 31808587 29136697 26948527 25142365 23628234 22579308 21611668
5341 21611668 20832931 20175859 19703325 19397770 19171151 18626858 18055294 17482614 16839493
5332 16839493 16169281 15403954 14889664 14355332 13946467 13601866 13367629 13066501 12770395
5323 12770395 12665379 12354438 12120479 11863867 11581470 11272712 11055079 10908493 10840330 10904247
5313 10904247 10905468 10847122 10793349 10629093 10395900 10102323 9862098 9695923 9429154 9139380
5303 9139380 8854251 8755524 8581471 8495208 8369658 8230555 8152833 7983291 7668724 7353955
5293 7353955 7198015 7052853 6869939 6851838 6587589 6549632 6543426 6710512 6581153 6470802
5283 6470802 6397780 6278940 6168471 6003760 5967866 5823893 5770287 5749287 5580964 5425466
5273 5425466 5369808 5282273 5250499 5175963 5213652 5127336 5013780 5027693 5101821 5008088 4917225
5262 4917225 4845317 4786108 4805515 4771065 4769785 4665416 4609310 4721304 4607314 4489478 4557025
5251 4557025 4520063 4485138 4588792 4615001 4767002 4874683 5068566 5192877 5295193 5285357
5241 5285357 5415050 5390888 5442149 5566563 5464662 5576752 5634313 5452262 5333080 5208415
5231 5208415 4939137 4800524 4633804 4649608 4578229 4627857 4735141 4656525 4704328 4680878 4763168
5220 4763168 4890461 4934499 4923813 4832117 4938659 4954004 5177860 5152609 5054717 5032676 4840730
5209 4840730 4731848 4595878 4548222 4486445 4390202 4375127 4395690 4416885 4323788 4385602 4342232
5198 4342232 4215036 4118502 4091377 4070035 3930721 3772373 3586324 3531002 3479509 3397560 3313777
5187 3313777 3244328 3158269 3190046 3166218 3117660 3177068 3100473 3009103 2989512 2970914 3058766
5176 3058766 2960375 2884357 2947742 3063198 3037531 3042021 2901807 2875698 2858761 2695162 2616230
5165 2616230 2576859 2587941 2583553 2552863 2525231 2600076 2521040 2491578 2419099 2406095 2288135
5154 2288135 2280619 2230950 2277800 2360007 2430644 2300916 2244334 2225912 2222721 2256981 2304244 2256329
5142 2256329 2280019 2315164 2239851 2193804 2142635 2153535 2241936 2259896 2333418 2260352 2093749
5131 2093749 2281918 2345887 2389821 2257105 2197271 2279833 2346010 2384123 2570152 2516772 2491966
5120 2491966 2512499 2610077 2658002 2831163 2998006 2948834 2987635 3202708 3236156 3345689 3356275
5109 3356275 3519474 3725386 3829250 3932535 3841273 3951007 4075957 4217582 4200693 4078819
5099 4078819 4117251 3981929 3863675 3746626 3830528 3949406 4054977 4131799 4165161 4146108
5089 4146108 4202125 4236351 4353743 4498002 4512879 4686966 4733007 4901252 5163414 5294702
5079 5294702 5449762 5716186 5878994 6073471 6284405 6594561 6845479 7049288 7200563 7408476
5069 7408476 7526177 7656356 7831532 8171010 8536532 8807201 9222101 9837149 10556214 11270062
5059 11270062 12127576 13103170 14081860 15242262 16546228 18303419 20275776 22453117 25017885
5050 25017885 27490084 29557497 30676791 30305336 28835492 26881796 24860995 23228920
5042 23228920 21947546 21076412 20502887 20256494 20334828 20756397 21067624 21850096 23000698
5033 23000698 24340410 25959257 27926115 30230131 32658140 35619664 39010817 42911532
5025 42911532 47172212 51491730 54793412 55678553 53933750 49948013 45161028 40762765
5017 40762765 36863283 33750258 31345775 29451679 28065968 27173065 26509659 26142875 26014578
5008 26014578 26229710 26626109 27315671 28071364 29019718 29969360 30981230 32106748 33235313
4999 33235313 34582551 35576602 35682159 34666533 32484426 29741944 27044583 24711452
4991 24711452 22763367 21038771 19657966 18518949 17556273 16542438 15764556 15139841 14585471
4982 14585471 14217578 13720611 13126936 12725132 12335958 11774918 11430839 11089921 10766538
4973 10766538 10367089 10104811 9966257 9877834 9739307 9565965 9409080 9290987 9108407 8964174
4963 8964174 8841625 8701285 8607408 8568206 8491568 8267144 8266367 8246756 8268023 8261532 8153613
4952 8153613 8106918 7978602 7892225 7976798 7918780 7988500 7998072 8158784 8118982 8056869 8290630
4941 8290630 8239274 8290477 8367138 8270494 8278039 8413232 8527215 8483304 8627438 8621002 8710424
4930 8710424 8919625 8870657 8944899 9058828 9106890 9063430 9052695 9012698 9058257 9098711 9109410
4919 9109410 9253101 9390508 9655017 9992072 10290600 10591814 10952811 11439644 11801618 12193380
4909 12193380 12439579 12408146 12389672 12171852 12049119 11991116 11896862 11943438 12048189 12165771
4899 12165771 12412158 12516320 12754602 13083902 13237577 13491180 13860329 14314989 14856254
4890 14856254 15360471 15922379 16609554 17319792 18262226 19169665 19737581 20132066 20086914 19720578
4880 19720578 19389761 19216295 19077590 18992803 18977715 18992782 19152501 19266907 19558035 20040014
4870 20040014 20510338 20947481 21395013 21974259 22557347 23139550 24030702 24879322 25868332
4861 25868332 27063794 28116942 29087780 30091104 31109670 32115903 33173367 34442347
4853 34442347 35747972 37133870 38597504 40381788 42474889 45226132 48669740 52769951
4845 52769951 57601974 63302708 69956307 77698853 86854871 97654935 110162765 123541247
4837 123541247 137341727 149929866 158316904 162390875 161941123 155311840 144442041 130750725
4829 130750725 115175720 100088861 86616724 75183104 65810387 58203862 52346419
4822 52346419 47509016 43544787 40085630 37154200 34566355 32106655 30011898 28262739
4814 28262739 26626690 25181768 23887623 22693317 21580799 20753537 19843547 19028314 18398523
4805 18398523 17730490 17062382 16543961 16026231 15503735 14998547 14618344 14123406 13580778
4796 13580778 13188783 12791473 12352142 11940802 11579363 11177632 10868701 10557456 10348254
4787 10348254 10157662 9849877 9526885 9305686 9132579 8938201 8696154 8461523 8334478
4778 8334478 8267076 8037498 7930977 7629554 7404805 7327404 7343991 7253918 7094688 6952234
4768 6952234 6840247 6681817 6667153 6508758 6428945 6222985 6267037 6205343 6180947 6163547 6143017
4757 6143017 5945031 5871847 5900206 5896758 5863245 5718806 5723904 5724421 5618912 5522389 5474280 5315840
4745 5315840 5233227 5118163 5024712 4924440 4888820 4832408 4832035 4840225 4638570 4696626 4694824 4675921
4733 4675921 4803798 4873146 4993732 4941773 4954599 4908840 4897252 4998041 4968966 4959365 4914438
4722 4914438 4766418 4646095 4545164 4387072 4274641 4307259 4271054 4336232 4247881 4199367
4712 4199367 4234901 4238956 4110866 3998241 4007831 4082215 4067753 3991782 3938600 4000971 3983532
4701 3983532 3916056 3839857 3779416 3557362 3458413 3378258 3295844 3160723 3178048 3241306 3052355
4690 3052355 2962996 2982590 3006327 2977893 2877749 2922619 2843418 2612343 2602284 2517276 2380502
4679 2380502 2356802 2305518 2323269 2188527 2091487 2034580 1953001 1907672 1939182 1884469 1814631
4668 1814631 1850537 1783397 1795095 1707948 1692178 1679895 1781595 1735920 1579506 1631865 1568304
4657 1568304 1499903 1299568 1517058 1646825 1615168 1598479 1527430 1567570 1490804 1448573 1361019
4646 1361019 1429744 1487190 1443307 1338896 1391642 1439671 1310119 1238818 1303030 1234863 1179964
4635 1179964 1189993 1174175 1070413 972584 1125352 1126804 1214218 1194175 1077699 1194733 1098002
4624 1098002 1050431 1150750 1062057 1044673 1074187 1031699 1024238 983190 997482 992278 929556 1052133
4612 1052133 1094184 991079 979917 926537 1043832 1024786 990075 971476 906605 882141 889182
4601 889182 867425 859746 934895 876200 880106 910450 955285 929032 856028 948938 938421 936145
4589 936145 883808 906693 979128 973291 1049476 1058130 1135662 1015181 982558 1025933 933832 903625
4577 903625 1068138 1103966 998745 948838 995731 1050991 1054360 1142230 1132641 1142527 1271285 1272315
4565 1272315 1248308 1453024 1516449 1549098 1598630 1621872 1609874 1580757 1437756 1301115 1245012
4554 1245012 1172134 1098162 1123142 1070078 1116401 1037609 926783 900908 911094 862185 817329
4543 817329 816340 862924 884705 904243 960284 930232 812129 734302 591062 678969 629298 724329
4531 724329 739131 787453 781200 842772 845404 693998 634433 639657 731370 665419 741781 771367
4519 771367 745728 689298 694191 749790 721434 779906 819307 808672 887162 840735 766156 742332
4507 742332 929337 922535 934120 777551 728656 714289 771679 697176 826340 752771 777062
4496 777062 813635 831992 832101 703294 722773 666996 663513 721997 763184 705756 637075 696893
4484 696893 735454 723423 713396 691068 570447 632635 715659 742872 819843 797931 707922
4473 707922 663107 812279 690606 752982 742866 750765 716975 661689 687489 734079 810522
4462 810522 691934 752922 631460 688325 721312 833254 879327 780070 814649 869152 816717
4451 816717 832930 813631 857716 788043 725388 800935 794826 790957 771354 856947 925291 877584
4439 877584 780893 752698 869973 871894 856694 956427 959154 885555 797514 974106 929827 876056
4427 876056 951757 1039723 963008 974185 995122 956160 840772 788521 906242 961569 1050259
4416 1050259 992715 825043 1008439 1013322 1054823 1110995 1067323 1009860 993970 1021079 965688
4405 965688 902218 1007860 1092016 1050081 1040349 1133729 1060575 1105227 1034598 1004350 1073998 957529
4393 957529 931544 970704 984798 1014149 1007523 984199 892111 927095 952823 966880 1048420 994006
4381 994006 1016691 1113125 973636 1019369 1129684 1001412 1101046 1067635 1007928 1025870 1035191
4370 1035191 1126240 1115539 1085954 1162099 1092869 1081736 1104469 1146397 1172645 1209956 1225678
4359 1225678 1129400 1050640 1087464 1058899 1156658 1184452 1170954 1177560 1213516 1128243 1073010 1017620
4347 1017620 1040317 1153950 1164580 1238134 1243450 1184649 1196042 1229524 1344732 1310803 1355935
4336 1355935 1336891 1294386 1296157 1249824 1302394 1340282 1212280 1213658 1421808 1460592 1409579
4325 1409579 1274401 1262640 1324757 1276243 1280434 1321393 1206333 1216298 1336486 1272194 1277462
4314 1277462 1361177 1552760 1641040 1633006 1559231 1524327 1537463 1327174 1349674 1464471 1518642
4303 1518642 1552852 1482154 1521222 1553906 1635639 1661608 1606039 1681315 1652333 1636451 1612361
4292 1612361 1538588 1541134 1479961 1503169 1456133 1520870 1521563 1510475 1572912 1616473 1621808 1533354
4280 1533354 1610521 1620599 1617906 1577001 1541321 1544279 1609832 1579508 1613540 1710545 1780332 1784191
4268 1784191 1723183 1735614 1806844 1738639 1711427 1820707 1771283 1659261 1774432 1833601 1918595
4257 1918595 1901689 1888422 1914635 1840913 1817331 1856113 1811542 1821352 1802687 1875369 1918355 2043814
4245 2043814 1998614 2102943 2187472 2172902 2192455 2147615 2051361 1932457 1927923 1963811 2076751
4234 2076751 2034707 1969270 1981702 2044443 2000945 1936063 1977312 2063972 2093359 2073197 2048306
4223 2048306 2154371 2119678 2162330 2259793 2315738 2171319 2191167 2220537 2259940 2138520 2219114
4212 2219114 2285255 2182112 2286642 2300120 2320366 2304270 2329518 2301470 2327975 2361060 2424509
4201 2424509 2478499 2453439 2440644 2435185 2429754 2451833 2574784 2660644 2699854 2657093 2638407 2812695
4189 2812695 2959592 2979749 3022251 3015135 3063166 3254798 3284915 3459110 3761183 3926862 3980043
4178 3980043 3878753 3820860 3790827 3683415 3825454 3798854 3767203 3880926 3974719 4192161
4168 4192161 4296034 4344181 4324639 4319896 4321238 4202862 3984886 3841124 3659765 3610140 3552087
4157 3552087 3552869 3609581 3573899 3553193 3495045 3455380 3488963 3537515 3552687 3535349 3592928 3497842
4145 3497842 3480429 3548843 3601232 3641586 3575854 3422482 3506138 3619373 3600497 3646170 3670209
4134 3670209 3719299 3773151 3776341 3826837 3902403 3923307 4057864 4001836 4036687 3993871 3868747
4123 3868747 3955267 3967024 3993279 3879193 3912488 4000028 3982576 4021108 4036689 4165948 4100283
4112 4100283 4030817 4073562 4106294 4189529 4316876 4397624 4386520 4401204 4445266 4458622 4543390
4101 4543390 4637318 4637611 4690071 4797081 4760775 4824312 5008814 5174679 5322937 5360431 5424958
4090 5424958 5674253 5803391 5990113 6132384 6178381 6289179 6102896 5941504 5896271 5863917
4080 5863917 5902452 5800644 5679571 5683168 5670577 5750050 5770193 5774294 5817761 5780491 5858985
4069 5858985 5894422 5980103 6066324 6118171 6176759 6329108 6349230 6389943 6426832 6538373 6705195
4058 6705195 6768695 6741819 6868670 7193408 7197799 7315826 7356266 7412166 7528295 7634092 7737360
4047 7737360 7915754 7967910 8158994 8278101 8300349 8393819 8567741 8649976 8656699 8767881 8841113
4036 8841113 8925603 8929396 9048576 9223594 9388596 9368407 9387447 9491699 9698516 9882247
4026 9882247 10176834 10136058 10267110 10344674 10432993 10739759 10908129 10950627 11147992 11267148
4016 11267148 11629476 11832753 11986311 12247699 12321161 12413338 12366473 12328448 12382250 12584465
4006 12584465 12786057 13006245 13140009 13438871 13722722 13975430 14320417 14789622 15158991
3997 15158991 15724631 16316299 17102856 17958234 18821716 19867180 20966761 22267613 23968416
3988 23968416 25913339 27999532 30550038 33690190 37442487 42144557 47677539 52007905
3980 52007905 52830099 50256935 45243873 39301070 34521954 31028980 28486260 26729352
3972 26729352 25332169 24230312 23497969 22816421 22332222 21987901 21712771 21594267 21445875
3963 21445875 21362772 21327304 21364628 21400017 21457367 21347925 21179889 21160342 21107017 21033086 21250485
3952 21250485 21483263 21786520 21986676 22212033 22662277 23043559 23405835 23960140 24569237
3943 24569237 25076846 25548048 26119088 26829958 27666688 28542218 29550760 30464200 31524400
3934 31524400 32718280 33857638 35157133 36640822 38062933 39596683 41437496 43564790
3926 43564790 45978945 48797195 52056802 55951422 60435068 65688418 71698431 78480539
3918 78480539 86319066 95542983 106365854 119305912 134486945 152899572 175169244
3911 175169244 199747557 225760517 250998885 269079752 273942467 264125322 243546519
3904 243546519 218031392 192279667 169348190 149575940 132962896 119816071 110026361
3897 110026361 102595257 96459074 90735979 85348891 80225426 75350412 71131561 67553551
3889 67553551 64526223 61968078 59525164 57221029 55049795 53123324 51528867 50262477
3881 50262477 49399043 48954901 48507875 48165901 47833015 47230276 46502218 45713732 44892267
3872 44892267 44094423 43285806 42616185 42028280 41589773 41191593 40876299 40468952 40103722
3863 40103722 39791244 39486480 39086883 38923636 39041420 39347155 39543790 39824968 40018959
3854 40018959 40082971 40306769 40537641 40826439 41354554 41990313 42748768 43733829 44948049
3845 44948049 46458916 48114193 50136258 52591724 55511901 58853816 62770178 67462971
3837 67462971 72794970 79169310 86444338 95093464 105155629 117089734 131501255 148595391
3829 148595391 169853137 194675726 219229126 242012532 261201990 268368566 262734677
3822 262734677 247876005 223138364 194968491 168547828 144743022 125577364 111292378
3815 111292378 100691392 92581818 86468111 81841208 77967764 74246999 70791223 66983798
3807 66983798 63163341 59411144 55892222 52759712 50168393 48075849 46323771 45006892
3799 45006892 43901717 43071248 42351099 41911254 41614045 41424529 41387983 41329693 41450752 41685878
3789 41685878 42062633 42473613 43132769 44122082 45361172 46874979 48681771 50726514 53121687
3780 53121687 55576620 57978119 60542814 63619829 67388691 72492323 79131663 83254557
3772 83254557 81553773 75944268 67252330 58465669 52114767 47778033 44625403 42198004
3764 42198004 40333065 38933435 37715637 36874296 36376519 36007828 35866231 35861925 35899328
3755 35899328 36057567 36317248 36556762 36890786 37370798 37846548 38395287 38791565 39396537
3746 39396537 40383376 41612637 43032217 44517691 46054076 47092932 47775278 48261985 48808062
3737 48808062 49449810 50262507 51281745 52567576 53814243 55349459 57077015 59140139
3729 59140139 62254986 66623495 72318141 79456061 87010757 91274444 90094465 85024400
3721 85024400 77481138 70422996 65318384 61914112 59593036 58047987 56798602 55815816
3713 55815816 55211515 55326722 56111980 57020512 56596784 54602544 51157445 47045850 43444973
3704 43444973 40559824 38525168 36931558 35762448 35065326 34351685 33987186 33708707 33478886
3695 33478886 33366913 33315681 33381248 33514618 33580788 33548275 33770323 34133324 34777024 35629423
3685 35629423 36560681 37006566 36850622 36398966 35812687 35407343 35095442 34672606 34384813
3676 34384813 34116839 33704122 33039141 32354042 31679585 31278032 30643233 30104224 29528172
3667 29528172 29099140 28947916 28816950 28570491 28138725 27732596 27509662 27155617 27003703
3658 27003703 27064969 27262120 27394156 27739345 28093445 28489599 28730989 28810053 29048922 29424618
3648 29424618 29860299 30329228 30921307 31594560 32294222 32932327 33411260 33672036 33588724 33247400
3638 33247400 33015596 32886757 32940148 33137932 33419294 33882040 34177294 34554035 35048391 35347302
3628 35347302 35405966 35182500 34757414 34433111 34317089 34169971 34360672 34495647 34746080 35286983
3618 35286983 35725699 36025361 36477116 36812180 37181652 37768654 38414936 39271212 40440895
3609 40440895 41502633 42713866 43519707 44168884 44617695 45025368 45386399 45395190 45167970
3600 45167970 44778882 44222491 43758889 43336462 43415158 43700461 43931370 44337663 44890769 45592004
3590 45592004 46072885 46445451 46748140 47200076 47869873 48735651 49812239 51037249 52516660
3581 52516660 54018546 55332460 56359371 57077842 57713257 58339954 59076887 59731823 60119534
3572 60119534 60240289 59952467 59524091 59042868 58654641 58583955 58589613 58851973 58769590 58460785
3562 58460785 57833026 57160011 56496102 55953674 55402163 54888212 54518456 54216808 53837351
3553 53837351 53420645 53054138 52702111 52547803 52895060 53200537 53521288 53752118 53526263
3544 53526263 52864658 51642645 50166967 48579997 47294213 46067191 45033887 43981803
3536 43981803 42879396 41932971 40702576 39409884 38482249 37679311 36903472 36151420 35447086
3527 35447086 34733162 34181355 33594915 33204362 32976903 32773464 32640087 32508400 32367894
3518 32367894 32101494 31841657 31599422 31022344 30568396 30093924 29744378 29359167 28953953
3509 28953953 28635944 28074027 27558384 27062448 26530620 25910471 25362282 24688789 24231000
3500 24231000 23773315 23416331 22998829 22698761 22440496 22253259 22136382 22204685 22389951 22477722
3490 22477722 22642083 22580342 22598514 22573607 22451137 22362124 22460363 22573556 22780365 22941129
3480 22941129 23060572 23253815 23421238 23513438 23532788 23698149 23856095 24107515 24388678 24728646
3470 24728646 25029926 25398929 25960423 26449113 26771422 27231673 27682173 28075624 28422576
3461 28422576 28806585 29124818 29221058 29036602 28722275 28435376 28274771 28268477 28277523 28446813
3451 28446813 28785229 29292512 29914738 30705644 31578252 32525574 33601738 34708341 35728723
3442 35728723 36624979 37539559 38501022 39446144 40347027 41380307 42291617 42712069 42482342
3433 42482342 41977454 41358114 40669297 40141530 39932789 39694202 39575906 39468745 39238123
3424 39238123 39135475 39056437 39306811 39542624 40184659 41153055 42121865 43032297 43749521 44367097
3414 44367097 44680663 45172269 45900254 46650439 47369702 48009319 48731498 49427353 50035058
3405 50035058 50459098 50765214 50850858 50592197 49995332 49043415 47722741 46184303 44612039
3396 44612039 43278696 42365076 41831719 41582570 41321351 40996487 40742103 40300772 39713644
3387 39713644 39161422 38850555 38965308 39383000 39921681 40747293 41565337 42146880 42300284
3378 42300284 42086973 41622875 40777805 39755251 38607518 37320598 35940402 34405947 32948470
3369 32948470 31493663 30148328 28984436 28132492 27166623 26430226 25943830 25469589 25110473
3360 25110473 24821400 24758700 24616956 24446242 24413709 24396790 24354451 24057290 23801258 23307416
3350 23307416 22977683 22724896 22218988 21898733 21392994 20947333 20446450 19965187 19439338
3341 19439338 18962208 18517422 18081456 17662296 17201049 16883480 16592853 16418710 16100826
3332 16100826 15946292 15773397 15520345 15318936 15020824 14819110 14546092 14255225 14072739
3323 14072739 14011943 13569659 13248343 13008166 12823239 12703403 12532933 12318075 12168848 12013389
3313 12013389 11840582 11652952 11449268 11263071 11056841 10935220 10709706 10587016 10421077
3304 10421077 10198650 10003523 9780730 9608254 9551504 9487537 9374380 9205763 9025292 8881216
3294 8881216 8896558 8953074 8825214 8704776 8639113 8645849 8521057 8389427 8399559 8381460 8238926
3283 8238926 8280614 8180794 8063997 7881954 7749813 7526256 7480866 7428314 7330962 7268360 7161125
3272 7161125 7084909 7008614 6974737 6856076 6836757 6964403 7018879 7006976 6936782 6906819 7000964
3261 7000964 7058305 7150334 7118119 7105887 7139543 7108068 7139994 7171796 6980485 6926673 6985683
3250 6985683 6914911 6885924 6821534 6765600 6671306 6599734 6479268 6410476 6435676 6469487 6421798
3239 6421798 6372650 6393735 6402005 6451587 6408543 6449382 6608747 6734977 6849881 6879392 6847438
3228 6847438 6972150 7106202 7296825 7269348 7296694 7252590 7142395 7116578 7118060 7159178 7094844
3217 7094844 6978521 6957043 6768823 6725553 6775491 6736560 6840249 6684512 6691006 6712808 6800486
3206 6800486 6859664 6906430 6948383 6913640 7066828 7109480 7189837 7331098 7327032 7405548 7569902
3195 7569902 7679354 7771939 7730083 7699803 7545171 7524717 7341360 7116547 7104711 7002178
3185 7002178 6909660 6857311 6800365 6819716 6695809 6596601 6407632 6477709 6650990 6641785 6699304
3174 6699304 6621246 6669069 6695278 6659860 6879973 6913185 6942835 6950282 6915603 6771185 6658153
3163 6658153 6574571 6581632 6586133 6524839 6490447 6365433 6401110 6438494 6554415 6526083 6441112
3152 6441112 6434566 6459990 6464949 6525236 6617296 6704788 6685439 6600101 6421545 6319342 6096831
3141 6096831 6000130 5913481 5812709 5721052 5691293 5644503 5577140 5550892 5539858 5511049 5444892
3130 5444892 5474279 5460609 5566905 5580330 5585714 5432594 5380931 5293107 5210093 5325644 5390612
3119 5390612 5355305 5403409 5402822 5259230 5249959 5278669 5334463 5386315 5526676 5569999 5519399 5565491
3107 5565491 5654772 5679717 5840516 5848664 5820059 5812360 5841076 5932006 6053867 6206873 6322866
3096 6322866 6481519 6420188 6491002 6658187 6811873 6942423 7146443 7163219 7212716 7110231
3086 7110231 6870517 6751756 6654733 6559950 6420179 6222361 6176908 6192810 6167925 6205816 6224020
3075 6224020 6162475 6146546 6279428 6384066 6339249 6421589 6620887 6697601 6764301 6672124 6580845
3064 6580845 6362077 6320798 6324557 6203342 6156927 6247500 6316715 6310314 6198653 6331400 6553482
3053 6553482 6763305 6971653 7103184 7383970 7572840 7908621 8297775 8725920 9392016 9944790
3043 9944790 10622400 11506527 12449821 13431338 14635923 15649202 16938718 18684989 20173672
3034 20173672 20027665 18782317 16471394 14115204 12596295 11662126 10973099 10436335 10213300
3025 10213300 9950907 9949734 10023336 10234489 10376126 10784090 11263840 11843436 12332972 12878755
3015 12878755 13554034 14268608 15365823 16892778 18929383 20609795 20577582 19441137 17371773
3006 17371773 14909872 13110023 11822459 11004014 10214711 9599500 9220650 8854783 8438178
2997 8438178 8156976 7901454 7793437 7836254 7622035 7538404 7406511 7197679 7034388 6907256
2987 6907256 6731513 6767469 6717074 6643569 6669233 6753060 6666173 6529344 6435545 6310557 6281477
2976 6281477 6141466 5832031 5635443 5504325 5463408 5401895 5237706 5174580 5116963 4968251
2966 4968251 4828319 4884606 4923653 4835376 4827361 4805400 4715816 4624120 4600591 4636930 4656400
2955 4656400 4663548 4508931 4424350 4390500 4360918 4276406 4243026 4208440 4192749 4151707 4044483
2944 4044483 3957697 4003132 3944880 3881898 3891323 3834288 3831879 3820781 3890062 3836958 3770280 3637661
2932 3637661 3602540 3486414 3541564 3584014 3550769 3523726 3426454 3355090 3427108 3432779 3485634
2921 3485634 3419228 3464950 3401871 3442086 3470311 3475634 3448827 3329295 3246063 3167908 3134984
2910 3134984 3238997 3150706 2991266 2934229 2949758 2990441 2879454 2930029 2857538 3001097 2897129
2899 2897129 2789143 2639120 2644077 2745979 2718144 2732338 2647421 2629501 2665832 2563067 2489636
2888 2489636 2501643 2557689 2421924 2440743 2414095 2378954 2498770 2394939 2304717 2312165 2273206
2877 2273206 2255994 2107433 2108524 2132959 2132012 2079837 2024964 2014919 1961643 1877001 1871168 1807445
2865 1807445 1866720 1957681 1957467 1865227 1897334 1795590 1662601 1627745 1648332 1666285 1565162
2854 1565162 1723845 1748096 1732422 1762123 1669734 1628675 1717769 1760812 1728127 1704377 1762389
2843 1762389 1699410 1665986 1477906 1415800 1558375 1568389 1604030 1709037 1650053 1572277 1585171
2832 1585171 1553303 1464532 1420238 1580590 1404075 1490868 1593666 1634169 1581810 1424172 1366214
2821 1366214 1395960 1459322 1444070 1467933 1515879 1549145 1546677 1557764 1575343 1525100 1432884 1419923
2809 1419923 1662053 1642965 1594894 1559825 1597101 1756153 1671221 1643006 1589758 1618181 1509553
2798 1509553 1448412 1495342 1583291 1633372 1673137 1623112 1588419 1545757 1558405 1611475 1593489
2787 1593489 1493906 1544135 1650550 1601048 1536585 1595983 1609985 1599757 1595137 1591058 1607697 1607566
2775 1607566 1438738 1391649 1457662 1459579 1378245 1303206 1368707 1396511 1328870 1311180 1329578
2764 1329578 1336835 1375226 1380029 1322408 1363267 1352467 1417090 1432604 1389494 1248374 1298093 1434957
2752 1434957 1405307 1251774 1273944 1253067 1285299 1272431 1295560 1247879 1192939 1215329 1153903
2741 1153903 1099082 1018109 1091400 1076920 1029393 986435 994805 1004891 993265 1035277 1044201 983176
2729 983176 884566 870981 885544 893897 941681 946284 942834 912026 824505 803455 942330 1018725
2717 1018725 982868 774422 782536 762165 671956 715188 848671 744839 730549 763413 772867
2706 772867 781503 775726 852107 871121 842294 737176 736857 662755 679886 752848 670446 675183
2694 675183 724589 638859 659954 655307 572844 625895 539470 630057 610340 597557 580301 587431
2682 587431 572831 598298 575536 603468 585597 471354 536607 484447 443080 474140 482126 432235
2670 432235 401766 369661 332936 378695 393136 347797 447480 422819 462945 532044 440771 463152
2658 463152 561755 465783 434491 365756 232944 333332 402512 285801 371001 401404 321452
2647 321452 313836 276365 346313 294717 250185 297903 456886 432039 375653 329951 348099 423206
2635 423206 358014 436717 344610 360118 310126 256203 426910 339509 291101 321115 308696
2624 308696 226925 267730 296770 230249 209045 304492 287959 342234 338598 372704 280074 303775
2612 303775 350392 245902 322153 228845 234992 292743 203454 326863 304664 135511 257710
2601 257710 286125 283146 298112 256516 227658 233492 231969 356800 395105 310789 215579 306830
2589 306830 281350 308903 267836 223591 192333 198992 136624 211912 232764 234452 210110 258980
2577 258980 229895 252477 349640 283101 208528 148688 267430 160798 132403 222509 150435
2566 150435 299519 321211 78622 206839 259208 58858 121264 197274 217832 149502 163953
2555 163953 219593 81738 72179 169826 254630 142467 245216 221009 187071 247183 243107
2544 243107 160230 140386 105826 106177 226285 224534 183739 174155 217861 241100 132040 177237
2532 177237 124420 12844 88608 172892 119357 134517 182148 205202 156780 74140 115936
2521 115936 63021 91256 170308 152590 143707 313100 151006 48002 47269 103565 93837 -2528
2509 -2528 35267 143666 131577 52565 148318 131429 149972 264396 201347 94288 220080
2498 220080 79578 34874 74425 232911 237911 191086 156576 165635 187338 173879 130911 151112
2486 151112 226387 174887 152000 213349 281043 143826 146525 167184 94295 86634 166996 137027
2474 137027 109816 116846 230609 196087 203721 -1764 31453 58853 -32755 65006 37437 -32135
2462 -32135 20272 125195 141931 180072 52531 120178 158281 180387 137994 39460 93132
2451 93132 151716 168480 88729 126938 225958 177318 70704 93266 162934 150495 52708 33032
2439 33032 103848 147070 139074 207595 177328 49489 -8891 118018 142251 73523 76294 57888
2427 57888 105792 126709 39467 37580 64876 78915 83657 45944 62657 51469 37135 143665
2415 143665 199126 35336 106837 114796 6831 -20927 -41357 -6435 -5389 95297 100811 80602
2403 80602 32576 54172 34168 56501 47509 79695 82970 -78541 -130038 -60713 -64979 -46101
2391 -46101 66692 99105 182974 154654 166420 114575 151093 13695 55937 78841 18822
2380 18822 42152 108011 15169 90819 113847 197375 105243 72285 94817 115923 150187 170019
2368 170019 191852 133303 224558 168268 83254 18860 58135 21323 -32770 70553 36392
2357 36392 49532 151256 62619 176644 95142 112646 103901 170430 98576 34968 82819 132368
2345 132368 105539 76120 56381 92781 97269 114357 120086 104802 34314 74656 71192 56713
2333 56713 149049 72824 103859 107296 113868 152528 171092 120861 112210 120390 162865 175321 55841
2320 55841 69725 -36798 22530 149614 126991 136500 47879 115429 195985 144425 149474 158918
2308 158918 95598 127935 163233 291906 436934 490899 495485 527692 384768 389232 424243
2297 424243 303436 278702 289597 160957 159768 130361 160849 155573 100536 95877 -40873 121360
2285 121360 144248 85638 121923 100637 227175 178330 139614 92310 54595 195520 265218
2274 265218 255071 111969 98650 227338 166633 98893 150092 176881 181656 176471 142586 93333
2262 93333 108572 56238 147015 156024 41166 -54980 -51741 73730 76662 157756 205019 130062
2250 130062 4673 -80764 -28209 -314 134853 149568 22019 64257 123680 122237 149596
2239 149596 220951 170941 88777 36496 147258 138109 130517 245513 225233 202001 146041 216738
2227 216738 244863 212375 161025 159747 136803 216702 352883 278415 181400 280189 287186 258239
2215 258239 199300 201165 231155 345689 346623 386756 302452 266095 265747 313796 320633 215635
2203 215635 201361 302271 187102 206342 346394 284395 228889 167340 155776 92101 193509
2192 193509 69839 104138 284385 268081 58923 143846 304443 364442 367090 332935 273660
2181 273660 320747 320259 524698 508202 407952 384556 371208 338141 294359 429246 362063
2170 362063 354338 339813 348886 423909 386249 357295 333668 374737 423014 521704 496919 588923
2158 588923 555083 544207 461471 420105 523239 724454 664929 639148 658428 567052 581119
2147 581119 581948 632497 648287 681378 711883 811373 764975 781731 893682 873452 923643 1076334
2135 1076334 994976 968606 996238 1088705 1109054 1106756 1249402 1154505 1195023 1264543 1294163
2124 1294163 1394342 1268446 1398706 1449477 1495546 1506637 1532316 1627866 1564594 1608729 1725160
2113 1725160 1824139 1937622 1930092 2075689 2110951 2123143 2109526 2165475 2293167 2304007 2383893
2102 2383893 2391797 2357993 2436342 2554643 2623346 2676834 2818643 2986183 3207949 3305628 3440896
2091 3440896 3650851 3881429 4104695 4403145 4577772 4918281 5252913 5525464 5798323 6267129
2081 6267129 6644946 7078113 7670671 8418592 9345718 10418943 11782518 12953365 14139830
2072 14139830 15414679 16945191 18971575 21579815 24506889 27778057 32042031 37741345
2064 37741345 44918503 54149859 66439312 72421717 69105066 61055381 48310575 37377278
2056 37377278 30144526 25387378 21836006 19046034 17135903 15536202 14281683 13343771
2048 13343771 12579280 11736610 10905031 9977398 9067336 8379811 7623974 7192903 6785498
2039 6785498 6294113 5924781 5615080 5379376 5087686 4801511 4676786 4477609 4274005 4162357
2029 4162357 4034179 3865734 3806388 3625047 3530229 3431443 3286966 3156571 2934525 2858037
2019 2858037 2701698 2600638 2457082 2354522 2303137 2242246 2256635 2065958 2024217 2087110
2009 2087110 1970456 1994759 1844287 1838861 1872805 1776335 1621155 1605194 1607220 1550862 1566672
1998 1566672 1497935 1372847 1360060 1378657 1412583 1407161 1375910 1288045 1377620 1314435 1196764
1987 1196764 1247851 1216217 1221591 1256185 1180318 1071456 872272 919312 962954 878161 976334
1976 976334 806315 816464 758358 730194 771062 664752 639100 604862 695714 686732 727331
1965 727331 668631 621808 572759 474451 511737 598057 597454 631402 620792 576628 532354 524470
1953 524470 576472 475344 445961 426818 453658 365517 346196 303437 362522 357234 473017
1942 473017 395827 479388 582356 446528 551152 488955 508838 495834 414224 407632 316207
1931 316207 313910 341183 293532 353850 324957 228669 216638 342971 373797 338242 332718 253972
1919 253972 171478 233064 219668 340128 287233 243194 212144 223242 294062 314775 288762
1908 288762 309963 232439 173291 167302 214484 247518 255724 258631 245020 218778 178896 138621
1896 138621 223946 164506 109188 185626 212616 213490 81799 74958 262759 300998 244489 242375
1884 242375 93465 107755 214110 230390 180305 126168 148988 175830 216642 325994 276495
1873 276495 246179 157846 205719 115510 108905 93678 97772 87346 8894 15843 97193 112955
1861 112955 81327 149648 284017 249464 236540 202812 263223 186680 51844 103378 137538
1850 137538 144259 96887 75324 45040 70514 90729 121087 39071 54343 171107 200526 104932
1838 104932 103300 139295 56808 35792 138640 116362 85589 142269 193477 141120 164121 200071
1826 200071 224382 336941 353883 225435 312309 353169 358839 628671 666418 558893 506781
1815 506781 489580 267126 236074 133174 44462 168071 224176 75702 108943 91130 97585
1804 97585 192131 163599 95826 152744 192217 236382 250282 187845 149077 72475 109336 80128
1792 80128 -9161 45020 3291 23693 -26182 -94274 32517 -16600 7148 -81365 -122430 40200
1780 40200 171389 83072 93822 35033 76918 52439 49808 -17 -55635 5015 92747 29706
1768 29706 52802 110550 11690 54959 63991 48383 56132 92871 129818 62534 134705 120607
1756 120607 28767 -5242 71883 -65782 -29491 68593 102990 73423 57488 74453 -7534
1745 -7534 -6891 -47125 96226 34577 30629 57157 69091 10485 -42417 68362 50430 76464
1733 76464 -59544 28318 94471 86959 98131 11447 80637 132943 35256 109871 25076 -30684
1721 -30684 81782 16465 26572 57087 -12686 -162515 -102324 140448 163400 133165 9758
1710 9758 32577 74396 202521 147592 21955 96062 -16558 12536 56227 33278 -71630
1699 -71630 16460 2861 -27108 -71331 -146369 -115291 -44057 -50038 -39139 -596 87880 107344
1687 107344 41970 -8997 -83034 43803 70865 11758 45415 13935 87209 4606 53418
1676 53418 10729 52567 -90805 -81426 -3204 29068 -22182 -66167 -98 -34988 -47629 -61480
1664 -61480 -75413 -90385 -69512 -56467 -71480 -79474 29539 67804 -42508 -151516 -125616
1653 -125616 -102396 -225100 -179206 -16780 16136 23249 70833 19800 -65465 -117573 -157005
1642 -157005 -34553 42390 15772 53089 9604 12770 -5679 -52401 4101 98193 180332 138914
1630 138914 45730 12335 77087 103201 -2750 10780 89370 20498 -67973 -92368 -54742
1619 -54742 -43750 -69968 -42640 -136782 -40781 -41983 -55209 1250 -39973 6229 -42087 -2796
1607 -2796 42937 40805 -48762 -102626 -57485 48269 6054 113016 171764 53612 -28180 104116
1595 104116 61966 -30064 -134662 -147687 -33464 84907 81322 85126 107414 109635 93644 46181
1583 46181 -84602 -85430 31118 -47036 42948 100664 78439 34356 -83110 -4219 61341 82231
1571 82231 -68173 -63376 -66779 90284 50957 15622 77509 -16937 277 -18518 -85809 -14233
1559 -14233 86748 -27736 -96889 -5921 117550 -30808 -83784 12772 -26817 13900 148924
1548 148924 154787 10655 -91319 -107632 56389 142769 21884 62958 79822 55098 -6550
1537 -6550 58555 76494 -83943 -47820 61348 31109 21603 -50527 -53695 5486 55907 95957
1525 95957 34339 37930 42858 18256 30101 32631 36621 17883 50768 -36255 -84381 -76164 -12261
1512 -12261 -15099 -38331 -104041 47239 108715 36813 -120312 -131386 -7965 -86214 -68420
1501 -68420 62564 70383 83687 88622 -8424 10322 -20983 -442 -21308 -35756 13063 15641
1489 15641 -12255 5544 77309 82943 165193 65605 -104384 -90901 -11330 -17732 38987 133998
1477 133998 84222 -90630 -79036 5639 -49195 -43893 -65080 -49472 -69214 -42565 41774 47605
1465 47605 60476 72922 100154 73080 114195 -1178 -36058 28247 27835 73028 -82571 -65063
1453 -65063 -106314 -71154 32875 61073 58723 -22112 -15741 26730 45381 61574 15343 33454
1441 33454 -7221 -18840 -150287 -100767 18303 -16435 -44498 -10334 -53093 2407 18504
1430 18504 59747 44227 -85977 -93413 -47933 -65308 -225263 -144936 -10699 -71475 -89056
1419 -89056 -25437 -132722 -93670 -11819 -8157 -42471 10156 -93381 -119639 -98827 -33893 -68539
1407 -68539 -117411 -100573 -14376 -61117 28587 25646 -82443 -12485 28079 60895 -986 -122768
1395 -122768 -102637 -61406 -8779 -37883 -102497 -89342 -78243 -42400 52921 148297 3839
1384 3839 -24786 -7672 -83610 -40703 18786 31199 89763 -11103 -9865 61391 39691 103767
1372 103767 111884 48563 18440 2590 -28313 -1983 15003 14599 -5123 9566 84978 95779
1360 95779 50677 101490 58062 -27707 -19909 6808 -5587 43625 158012 14984 -106979
1349 -106979 -119506 -66408 -109634 -123423 -28369 21084 -78454 -95150 -84497 72511 68120 42179
1337 42179 27578 26642 -19661 3730 5228 27543 21849 15835 11259 61392 91022 17735 -13447
1324 -13447 50168 3050 -19103 -26631 182046 184185 -14945 -2568 -87196 -67848 28123 -55027
1312 -55027 -89981 -156437 -82747 2008 -93839 -13923 76123 51021 -50974 -88250 -70814 -65587
1300 -65587 -150981 -126946 -89681 26123 4242 -92930 -59582 -33001 -7032 -25619 -45082 18473
1288 18473 37238 144482 64030 129539 206184 54231 69901 74648 61313 -15548 -42935 7165
1276 7165 45740 81892 -12502 -29467 -121980 -7637 -40702 11520 86382 34937 28208 107435
1264 107435 82131 76021 145429 76450 -1857 -88564 -1760 187341 76078 22670 -28428
1253 -28428 35234 -31307 -122137 -11971 138792 82385 47157 35261 15726 114064 -36759
1242 -36759 -137032 -35888 -63078 -117858 -39794 -143986 -32290 -17905 -93231 -107918 -132823
1231 -132823 -112925 -174422 -135539 -107374 -137979 -29574 36749 -51207 -3567 124769 44642
1220 44642 -5810 37541 -31592 -83698 -181318 -135922 -104734 -24518 -5692 -195 109965 123930
1208 123930 90780 18908 91468 75003 -10976 -115696 -39091 103883 71757 5985 -10462
1197 -10462 -78965 6822 68276 91118 15276 -95382 -74222 -24232 -52197 -33917 -39400 -89959
1185 -89959 -81928 -2492 -71237 76671 46221 38833 18638 -16474 61476 50630 145073 136260
1173 136260 112026 74905 36326 -565 -15997 -79929 -42155 19311 52872 21601 77102 14013
1161 14013 -63712 -42865 129994 136419 52092 58654 -97883 -80408 -95428 -68118 4199 -53385
1149 -53385 -28606 37920 43750 56371 -35713 34904 -23268 30590 83256 118826 92149 37230
1137 37230 40547 5310 20199 -62232 -35886 -20501 -56879 -18204 -97 -30363 -13596 22597
1125 22597 38174 167068 95407 724 115125 15349 -77308 -71688 119569 109691 512
1114 512 -31880 -65698 -77680 -25594 31029 -69334 -143402 -184486 -161335 -85050 -117452 -86000
1102 -86000 50815 45885 -8005 -13827 -46188 19725 10854 -21433 -63295 9780 47823 -101224
1090 -101224 -124131 -63562 -3067 73649 26716 58640 62150 -97022 -144964 -145624 -173117 -192877
1078 -192877 -5623 19022 30957 -40007 -97377 -8648 -89574 -132419 -13353 46053 83747
1067 83747 4050 -90946 -122661 11259 65051 -119527 -18460 -22991 -29955 -4285 65855 90836
1055 90836 23722 -43033 -39707 -111597 -119399 -109874 49018 80798 56732 -82624 -144249 -92170
1043 -92170 -65173 -103691 -104405 -54084 -78115 -86891 -115785 -106112 -66708 -120504 -166317 -35548
1031 -35548 39922 73015 27942 158490 77647 46095 100040 88752 106372 34374 13300 17892
1019 17892 -14089 -90530 -65271 -59689 -27306 -81700 -42360 53226 56529 9448 -7804 -55379
1007 -55379 24106 75518 -39660 41226 -61376 -85517 -52246 37330 105701 -16991 -101031
996 -101031 -72860 -123849 -78500 -6179 -59361 66356 6645 19116 3127 -56153 -62587 -137772
984 -137772 -105654 -178700 -174477 -185954 -120983 21823 10493 -8407 34456 68132 -58930 -156657
972 -156657 -110800 26465 50320 -55772 -52266 -98097 -70171 -89048 10550 128425 82230
961 82230 -47278 26839 50399 26540 -32316 -32600 -46667 -39302 39205 39859 -24924 -26248 -77421
948 -77421 -85976 -59580 -87244 6258 67253 53807 -2331 -45878 -14089 6897 104279 -69132
936 -69132 -12306 64773 -21411 -65475 -52790 -86616 -56788 66300 32135 -19417 35313 76084
924 76084 40047 47308 5732 -161764 -168222 74257 26199 70928 135701 65482 -33657 79502
912 79502 55407 56611 -6210 37630 82806 37214 28254 117723 100146 62262 41813 -30562
900 -30562 -50891 -26902 -48730 -90705 6129 -108282 -59580 66784 25775 44923 13802 76214
888 76214 220866 114279 -121018 -15868 -68764 -57062 -68582 -24014 -114664 -68613 -81644
877 -81644 -88406 -44563 -61257 35480 51752 -11130 44488 114401 62393 49340 1356 -31072
865 -31072 980 5499 -34056 -62712 -62537 -25794 -112698 23004 180112 143599 117551 80414
853 80414 -92 37103 63188 70660 15964 -15099 -127376 -115 -28289 -78431 11414 12421
841 12421 -37338 44874 34353 18960 -2124 -100302 -170704 -67602 -95437 -148740 -25529 -960
829 -960 -1120 -65373 -74675 -55730 -98428 -116431 -129145 -181306 -125158 -59536 -20675 -117570 -150263
816 -150263 -32716 -83201 -30757 -104058 -126389 -62561 -57794 -89844 -21656 102138 47822 -53795
804 -53795 -131787 -73171 10922 -9906 57682 36849 -34488 -40099 -123384 -141357 -20178 18365
792 18365 73541 104527 -4317 -9785 -57472 47004 -1419 -20511 54081 -27210 -146829 -2347
780 -2347 -12824 -63741 -16714 59302 67416 18082 -89492 -86460 -84290 -107542 -81638 -72191 32164
767 32164 31608 67086 22298 -35826 49133 14364 -25253 -36128 -85478 -134891 -121124 -72609
755 -72609 -110414 -48002 -3915 -99227 -88168 -23284 15999 37168 -39861 -82594 -111341 -48747
743 -48747 -22047 -83892 -34698 97778 33450 -101566 -141013 -81187 -6649 10160 41412 42183
731 42183 18634 -16137 -9209 -1517 -85093 -81858 -48580 17567 38652 7482 58332 28802 -78259
718 -78259 -141445 -7358 61284 38997 41749 -110537 15578 73342 133089 -3404 -13911
707 -13911 90422 9114 -39724 42243 67137 23221 -36157 -78848 -111843 5906 70081 112064
695 112064 36806 -77598 -7655 47694 75938 86001 109017 23115 18021 375 7334 18245
683 18245 -118325 -60997 144249 -5571 -5058 145979 95052 6000 -34082 50687 146010 98985
671 98985 -7429 -24192 -40183 29464 181685 -60962 -163748 -253292 -100781 5359 -7643
660 -7643 -6753 -53302 -9222 57873 29772 100057 69018 51187 39923 92998 -19686 7836
648 7836 99406 137125 76931 29906 58801 8830 20514 -8573 34789 -9280 -42050 79574
636 79574 70394 -1716 -7669 -81326 -27755 57872 49265 -51873 -172019 -65239 70506 -23550
624 -23550 -4836 14878 58925 -18613 -11336 19157 -83161 -34717 -28442 -98996 -124964 -15984
612 -15984 46670 -70499 3995 41427 25586 -20579 -69397 31199 65903 105039 22272 -28316
600 -28316 -199038 -193215 -61953 -183174 -7404 104986 -14001 -21362 -12285 77682 -4007
589 -4007 -66081 -114 17458 36275 36580 57906 10317 86951 -18510 20856 -38832 69581
577 69581 60302 -29773 -22129 -5664 -67205 -39663 73206 -54750 -103807 -95467 -278952 -228093
565 -228093 -45360 32160 -51471 -15412 -46209 13047 -33914 -42532 59105 5243 -100870
554 -100870 -24631 121817 74516 46212 56819 78254 82752 88984 -7168 104033 -23743 -13846
542 -13846 -68029 -93 65129 84641 54520 818 51482 -12181 2383 9410 39182 -110914
530 -110914 -113500 -84101 60245 43926 -149723 -142054 -170856 -34257 99766 23104 -122015
519 -122015 -44960 -3915 43414 56276 -72307 -48116 38581 117829 -25935 -62176 350
508 350 41781 100902 84430 68387 -44670 -166523 -73551 18076 -104217 -207890 -104757
497 -104757 -13451 -81965 89141 38550 -114887 -27932 -84527 -49940 29356 -14125 22809
486 22809 105819 2784 -109731 -30566 -59165 -41158 -24738 -8259 -36629 -99567 -35351 -10274
474 -10274 -25787 79676 18421 74131 32463 25237 63341 102042 15350 43116 50869 -47358
462 -47358 -145020 -17545 44509 100980 35308 60171 118384 -107216 -113782 11929 50007 48425
450 48425 -36115 -39419 14353 6851 87658 70644 51310 77307 45087 -71553 -9257 -19422
438 -19422 -103205 -162754 -69343 -68187 20348 22995 -2906 -13746 -40393 -47746 -54226 -36969 -20192
425 -20192 32986 -3590 21638 89660 4810 7605 41134 6765 52560 -45427 -61566 -59852
413 -59852 -93254 -114553 -101238 -125416 -108337 -2185 -21503 -14723 -30686 -53191 -98229 -67704
401 -67704 -65573 10171 115019 140864 -43430 -138143 -40873 -14722 -7472 133914 62991 -22752
389 -22752 55832 -20539 -58325 -68130 -60682 1945 1876 43757 98679 102304 65415 25196 -132096
376 -132096 -25335 -88746 -114529 -15573 -3004 -47072 -51543 60302 -87012 -150826 -82216
365 -82216 -158185 -126368 -23723 -81243 -56365 -50587 56849 91843 45255 -12704 -36179 518
353 518 -71852 -43247 -70113 -58370 -15850 -27630 -77499 -15254 51467 94215 3282 41102
341 41102 -89130 -35621 39850 -64109 14749 -8938 -67642 -107071 -13102 -36009 -142818
330 -142818 -49173 19044 -39280 80703 -4856 6544 6521 1056 4579 -121313 -168100 -79817
318 -79817 73461 81145 20450 60245 -34202 -9314 -20154 74911 89614 -77496 -47959 -10455
306 -10455 -45626 -43057 -63131 -27794 -68819 -48431 -65932 -130844 -21806 57155 -18308 31306
294 31306 91250 39905 21352 23968 91797 -19624 -16663 -8482 -48455 125056 35623 -34187
282 -34187 -25304 -519 -23505 39617 -10634 -96857 15907 -17146 -61976 -153480 -158741 -136169
270 -136169 118089 144514 21822 -35088 87303 -74317 -72837 -41076 -63327 4185 -6539
259 -6539 81287 42127 41168 -26912 11139 22502 11371 90665 76924 -43097 -110848 -58388
247 -58388 8925 -82039 -102950 -32520 5417 -89961 -93386 -142554 -140937 -135413 -63133 -76814 -30223
234 -30223 -31913 -25010 73051 -6637 58329 86243 -49853 80378 6859 -131897 -93567 74549
222 74549 1183 73040 60969 -20589 -90154 -146930 -97616 -121068 -55936 18861 -69556 -64845
210 -64845 -4780 -50052 -19040 -70799 -105812 -50733 81821 59516 93039 66773 -13307 -2929
198 -2929 -21372 -59622 -51828 -188529 -143137 -76615 27312 29625 -7346 -31944 -21139 14104
186 14104 -215 -20463 -26691 -60793 47974 74633 -5859 -47712 64856 117597 41706 80332
174 80332 109309 8684 -72544 7213 98435 44649 3736 -48692 42046 68037 90929 103467
162 103467 80421 -20992 -73190 -40560 26517 38997 -28215 -147116 -43550 35211 -18843
151 -18843 -115040 -43202 -30261 -72565 -88783 -118567 -33200 -59218 -25055 -62440 -2988 23715
139 23715 7009 48773 -35237 -104656 -54791 -36227 8427 39102 -2934 2917 -66009 -51599
127 -51599 37575 15491 -44048 -98494 -65218 59093 34665 29615 -4594 -68216 -43207 54043
115 54043 6921 -111613 -96381 -109820 2810 -53273 3140 -20737 -32125 -23983 -41731 78436
103 78436 53473 53258 63879 -18498 -47544 -52146 -20409 21562 -42693 -11119 10999 23606 58966
90 58966 63562 114493 83329 -5402 34050 8424 -45164 46100 -46974 -8247 -33854 -32187 2222
77 2222 28694 15948 22698 17416 47223 -5834 40927 -23218 -74898 -71522 -59250 -60500 14834
64 14834 35597 -18691 19382 -107846 -71301 21708 -33100 13404 60608 -29561 -89659 -45557
52 -45557 13978 -79290 -14866 -24154 -76713 -12797 -40026 -25752 -15904 -5706 -28540 -25077 -18758
39 -18758 -64144 -18596 20716 -29121 -31215 -27307 -59144 -71266 -18514 18529 18582 -5881 -47727
26 -47727 -38231 -19414 5203 -4148 59452 71961 -1652 55877 5528 88652 96239 8687 19752
13 19752 60973 33690 -5026 -31677 -89157 -62754 -15797 -7235 33046 15123 -39482 -70057
1 -70057 -33685
0 -33685
$$ Imaginary data points
##PAGE= N=2
##DATA TABLE= (X++(I..I)), XYDATA
16383 -1489302 -1417271 -1369175 -1418459 -1342413 -1319871 -1341608 -1272029 -1253039 -1261478 -1188524 -1097482
16372 -1097482 -1151860 -1120890 -1104062 -1125387 -1150894 -995362 -970722 -942083 -906329 -916077 -913170
16361 -913170 -900601 -829705 -802570 -766254 -734574 -687591 -676263 -614709 -614029 -637159 -551285 -550448
16349 -550448 -574954 -565860 -510228 -491306 -464269 -418034 -373130 -264719 -321818 -330213 -267167 -210481
16337 -210481 -282712 -270924 -243978 -248725 -210053 -133502 -111832 -76100 -88995 -37444 4718 9306
16325 9306 -6236 -98066 -5183 172613 104103 61798 165109 155513 183455 236149 285042 286708
16313 286708 353018 351755 331022 375130 374454 356765 298574 408845 453032 455344 547431 584421
16301 584421 461058 558153 588133 608676 648384 657696 779947 848468 814398 737405 780534
16290 780534 777230 797439 879530 906418 1044804 1034529 931590 918024 918087 986753 1039259 1019508
16278 1019508 1049716 1089517 1130419 1027884 1014216 1112740 1140180 1194082 1269785 1326052 1316149
16267 1316149 1297177 1215777 1294424 1422796 1359260 1313514 1325422 1398217 1321285 1414394 1460927
16256 1460927 1512277 1462549 1467398 1421116 1446592 1491231 1541107 1527743 1541530 1615574 1605133
16245 1605133 1633178 1569447 1556351 1564162 1595520 1646269 1569425 1668326 1728743 1606234 1745716
16234 1745716 1714966 1793965 1878603 1914135 1946562 1926659 1877450 1801830 1790259 1833440 1872266
16223 1872266 1894872 1833445 1856899 1885774 1967361 2004094 2043184 2035442 1990371 1959835 1975784
16212 1975784 2044039 2073324 2108965 2109841 2033988 1980676 2036251 2145584 2104443 2152759 2105487
16201 2105487 2097337 2088624 2121131 2158394 2235283 2218910 2219305 2231833 2254444 2196453 2303339 2292256
16189 2292256 2240458 2223762 2196653 2217853 2156017 2195574 2105720 2164379 2122956 2106060 2200162
16178 2200162 2247559 2300209 2327921 2288555 2302010 2353257 2348734 2347432 2383758 2449870 2477090 2505273
16166 2505273 2446667 2425888 2414877 2298627 2401171 2468326 2370987 2352658 2355912 2346794 2422616
16155 2422616 2372746 2374205 2309110 2359478 2502916 2495053 2459473 2380744 2386566 2398954 2404687 2545378
16143 2545378 2454645 2361145 2365945 2481790 2548567 2562927 2575175 2534420 2614222 2704436 2643731
16132 2643731 2614804 2555504 2579992 2596094 2532160 2628853 2604963 2610607 2584519 2571433 2618683
16121 2618683 2554416 2588265 2604348 2493091 2527054 2578400 2542320 2619305 2661863 2629095 2547101
16110 2547101 2548786 2591843 2566199 2624567 2643201 2692861 2708793 2698485 2676560 2633825 2672907
16099 2672907 2709654 2639701 2644804 2691256 2763850 2769994 2756586 2660346 2619995 2591210 2609863 2669583
16087 2669583 2649364 2642594 2643831 2710319 2767029 2694898 2763922 2761393 2761789 2761998 2748146 2770762 2755261
16074 2755261 2689280 2775696 2782644 2760356 2889709 2803594 2836856 2821276 2754375 2705365 2764148
16063 2764148 2713756 2719036 2898937 2881911 2761379 2721945 2720282 2592223 2616764 2582817 2680919
16052 2680919 2696438 2655059 2749437 2725635 2726262 2658711 2565521 2627946 2718719 2803911 2766705 2793907
16040 2793907 2762436 2674195 2722032 2672445 2753053 2752035 2813272 2694596 2657921 2646489 2716687
16029 2716687 2692152 2733964 2656719 2676087 2738677 2716914 2673228 2678356 2714627 2707852 2710012 2870001
16017 2870001 2863896 2790180 2750019 2737396 2723475 2875378 2881457 2708305 2771066 2754805 2652160
16006 2652160 2764968 2792909 2731702 2875307 2725496 2661481 2678991 2695251 2768058 2735301 2775933
15995 2775933 2747377 2765689 2809440 2795462 2695527 2603463 2715045 2797519 2752456 2679952 2732203
15984 2732203 2842185 2851099 2686056 2771830 2753486 2753949 2716964 2681996 2646807 2725853 2861244
15973 2861244 2871491 2815187 2781987 2812314 2811719 2726005 2896216 2966896 2837713 2774707 2767588
15962 2767588 2762487 2794325 2756027 2736443 2743972 2706616 2742742 2735709 2844307 2832626 2781483 2687126
15950 2687126 2739139 2825398 2801135 2802545 2770718 2794767 2735136 2770954 2722236 2760390 2736119
15939 2736119 2732764 2853660 2731717 2668043 2723165 2718576 2828094 2819405 2872447 2809001 2771335
15928 2771335 2702198 2744112 2819720 2863547 2847611 2839702 2853945 2873872 2707938 2742718 2800517
15917 2800517 2818112 2874459 2754105 2831510 2831927 2761572 2770939 2712776 2728252 2804591 2919904
15906 2919904 2987904 2957817 2886513 2757456 2801385 2765206 2752663 2839105 2824261 2767236 2857380
15895 2857380 2787999 2846748 2911504 2829823 2879981 2873543 2724316 2741237 2779783 2755686 2597966
15884 2597966 2660454 2608306 2712059 2758848 2867926 2949299 2865605 2772954 2811267 2812374 2827151
15873 2827151 2788762 2882073 2929794 2832514 2780230 2876129 2785049 2654069 2728249 2777897 2845609
15862 2845609 2761113 2714139 2797005 2848267 2834516 2799105 2746056 2823501 2831289 2674234 2811728
15851 2811728 2809869 2762054 2768304 2758763 2835597 2726379 2652767 2613140 2751545 2782489 2828249
15840 2828249 2809658 2841040 2931320 2799492 2812660 2920293 2869212 2737277 2725707 2828103
15830 2828103 2872065 2929027 2825975 2865315 2844828 2895422 2715118 2767844 2769416 2732434 2765552
15819 2765552 2794849 2740317 2711095 2910578 2918263 2813104 2899437 2902702 2889195 2901419 2875815
15808 2875815 2864899 2845339 2821169 2815466 2836830 2913655 2856161 2730294 2743860 2785668 2864513
15797 2864513 2878524 2891932 2799804 2857666 2814427 2799700 2793146 2792276 2760309 2776406 2786267 2755431
15785 2755431 2777900 2856657 2910417 3000795 2894484 2831606 2773418 2838265 2941133 2956016 2911461
15774 2911461 2802688 2836739 2872989 2790452 2674684 2789434 2834911 2761073 2885348 2877120 2782748
15763 2782748 2843011 2782436 2758560 2808207 2830187 2881291 2829954 2799458 2846097 2836814 2848478
15752 2848478 2867705 2855747 2896702 2875280 2871712 2983016 3073583 3054797 3003866 2937096 2857291
15741 2857291 2899775 2895391 2830253 2869878 2947131 3016285 2966609 2960157 2885715 2849161 2782376 2797467
15729 2797467 2797053 2853967 2802618 2749784 2884297 2924930 2836418 2782253 2802690 2825118 2915559
15718 2915559 2860799 2874404 2919752 2886101 2897107 2937816 2868388 2868327 2840776 2837493 2855141 2844457
15706 2844457 2791224 2804238 2815445 2817601 2888695 2850917 2867439 2937153 2875544 2910802 2873965
15695 2873965 2904562 2844235 2863493 2881732 2901241 2808676 2827784 2735017 2694072 2749600 2775824
15684 2775824 2850450 2771073 2694540 2841720 2909461 2980552 2908303 2903875 2948540 2834476 2885996
15673 2885996 2846862 2872411 2771950 2826334 2865305 2797385 2947953 2968496 3010136 2920176 2885250
15662 2885250 2874088 2906176 2924196 2858115 2872928 2816726 2758591 2896442 2964990 2869544 2855897
15651 2855897 2848619 2939482 2930547 2917843 2871074 2878084 2912631 2886971 2960120 2900816 2683185 2750795
15639 2750795 2831538 2819089 2810907 2822344 2861193 2769459 2828323 2896521 2816534 2888936 2957840
15628 2957840 2847328 2862642 2996312 2923401 2951137 3013818 2958136 2878550 2976103 2958491 2883129
15617 2883129 2894994 2893770 2933935 3018207 2857438 2879725 2919596 2859176 2767580 2894152 2915384
15606 2915384 2906568 2824654 2886416 2888381 2849518 2771995 2803710 2805273 2784910 2823279 2983737 3002230
15594 3002230 2905281 2802761 2750101 2910595 2919282 2927195 2754343 2865595 2847214 2864657 2906001
15583 2906001 2860462 2919668 2985887 2916024 2952028 2877698 3069858 3143713 3031212 2963683 2848783
15572 2848783 2847109 2882273 2978980 3012306 2968503 2923798 2900010 2883228 2940282 2817199 2769371
15561 2769371 2865082 2901612 2922113 2939078 2939391 2926778 2949434 2946471 2905537 2892830 2860093 2883834
15549 2883834 2917567 2844511 2843491 2855903 2818140 2774625 2912876 3059354 3115229 3050585 3019409
15538 3019409 3014102 2915565 2871650 2889794 2881504 2883001 2910433 2903205 2769285 2827006 2916503 2891053
15526 2891053 2777336 2812398 2881939 2864701 2978888 2993123 2864021 2843014 3003706 2937943
15516 2937943 2935024 2994661 2982085 2927883 2956631 3029845 3001245 2884659 2975929 2940922 3061476
15505 3061476 2963574 2824192 2837782 2872803 2921160 2955821 2980254 2865864 3104797 3033008 2977355
15494 2977355 2966408 2980969 2948216 2913938 2956868 2851944 2979620 3041270 2901133 2937312 2957696
15483 2957696 2914104 2835727 2832710 2806512 2917693 3001925 2857942 2899111 2959950 2936443 2890132
15472 2890132 2760253 2917650 2893193 2903859 3038013 3063750 2978689 2941512 2914755 3037787
15462 3037787 3068034 3009790 2905634 2893424 2918410 2827557 2956563 3037908 3045764 3065765 2995375
15451 2995375 2925357 2979508 2937993 2923247 3059523 3150902 2947715 2877980 2867323 2884761 2964467
15440 2964467 2954492 2944453 2922665 2826394 3046542 3054718 2952956 2934024 2953814 2995473 2977057
15429 2977057 2979133 2923570 2893676 2867198 2834270 3002743 2988255 2950244 2943086 2950020 3059997
15418 3059997 3061516 3169110 3029961 2858356 2961453 2978607 3064535 3064013 2898384 2903051 2922574
15407 2922574 2910098 2956880 3057825 3001001 2944477 2914872 2939996 2977313 2924741 3031539 3047147
15396 3047147 2964468 2970612 3034652 3095732 3124735 2992732 3007475 3099898 3005607 2929409 2945094
15385 2945094 3079976 3019993 2916502 3015072 3004736 2964710 2922008 3049064 3154685 3080395
15375 3080395 3007935 3032041 3086405 3005149 3003798 3062834 3085101 2940329 2887827 2877207 2858539
15364 2858539 2940268 2915726 2989914 3073709 2917162 2914706 3015199 2954084 2970208 2940672 2891300
15353 2891300 2950920 2954632 2928819 3001493 3042584 3058120 3031100 2946858 3000465 2966269 2919508
15342 2919508 3027243 3018038 2909965 2963064 2914593 2912304 2925039 3027298 3057344 2983697 2943799
15331 2943799 2918233 3036608 2904828 2912488 3003180 3074762 3068939 2953764 2914390 2935116 3026454
15320 3026454 2931913 2849110 2934155 2966585 2983935 2906019 2987156 3078201 3074528 3013431 2843166
15309 2843166 2867903 2876708 2909540 2901129 2918934 2960949 2955071 3040764 2980022 2907994 2950862 3013894
15297 3013894 2939191 2924282 2968156 2983183 2911612 2992152 3101155 3026984 2991194 2941082 2890490
15286 2890490 2888414 2937791 2950844 2950225 3023673 2946728 2955508 3014414 3014868 3000736 2967455 2983588
15274 2983588 3061801 3055014 2992599 3011159 2879621 2898963 2906371 2995143 3000367 3108821 3094320
15263 3094320 3021231 3022481 2973547 2888148 2904014 2891795 2994754 2942594 2940303 2961997 2969905 2972454
15251 2972454 2982577 3041153 3026020 3072597 3002736 3003046 3034294 3039413 3137634 3122693 3102432 3054219
15239 3054219 2989974 2970261 3027872 3121393 3110362 3109617 3031620 3131980 3093831 3115455 3104233
15228 3104233 3038196 3030187 3007048 2972857 3026084 3059625 3102889 2993867 2912995 3011469 2934740
15217 2934740 2963133 3075251 3054787 3027701 3010509 3034410 3098413 3123168 3085315 3156280 3077773
15206 3077773 3071585 3077168 3026783 2977540 3020944 3077204 3099640 3184532 3078876 2975778 3018925
15195 3018925 3037161 3040761 3075290 3140602 3009320 3130519 3200224 3072012 3098968 3025985 3027378
15184 3027378 3097080 3073861 3048266 3048035 3096832 3197791 3156483 3183993 3066706 3183638 3184042
15173 3184042 3128927 2966283 3027987 3155765 3159588 3122357 3135169 3225133 3029027 2980655 3051033
15162 3051033 3046718 2981056 3053880 3029051 3040674 3003021 2988355 3040081 3090289 3089061 3035185 3098698
15150 3098698 2974360 3067243 3068371 2926558 2973216 3081195 2991426 3044112 3027248 2990912 3054492
15139 3054492 3107241 3145689 2956428 3029727 3065267 3150662 2999431 3173188 3113578 3093934 3096809
15128 3096809 3019695 3051660 2969038 3093837 3015449 2996038 3027057 3095911 3110292 3110862 3213554
15117 3213554 3263469 3098958 3070820 3040137 3044548 3061209 3050905 3086916 3078733 3148617 3128541
15106 3128541 3156032 3054262 3083380 3048588 3102921 3088662 3179709 3087478 3087301 3184590 3216534
15095 3216534 3187245 3048776 3049147 3055334 3260433 3161116 3101789 3082080 3094426 3031252 2954743
15084 2954743 3002028 3076777 3034173 3082417 3071449 3100434 3069865 3072837 3096780 3111766 3043158
15073 3043158 2982178 2996414 3046295 3139405 3103756 3048677 2989948 3075431 2996059 2983353 2981966
15062 2981966 2959473 2969226 3058525 3112484 3091742 3091194 3010706 3027994 3004080 2988720 3058316 3162741
15050 3162741 3255074 3218886 3140906 3096752 3027955 3089727 3150182 3119009 3127955 3199405 3035714
15039 3035714 3012603 2966194 3015927 3109601 3089662 3175695 3120205 3104639 3058558 3128664 3140344
15028 3140344 3003618 3090609 3189046 3097802 3036768 3072666 3165049 3157636 3170429 3147351 3108320
15017 3108320 3074564 3100774 3133910 3186091 3174475 3132254 3122934 3135387 3200534 3067241 3078624
15006 3078624 3100350 3057957 3136802 3075803 3058481 3079588 3146195 3157272 3118674 3121812 3028285
14995 3028285 3028136 3028478 3068736 3115745 3061461 2918619 3007010 3047215 3168471 3080012 3040962 3005420
14983 3005420 3092567 3032534 3009413 3180165 3099501 3072428 3054434 3036975 3052967 3153496 3122308
14972 3122308 3064085 3026236 3113062 3110173 3175862 3200856 3175541 3159569 3222357 3273831 3259136
14961 3259136 3142962 3085654 3110570 3134912 3097864 3118428 3144247 3008882 2979502 3151140 3205729
14950 3205729 3213243 3239184 3147436 3162539 3173472 3110496 3173927 3252170 3277772 3170683 3159764
14939 3159764 3224912 3119146 3012264 3010566 3131693 3118303 3193220 3186044 3189225 3182970 3151051
14928 3151051 3166008 3206496 3220901 3011288 3065065 3159971 3099381 3046486 3133799 3068841 3070048
14917 3070048 3144842 3115908 3153584 3107703 3130658 3061961 3061310 3128197 3215638 3105308 3174051
14906 3174051 3129922 3182632 3171885 3137261 3254192 3116556 3233571 3165068 3248331 3224568 3171951
14895 3171951 3127373 3182870 3204073 3161786 3104449 3179060 3129039 3119092 3036007 3141201 3215021
14884 3215021 3234795 3187449 3163255 3099487 3106259 3085749 3044247 3118060 3075197 3059853 3064848 3160909
14872 3160909 3173087 2997656 2948750 3020499 3121664 3213104 3228007 3262777 3288089 3327635 3303498
14861 3303498 3321706 3214821 3249987 3160039 3190789 3160528 3150173 3087043 3114468 3027085 3055385
14850 3055385 3164131 3256761 3222610 3255986 3254526 3182531 3097033 3202774 3279543 3173781 3179116
14839 3179116 3186486 3098362 3036015 3135984 3212616 3268572 3204591 3141326 3106797 3106671 3188834 3192962
14827 3192962 3244464 3226774 3258818 3245931 3087876 3261188 3219468 3107070 3145604 3133923 3089866
14816 3089866 3136897 3125097 3096891 3055812 3237965 3265509 3235219 3277069 3291429 3219253 3133852
14805 3133852 3237862 3168744 3102421 3080925 3208156 3333509 3219187 3198402 3220517 3182700
14795 3182700 3138497 3127533 3163788 3212992 3189988 3092971 3257570 3276429 3312099 3217932 3182282
14784 3182282 3176936 3185389 3192784 3283387 3224915 3116083 3107777 3264878 3249697 3236041 3256657 3207300
14772 3207300 3215641 3133559 3200603 3216660 3249672 3212557 3196824 3249646 3238796 3255048 3236916
14761 3236916 3327272 3302064 3313729 3265180 3258505 3338811 3270762 3106178 3132079 3204774 3128265
14750 3128265 3289564 3376054 3257335 3146866 3235460 3359364 3313051 3148068 3155014 3119897
14740 3119897 3200123 3179442 3167066 3113823 3181287 3245292 3227129 3344352 3251013 3177450 3190071
14729 3190071 3127828 3289131 3309800 3310604 3225578 3193370 3121863 3173422 3205026 3217955 3200821
14718 3200821 3166877 3170694 3166030 3352589 3288033 3200924 3224744 3218221 3324050 3265491 3130411
$$ [...]
##END NTUPLES=NMR SPECTRUM
##END=
