##TITLE=1H_EC-3257(3)
 CDCl3, 8 sc, 
 27.07.2021
##JCAMPDX= 6.0         $$ Bruker NMR JCAMP-DX V2.0
##DATA TYPE= NMR SPECTRUM
##DATA CLASS= NTUPLES
##ORIGIN= UXNMR, Bruker Analytische Messtechnik GmbH
##OWNER= root
$$ XWIN-NMR		Version 3.5
$$ Tue Jul 27 09:17:38 2021 Russian Standard Time (UT+4h)  she@DPX200
##.OBSERVE FREQUENCY= 200.131506
##.OBSERVE NUCLEUS= ^1H
##.ACQUISITION MODE= SIMULTANEOUS
##.ACQUISITION SCHEME= undefined
##.AVERAGES= 8
##.DIGITISER RES= 18
##SPECTROMETER/DATA SYSTEM= spect
##.PULSE SEQUENCE= zg30
##.SOLVENT NAME= CDCl3
##.SHIFT REFERENCE= (INTERNAL, CDCl3, 0, 17.5118)
##AUDIT TRAIL= $$ (NUMBER, WHEN, WHO, WHERE, WHAT)
$$ ##TITLE= Audit trail, XWIN-NMR		Version 3.5
$$ ##JCAMPDX= 5.01
$$ ##ORIGIN= Bruker BioSpin GmbH
$$ ##OWNER= she
$$ F:/spectra/data/she/nmr/H-F/1/pdata/1/auditp.txt
$$ ##AUDIT TRAIL=  $$ (NUMBER, WHEN, WHO, WHERE, WHAT)
(   1,<2021-07-27 09:16:08.62 +0400>,<she>,<DPX200>,
      <created by zg, POWCHK disabled, PULCHK disabled
       configuration hash MD5:
       00 E9 B6 7A A2 85 ED C7 34 08 36 98 17 FE 4E 26
       data hash MD5: 16K
       26 C6 C1 6C EB 5D 20 7A EB 9A 8F 62 65 AF A8 DB>)
(   2,<2021-07-27 09:16:10.84 +0400>,<she>,<DPX200>,
      <Start of raw data processing
       efp BC_mod = 2 LB = 0.24 FT_mod = 6 PKNL = 1 PHC0 = -12635.29 PHC1 = 13.60099 SI = 16K 
       data hash MD5: 16K
       6D 2D AC AE A0 87 79 CD 04 03 59 21 DE 1A 3B DB>)
(   3,<2021-07-27 09:16:32.25 +0400>,<she>,<DPX200>,
      <pk PHC0 = -0.3928618 PHC1 = 1.2 
       data hash MD5: 16K
       98 DA E0 A0 47 C4 A5 8F E1 EC D3 A7 50 AC FF 8F>)
(   4,<2021-07-27 09:16:35.54 +0400>,<she>,<DPX200>,
      <abs ABSG = 5 
       data hash MD5: 16K
       AC 79 D9 A3 63 EB 83 FC FB 2B BD D6 8C A5 25 95>)
$$ ##END=
$$ 
$$ hash MD5
$$ 3E B5 79 AF 70 59 C9 7B AB 40 51 0A FC 02 39 01
##$RELAX= 
##$RELAX= 
##$RELAX= 
##$RELAX= 
##$RELAX= 
##$RELAX= 
$$ Bruker specific parameters
$$ --------------------------
##$DU= <F:/spectra>
##$EXPNO= 1
##$NAME= <H-F>
##$PROCNO= 1
##$TYPE= <nmr>
##$USER= <she>
##$AMP= (0..31)
100 100 100 100 100 100 100 100 100 100 100 100 100 100 100 100 100 100 
100 100 100 100 100 100 100 100 100 100 100 100 100 100 
##$AQSEQ= 0
##$AQ_mod= 1
##$AUNM= <au_zg>
##$AUTOPOS= <>
##$BF1= 200.13
##$BF2= 200.13
##$BF3= 200.13
##$BF4= 200.13
##$BF5= 200.13
##$BF6= 200.13
##$BF7= 200.13
##$BF8= 200.13
##$BYTORDA= 1
##$CFDGTYP= 0
##$CFRGTYP= 5
##$CHEMSTR= <none>
##$CNST= (0..31)
1 1 145 1 1 1 1 1 1 1 1 1 1 1 1 1 1 1 1 1 1 1 1 1 1 1 1 1 1 1 1 1 
##$CPDPRG= <>
##$CPDPRG1= <>
##$CPDPRG2= <>
##$CPDPRG3= <>
##$CPDPRG4= <mlev>
##$CPDPRG5= <mlev>
##$CPDPRG6= <mlev>
##$CPDPRG7= <mlev>
##$CPDPRG8= <mlev>
##$CPDPRGB= <>
##$CPDPRGT= <>
##$D= (0..31)
0 1.2 0 0 0 0 0 0 0 0.06 0 0.03 0 0 0 0 0.0002 0 0 0 0 0 0 0 0 0 0 0 0 
0 0 0 
##$DATE= 1627362968
##$DBL= (0..7)
120 120 120 120 120 120 120 120 
##$DBP= (0..7)
150 150 150 150 150 150 150 150 
##$DBP07= 0
##$DBPNAM0= <>
##$DBPNAM1= <>
##$DBPNAM2= <>
##$DBPNAM3= <>
##$DBPNAM4= <>
$$ [...]
##$SUBNAM3= <"">
##$SUBNAM4= <"">
##$SUBNAM5= <"">
##$SUBNAM6= <"">
##$SUBNAM7= <"">
##$SUBNAM8= <"">
##$SUBNAM9= <"">
##$SW= 20.0188882624521
##$SWIBOX= (0..15)
0 0 2 0 0 0 0 0 0 0 0 0 0 0 0 0 
##$SW_h= 4006.41025641026
##$TD= 16384
##$TD0= 1
##$TE= 0
##$TE2= 300
##$TE3= 300
##$TEG= 300
##$TL= (0..7)
0 120 120 120 120 120 120 120 
##$TP= (0..7)
150 150 150 150 150 150 150 150 
##$TP07= 0
##$TPNAME0= <>
##$TPNAME1= <>
##$TPNAME2= <>
##$TPNAME3= <>
##$TPNAME4= <>
##$TPNAME5= <>
##$TPNAME6= <>
##$TPNAME7= <>
##$TPOAL= (0..7)
0.5 0.5 0.5 0.5 0.5 0.5 0.5 0.5 
##$TPOFFS= (0..7)
0 0 0 0 0 0 0 0 
##$TUNHIN= 0
##$TUNHOUT= 0
##$TUNXOUT= 0
##$USERA1= <user>
##$USERA2= <user>
##$USERA3= <user>
##$USERA4= <user>
##$USERA5= <user>
##$V9= 5
##$VALIST= <valist>
##$VCLIST= <CCCCCCCCCCCCCCC>
##$VD= 0
##$VDLIST= <DDDDDDDDDDDDDDD>
##$VPLIST= <PPPPPPPPPPPPPPP>
##$VTLIST= <TTTTTTTTTTTTTTT>
##$WBST= 1024
##$WBSW= 4
##$XGAIN= (0..3)
0 0 0 0 
##$XL= 0
##$YL= 0
##$YMAX_a= 357852
##$YMIN_a= -502695
##$ZGOPTNS= <>
##$ZL1= 120
##$ZL2= 120
##$ZL3= 120
##$ZL4= 120
##$ABSF1= 17.47879
##$ABSF2= -2.540247
##$ABSG= 5
##$ABSL= 3
##$ALPHA= 0
##$AQORDER= 0
##$ASSFAC= 0
##$ASSFACI= 0
##$ASSFACX= 0
##$ASSWID= 0
##$AUNMP= <proc_1d>
##$AZFE= 0.1
##$AZFW= 0.1
##$BCFW= 0
##$BC_mod= 2
##$BYTORDP= 0
##$COROFFS= 0
##$CY= -3
##$DATMOD= 1
##$DC= 0
##$DFILT= <>
##$DTYPP= 0
##$F1P= 0
##$F2P= 0
##$FCOR= 1
##$FTSIZE= 16384
##$FT_mod= 6
##$GAMMA= 0
##$GB= 0
##$INTBC= 1
##$INTSCL= 1.334414e-10
##$ISEN= 128
##$LB= 0.24
##$LEV0= 0
##$LPBIN= 0
##$MAXI= 10000
##$MC2= 0
##$MEAN= 0
##$ME_mod= 0
##$MI= 1.114404
##$NCOEF= 0
##$NC_proc= -6
##$NLEV= 6
##$NOISF1= 3.799351
##$NOISF2= 2.8
##$NSP= 0
##$NTH_PI= 0
##$NZP= 0
##$OFFSET= 17.51177
##$PC= 1
##$PHC0= -12635.68
##$PHC1= 14.80099
##$PH_mod= 1
##$PKNL= yes
##$PPARMOD= 0
##$PSCAL= 0
##$PSIGN= 0
##$REVERSE= no
##$SF= 200.130004575111
##$SI= 16384
##$SIGF1= 3
##$SIGF2= 2
##$SINO= 5.538805
##$SIOLD= 16384
##$SREGLST= <1H.CDCl3>
##$SSB= 0
##$STSI= 16384
##$STSR= 0
##$SW_p= 4006.41025641026
##$SYMM= 0
##$S_DEV= 0
##$TDeff= 16384
##$TDoff= 0
##$TI= <>
##$TILT= no
##$TM1= 0
##$TM2= 0
##$TOPLEV= 0
##$USERP1= <user>
##$USERP2= <user>
##$USERP3= <user>
##$USERP4= <user>
##$USERP5= <user>
##$WDW= 1
##$XDIM= 16384
##$YMAX_p= 352416175
##$YMIN_p= -338396
$$ End of Bruker specific parameters
$$ ---------------------------------
##NTUPLES= NMR SPECTRUM
##VAR_NAME=  FREQUENCY,     SPECTRUM/REAL,   SPECTRUM/IMAG
##SYMBOL=    X,             R,               I
##VAR_TYPE=  INDEPENDENT,   DEPENDENT,       DEPENDENT
##VAR_FORM=  AFFN,          ASDF,            ASDF
##VAR_DIM=   16384,         16384,           16384
##UNITS=     HZ,            ARBITRARY UNITS, ARBITRARY UNITS
##FACTOR=    0.24454680195387, 1,            1
##FIRST=     3504.6306599332, 0,             0
##LAST=      -501.779596477056, 0,           0
##MIN=       -501.779596477056, -338396,     0
##MAX=       3504.6306599332, 352416175,     0
$$ Real data points
##PAGE= N=1
##DATA TABLE= (X++(R..R)), XYDATA
$$ [...]
11238H4632n0518o2005p5371M4926m653J5413o4601J01227M958l4561p5081j6182
$$ 84632 34114 -27891 -103262 -58336 -62989 -47576 -112177 -10950 -5992 -40553 -115634 -131816
11226a31816N2382M6839J1170j2833j21447L5193k8326Q3782P3182M5153J3112
$$ -131816 -79434 -32595 -21425 -34258 -155705 -120512 -148838 -65056 8126 53279 66391
11215F6391j33907j34k2187M2914J011O8365K5298m0770l7545J03415n9118q2054
$$ 66391 -67516 -67650 -89837 -46923 -45912 22453 47751 6981 -30564 72851 13733 -68321
11203f8321j3487L3078R8881M5808o2485M435j3226M809K2465k4750o9940k2913
$$ -68321 -81808 -48730 50151 95959 33474 37909 24683 29492 51957 27207 -42733 -65646
11191f5646m2028J43591P3629j22234k7556L3257n8978L7499P4658j12563j2812
$$ -65646 -107674 35917 109546 -12688 -40244 -6987 -65965 -28466 46192 -66371 -79183
11180g9183N2867J15442k9558n6246J07144L1640n513j67701r5547R5398P1221
$$ -79183 -26316 89126 59568 3322 110466 142106 136593 -31108 -126655 -31257 39964
11169C9964O5563k2791q5750o9200n7058M2539Q1210L9797j08889J350j898j24405
$$ 39964 105527 82736 -3014 -72214 -129272 -86733 -5523 34274 -74615 -73265 -75163 -199568
11157a99568K6047L32p5911J53875J5093L0348P5663k9100N3100J6876k4114j28085
$$ -199568 -173521 -173189 -249100 -95225 -80132 -49784 25879 -3221 49879 66755 42641 -85444
11145h5444M8862j682M4422M6341o2169j7447P9540O6466j18897l3457N6686q3628
$$ -85444 -36582 -38264 6158 52499 -9670 -27117 52423 118889 -8 -33465 23221 -60407
11133f0407n5029J24765Q8634p5057p31j02813M8032J5053j7545n7794J5398j252
$$ -60407 -115436 9329 97963 22906 22175 -80638 -32606 -17553 -35098 -92892 -77494 -78746
11121g8746m5062k524J07020L26j14730J38861k0304P5614j6255J6604n028l4213
$$ -78746 -123808 -126332 -19312 -18986 -133716 5145 -15159 60455 44200 60804 55776 21563
11109B1563O7059m2675l3930m1500J30414M3361q4014q318r6796p6897K6902M2694
$$ 21563 88622 45947 12017 -29483 100931 144292 60278 51960 -44836 -121733 -94831 -52137
11097e2137o276P031J12645L2169m3341n4325Q3988j49247p9641N6025J4917J58344
$$ -52137 -58413 -51382 61263 93432 50091 -4234 79754 -69493 -149134 -93109 -78192 80152
11085H0152j0973j33450R087O2932n6109J19894n4410j7152n9624n4604m0635
$$ 80152 69179 -64271 -55184 7748 -48361 71533 17123 -29 -59653 -114257 -154892
11074a54892Q5113J24502J10214j36827n4138j52696O3067N9747L6347J16739
$$ -154892 -69779 54723 164937 28110 -26028 -178724 -115657 -55910 -19563 97176
11064I7176j69928P450M4334m7581j002J4429l9551J03478l5444j14597M0581
$$ 97176 -72752 -65302 -20968 -68549 -69551 -55122 -94673 8805 -26639 -141236 -100655
11053a00655M8169n7175j8859L2043N1127M8456p1263M6247Q5222O894n134l4277
$$ -100655 -52486 -109661 -128520 -96477 -45350 3106 -68157 -21910 63312 70206 65072 30795
11041C0795J26150k5043k01072Q811N2008j03979J75274o1551n9997K2509J9820
$$ 30795 156945 131902 -69170 -60359 -8351 -112330 62944 1393 -58604 -36095 -16275
11030a6275L862q37j3772m3062P8234P5602o2583P9360m8749k4864J08225r0816
$$ -16275 -12413 -13250 -27022 -70084 8150 83752 21169 100529 51780 26916 135141 44325
11018D4325J6277l7758k4726r6522l045k409l0999R8813P0650n9442m7646M8298
$$ 44325 60602 22844 -1882 -98404 -101449 -103858 -134857 -36044 34606 -24836 -72482 -24184
11006b4184K471J4522l6008J925j7533O6016O8421j12315q0860K3440P4062O215
$$ -24184 -21713 -7191 -43199 -41274 -58807 7209 75630 -36685 -117545 -94105 -20043 -13828
10994a3828J34j9557l0122n621K9121o5615L5293Q9693J0178j1984k2293K3127
$$ -13828 -13694 -33251 -63373 -68994 -39873 -105488 -70195 19498 29676 17692 -4601 18526
10982A8526j997R087L496l650l4780o0979O0048n5335k0822L2810k3900J13497
$$ 18526 16529 25616 29112 25462 -9318 -70297 -10249 -65584 -86406 -53596 -77496 36001
10970C6001p6845m6682n1131R8495J26813j32491R0437j05324N4262P0967o1704
$$ 36001 -40844 -87526 -138657 -40162 86651 -45840 44597 -60727 -6465 64502 2798
10959B798k8946P1324l3686j02832M7868N7181K116m1046M6015Q293k7969M675
$$ 2798 -26148 45176 11490 -91342 -43474 13707 15823 -25223 20792 29085 1116 5791
10947E791k6220j29074O8884k0937J11354m4638J2419M6015p6086k7390Q7156
$$ 5791 -20429 -149503 -80619 -101556 9798 -34840 -22421 23594 -52492 -79882 7274
10936G274K6874M2888O8580r5459j15018Q180J6347J9908j12636K9216P2151N1394
$$ 7274 34148 77036 145616 50157 -64861 -56681 -40334 -20426 -133062 -103846 -31695 19699
10924A9699j04642k5078L8707r401j24299j89P6282L3312L1582K1014j5541J06045
$$ 19699 -84943 -110021 -71314 -80715 -205014 -205203 -128921 -95609 -64027 -43013 -58554 47491
10912D7491R5933q1403j9222m6485R6404m4772L8594n8946Q3126J13241j19054
$$ 47491 143424 62021 42799 -3686 92718 47946 86540 27594 110720 223961 104907
10901A04907q4478n668M0286K0963j35775m7893M7287j5706P3660R916n3947M6573
$$ 104907 20429 14761 55047 76010 -59765 -107658 -60371 -76077 -2417 7499 -46448 125
10889A25p030l9985M0572L2694l4051R0228j2588o8592q6365J41420M992p6147
$$ 125 -6905 -46890 -6318 26376 -7675 82553 69965 1373 -84992 56428 61420 -14727
10877a4727K8098j9296Q2665R769r1402K3395R7284P0415k42922N1867R9171j36215
$$ -14727 13371 -5925 76740 86509 -4893 18502 115786 186201 -56721 -4854 94317 -41898
10865d1898L8287n631n4677O2541n163M2887j9793l7783O6739K2680m1287j5168
$$ -41898 -3611 -9242 -63919 -1378 -6541 36346 16553 -21230 45509 68189 26902 11734
10853A1734q07p8464M993M7428J4397R2151M1059r7578k8704l5132N319J08791
$$ 11734 10927 -67537 -62544 -15116 -719 91432 132491 34913 6209 -28923 -23604 85187
10841H5187p6048J00422N0410j61545n8294L1775J27940j896K4602M4172j48723
$$ 85187 9139 109561 159971 -1574 -59868 -28093 99847 97951 122553 166725 18002
10830A8002k1971j5771n3552L0948N1815j6849K5090j0645J0027L7336j28033
$$ 18002 -3969 -19740 -73292 -42344 9471 -7378 17712 7067 17094 54430 -73603
10819g3603M0049O0441p1000p1657Q2303K7878O0969L2773r8954j7978k1K5879
$$ -73603 -33554 26887 -44113 -115770 -33467 -5589 55380 88153 -10801 -28779 -28800 -2921
10807b921L0934Q6181J5780o6332L8707l0473J62915j38627q6859N2010P240j21863
$$ -2921 28013 114194 129974 63642 102349 71876 234791 96164 9305 61315 68555 -53308
10795e3308k5342P226M0264Q9060L8560J9904r3090J19224q4438r7397J00949
$$ -53308 -78650 -71424 -31160 57900 96460 116364 23274 142498 58060 -39337 61612
10784F1612J8532j43190P1979J20629k14195L7573P6711J5306p4092M8298J24584
$$ 61612 80144 -63046 8933 129562 -84633 -47060 29651 44957 -29135 19163 143747
10773A43747r6364O3670m611j07407j1764N5716r4604k7150Q0697P1273j5699
$$ 143747 47383 111053 106442 -965 -12729 42987 -51617 -78767 1930 73203 57504
10762E7504k2452r6257L1616O4018L0845n0221M4205m455J3115q2871O7506J11976
$$ 57504 35052 -61205 -29589 34429 65274 15053 59258 54803 67918 -14953 52553 164529
10750A64529j93258k4713m1151O0867M3985m1485p085J5026j746n4677P3393K02791
$$ 164529 -28729 -53442 -94593 -33726 10259 -31226 -38311 -23285 -25031 -79708 -6315 196476
10738A96476j62562r4829k3091R2683j7719k0553N1055K0423l7906J1044j25082
$$ 196476 33914 -60915 -84006 8677 -9042 -29595 21460 41883 3977 15021 -110061
10727a10061J12809J44008j28953r3458k9619J06654l1914O1145N6473q4665n7141
$$ -110061 2748 146756 17803 -75655 -105274 1380 -30534 30611 87084 2419 -54722
10716e4722K526J08237O2282o8834O5221n3285j9333k3608J9109l0337N1376J25138
$$ -54722 -52196 56041 118323 49489 114710 61425 42092 18484 37593 7256 58632 183770
10704A83770q2043j8849j48192P9680J12067j8117j42827k3569J57783l4374j16537
$$ 183770 101727 82878 -65314 14366 126433 108316 -34511 -58080 99703 65329 -51208
10693e1208K9537J5313J04185l2779L4756p0375L0914R025j19862L2253m625j00300
$$ -51208 -21671 -6358 97827 65048 99804 29429 60343 69368 -50494 -18241 -22866 -123166
10681a23166J03098P1146m8384R1436J3310l3553R8047k976n0561p9276p9865
$$ -123166 -20068 51078 2694 94130 107440 73887 171934 168958 118397 39121 -40744
10670d0744R9044K1543m9529q4241K439l9449O9584j52903J08458J03543j7136
$$ -40744 58300 79843 30314 -53927 -51488 -90937 -21353 -174256 -65798 37745 20609
10659B0609K2164Q087k7891R7505n088j783J4568J3029m1119M2691p7796n924
$$ 20609 42773 50860 22969 120474 115386 113603 128171 141200 100081 142772 64976 59052
10647E9052J02253j38228r0120N5166K0919j4765l1657M9928J05287q7210L0523
$$ 59052 161305 23077 -67043 -11877 9042 -5723 -37380 12548 117835 30625 61148
10636F1148p922m5437j3548o0216K32399o4872j50886J9057P2666L8448p3506
$$ 61148 53226 7789 -5759 -65975 166424 101552 -49334 -30277 42389 80837 7331
10625G331L0697O4852K0181j40105q7462J21607L5510L4335J19740K0372q0160
$$ 7331 38028 102880 123061 -17044 -104506 17101 52611 86946 206686 227058 146898
10614A46898J8094N0877j49352j39322J35269N6770K6164l4131l0307K0458p5270
$$ 146898 164992 215869 66517 -72805 62464 119234 145398 111267 80960 101418 26148
10603B6148j7433m4038P276r1701R6454K3877l8018J4332K7356P6998o7417J8697
$$ 26148 8715 -35323 -28047 -119748 -23294 583 -37435 -23103 4253 81251 13834 32531
10591C2531M1365k1888J5403r5530L9838J59364o2763r8588j35170J13779L7078
$$ 32531 73896 52008 67411 -28119 11719 171083 108320 9732 -125438 -11659 25419
10580B5419q818j31581Q6694Q485P6999n2846n0614K3827M3174O2323n8213L4157
$$ 25419 16601 -114980 -28286 -19801 57198 4352 -46262 -22435 20739 83062 24849 59006
10568E9006Q8262m7398o9082O7469l7209O5525o8437L8069q8413n582M4253j7927
$$ 59006 147268 99870 30788 98257 61048 126573 58136 96205 7792 2210 46463 28536
10556B8536k9927q656k3823j9529N169P0806k1759k7932J0933O8689j27235R2014
$$ 28536 -1391 -10047 -33870 -53399 -48230 22576 817 -27115 -16182 52507 -74728 17286
10544A7286K582j280R3765Q753j00593l610n6123J69519K831j59343L8910k1414
$$ 17286 19868 18588 112353 121106 20513 16903 -39220 130299 133130 -26213 12697 -8717
10532h717k8375J50671m9237j09718J01560p5448L1263l5716m3095J46907p4011
$$ -8717 -37092 113579 64342 -45376 56184 -19264 11999 -23717 -66812 80095 6084
10521F084j29226k5655k7062J44403N4819p8547K7081P5888Q3003l4128K0098
$$ 6084 -123142 -148797 -175859 -31456 23363 -55184 -28103 47785 130788 96660 116758
10510A16758j65591N6548J32125m6262p776L4560J4630N41j6297o6196R0102n4896
$$ 116758 -48833 7715 139840 93578 85802 120362 134992 135533 119236 53040 143142 88246
10498H8246r4545O4247K6703O368n3890l2482j5316m2252K0322L9724L3094l3889
$$ 88246 -6299 57948 84651 91019 37129 4647 -10669 -52921 -32599 7125 40219 6330
10486F330M0948M4043k7446l9391M1570J81126j25647j5735K0762p4245K6329
$$ 6330 47278 91321 63875 24484 66054 247180 121533 105798 126560 52315 78644
10475G8644L499J9606j55878l1708N9759m0335K3241L602k0676M1650n009M7245
$$ 78644 82143 101749 -54129 -85837 -26078 -66413 -43172 -39570 -60246 -18596 -23605 23640
10463B3640J02305j1445m5448P3282m092p3631q6105P0009M0405p4633j5313N7471
$$ 23640 125945 114500 69052 142334 138242 64611 -21494 48515 88920 14287 -1026 56445
10451E6445n7116M042R6740n0043J4930R724r8428K17935m0771j08444m6369R5386
$$ 56445 -671 3371 100111 50068 64998 74722 -23706 194229 153458 45014 -1355 94031
10439I4031K1382j0906j14260l7663L9981L0816R733J74122n1113K826K622q9677
$$ 94031 115413 104507 -9753 -47416 -7435 23381 33114 207236 156123 158949 161571 71894
10427G1894m3145O4204j0870k1959j0247L6026n5947J2282P3887r7300n4698R8698
$$ 71894 28749 92953 82083 60124 49877 85903 29956 42238 116125 18825 -35873 62825
10415F2825J37886n083j18573p6484J17894o9158K6112n8323L9717Q1845l9244
$$ 62825 200711 195628 77055 571 118465 49307 75419 17096 56813 138658 99414
10404I9414p9028J15672K717q5279n6228M4468m1062N9494K2493n0030L7515n6776
$$ 99414 20386 136058 138775 53496 -2732 41736 674 60168 82661 32631 70146 13370
10392A3370J9529N924R6669P823m1116r5687J09288p516o370q9514l8184J11198
$$ 13370 32899 38823 135492 143315 102199 6512 115800 108284 101914 12400 -25784 85414
10380H5414p5954q2700N6593M1228j3689J15364r3984o6747J4675n765K7879L9506
$$ 85414 9460 -73240 -16647 24581 10892 126256 32272 -34475 -19800 -25565 2314 41820
10368D1820N7247k3008K0551r2235q8998L6970N0733M5192m9607j11875J38036
$$ 41820 99067 76059 96610 4375 -84623 -47653 3080 48272 -1335 -113210 24826
10357B4826K1257N367K3891n2478m3020n6029J88780n6703K440P2286m6834r2907
$$ 24826 46083 51450 75341 22863 -20157 -76186 112594 55891 58331 130617 83783 -9124
10345i124l8111O9722l3162l2085O5475o8813Q8835l6258L7251P0582o7315j00457
$$ -9124 -47235 22487 -10675 -42760 22715 -46098 42737 6479 43730 114312 46997 -53460
10333e3460P0439O5080n9963n5595J47141o3057Q817p4253r9510o733R4043J44762
$$ -53460 16979 82059 22096 -33499 113642 50585 59402 -14851 -114361 -121094 -27051 117711
10321A17711J08484N1L5495j20343j12899J30391r573j7188l479j20328j13576
$$ 117711 226195 226246 261741 141398 28499 158890 149317 132129 128650 8322 -105254
10310a05254J27948J5165L8532R824q563K520j36712K4634m8841L031P5550Q8057
$$ -105254 22694 37859 76391 86215 77652 80172 -56540 -31906 -80747 -77716 -2166 85891
10298H5891o9101m4148k5901J9376O877J32281M812m6734o8655K0906N9022L5091
$$ 85891 16790 -27358 -53259 -33883 -27006 105275 110087 63353 -5302 15604 74626 109717
10286A09717L4564l2534l6326r3747l2754l1000J15619l5461l0178R2105J3052
$$ 109717 144281 111747 75421 -18326 -51080 -82080 33539 -1922 -32100 60005 73057
10275G3057k0216J5791M1668J4998j26355p110M5617p793m3677K6085L3723J58736
$$ 73057 52841 68632 110300 125298 -1057 -8167 37450 29657 -14020 12065 45788 204524
10263B04524o6961r0482o7421J4627K0974P2184n3771o5689m2529N0328O7955
$$ 204524 137563 47081 -20340 -5713 15261 87445 33674 -32015 -74544 -24216 43739
10252D3739J6900Q1717J9281n0876M3668r1907N2291M1173j07468o0460J4509
$$ 43739 60639 142356 161637 110761 154429 62522 114813 155986 48518 -11942 2567
10241B567n6408K7388P3672P3609q4149L3566K2082j25596L4796M8114j21861
$$ 2567 -53841 -26453 47219 120828 36679 70245 92327 -33269 1527 49641 -72220
10230g2220J5262J59330k8655p8687K3066k1775P5274l6544q6056L1543K00031
$$ -72220 -56958 102372 73717 -4970 18096 -3679 71595 35051 -51005 -19462 180569
10219A80569r9705o8263J34516o1764J3864K5019l3212L753J07754L1063q6532
$$ 180569 80864 12601 147117 85353 99217 124236 91024 94777 202531 233594 147062
10208A47062j05666j0739J20282k8298j6503m9480p0519M0405O3003L2727k3018
$$ 147062 41396 30657 150939 122641 106138 56658 -13861 26544 89547 122274 99256
10197I9256k2090j22855q8446Q7909Q6099J05837m3947m7220j4782p4351j1950
$$ 99256 77166 -45689 -134135 -46226 39873 145710 101763 54543 39761 -34590 -46540
10186d6540P6256m483q8623J53495r6647j37176R2027J75425q790n116q0325R3900
$$ -46540 29716 25233 -63390 90105 -6542 -143718 -51691 123734 114944 109828 29503 123403
10174A23403o2303n3239l1296M1133m7480M7031N417Q5314q896R88j73780N7327
$$ 123403 61100 7861 -23435 17698 -29782 17249 22666 107980 99084 100072 -73708 -16381
10162a6381j25113J21195J17494m7873q8746O1593J53992j02555L4802R188m6467
$$ -16381 -141494 -20299 97195 49322 -39424 22169 176161 73606 108408 117596 71129
10151G1129k1332m1094L0530J23039j06366j6516K6785L4732n9251j37160k9368
$$ 71129 49797 8703 39233 162272 55906 39390 66175 100907 41656 -95504 -124872
10140a24872j0740O3660O5883q4930K1859M8919O8282J426J6353l4040J8113l1464
$$ -124872 -135612 -71952 -6069 -90999 -69140 -20221 48061 49487 65840 31800 49913 18449
10128A8449l7135k0527Q7895N6769O9592r5578o5344j2151k3509N7939N927M3849
$$ 18449 -18686 -39213 48682 105451 175043 79465 14121 1970 -21539 36400 42327 86176
10116H6176P870q3189J31239m4464O272K00959j29275k26036j0995J46029O5633
$$ 86176 94046 10857 142096 97632 103904 304863 175588 -50448 -61443 84586 150219
10105A50219j23884l3669L7789m1117l998p863L2750J45650l8027j25532P1154
$$ 150219 26335 -7334 30455 -10662 -14660 -22523 10227 155877 117850 -7682 63472
10094F3472L1388j39558M214n08J32216r110N220p3938K0020J3298l8075m4473
$$ 63472 94860 -44698 -40484 -40992 91224 82114 87334 13396 33416 46714 8639 -35834
10082c5834q150j5165O4292m9926J31955R1254j24826j29236J48404q780j17472
$$ -35834 -43984 -59149 5143 -44783 87172 178426 53600 -75636 72768 63988 -53484
10071e3484K9518R9741L5563j05428M4104l1679m7459P5092L0803r625R65p9877
$$ -53484 -23966 75775 111338 5910 50014 18335 -29124 45968 76771 67146 68111 -11766
10059a1766Q1404m0655p585n870m1884O0895K0931p7401K7539j2216P1379l3004
$$ -11766 69638 28983 21398 15528 -26356 34539 55470 -21931 5608 -6608 64771 31767
10047C1767L2788K4102j16697M6150J72084j32669L8394j13101l0680O8325O9254
$$ 31767 64555 88657 -28040 18110 190194 57525 95919 -17182 -47862 20463 89717
10036H9717K5474m8073j34998N4862J8283L0860O5821m3572l1056J24860P6191
$$ 89717 115191 67118 -67880 -13018 5265 36125 101946 58374 27318 152178 228369
10025B28369J4951j15867o5834K6565P6666k06709N6221J28435r996o6263r1780
$$ 228369 243320 127453 61619 88184 164850 -41859 14362 142797 132801 66538 -25242
10014b5242O1960j0815O2277Q347k7148k2888o9933K2597J82510r8480k5985J7851
$$ -25242 36718 25903 88180 96527 69379 46491 -23442 -845 181665 83185 57200 75051
10002G5051j2903J6510J5714j37972J2452m1881j3817N7560R3680m0076j10559
$$ 75051 62148 78658 94372 -43600 -31148 -73029 -86846 -29286 64394 24318 -86241
9991h6241M1176J0998M3076J22808O091p2726k134j07178M8051K08570p8291m1551
$$ -86241 -45065 -34067 9009 131817 137908 65182 63048 -44130 3921 212491 134200 92649
9979I2649N4020K9885j16188m4450M9827m5772M8008p1723R7071L7102k15928
$$ 92649 146669 176554 60366 15916 65743 19971 67979 -3744 93327 130429 -85499
9968h5499O0691p010K6583o2793O1304J22883n9059M3733R298M2955m9384j66309
$$ -85499 -24808 -31818 -5235 -68028 -6724 116159 57100 100833 110131 153086 103702 -62607
9956f2607K5010L6372J00626Q9651m7504M6535n3923j3776l263p0128J8253m9883
$$ -62607 -37597 -1225 99401 189052 141548 188083 134160 120384 117121 46993 65246 15363
9944A5363k3677p6331j6054N2388O9439k8004l209M4706j25329J52695J04763
$$ 15363 -8314 -84645 -100699 -48311 21128 -6876 -10085 34621 -90708 61987 166750
9933A66750l2612m4525p2931n6042J0520N6574j06748M2298k0662L5674J2007
$$ 166750 134138 89613 16682 -39360 -28840 27734 -79014 -36716 -57378 -21704 -9697
9922i697L7919j8353k5074k9646n1392j6689r733J3066o1059J5090Q2733O283
$$ -9697 28222 9869 -15205 -44851 -96243 -112932 -122665 -109599 -170658 -155568 -72835 -66552
9910f6552k4417J43947J03597n0034j14256P0243Q9740K937j21100L4765J30034
$$ -66552 -90969 52978 156575 106541 -7715 62528 152268 155205 34105 68870 198904
9899A98904j01102l4513k5422o1791j470O6179L368N5220k0415j598j6722n0484
$$ 198904 97802 63289 37867 -23924 -25394 40785 44153 99373 78958 77360 60638 10154
9887A0154j14309Q7023P0437j4700Q564j322m2295L9543j4536k7042L6156K0724
$$ 10154 -104155 -17132 53305 38605 47169 45847 3552 43095 28559 1517 37673 58397
9875E8397n1599M9048j472j05864J2774P6924O598O6670n4293j2478j6560j468
$$ 58397 6798 55846 54374 -51490 -38716 38208 44806 111476 57183 44705 28145 26677
9863B6677q2231L920P3906r3525J29912k5716L1723N3393O3165j84747P9326J73
$$ 26677 -55554 -51634 22272 -71253 58659 32943 64666 118059 181224 -3523 75803 75976
9851G5976o1553K1034k8008L6639J16701k8267O343j70884j0243N3575n4967j26785
$$ 75976 14423 35457 7449 44088 160789 132522 138865 -32019 -42262 11313 -43654 -170439
9839a70439N1962J0397N2637p8186J0631J88499j00499K8388P5525l1975K6195
$$ -170439 -118477 -108080 -55443 -133629 -122998 65501 -34998 -6610 68915 36940 63135
9828F3135q9136J1403L1929K8614Q927m3738J6631J63032J3201j7984N0930O364
$$ 63135 -26001 -14598 17331 45945 54872 11134 27765 190797 203998 186014 236944 243308
9816B43308j58915q9274N5236L2516J4622j05302k1087m9074N434N0661k1507
$$ 243308 84393 -4881 50355 82871 97493 -7809 -28896 -77970 -72536 -21875 -43382
9805d3382L9147j9776j7080L2061Q420j2144K4303M4877n2802J5187j0572L5916
$$ -43382 -4235 -24011 -41091 -9030 -610 -12754 11549 56426 3624 18811 8239 44155
9793D4155m4226j03886P7005L9220l9010n939r713J4589Q715n8467m4773J18641
$$ 44155 -71 -103957 -26952 12268 -26742 -32681 -42394 -27805 -19090 -77557 -122330 -3689
9781c689n5240Q1367J06197j09503m1614J10774j6099K7934K5670o8353p5857
$$ -3689 -58929 22438 128635 19132 -22482 88292 72193 100127 125797 57444 -18413
9770a8413R7935j27692O0027R6576p9775O387J3512l8947k257L827k9687m4572
$$ -18413 79522 -48170 11857 108433 28658 35045 48557 9610 7353 11180 -18507 -63079
9758f3079K2943J4463J3410k783j4222j572R8485j14395q4649J00061L9067j185
$$ -63079 -40136 -25673 -12263 -15046 -29268 -30840 67645 -46750 -131399 -31338 7729 6544
9746F544N8633j1414o4541O6623k3720k3619l8121n9491J15354L3295o4646n8796
$$ 6544 65177 53763 -10778 55845 32125 8506 -29615 -89106 26248 59543 -5103 -63899
9734f3899O284o2831K3637J43158J846p2688l9128r168R329j7542M7473k2766
$$ -63899 -57615 -120446 -96809 46349 48195 -24493 -63621 -72789 -63460 -81002 -33529 -56295
9722e6295L8206R5330J4917Q68j2068J07815j35433j7890j28165M0230M0207o2789
$$ -56295 -18089 77241 92158 93026 80958 188773 53340 35450 -92715 -52485 -12278 -75067
9710g5067L8077Q7458K3056n1172r8708N6408P5943j36162J30588P8509j90343
$$ -75067 -36990 50468 73524 22352 -76356 -19948 55995 -80167 50421 128930 -61413
9699f1413O6516P7326M9372n1721p5166O5524k972o0754R913o6367J0361J06745
$$ -61413 5103 82429 131801 80080 4914 70438 67466 6712 16625 -49742 -39381 67364
9687F7364o0833L3847L2781k7553N3887o3775q3066J7914n1109m52M4730L6805
$$ 67364 6531 40378 73159 45606 99493 35718 -47348 -29434 -80543 -80995 -36265 540
9675E40j6408M886o2466r74J5520Q4419J03543l7790j28860P8055J6272q5207
$$ 540 -15868 -10982 -73448 -74422 -58902 25517 129060 91270 -37590 40465 56737 -28470
9663b8470j54765P0988J69435L7155k9129J6567p8010N63M0264k046O0481o6760
$$ -28470 -183235 -112247 57188 94343 65214 81781 3771 4334 44598 42552 103033 36273
9651C6273p580N366J6748m9214r435r9444J6966K055N4287K8098n1253m0493K8377
$$ 36273 28693 34059 50807 1593 -7842 -107286 -90320 -88265 -33978 -5880 -57133 -97626 -69249
9638f9249O3120r891j4010J19154n296j4766j931j3860L4432o4745j9301Q3256
$$ -69249 -6129 -16020 -30030 89124 83828 69062 67131 53271 87703 22958 3657 86913
9626H6913L705K0614l2265L370k7940r1348l53p9188O2309m0651J7610J16317
$$ 86913 90618 111232 78967 82337 54397 -36951 -37304 -116492 -54183 -94834 -77224 39093
9614C9093o4571k8348M5402N585O2365q4622J00012J6550n7202P3819j08388J11063
$$ 39093 -25478 -53826 -8424 -2839 59526 -25096 74916 91466 34264 108083 -305 110758
9602A10758L0378n9886K357j25746N670L4643K5860J20653o5044J3829k498q3316
$$ 110758 141136 81250 83607 -42139 -36469 -1826 24034 144687 79643 93472 90974 7658
9590G658j5465P0074k7482j5943m8436m2208j9309J85660J0258l2400J9019l7102
$$ 7658 -7807 62267 34785 18842 -29594 -71802 -91111 94549 104807 72407 91426 54324
9578E4324o2423j01313J43020J6433p6534n0112P7827P307J6979m4908r5706J25524
$$ 54324 -8099 -109412 33608 50041 -26493 -76605 1222 8529 25508 -19400 -115106 10418
9566A0418o303M0830r1782o2905Q1589n8585l8241R3069R2048J3950l2810m2976
$$ 10418 4115 44945 -46837 -109742 -28153 -86738 -124979 -31910 60138 74088 41278 -1698
9554a698O549L950l0550j7393J18196l1179j32154o340N8055L2185J9486k3744
$$ -1698 4851 8801 -21749 -39142 79054 47875 -84279 -90619 -32564 -379 19107 -4637
9542d637L413j19724J6844N8524k3163Q4836M8051j61861O263R3716l1295J378
$$ -4637 -1224 -120948 -104104 -45580 -68743 16093 64144 -97717 -91454 2262 -29033 -27655
9530b7655J50417L8070j24216n3044J4570N8953j22992o3658J23311J13442r1840
$$ -27655 122762 160832 36616 -16428 -1858 57095 -65897 -129555 -6244 107198 15358
9519A5358M4821o7928j3332R5419q243J5288K3696j1712m3341r5056O754O4287
$$ 15358 60179 -7749 -21081 74338 66095 81383 105079 93367 50026 -45030 -38276 26011
9507B6011n2337J5745j03209L7859J05464P505j01279M4814m3129O4779l4297
$$ 26011 -26326 -10581 -113790 -75931 29533 37038 -64241 -19427 -62556 2223 -32074
9496c2074O1043l6271L6496N7736m373l7004j7876K896J2126J08352n9764J4289
$$ -32074 28969 -7302 29194 86930 82557 45553 27677 30573 42699 151051 91287 105576
9484A05576r4005P6261O4369o2250p4315k1717K6419j5098j1617o9467Q064O1754
$$ 105576 11571 87832 152201 89951 15636 -6081 20338 5240 -6377 -75844 -67780 -6026
9472f026r6927J7917J30926O3959P4949j04665j58340k6301J47137j3849j48636
$$ -6026 -102953 -85036 45890 109849 184798 80133 -78207 -104508 42629 28780 -119856
9461a19856J9930q007M2965R9469p7710O5198J9032j61450O7472l7491L7929P4683
$$ -119856 -99926 -107933 -64968 34501 -43209 21989 41021 -120429 -52957 -90448 -52519 22164
9449B2164J19070k4272l0132L5527j22582R380J00245j37789l9554R060Q2981
$$ 22164 141234 116962 86830 122357 -225 9155 109400 -28389 -67943 -58883 24098
9438B4098L3041m6551J4662p4309O1875K9391K9927q8249j1277M2662P0710r1978
$$ 24098 57139 10588 25250 -49059 12816 42207 72134 -16115 -27392 15270 85980 -5998
9426e998J14J09323j2678J6006N620o5377o8223o7094k4627j1822K6054N5823
$$ -5998 -5884 103439 90761 106767 112387 47010 -21213 -88307 -112934 -124756 -98702 -42879
9414d2879j09634M0718m9219l0401Q6064J8345N1133J8117N3720p0531j66244
$$ -42879 -152513 -111795 -161014 -191415 -105351 -87006 -35873 -17756 35964 -34567 -200811
9403b00811P4367J37931j823n8407N4151Q82J11129J6611J0534q2063Q697J8854
$$ -200811 -126444 11487 9664 -48743 5408 6290 117419 134030 144564 62501 71198 90052
9391I0052m4012m4810K2658M0667k05060N9051K3014N8996j0637l2590J29287
$$ 90052 46040 1230 23888 64555 -140505 -81454 -58440 556 -10081 -42671 86616
9380H6616l279j35979q0840m6450N2442k8478Q1553J16884o3955n7519J6919P2914
$$ 86616 83337 -52642 -133482 -179932 -127490 -155968 -74415 42469 -21486 -79005 -62086 10828
9368A0828j64608j07159M4153J10954K630J22077j9919q5593k2372Q6669l0354
$$ 10828 -153780 -260939 -216786 -105832 -103202 18875 -1044 -86637 -109009 -22340 -52694
9357e2694j11227L6294J10572J9571l5206n0629J18742L5780r5674m1529J960
$$ -52694 -163921 -127627 -17055 2516 -32690 -83319 35423 71203 -24471 -66000 -64040
9346f4040J9971N1948Q1605n9547p714L0346J6297J4418M4322q2428r433Q6515
$$ -64040 -44069 7879 89484 29937 22223 52569 68866 83284 127606 45178 35745 122260
9334A22260q5099l2082Q233K2085l017l324M0557j87N037r3674P4181j26449J10720
$$ 122260 37161 5079 13312 35397 32380 29056 69613 69426 74463 -19211 54970 -71479 39241
9321C9241k7909m762k7176o302M5217o3663L9427r363L3735L4294k2388J2581
$$ 39241 11332 6570 -20606 -26908 18309 -45354 -5927 -15290 18445 52739 30351 42932
9309D2932o7842l7837J43633n1041k4425R0760p1791L689k3732m7751L6183l7819
$$ 42932 -24910 -62747 80886 29845 5420 96180 24389 28078 4346 -43405 -7222 -45041
9297d5041P5163o725j2051j5361K6316p6663M9417R6376k494l5805J5241J21381
$$ -45041 30122 23397 11346 -4015 22301 -54362 -4945 91431 88937 53132 68373 189754
9285A89754N8142j62466j71070l3138N3332J01594j3739k4036N4723j32477N4444
$$ 189754 247896 85430 -85640 -118778 -65446 36148 22409 -1627 53096 -79381 -24937
9274b4937L6336m7543k8619j00315J5203n4539J93186K6538j04832N3133O7224
$$ -24937 11399 -36144 -64763 -165078 -149875 -204414 -11228 15310 -89522 -36389 30835
9263C0835J05414j20289j02410m840M7083M6517N3743o8956r6518Q8405r3557
$$ 30835 136249 15960 -86450 -91290 -44207 2310 56053 -12903 -109421 -21016 -114573
9252a14573n914J66090o5363J23994M9480j55571J14424k4564r9118k0727K2074
$$ -114573 -120487 45603 -19760 104234 153714 -1857 112567 88003 -11115 -31842 -9768
9241i768L4314N8657p7104p8409O5888j7015P833M1036J5487R4662l6486n2871
$$ -9768 24546 83203 6099 -72310 -6422 -23437 -15604 25432 40919 135581 99095 46224
9229D6224J0447j15028k4997O9981l422P8339K6484j6863j85194J14958j2140
$$ 46224 56671 -58357 -83354 -13373 -16795 61544 88028 71165 -114029 929 -11211
9218a1211m9226K6973L6997L5410n9984m4105J11629n0368K8823J20817p3148
$$ -11211 -60437 -33464 3533 38943 -21041 -65146 46483 -3885 24938 145755 72607
9207G2607j23561M0030M8182o8816K9859r215J3351N454Q8201r5969m350J14345
$$ 72607 -50954 -10924 37258 -31558 -1699 -10914 2437 7891 96092 123 -4227 110118
9195A10118L776o4196n2592N4129J07849L7062k6726k4836j7065K0101M3128p1722
$$ 110118 113894 49698 -2894 51235 159084 196146 169420 144584 127519 147620 190748 119026
9183A19026L669n2897j36436l7621N7953n7246N4370Q4367j36941O1645R688j9006
$$ 119026 122695 69798 -66638 -104259 -46306 -103552 -49182 35185 -101756 -40111 -30423 -49429
9171d9429J18953o5241j33012O8k5797Q5678j7455J807N9027k5658N4050m193
$$ -49429 69524 4283 -128729 -128661 -154458 -68780 -86235 -84428 -25401 -51059 2991 -1202
9159a202K2460N5747p4214r7412J63201J32004l8146j11353j4203O251J21074
$$ -1202 21258 77005 2791 -94621 68580 200584 162438 51085 36882 43133 164207
9148A64207j38459r1195k8736P1084o8375O8602Q1706M1555K7911j26001n071
$$ 164207 25748 -65447 -94183 -23099 -91474 -22872 58834 100389 128300 2299 -2772
9137b772K5769o0666K0766n4760N8312O108o6806M7943L0232l1261K1398P0760
$$ -2772 22997 -37669 -16903 -71663 -13351 -7243 -74049 -26106 4126 -27135 -5737 65023
9125F5023r8125M672m1857l2433J8438P2282J4649K8413N1047J07118o3673k3960
$$ 65023 -33102 -28430 -70287 -102720 -84282 -12000 2649 31062 82109 189227 125554 101594
9113A01594o3690r4186J2972M499J09967j52849K2859M7955J34410L861j940m546
$$ 101594 37904 -56282 -43310 -38811 71156 -81693 -58834 -10879 123531 127392 125452 120906
9101A20906r1203N1443K9031k4670l4081J3329j9449M535k397l8522J1907P3181
$$ 120906 29703 81146 110177 85507 51426 64755 45306 49841 47444 8922 20829 94010
9089I4010p0764n1708K2932N7455o2649J207L4475J07072O7857q6089n7770N2999
$$ 94010 23246 -28462 -5530 51925 -10724 -9517 24958 132030 199887 113798 56028 109027
9077A09027n9180P9685n4235n7650q805J9983m6629k8313k0268J0474R9J3116
$$ 109027 49847 129532 75297 17647 8842 28825 -17804 -46117 -66385 -55911 -55812 -42696
9065d2696N980P812R3120l618N6074Q023p4453L8590k0881k6215j0341M3351M4888
$$ -42696 -36716 -28904 64216 60598 116672 124695 50242 88832 67951 41736 31395 74746 119634
9052A19634l0685J9836m8254N6298Q2914j28758j38546J12717M9540j085p365
$$ 119634 88949 108785 60531 116829 199743 70985 -67561 45156 94696 93611 86246
9041H6246j78123P7960M3003p1001M9431P6896K1153j21342m9367k2765M0108
$$ 86246 -91877 -13917 29086 -41915 7516 84412 105565 -15777 -65144 -87909 -47801
9030d7801J5157N2257p241j07010K28205m2501j20236J02878K9622j3349n1316
$$ -47801 -32644 19613 12372 -94638 133567 91066 -29170 73708 103330 89981 38665
9019C8665j64318J52639J19413m5482L9732K1988n3716j35520K9343J25594p9208
$$ 38665 -125653 26986 146399 100917 140649 162637 108921 -26599 2744 128338 49130
9008D9130M6221K6062o2355N4316r7302M5453k7011J33186K6037n0598o8033J6278
$$ 49130 95351 121413 59058 113374 16072 61525 34514 167700 193737 143139 75106 91384
8996I1384P8691j10835j20734J44658j57778J15852L6960q2366N7805m3699P7559
$$ 91384 170075 59240 -61494 83164 -74614 41238 78198 -4168 53637 9938 87497
8985H7497p5559r8158L4123j914P4617R4808K9529k3146j20489m1407Q9255M506
$$ 87497 11938 -86220 -52097 -54011 20606 115414 144943 121797 1308 -40099 49156 53662
8973E3662p0324P539J5804J37153r3196p3848M8167k5856J0939P3589j7527k8411
$$ 53662 -16662 -9123 6681 143834 50638 -23210 24957 -899 10040 83629 66102 37691
8961C7691j23595Q1133N7253q762L1720j28736n3961P1047Q3495M8911j33371
$$ 37691 -85904 -4771 52482 43720 75440 -53296 -107257 -36210 47285 96196 -37175
8950c7175K7030r879N4800P1343r8849k3814n0470l1953J52693M507M0405o542
$$ -37175 -10145 -20024 34776 106119 7270 -16544 -67014 -98967 53726 58233 98638 92096
8938I2096m1225j44916j1394J31350R881N4283q2587L4907k6934q9558R621r7985
$$ 92096 50871 -94045 -105439 25911 35792 90075 7488 42395 15461 -74097 -64476 -162461
8926a62461P2016J00964M1258L2025r0815n8913K1677K3698L9476L9810l2849
$$ -162461 -90445 10519 51777 83802 -7013 -65926 -44249 -20551 18925 58735 25886
8915B5886L9577n5351L7750r200J03387J9368q4551l8864L5844M883O9335p3984
$$ 25886 65463 10112 47862 38662 142049 161417 76866 38002 73846 78729 148064 74080
8903G4080r5248J4579P7972N6777j01032r506J06261L3726K2690q5181j25303
$$ 74080 -21168 -6589 71383 128160 27128 17622 123883 157609 180299 95118 -30185
8892c0185J33560J2809J598k1053p5701j04700J05854J7193L7504J5943l4031
$$ -30185 103375 116184 117782 96729 21028 -83672 22182 39375 76879 92822 58791
8881E8791L1523J9408L607P0979j9396j54544Q9296q5201L2553p2805O9219P0619
$$ 58791 90314 109722 113329 184308 164912 10368 99664 14463 47016 -25789 43430 114049
8869A14049r613n7018k4770M7586J91085p9477r2848O8382m4266j3598L5923L2726
$$ 114049 104436 47418 22648 70234 261319 181842 88994 157376 113110 99512 135435 168161
8857A68161M3587M9680j6258l9626L4875k1397p1337P3938k0381K0842O660r1323
$$ 168161 211748 261428 245170 205544 240419 219022 147685 221623 201242 222084 228744 137421
8845A37421P9264j63194J66053k1436k75N6954m1524N1540R9982j4759k785M0737
$$ 137421 216685 53491 219544 198108 197833 254787 213263 264803 364785 350026 347241 387978
8833C87978m2624O1775k3987J11711M3168M2903r5340j26323R7742j2747m4867
$$ 387978 345354 407129 383142 494853 538021 580924 485584 359261 457003 444256 399389
8822C99389J07878N050J02900o3289p7212o396k9413k4420J1769J4121j6900n0027
$$ 399389 507267 512317 615217 551928 474716 468320 438907 414487 426256 440377 423477 373450
8810C73450J52590m8009q335q2594m1717j5116N1842q5316p297O0622l5085R022
$$ 373450 526040 478031 469696 387102 345385 330269 382111 296795 289498 350120 315035 324057
8798C24057K09289l8647q6758Q0684O6181r2305O7418N0915k9496J8999o5988
$$ 324057 533346 494699 407941 488625 554806 462501 529919 580834 551338 570337 504349
8787E04349r0039K9690j06049q639O4319k7411j9930J320n2391K6287j7229J03433
$$ 504349 414310 444000 337951 329312 393631 366220 346290 347610 295219 321506 304277 407710
8775D07710O6217j68729N7661r9468m6784M8454J5052q296j02947Q983O1803k4011
$$ 407710 473927 305198 362859 263391 216607 265061 280113 271817 168870 177853 239656 215645
8763B15645P8574P9057r0067n9232l4778O8735m6428j2001j04472R6316O9392
$$ 215645 294219 373276 283209 223977 189199 257934 211506 199505 95033 191349 260741
8752B60741m7413J7940O0394j2580p2296J14219l1604o4137R729K4833k1621M2940
$$ 260741 213328 231268 291662 279082 206786 321005 289401 225264 234993 259826 238205 281145
8740B81145n7283q1611o6571P138L6829J46645k0663l2401J1290R2755n8110m2931
$$ 281145 223862 142251 75680 82818 119647 266292 245629 213228 224518 317273 259163 216232
8728B16232J5540O2138J9617J23438q4390o526n2920j2249L872m1558o8327R7038
$$ 216232 231772 293910 313527 436965 352575 346049 293129 280880 284752 243194 174867 271905
8716B71905J14768J04623p3502j0208j23061P4757j7679P4081l3185q5097R9582
$$ 271905 386673 491296 417794 407586 284525 359282 341603 415684 382499 297402 396984
8705C96984N2050j4754K4104J7571j49457r472J2938J8427L2654J92444o6268
$$ 396984 449034 434280 458384 475955 326498 317026 329964 348391 381045 573489 507221
8694E07221r1549P9612J40170o7997J66P3957N2959j10777N5691j52161L2506
$$ 507221 415672 495284 635454 567457 567623 641580 694539 583762 639453 487292 519798
8683E19798M2009N3949R09p6601K5120j7272q2869M1411J12948L5656m7944l4505
$$ 519798 561807 615756 616665 540064 565184 547912 465043 506454 619402 655058 607114 572609
8671E72609J49007j5831l6743P0876J11296j19945m9094L6968k9983J7142K3203
$$ 572609 721616 705785 669042 739918 851214 731269 682175 719143 689160 706302 729505
8660G29505j3566P9115L7413R586k3976k385L2285L1584L2446J09823J05483r9205
$$ 729505 715939 795054 832467 842053 818077 815692 847977 879561 912007 1021830 1127313 1028108
8648A028108k09067J18280J5886n5859Q608O5773J8440J1810r565j12784M3138
$$ 1028108 819041 937321 953207 897348 905956 971729 990169 1001979 992414 879630 922768
8637I22768R8006J3521j22093J24456p123q5625J3749J7867M8369J4301Q0550
$$ 922768 1020774 1034295 912202 1036658 1029535 943910 957659 975526 1023895 1038196 1118746
8626A118746Q5125r789L4335k3161L4226O1585n6445j1642M0318J5440N8788Q0637
$$ 1118746 1203871 1194082 1228417 1205256 1239482 1301067 1244622 1232980 1273298 1288738 1347526 1428163
8614A428163r7914l7335J15202J8668J15890p8181j11112P5783O2428n7857P5391
$$ 1428163 1330249 1292914 1408116 1426784 1542674 1464493 1353381 1429164 1491592 1433735 1509126
8603A509126M803J33098J06394J10578n2984m4519Q004k1420P7141N1017O6818
$$ 1509126 1513929 1647027 1753421 1863999 1811015 1766496 1774500 1753080 1830221 1881238 1948056
8592A948056M3940R4922J7658J7268K2457O988k4657J36700J30524j00963l506
$$ 1948056 1991996 2086918 2104576 2121844 2144301 2151289 2126632 2263332 2393856 2292893 2289387
8581B289387R8176M1881J31035J07732M2204J40074k035J70815J63751m2771J7988
$$ 2289387 2387563 2429444 2560479 2668211 2710415 2850489 2848454 3019269 3183020 3140249 3158237
8570C158237O6878K12893J23833K0625J74255J74635O4372J07487J21618K33586
$$ 3158237 3225115 3438008 3561841 3582466 3756721 3931356 3995728 4103215 4224833 4458419
8560D458419J60878J92856J49842P9497L25615K30359J12147K38128K50688K79458
$$ 4458419 4619297 4812153 4961995 5041492 5367107 5597466 5709613 5947741 6198429 6477887
8550F477887M10444K97731L15427M27672M18029N44065K21404P42676O31869O52466
$$ 6477887 6888331 7186062 7501489 7929161 8347190 8891255 9112659 9855335 10487204 11139670
8540A1139670O28780N07615M53947N69785N09763M31115K22239J57455K65215
$$ 11139670 11768450 12276065 12730012 13299797 13809560 14240675 14462914 14620369 14885584
8531A4885584J11333J75709R2440J75410J54655P0395K24161M22609N14864O73676
$$ 14885584 14996917 15172626 15265066 15440476 15595131 15665526 15889687 16312296 16827160 17500836
8521A7500836O38222P77901Q41745R08375R52549P57606O69099Q37030R30092
$$ 17500836 18139058 18916959 19758704 20667079 21619628 22377234 23046333 23883363 24813455
8512B4813455Q84945P01907N86735M69907P11585R26448J245808J487251J679076
$$ 24813455 25698400 26400307 26987042 27456949 28168534 29094982 30340790 31828041 33507117
8503C3507117J743324J934134K107918K583293K761292L183896L443054L520433
$$ 33507117 35250441 37184575 39292493 41875786 44637078 47820974 51264028 54784461
8495E4784461L457149L900083M240506L748837K315829J234190J047599J767370
$$ 54784461 58241610 62141693 66382199 70131036 72446865 73681055 74728654 76496024
8487G6496024J424702p52193k994690m884773n402990m808130l683656k841802
$$ 76496024 77920726 77168533 74173843 69289070 63886080 59077950 55394294 52552492
8479E2552492k165628j910423k242160k492042k360314j745669j063217l18747
$$ 52552492 50386864 48476441 46234281 43742239 41381925 39636256 38573039 38254292
8471C8254292K01540O69819J246774J824127K498048K992403L375141L888085
$$ 38254292 38455832 39125651 40372425 42196552 44694600 47687003 51062144 54950229
8463E4950229L967748L537064L426467L243011K968203K633548K894255K630553
$$ 54950229 58917977 62455041 65881508 69124519 72092722 74726270 77620525 80251078
8455H0251078O13517j158311k787325l856587m899082o725424p750780p267184
$$ 80251078 80864595 79706284 76918959 73062372 68163290 61437866 53687086 46419902
8447D6419902n757255m308732l184047k517630j997904j733606j646562j673205
$$ 46419902 40662647 36353915 33169868 30652238 28654334 26920728 25274166 23600961
8439B3600961j439395j352053j185398r27146q92994j049887r40723r29640o45126
$$ 23600961 22161566 20809513 19624115 18696969 17803975 16754088 15813365 14883725 14238599
8430A4238599n52737m53107o03788m58206m16618k31383l36475l23694k06645
$$ 14238599 13685862 13232755 12628967 12170761 11754143 11522760 11186285 10862591 10655946
8421A0655946k94953j94162j30791k47843k73659j22269k42292k03014k3910k48310
$$ 10655946 10360993 10166831 10036040 9788197 9514538 9392269 9149977 8946963 8923053 8674743
8411H674743j43427k25095k29246j17301j28767k18122o4605q4175o5330o4421
$$ 8674743 8531316 8306221 8076975 7959674 7830907 7612785 7548180 7464005 7398675 7334254
8401G334254q9842l4664j21271q4932R290l5598l7957L0532p7072p8718P1105
$$ 7334254 7244412 7209748 7088477 7003545 7012835 6977237 6939280 6969812 6892740 6814022 6885127
8390F885127K9678j71443K2241J37013p579j6976J4904O1693l1197j07960r0567
$$ 6885127 6914805 6743362 6765603 6902616 6895037 6878061 6892965 6954658 6923461 6815501 6724934
8379F724934J19866J59539j37678N3195J14986j9146q1942O7100o4820M3102J30128
$$ 6724934 6844800 7004339 6866661 6919856 7034842 7015696 6933754 7000854 6936034 6979136 7109264
8368G109264P1070O7555m3081O6754Q7517K63251R7018K5702K29152J04944K5675
$$ 7109264 7180334 7247889 7204808 7271562 7359079 7622330 7719348 7745050 7974202 8079146 8104821
8357H104821J98933R5896K00639L47004L9410K28300J61759K80725K29491L24232
$$ 8104821 8303754 8399650 8600289 8947293 8986703 9215003 9376762 9657487 9886978 10211210
8347A0211210L60015M52413M66747O60370N46049P78807O28759Q14111J087917
$$ 10211210 10571225 11023638 11490385 12150755 12696804 13475611 14104370 14918481 16006398
8338A6006398J003539J145162J288601J274068J389797J389155J307296J071757
$$ 16006398 17009937 18155099 19443700 20717768 22107565 23496720 24804016 25875773
8330B5875773R55024O53450O07305O54979M00779k27981o89117q55363r76875
$$ 25875773 26830797 27484247 28091552 28746531 29147310 28919329 28230212 27374849 26397974
8321B6397974o83260o45233l68231j64139l13341j15648j2091J16098K40046J90921
$$ 26397974 25714714 25069481 24701250 24537111 24223770 24108122 24096031 24212129 24452175 24643096
8311B4643096L24915O07931O13145O73006Q95809Q52069R47556J097792J116680
$$ 24643096 24968011 25575942 26189087 26862093 27757902 28609971 29557527 30655319 31771999
8302C1771999J012430J022046R91002Q63715Q30844R24167O89862R9012m27078
$$ 31771999 32784429 33806475 34797477 35661192 36492036 37416203 38106065 38205077 37777999
8293C7777999p24707j147823j326421j663770j900706j891660j623018j331094
$$ 37777999 37053292 35905469 34579048 32915278 31014572 29122912 27499894 26168800
8285B6168800j050391q07086m75506m35897n61104n78299m71785k53451k95365
$$ 26168800 25118409 24311323 23835817 23399920 22838816 22260517 21788732 21535281 21239916
8276B1239916k80353l26076l83823n15709l81388n48781n62431m50520n02786
$$ 21239916 20959563 20633487 20249664 19733955 19352567 18803786 18241355 17790835 17288049
8267A7288049m20176n23116o30388n76177o39700n83471o71596o87989o13660
$$ 17288049 16867873 16344757 15714369 15138192 14498492 13915021 13243425 12555436 11941776
8258A1941776m52079n50444m59772n28575l69276j97386l47201k90684j83121
$$ 11941776 11489697 10939253 10479481 9950906 9581630 9384244 9037043 8746359 8563238
8249H563238j68130k86939k24447j34079j29900r8377j22370j26839j12626J43586
$$ 8563238 8395108 8108169 7883722 7749643 7619743 7521366 7398996 7272157 7159531 7303117
8239G303117K82l3561O5675M9303M7840M7193R9907p6640L975j9624J88155k1755
$$ 7303117 7303399 7269838 7335513 7384816 7432656 7479849 7579756 7503116 7507091 7487467 7675622 7653867
8227G653867O9801o4457J3691j63570k14319j43755j32775j35987o9533j38212
$$ 7653867 7723668 7659211 7672902 7509332 7295013 7151258 7018483 6882496 6812963 6674751
8217F674751o240j97882K3698j33072J73026n1987o902K4619J54261l6943L0693
$$ 6674751 6668511 6470629 6494327 6361255 6534281 6482294 6475392 6500011 6654272 6617329 6648022
8206F648022j51581K02079o4608J01021K5396K68407r1858J53399n7992M41006
$$ 6648022 6496441 6698520 6633912 6734933 6760329 7028736 6936878 7090277 7032285 7473291
8196G473291R9042M24802P3961J640017J130928l488100J60821N4943J17328J29235
$$ 7473291 7572333 7997135 8071096 9711113 10842041 7353941 7514762 7569705 7687033 7816268
8186G816268J10980K49741J34056J66284J74620K71908K71874J42504J29351K64100
$$ 7816268 7927248 8176989 8311045 8477329 8651949 8923857 9195731 9338235 9467586 9731686
8176I731686K97563J99721M42848L40293K14318L78750L67346M37804N63696L35371
$$ 9731686 10029249 10228970 10671818 11012111 11226429 11605179 11972525 12410329 12974025 13309396
8166A3309396M23801M29320N13773O35462N41914P20593P67685P53032P62331
$$ 13309396 13733197 14162517 14676290 15311752 15853666 16574259 17341944 18094976 18857307
8157A8857307R62588P26915R57352R78708J183552J106679J150164J237355J149353
$$ 18857307 19819895 20546810 21504162 22482870 23666422 24773101 25923265 27160620 28309973
8148B8309973R29190J075326J040133J037795R17745R97393P23785P90273R21101
$$ 28309973 29239163 30314489 31354622 32392417 33310162 34307555 35031340 35821613 36742714
8139C6742714J324279J633405J728521K132880K319105K739834K932127L169795
$$ 36742714 38066993 39700398 41428919 43561799 45880904 48620738 51552865 54722660
8131E4722660L391001L924075M426731M934149N060404M273162L258178K013957
$$ 54722660 58113661 62037736 66464467 71398616 76459020 80732182 83990360 86004317
8123H6004317N79687o62134j346827j026689o60186k55293o994j2423k68019p30330
$$ 86004317 86584004 85921870 84575043 83548354 82888168 82632875 82625881 82613458 82345439 81615109
8113H1615109q26987r86663j021776o51287N5420O81837J340064J738120K284328
$$ 81615109 80788122 79801459 78779683 78128396 78183816 78865653 80205717 81943837 84228165
8104H4228165K625814K948710L378981M374691N636169O498653P022115P030382
$$ 84228165 86853979 89802689 93181670 97556361 103192530 109691183 116713298 123743680
8096A23743680O480878N129861L089799P47664j024094k584340l303344l405541
$$ 123743680 130224558 135354419 138444218 139191882 138167788 135583448 132280104 128874563
8088A28874563k983048l509585m337556m910974m898548m696000m667580m532570
$$ 128874563 125891515 122381930 118044374 113133400 108234852 103538852 98871272 94338702
8080I4338702m281128m103712l298532k459130j522841p38191j1223L96214Q26323
$$ 94338702 90057574 85953862 82655330 80196200 78673359 77935168 77923945 78320159 79146482
8071G9146482J474351J934088K010438K344543K069687J832560J622138K180758
$$ 79146482 80620833 82554921 84565359 86909902 88979589 90812149 92434287 94615045
8063I4615045K366890K066828J393887j23756k103522l830505m519856m108820
$$ 94615045 96981935 99048763 100442650 100318894 98215372 94384867 89865011 85756191
8055H5756191l522449k550510j948872j370131p60526m16493k99576L7540L04723
$$ 85756191 82233742 79683232 77734360 76364229 75603703 75187210 74887634 74925174 75229897
8046G5229897O86954Q92176J030498R55851J163367J300845J257919J006411Q54023
$$ 75229897 75916851 76809027 77839525 78795376 79958743 81259588 82517507 83523918 84377941
8037H4377941N21175J05684j1465J59798L59476P08671P49730R71418J172873
$$ 84377941 84899116 85004800 84993335 85153133 85512609 86221280 86971010 87942428 89115301
8028H9115301J767504K206063K812674L257713L933232N195606O671992P657345
$$ 89115301 90882805 93088868 95901542 99159255 103092487 108288093 114960085 122617430
8020A22617430Q755419R756837J0942606J2750473J5253236J7686855K1514744
$$ 122617430 131372849 141129686 152072292 164822765 180076001 197762856 219277600
8013B19277600K5978936L0203950L0705074K4907398K1343217j6555180m8239300
$$ 219277600 245256536 275460486 306165560 331072958 352416175 335860995 287621695
8006B87621695n0911965m0033387k6054607j8577422j3942281j2067958r875873
$$ 287621695 236709730 196676343 170621736 152044314 138102033 126034075 116158202
7999A16158202q835871p334365o045771m498556l687357k786093k500346j832278
$$ 116158202 107322331 99987966 93942195 89443639 85756282 82970189 80469843 78637565
7991G8637565j257817p56884n35174J86798L12133O83717N21401J77920M5828
$$ 78637565 77379748 76622864 76087690 76274488 76586621 77270338 77791739 77969659 78015487
7982G8015487r6279l03486k40028m95490q14821j746264k388935l045338l078024
$$ 78015487 77919208 77615722 77375694 76880204 76065383 74319119 71930184 68884846 65806822
7973F5806822l089394k872476k923546k905181k728044k050857j702805j132162
$$ 65806822 62717428 59844952 56921406 54016225 51288181 49237324 47534519 46402357
7965D6402357q66421m79640l69789j07473M6154M74645O03568R02107J171171
$$ 46402357 45535936 45056296 44686507 44579034 44625188 45099833 45703401 46605508 47776679
7956D7776679J507336J733129J937606J727569J362396P24321P96048Q38357N31824
$$ 47776679 49284015 51017144 52954750 54682319 56044715 56769036 57565084 58403441 58935265
7947E8935265p35851j702938k129118j941209j766177k050265k172645k193172
$$ 58935265 58199414 56496476 54367358 52426149 50659972 48609707 46437062 44243890
7939D4243890j849929j428260j133051q55075n99293l65423k05362L48954O67380
$$ 44243890 42393961 40965701 39832650 38977575 38378282 38012859 37807497 38156451 38823831
7930C8823831R96208J356043J627761J938059K329883J955063J919042J916122
$$ 38823831 39820039 41176082 42803843 44741902 47071785 49026848 50945890 52862012
7922E2862012K339267K644403K398897J681745J10206j473844k790802l673906
$$ 52862012 55201279 57845682 60244579 61926324 62036530 60562686 57771884 54097978
7914E4097978l526604k821883k040489j579806j576666k138988k576208k386266
$$ 54097978 50571374 47749491 45709002 44129196 42552530 40413542 37837334 35451068
7906C5451068j726567j428907j121612o84583m86549j90111J6250K21267N53000
$$ 35451068 33724501 32295594 31173982 30489399 30002850 29812739 29828989 30050256 30603256
7897C0603256O83436P38091R10650R86283R42699N16892K08895j07428j22623
$$ 30603256 31286692 32024783 32935433 33921716 34864415 35381307 35590202 35482774 35360151
7888C5360151l67283p40332j400117j467272j516797j277622j396516j476397
$$ 35360151 34992868 34252536 32852419 31385147 29868350 28590728 27194212 25717815
7880B5717815j390546j323408j186519r40430q74480o78149m31140m95219l51783
$$ 25717815 24327269 23003861 21817342 20876912 20002432 19324283 18893143 18397924 18046141
7871A8046141j29148j9778o8428j05660J46444L14556M1722J6953j31750m13382
$$ 18046141 17916993 17897215 17828787 17723127 17869571 18184127 18225849 18242802 18111052 17697670
7861A7697670o16257p49803q30001r30803o92165p90888n40034n13344n45817
$$ 17697670 17081413 16331610 15501609 14570806 13878641 13087753 12547719 12034375 11488558
7852A1488558m96364n09612l24909l17542l69803l25733k95778j59347k13099
$$ 11488558 10992194 10482582 10157673 9840131 9470328 9144595 8848817 8689470 8476371
7843H476371j00651r6889j80685K32940R2938k19707L8898M665j39537m5632m3827
$$ 8476371 8375720 8278831 8098146 8331086 8424024 8204317 8243215 8247880 8108343 8062711 8018884
7832H018884o6895j60881l53459l18550m61996l30940l30615l10558k82223k11430
$$ 8018884 7951989 7791108 7437649 7119099 6657103 6326163 5995548 5684990 5402767 5191337
7822E191337l21096j96203j25856k25575j41278j46045o4750l8613k27398j90512
$$ 5191337 4870241 4674038 4548182 4322607 4181329 4035284 3970534 3931921 3704523 3514011
7812C514011j46989k6040M0394j9179J4430k8625q6468r402k1439k382o4679m4758
$$ 3514011 3367022 3340982 3381376 3362197 3376627 3348002 3261534 3252132 3230693 3228311 3163632 3118874
7800C118874n1650l9782l8375O018p0561P7268k8091j42881j13422l3114k7974
$$ 3118874 3067224 3027442 2989067 2995085 2924524 3001792 2973701 2830820 2717398 2684284 2656310
7789B656310k3701p7561j03950j1999k3694M0317r0931o4339M174j80237j7441
$$ 2656310 2632609 2555048 2451098 2439099 2415405 2455722 2364791 2300452 2304626 2124389 2106948
7778B106948L8055N1296Q2647J68972n7124j57452P6339l5880O9208j10769j80858
$$ 2106948 2145003 2196299 2278946 2447918 2390794 2233342 2309681 2273801 2343009 2232240 2051382
7767B051382n406m063n770k1483o8016J18719J615k43680j56495K65399n8996
$$ 2051382 2045976 2041913 2036143 2014660 1946644 2065363 2066978 1823298 1666803 1932202 1873206
7756A873206j7983p6325m6044J71199n9565m5632o7829j01771j4488n2914O2310
$$ 1873206 1855223 1778898 1732854 1904053 1844488 1798856 1731027 1629256 1614768 1561854 1624164
7745A624164j2676j2505J8989n4883m6647n431J5385N2184l8292m7496K5200k692
$$ 1624164 1611488 1598983 1617972 1563089 1516442 1511011 1526396 1578580 1540288 1492792 1517992 1515300
7733A515300j45114n0795J05167k3864j05713N5434P502P179p0110r1776j93294
$$ 1515300 1370186 1319391 1424558 1400694 1294981 1350415 1357917 1365096 1294986 1203210 1009916
7722A009916R2918q4056N6667M8754o3189R2342o2164k1233K5392O7005O2988
$$ 1009916 1102834 1018778 1075445 1124199 1061010 1153352 1091188 1069955 1095347 1162352 1225340
7711A225340q8747j0974K733j25067K2012L219O5575k3450j49604n8312o5195
$$ 1225340 1136593 1125619 1128352 1003285 1025297 1028516 1094091 1070641 921037 862725 797530
7700G97530Q2389J57538r2341p0072N0431J9965o2832L8229L95k2764p4034j4496
$$ 797530 879919 1037457 945116 875044 925475 945440 882608 920837 921232 898468 824434 809938
7688H09938J2129M659J43809j05649L612q56M0207m8675j6164O6744N4941j1431
$$ 809938 822067 826726 970535 864886 868498 867642 907849 859174 843010 909754 964695 953264
7676I53264p6058J9716o5531K3262j9088r8680J7623L9026j09154N7751K2958
$$ 953264 877206 896922 831391 854653 835565 736885 754508 793534 684380 742131 765089
7665G65089Q110k7283o1692K3868j85j56199P9619o8016p5804O8045O0214J04455
$$ 765089 773199 745916 684224 708092 707907 551708 631327 563311 487507 555552 615766 720221
7653G20221n5761q92l8866J7892R3305R1418r993n4067n2648j55356j6540L0225
$$ 720221 664460 663568 624702 642594 735899 827317 817324 763257 710609 555253 538713 568938
7641E68938P7834q7271k1353J13424q4287p5759j092N6242p2634J24136L8788
$$ 568938 646772 559501 538148 651572 567285 491526 490434 546676 474042 598178 636966
7630F36966m1454j7468q6679l6209P9610J36242q3151R606K5316o9870J06486
$$ 636966 595512 578044 491365 455156 534766 671008 587857 597463 622779 552909 659395
7619F59395P4310j47482o014n6249Q554o2664q3986O5697L5533j06038j7672J16773
$$ 659395 733705 586223 580209 523960 532514 469850 385864 451561 487094 381056 363384 480157
7607D80157L8801j1095n5763n666k8463P449M4890r155O7692m247m5359L5839
$$ 480157 518958 507863 452100 446434 417971 425420 470310 461155 528847 524600 479241 515080
7595E15080J83934j5984l847P2771o4031k4055N1121N759L0095J48418L5760P2572
$$ 515080 699014 683030 679183 751954 687923 663868 714989 720748 750843 899261 935021 1007593
7583A007593J17007Q2167J87961O1824K0852K44380o8128l71857k34948j52775
$$ 1007593 1124600 1206767 1394728 1456552 1477404 1721784 1653656 1281799 1046851 894076
7573H94076k18650j9477p2980j04606n7153r1753J43058n2382L7409N5934M0123
$$ 894076 675426 655949 582969 478363 421210 329457 472515 420133 457542 513476 553599
7562E53599j70209o8109J16383p2964J878n3568j824Q4581m5938R4358j13356
$$ 553599 383390 315281 431664 358700 360578 307010 305186 389767 343829 438187 324831
7551C24831o5213J02336p5065j9029M2041n8910o1785r8738p4158j857K1605M7817
$$ 324831 259618 361954 286889 267860 309901 250991 189206 90468 16310 14453 36058 83875
7539H3875L6338K05515j09119l7618J8248q238l5130O1090k1094K7528J5016j54891
$$ 83875 120213 325728 216609 178991 197239 189001 153871 214961 193867 221395 236411 81520
7527H1520K9064L2456M2090m5105m6204j8745K7180J6911J9365p208k1813L2070
$$ 81520 110584 143040 185130 140025 93821 75076 102256 119167 138532 131324 109511 141581
7515A41581n7640l613J208J2196J00405N3088j41713n4070M630P8078J5096O7291
$$ 141581 83941 80328 81536 93732 194137 247225 105512 51442 56072 134150 149246 216537
7503B16537j65836j7697J0379j3983N7323N0716J5486o8922j9935n0401P3405
$$ 216537 50701 33004 43383 29400 86723 137439 152925 84003 64068 13667 87072
7492H7072n4429q1032Q1400M2440p8403O4294l0783O0961o9352m1239k4096p3044
$$ 87072 32643 -48389 33011 75451 -2952 61342 30559 91520 22168 -19071 -43167 -116211
7480a16211m5697R1272L2647M6492j00984M9676J09677l8524K5635N3862n3955
$$ -116211 -161908 -70636 -37989 8503 -92481 -42805 66872 28348 53983 107845 53890
7469E3890o9633L5820n7497l3195L4097m8041q7426O4350N4621j56276j1014K8209
$$ 53890 -15743 20077 -37420 -70615 -36518 -84559 -171985 -107635 -53014 -209290 -220304 -192095
7457a92095R553K6440L6883L2258J0468N6024M2626J3405n2890J29643r7390l6058
$$ -192095 -182542 -156102 -119219 -86961 -76493 -20469 22157 35562 -17328 112315 14925 -21133
7445b1133J7105j5961m6622k1795r226P8178m0550J6524K9463J2103r1536k2130
$$ -21133 -4028 -19989 -66611 -88406 -97632 -19454 -60004 -43480 -14017 -1914 -93450 -115580
7433a15580O6794P6707J016l7339O750J6446n7789m717m7382J23472p20O0576
$$ -115580 -48786 27921 28937 -8402 -1652 14794 -42995 -47712 -95094 28378 27658 88234
7421H8234n4048j21337n250K8993J06307l9588q4866O5940Q374j7993o6372p2489
$$ 88234 34186 -87151 -92401 -63408 42899 3311 -81555 -15615 -7241 -25234 -91606 -164095
7409a64095J39303m4557J9341N823r1331l3891J2659K9726J37282M09j3352o2189
$$ -164095 -24792 -69349 -50008 -44185 -135516 -169407 -156748 -127022 10260 10669 -2683 -64872
7397f4872K5244j7824j10918P677L2767k9909r1362N0950M0779J35213l4520o4533
$$ -64872 -39628 -57452 -168370 -160693 -127926 -157835 -249197 -198247 -157468 -22255 -56775 -121308
7385a21308M2995J71418p4966l5861j1914r1826J2438n693J9065m9766j7484q3136
$$ -121308 -78313 93105 18139 -17722 -29636 -121462 -109024 -114717 -95652 -145418 -162902 -246038
7373b46038O4912j752O201l5958J41794q3727R437J4632M9605j92914K7010J16003
$$ -246038 -181126 -182878 -176677 -212635 -70841 -154568 -145131 -130499 -80894 -273808 -246798 -130795
7361a30795J35331j34890l6218R1172l9920M3423k1086J3380k5575P9691M2282
$$ -130795 4536 -130354 -166572 -75400 -115320 -71897 -92983 -79603 -105178 -25487 16795
7350A6795N293k0254p9728m7223k3183R9281Q0070r4448k3783J29211M3248j60155
$$ 16795 22088 1834 -77894 -125117 -148300 -49019 31051 -63397 -87180 42031 85279 -74876
7338g4876J5105j3525O6078o7579M494m4983P5189M6266m1597O8981m0498o6231
$$ -74876 -59771 -73296 -7218 -74797 -70303 -115286 -40097 6169 -35428 33553 -6945 -73176
7326g3176r2907K09775p8839k6134K924o0800m9152J25692N6880j26390M5660
$$ -73176 -166083 43692 -35147 -61281 -58357 -119157 -168309 -42617 14263 -112127 -66467
7315f6467n9742O1132M1944m3193q1960K1483J16929m0997M232L9211r3218j8808
$$ -66467 -126209 -65077 -23133 -66326 -148286 -126803 -9874 -50871 -46639 -7428 -100646 -119454
7303a19454l8436L8132J7987R9988k770J0077l0316J0711N1536q3526O9836j34030
$$ -119454 -157890 -119758 -101771 -1783 -4553 5524 -24792 -14081 37455 -46071 23765 -110265
7291a10265O0606J7450r7490j8945N8875j7747J5342N164R2364M4629r1374N7794
$$ -110265 -49659 -32209 -129699 -148644 -89769 -107516 -92174 -87010 5354 49983 -41391 16403
7279A6403m7200n0886R7788J7241k3081K4928n0815m2055O1815j054l4093n5484
$$ 16403 -30797 -81683 16105 33346 10265 35193 -15622 -57677 4138 3084 -31009 -86493
7267h6493j9991Q5972j5264n6544J1947Q1937k2412N5794M7639j12667j29316
$$ -86493 -106484 -20512 -35776 -92320 -80373 1564 -20848 34946 82585 -30082 -159398
7256a59398j8783O6634K08091r5841o8062l5030o2553M6673L9268K2258j7639
$$ -159398 -178181 -111547 96544 703 -67359 -102389 -164942 -118269 -79001 -56743 -74382
7245g4382N5729o8753k6292N8019n8894o8402O3130J23942j3932q8047j01625
$$ -74382 -18653 -87406 -113698 -55679 -114573 -182975 -119845 4097 -9835 -97882 -199507
7234a99507J53990j5348j2007n9687Q2412J3283r120m986o5517n1597O8734J447
$$ -199507 -45517 -60865 -72872 -132559 -50147 -36864 -45984 -50970 -116487 -168084 -99350 -97903
7222i7903m6552Q2569l5317k8880O1035p3045O3916J8149N774P4226l2697K863
$$ -97903 -144455 -61886 -97203 -126083 -65048 -138093 -74177 -56028 -50254 23972 -8725 -5862
7210e862j1259m3334M9648K9698Q6420m2541k17624O785j398N5005j06313l9342
$$ -5862 -17121 -60455 -10807 18891 105311 62770 -154854 -148069 -149467 -94462 -200775 -240117
7198b40117J03667p654N4488R5933P247r9717J3080O6705M3609j6561j25278L8856
$$ -240117 -136450 -144104 -89616 6317 13564 -86153 -73073 -6368 37241 20680 -104598 -65742
7186f5742Q6567L1826p4357m4591J030J8344k1566P123l3489J3065N5843N4927
$$ -65742 20825 52651 -21706 -66297 -65267 -46923 -68489 -61366 -94855 -81790 -25947 28980
7174B8980n1176j30662j2909l1525Q5227L0119m3889R4622n140M4693K3210o6945
$$ 28980 -22196 -152858 -165767 -197292 -112065 -81946 -125835 -31213 -36353 8340 31550 -35395
7162c5395L0823O8168m1344K645o3465M859m3317O0719P731p1498M4908m7711
$$ -35395 -4572 63596 22252 24897 -38568 -33709 -77026 -16307 -8576 -80074 -35166 -82877
7150h2877j74915P8951J57651k8234j1576j6053r979R5599J0406l8162l2507n9614
$$ -82877 -257792 -178841 -21190 -49424 -61000 -77053 -87032 8567 18973 -19189 -51696 -111310
7138a11310Q0229L2576K8349K6744q865R098l4300j15667k6802J0375P7200l6889
$$ -111310 -31081 1495 29844 56588 47723 56821 22521 -93146 -119948 -109573 -32373 -69262
7126f9262J0264l5269m140N3840o1009O7248j7014R8236k1825J12342r6719o3564
$$ -69262 -58998 -94267 -98407 -44567 -105576 -38328 -55342 42894 21069 133411 36692 -26872
7114b6872o2896K1131J00957q8742j0633k02J21817J5857j72364P5586k1561q900
$$ -26872 -89768 -68637 32320 -56422 -67055 -67257 54560 70417 -101947 -26361 -47922 -56822
7102e6822n1176M7110J03672q9978j9054j8235J57810l2622l897m237o3177L3849
$$ -56822 -107998 -60888 42784 -47194 -66248 -84483 73327 40705 36808 32571 -30606 3243
7090C243K7948j00606q3495J13927J5985N002o5521P2595L4570o1568p953K4393
$$ 3243 31191 -69415 -152910 -38983 -22998 -17996 -83517 -10922 23648 -37920 -45873 -21480
7078b1480M29L3880J02448r7370m4007r4824N1460N5785p198P7453m8329j1748
$$ -21480 -21051 12829 115277 17907 -26100 -120924 -69464 -13679 -20877 56576 8247 -3501
7066c501m8553N2763n6997P7076q5925q5458N8808N3537J5363j0627L0445k512
$$ -3501 -52054 709 -56288 20788 -65137 -150595 -91787 -38250 -22887 -33514 -3069 -5581
7054e581J25035p3725j06510j70147R2781J06604j19173M7696L0000j25212J02171
$$ -5581 119454 45729 -60781 -230928 -138147 -31543 -150716 -103020 -73020 -198232 -96061
7043i6061N6696J29998m6425j45615m5709Q3891J2199m0714P9749M491p0341O0780
$$ -96061 -39365 90633 44208 -101407 -147116 -63225 -51026 -91740 -11991 -7500 -77841 -17061
7031a7061j32391Q7882R5112o5067j20847J64443K9534k0214p0058j4714l8815
$$ -17061 -149452 -61570 33542 -31525 -152372 12071 41605 21391 -48667 -63381 -102196
7020a02196N8032m7964K2498M3764k4082M6252j189J9716k8587M9259M341L7974
$$ -102196 -44164 -92128 -69630 -25866 -49948 -3696 -4885 14831 -13756 35503 39844 77818
7008G7818j05433k8740n332M5551P94L8465l0899M8850q3702m5004J42872l8482
$$ 77818 -27615 -56355 -61687 -16136 -15342 23123 -7776 41074 -42628 -87632 55240 16758
6996A6758q4645P4796J5827L2068N2278r8782q8309J0863r016j1093O2124k751
$$ 16758 -67887 6909 22736 54804 107082 8300 -80009 -69146 -78162 -89255 -27131 -29882
6984b9882o2143r769L6927J9571N441Q1727K7155j72580l1124J32766M3656m1332
$$ -29882 -92025 -101794 -64867 -45296 -39855 41872 69027 -103553 -134677 -1911 41745 413
6972D13M7419L6763J5066P3236j56143P4129j01704m2719q3142P1725Q3719o1611
$$ 413 47832 84595 99661 172897 16754 90883 -10821 -53540 -136682 -64957 18762 -42849
6960d2849m5719p9448k747m4680N5458R7991Q3450j6455j01362j8215L3748L2639
$$ -42849 -88568 -168016 -170763 -215443 -159985 -61994 21456 5001 -96361 -114576 -80828 -48189
6948d8189K3986j47163M1588M4836J06974q2979j7501L4445M5685M3821j69697
$$ -48189 -24203 -171366 -129778 -84942 22032 -60947 -78448 -44003 1682 45503 -124194
6937a24194j3758q330k5315N8144N1668N1283O88l8411q4577k0070J33662l4621
$$ -124194 -137952 -146282 -171597 -113453 -61785 -10502 -9814 -48225 -132802 -152872 -19210 -53831
6925e3831L2226N9172j5943j71979O2119J5241J9061N9542J0261j04044N7407
$$ -53831 -21605 37567 21624 -150355 -88236 -72995 -53934 5608 15869 -88175 -30768
6914c0768J03212p5930n2658J2715j3974Q3481n2617j28806P8960M3760J9823
$$ -30768 72444 -3486 -56144 -43429 -57403 26078 -26539 -155345 -76385 -32625 -12802
6903a2802K7968m8717k3582L0297P8042r065n5757J02255k2875o3309j9136k6547
$$ -12802 15166 -33551 -57133 -26836 51206 42141 -13616 88639 65764 2455 -16681 -43228
6891d3228J10304o1897k3701R0130L158Q0346p1220P05Q480q6905J4546m1389
$$ -43228 67076 5179 -18522 71608 74766 155112 83892 84597 93077 6172 20718 -20671
6879b0671n0903O6004R0106L1800j18581O0923j5214k3817Q8154m3638l3729P8273
$$ -20671 -71574 -5570 84536 116336 -2245 58678 43464 19647 107801 64163 30434 108707
6867A08707l0125m6802M8526j05640m0891J48293l4910m5391n77k3845L6614m5942
$$ 108707 78582 31780 80306 -25334 -66225 82068 47158 1767 1190 -22655 13959 -31983
6855c1983R2214j5995r2895R069M117l6765K9363k6326M2413J03999k7090m3655
$$ -31983 60231 44236 -48659 -39590 -35473 -72238 -42875 -69201 -26788 77211 50121 6466
6843F466J4573J17959l4784j5033p0327K9110L7338O869q1022r895r6676k1314
$$ 6466 21039 138998 104214 89181 18854 47964 85302 92171 11149 1254 -95422 -116736
6831a16736j6307J0961Q6139N2427K8572k8736k7466M0212k3164M3690j29580
$$ -116736 -133043 -122082 -35943 16484 45056 16320 -11146 29066 5902 49592 -79988
6820g9988m6448O8069K8806M2196L8646n1124M5529M9522n0441n165p8729O6348
$$ -79988 -126436 -58367 -29561 12635 51281 157 45686 95208 44767 39602 -39127 27221
6808B7221R6340o1476j5142q9291r4245R4663J04354q361P8768Q3323j46768j4916
$$ 27221 123561 62085 46943 -42348 -136593 -41930 62424 54063 132831 216154 69386 54470
6796E4470j59484J48799L8995J1581j0649j02126L826L7676k1888p074Q6250p8270
$$ 54470 -105014 43785 82780 94361 83712 -18414 -14588 23088 1200 -5874 80376 2106
6784B106q4357R4891M7733J858L6428j21926N0543P9570K0486j02599o1719N3034
$$ 2106 -82251 12640 60373 62231 98659 -23267 27276 106846 127332 24733 -36986 16048
6772A6048M3994l3230P6737p437L9852q584L7292k1057j10012K8448l7537J09686
$$ 16048 60042 26812 103549 96112 135964 127380 164672 143615 33603 62051 24514 134200
6760A34200j01423q7572J21218j2124q6017j17264J00002P4174J7791Q7397j18580
$$ 134200 32777 -54795 66423 54299 -31718 -148982 -48980 25194 42985 130382 11802
6749A1802O6607l3073Q6997m8570q3016J09511P7376l5577L269j15069o3347R7083
$$ 11802 78409 45336 132333 83763 747 110258 187634 152057 155326 40257 -23090 73993
6737G3993J03757j90429n5469J68980J2611J9245n0260K2500K2558L0283M5627
$$ 73993 177750 -12679 -68148 100832 113443 132688 82428 104928 127486 157769 203396
6726B03396K9260J9137j16413J43352o977O1756n5433J6725l0861L6928j02142
$$ 203396 232656 251793 135380 278732 271755 333511 278078 294803 263942 300870 198728
6715A98728j72484J2670L876j1147n8121R9518P4616k0933m7622Q3242o1855P0191
$$ 198728 26244 38914 42790 31643 -26478 73040 147656 126723 79101 162343 100488 170679
6703A70679m2282K89Q835K3530m8517J1277P0388r136m2372o2473j47755m4416
$$ 170679 128397 128686 137521 161051 112534 123811 194199 185063 142691 80218 -67537 -111953
6691a11953l57K2927j6916J30439J13669n5448R1621k5097p0128j6588M3947O8477
$$ -111953 -112310 -89383 -106299 24140 137809 82361 173982 148885 78757 62169 106116 174593
6679A74593o5278j08368o0022J25084P172k0536n9684p7171L5464J78949n3455
$$ 174593 109315 947 -59075 66009 73181 52645 -7039 -84210 -48746 130203 76748
6668G6748L4104M9608j545q2944J0198P9983j14654l1461m6159J5476J67523K6722
$$ 76748 110852 160460 158915 75971 86169 166152 51498 20037 -26122 -10646 156877 183599
6656A83599j19371m9705K8036j9878q4204J43857P1512m3834L7091m7956K5031
$$ 183599 64228 14523 42559 22681 -61523 82334 153846 110012 147103 99147 124178
6645A24178K3838n1791K1939P4836k4749o764o243q7779M3277M5136j68014Q4080
$$ 124178 148016 96225 118164 193000 168251 161487 155244 67465 110742 155878 -12136 71944
6633G1944q789M5977R4573L5547m6117n1660l9530J05026j31184p6452J11536
$$ 71944 63155 109132 203705 239252 193135 141475 101945 206971 75787 -665 110871
6622A10871j02834P7598K9603L7378m3903P0298j7740m9781j5078m7260j4146
$$ 110871 8037 85635 115238 152616 108713 179011 161271 111490 96412 49152 35006
6611C5006O574m675J00302K4515k9694O6157N6696j22479p4308L7009K0640Q80
$$ 35006 41580 36905 137207 161722 132028 198185 254881 132402 58094 95103 115743 116623
6599A16623J27336K8924k9135m6521K440K0749R9873j7700k3401j7196l4212O1060
$$ 116623 243959 272883 243748 197227 199667 220416 320289 302589 279188 261992 227780 288840
6587B88840M4343K6677r629j9502P9984o8087K0596L1023M2734K8185l9359j00414
$$ 288840 333183 359860 350231 330729 410713 342626 363222 394245 436979 465164 425805 325391
6575C25391K9510j5899m298O3676K8425J6724j4972l0480l5784p1782J24168N6906
$$ 325391 354901 339002 334704 398380 426805 443529 428557 398077 362293 290511 414679 471585
6563D71585j2288P8678O3639k0913m7787R594P1442N1631j35224M3407j291M5085
$$ 471585 459297 537975 601614 580701 532914 542508 613950 665581 530357 573764 572473 617558
6551F17558R794M4898J13060R0839R9384o2924j5663K172J4833J29466J80308
$$ 617558 627352 672250 785310 876149 975533 912609 896946 899118 913951 1043417 1223725
6540A223725k8319J88001J83674J07409R1009J14496J81409J78945L08119K76398
$$ 1223725 1195406 1383407 1567081 1674490 1765499 1879995 2061404 2240349 2548468 2824866
6530B824866K47479M10761M48267M48042N14701M43011O02570Q41415R30507O94407
$$ 2824866 3072345 3483106 3931373 4379415 4894116 5337127 5939697 6781112 7711619 8406026
6520H406026L58470j47451n08950j076069j240317j005602q41748n54443l75095
$$ 8406026 8764496 8617045 8108095 7032026 5791709 4786107 3944359 3389916 3014821
6511C014821l38792k22166j71667j03483k05998j73299j7103j10486j69451j10785
$$ 3014821 2676029 2453863 2282196 2178713 1972715 1799416 1782313 1671827 1502376 1391591
6501A391591j01036J00374j50340K8717k8465P7507r0151j87865j13088J09346
$$ 1391591 1290555 1390929 1240589 1269306 1240841 1318348 1228197 1040332 927244 1036590
6491A036590k6524M8345K3850q1946J48565L9475j7782j17293j27622l2052L8805
$$ 1036590 1010066 1058411 1082261 1000315 1148880 1188355 1170573 1053280 925658 893606 932411
6480I32411J959n8344J4833M1517m2612J43128K9546k2550L632j13016L6824N707
$$ 932411 934370 876026 890859 932376 889764 1032892 1062438 1039888 1043520 930504 967328 973035
6468I73035m3464N4924M4007j0849Q7789l0768J03135J16712m9562J17269o186
$$ 973035 929571 984495 1028502 1017653 1105442 1074674 1177809 1294521 1244959 1362228 1356042
6457A356042N7097J37501P7486K04139Q3714L9721K94262L54447K01165J55481
$$ 1356042 1413139 1550640 1628126 1832265 1915979 1955700 2249962 2604409 2805574 2961055
6447B961055O7768j18307j79973j05298k71674q7597j11261j65524k2801j84183
$$ 2961055 3028823 2910516 2730543 2625245 2353571 2265974 2154713 1989189 1966388 1782205
6437A782205q474r3152m2279K9323M4321J5654k1405k0198J34309k0756k3499
$$ 1782205 1773731 1680579 1638300 1667623 1711944 1727598 1706193 1685995 1820304 1799548 1776049
6426A776049K4583J13086p1384K2248J64062J29526k6139Q082Q2699J90379N6524
$$ 1776049 1800632 1913718 1842334 1864582 2028644 2158170 2132031 2140113 2222812 2413191 2469715
6415B469715P3887K25688K5255J18713J13130q580K51583K11652J58833J81205
$$ 2469715 2543602 2769290 2794545 2913258 3026388 3017808 3269391 3481043 3639876 3821081
6405C821081K15487P1281M9301N4036J71115L0941P8644J19407P9026J24066L55436
$$ 3821081 4036568 4107849 4157150 4211186 4382301 4413242 4491886 4611293 4690319 4814385 5169821
6394E169821L04844L09806L99403M51936M92303M26881O16456N18786N96198M66870
$$ 5169821 5474665 5784471 6183874 6635810 7128113 7554994 8171450 8690236 9286434 9753304
6384I753304N90748N95866M42024N11676L96149K76830J99951L01562K21456J72365
$$ 9753304 10344052 10939918 11381942 11893618 12289767 12566597 12766548 13068110 13289566 13461931
6374A3461931K16425M25227N32281O97106P80487J086432J278608J416226J469449
$$ 13461931 13678356 14103583 14635864 15332970 16113457 17199889 18478497 19894723 21364172
6365B1364172J700167J926908K096725K258951K226554K079768J797602J032323
$$ 21364172 23064339 24991247 27087972 29346923 31573477 33653245 35450847 36483170
6357C6483170J25797o09194j451928k033391k990165l097678l134490k833020
$$ 36483170 36608967 35999773 34547845 32514454 29524289 26426611 23292121 20459101
6349B0459101k562078k064562j742249j452663j227651r64173q11621p55187o44961
$$ 20459101 17897023 15832461 14090212 12637549 11409898 10445725 9634104 8878917 8233956
6340H233956m53638m55917m29890l48683k19067k68131k24298k31155j60369j06605
$$ 8233956 7780318 7324401 6894511 6545828 6326761 6058630 5834332 5603177 5442808 5336203
6330E336203j25338j39071p7031J3012m5423j12985j38099m8273j48396j66898
$$ 5336203 5210865 5071794 4994763 5007775 4962352 4849367 4711268 4662995 4514599 4347701
6320D347701j58843j03036j53301j80412j69203k9228o3780j47129J6758n7289
$$ 4347701 4188858 4085822 3932521 3752109 3582906 3553678 3489898 3342769 3359527 3302238
6310C302238K9539j45124L9472J2024r1458R6357Q0627o913L9585O9718j8494
$$ 3302238 3331777 3186653 3226125 3238149 3146691 3243048 3323675 3316762 3356347 3426065 3407571
6299C407571N4706Q377J85527Q9723L93929k6253K7338L07538K37875O6829J73093
$$ 3407571 3462277 3470654 3656181 3745904 4139833 4113580 4140918 4448456 4686331 4753160 4926253
6288D926253K75530J32705J15243O6769O574j7948k09554o6230q2889k35909j26522
$$ 4926253 5201783 5334488 5449731 5516500 5523074 5505126 5295572 5229342 5146453 4910544 4784022
6277D784022l73466l82216l16706q0533k32104q8810k41120k43795j34213k5273
$$ 4784022 4410556 4028340 3711634 3631101 3398997 3310187 3069067 2825272 2691059 2665786
6267B665786K4642j37379j45489r4464j10731r7190l5309L5996j36343k06570
$$ 2665786 2690428 2553049 2407560 2313096 2202365 2105175 2069866 2105862 1969519 1762949
6257A762949q5715j09560N502p4823n729N2745j07387p4990m5144q9304m2347
$$ 1762949 1677234 1567674 1573176 1498353 1492624 1545369 1437982 1362992 1317848 1228544 1186197
6246A186197k6089R133r0350o7130K521R4232P65q1424N7795j3967k4011j78641
$$ 1186197 1160108 1169241 1078891 1011761 1014282 1108514 1109279 1027855 1085650 1071683 1047672 869031
6234H69031r8846j3272P7602R4532j9632o5007o6350K8483J3908n4899j54856
$$ 869031 770185 756913 834515 929047 909415 844408 778058 806541 820449 765550 610694
6223F10694J02971J3049O5385l2322j7939j05522m8164m6554k6532J24953l579
$$ 610694 713665 726714 792099 759777 741838 636316 588152 541598 515066 640019 636440
6212F36440l2910k4361J0931N761n9914j23457Q5047J6954J6793m6613n9653O8916
$$ 636440 603530 579169 590100 595861 535947 412490 497537 514491 531284 484671 425018 493934
6200D93934N5087j0864M0344j2671l5889q4634l8786N0699M2828N3072K7875M852
$$ 493934 549021 538157 578501 565830 529941 445307 406521 457220 500048 553120 580995 585847
6188E85847m5335j06803m8934n0734J5465Q6965m6089k8577n501k3799M3961j463
$$ 585847 540512 433709 384775 334041 349506 436471 390382 361805 356304 332505 376466 375003
6176C75003p6502m0451j144K07103j40898m7918Q5481J00528J3522j28551J41688
$$ 375003 298501 258050 256906 464009 323111 275193 360674 461202 474724 346173 487861
6165D87861n5626j0276m5158r8906N945p2777N1226j8238R7834J13149q5250m018
$$ 487861 432235 421959 376801 277895 283840 211063 262289 244051 341885 455034 369784 365766
6153C65766r698R3412j0598p8442Q1070L2041j09743r6521q4739q2757P5066R7510
$$ 365766 356068 449480 438882 360440 441510 473551 363808 267287 182548 99791 174857 272367
6141B72367L9058o0436n493O7046J7197l839k3986N7596J9110o5515Q517j13595
$$ 272367 311425 250989 245496 312542 329739 325900 301914 359510 378620 313105 321622 208027
6129B08027J12365L2224j24516N505N233N7845p1143n1724j0347j8183Q4272L4467
$$ 208027 320392 352616 228100 233605 238838 296683 225540 173816 163469 145286 229558 264025
6117B64025P8098l7438j05276l9779k2919M0466J41270L6761L3588M9634j78094
$$ 264025 342123 304685 199409 159630 136711 177177 318447 355208 388796 438430 260336
6106B60336j33435J32177j40486L1280N7955j9029N2243N3110K9228j54983L4161
$$ 260336 126901 259078 118592 149872 207827 188798 241041 294151 323379 168396 202557
6095B02557L3294p4056l7074K5236N0030m8106J1937M9432k1338K4845o2605O5629
$$ 202557 235851 161795 124721 149957 199987 151881 163818 213250 191912 216757 154152 219781
6083B19781K7312J6071k8961M0707m7819j4009l9856o167j827R7790P775K359
$$ 219781 247093 263164 234203 274910 227091 213082 173226 167059 165232 263022 270797 273156
6071B73156n0145j24721l3323M0490l6066M7300n532j8334j02181J75775J17794
$$ 273156 223011 98290 64967 105457 69391 116691 111159 92825 -9356 166419 284213
6060B84213k11131r306N4909N6973L1419J7164j6738q7881M7210J14316l5247
$$ 284213 73082 63776 118685 175658 207077 224241 207503 119622 166832 281148 245901
6049B45901J11731J74r0417M0642L9585l2676o7177R664K2643p1432K0404K1408
$$ 245901 357632 357806 267389 308031 347616 314940 247763 257427 280070 208638 229042 250450
6037B50450p156J5065l4990J21959k4736j08797j2132J6076M6657m2041o5897
$$ 250450 243294 258359 223369 345328 320592 211795 199663 215739 262396 220355 154458
6026A54458m4440j218N6922J19215p4158n8961R4754n4069K5999J30114j64765
$$ 154458 110018 108800 165722 284937 210779 151818 246572 192503 218502 348616 183851
6015A83851J5680M8087j3073M427n2200J4341n5913Q1791m5883o4990O0967K0438
$$ 183851 199531 247618 234545 238972 186772 201113 145200 226991 181108 116118 177085 197523
6003A97523l3783J00122q7488M2900R7834N4417q01j27351O6110M3782O8895L0992
$$ 197523 163740 263862 176374 219274 317108 371525 370724 243373 309483 353265 422160 453152
5991D53152j17099o2302n3655p263J17037n4413O019M9561J4333o5764Q55q714
$$ 453152 336053 273751 220096 212833 329870 275457 281476 331037 345370 279606 280461 271747
5979B71747p8484L3411l2620j18687J87575R521o8410m5145L0459L6917k965J60804
$$ 271747 193263 226674 194054 75367 262942 272463 204053 158908 189367 226284 223319 384123
5967C84123m3822j18070M1401l8615K4307p0773P620P4797M2654q472m7201j1946
$$ 384123 340301 222231 263632 225017 249324 178551 186171 260968 303622 295150 247949 236003
5955B36003O8404p2416p875r0195J22733P1371j67635N8929j7560m9184Q4105
$$ 236003 304407 231991 224116 133921 256654 328025 160390 219319 201759 152575 236680
5944B36680j59939O5452Q7026q9723O0670o5508K5093O3821Q2850o2883M2400
$$ 236680 76741 142193 229219 139496 200166 134658 159751 223572 306422 243539 285939
5933B85939k0096L4304j7928q9287J03984p1623o4034J0030m3667M7258J07061
$$ 285939 265843 300147 282219 192932 296916 225293 161259 171289 127622 174880 281941
5922B81941r436j8014q2193p184n0391J05556k3077n3261R6163O664m568J0208
$$ 281941 272505 254491 172298 165114 114723 220279 197202 143941 240104 246768 242200 252408
5910B52408o017k0100M1575k5042Q0671q9846K0406N0112M0120o9789n9746M4064
$$ 252408 246391 226291 267866 242824 323495 233649 254055 304167 344287 274498 214752 258816
5898B58816j9465k8158J6641K3337P3040j87372k5361J95125N5099q2019r6984
$$ 258816 239351 211193 227834 251171 324211 136839 111478 306603 361702 279683 182699
5887A82699J89544l7165k9525K1660j01806o9137n4438J22567N0685L6971n3563
$$ 182699 372243 335078 305553 327213 225407 156270 101832 224399 275084 312055 258492
5876B58492O3418Q0722j21028k0241o4700M79J2826k2030R358n7732M0861k2251
$$ 258492 321910 402632 281604 261363 196663 197142 209968 187938 197296 139564 180425 158174
5864A58174J16780P07j02002Q7358L3378N3385q1521j13518j5074k0043J48524
$$ 158174 274954 275661 173659 261017 294395 347780 266259 152741 137667 117624 266148
5853B66148M9651l4945l8456K6382j00724k493N8179J28809k8930j29410o5627
$$ 266148 315799 280854 242398 268780 168056 165563 223742 352551 323621 194211 128584
5842A28584J2672N6108L2521j10156p6401J77178o914J11866J5620j28538R354
$$ 128584 141256 197364 229885 119729 43328 220506 213592 325458 341078 212540 221894
5831B21894p7456j9041Q5472P3128J6350o275r3652K1647L4385L9137J05770k9905
$$ 221894 144438 125397 210869 283997 300347 294072 200420 222067 256452 295589 401359 371454
5819C71454q1847j68318R9586L3664P5122j02712O2978Q8407n0024K832K1213
$$ 371454 289607 121289 220875 254539 329661 226949 289927 378334 328310 331142 352355
5808C52355k7038n138O7648j19959m5905Q1510O1305l110L2761r5665M0550j03187
$$ 352355 325317 320179 387827 267868 221963 303473 364778 361668 394429 298764 339314 236127
5796B36127m0963N3318L528K1287N786q7005M1080J50328l8091l1871R7943n3203
$$ 236127 195164 248482 252010 273297 279083 192078 233158 383486 345395 313524 411467 358264
5784C58264o9010j47667J7975l4474m1885J27520R319N7072m3990r202K8796Q662
$$ 358264 289254 141587 159562 125088 83203 210723 220042 277114 233124 223922 252718 261380
5772B61380J0108l8473l9932P2546m853O8259k1069l5113n2775R0209m3035K1626
$$ 261380 271488 233015 193083 265629 260776 329035 307966 272853 220078 310287 267252 288878
5760B88878P4452r1917k3248J32423r0119j6639j22608N1877Q0118K5177j7398
$$ 288878 363330 271413 248165 380588 290469 273830 151222 203099 283217 308394 290996
5749B90996l3713m5897R2761N3936j03662P2955N8699J4850R2465r2267q4928
$$ 290996 257283 211386 304147 358083 254421 327376 386075 400925 493390 401123 316195
5738C16195p8746J1320Q0938k7981m0296O5085K8666j08995Q6720J01070J6102
$$ 316195 237449 248769 329707 301726 261430 326515 355181 246186 332906 433976 450078
5727D50078o1663L1782k10772Q310K3485L7549L7521q014k9422L9538P658Q2282
$$ 450078 388415 420197 209425 217735 241220 278769 316290 308276 278854 318392 326050 408332
5715D08332n9600m3868J20563p9997M705J8516K4491q7659j03201o3714J11733
$$ 408332 348732 304864 425427 345430 350135 368651 393142 305483 202282 138568 250301
5704B50301J73240q4769R1880r3273o7962K6640l4478p856K8194Q3401R43R578
$$ 250301 423541 338772 430652 337379 269417 296057 261579 253723 281917 365318 366261 375839
5692C75839R4938q4566r6426K0999P5501O4843k2838O244l4574J04111q6165n6943
$$ 375839 470777 386211 289785 310784 386285 451128 428290 434534 399960 504071 417906 360963
5680C60963L7079l7742M6128n7728Q0765n5159J00495j26953O057J57468j27507
$$ 360963 398042 360300 406428 348700 429465 374306 474801 347848 353905 511373 383866
5669C83866l6886j9900P5518J19925P7077k9982q2293j08886R9688K0955J8518
$$ 383866 346980 327080 402598 522523 599600 569618 487325 378439 478127 499082 517600
5658E17600J8975q9691n8474n0500Q4080J13830l4801l5332j27921J6869P6427
$$ 517600 536575 446884 388410 337910 421990 535820 501019 465687 337766 354635 431062
5647D31062L8557P8529j5424j03802r1053K7538M4026P9380l2623j13950J5315
$$ 431062 469619 548148 532724 428922 337869 365407 409433 488813 456190 342240 357555
5636C57555K5563l0688J03601N3833q5715p0090p1336M4613k3935J7489l9742
$$ 357555 383118 352430 456031 509864 424149 354059 282723 327336 303401 320890 281148
5625B81148Q4058P445q250Q7468L9955j02623M5725J7172q901j1187l5975o1076
$$ 281148 365206 372651 364401 451869 491824 389201 434926 452098 443197 432010 396035 334959
5613C34959r797J7556K2521M2358m551L0065n6295m0624O9818P6227r4413O6610
$$ 334959 325162 342718 365239 407597 403046 433111 376816 336192 406010 482237 387824 454434
5601D54434o2681L034K2433N9632o2228J1020N1544n7216N6695P5791j1308p3834
$$ 454434 391753 394787 417220 476852 414624 425644 477188 419972 476667 552458 541150 467316
5589D67316l2305j7765O715j3338j48934Q0272J47033q0895j04605N2228J7789
$$ 467316 435011 417246 423961 410623 261689 341961 488994 408099 303494 355722 373511
5578C73511R4714q6531J6612k4073L6474J32613j05724J36853n0872n3633l2305
$$ 373511 468225 381694 398306 374233 410707 543320 437596 574449 523577 469944 437639
5567D37639k9425J7155N7353N6009k009j55843j1597Q9057q525J6667n4415K8172
$$ 437639 408214 425369 482722 538731 536722 380879 369282 458339 449814 466481 412066 440238
5555D40238Q7973j607n6317l7774M2408J9382j8975N0514K1921M3113p5383J2905
$$ 440238 528211 526604 470287 432513 474921 494303 475328 525842 547763 590876 515493 528398
5543E28398k6796q0793O5667P5850N2224j06307J2430m842o1333J09741q7022
$$ 528398 501602 420809 486476 562326 614550 508243 520673 515831 454498 564239 477217
5532D77217k4889J32033q7784L7610o2115L5211j0359J1050J16838j13843L7673
$$ 477217 452328 584361 496577 534187 472072 507283 496924 507974 624812 510969 548642
5521E48642L9644k3467l9624Q5809o0423l2454J05380j8620J20148J8355r6112
$$ 548642 588286 564819 525195 611004 550581 518127 623507 604887 725035 743390 647278
5510F47278n1210m9270n1536J17836O3495j05303N606l8980P4939l5475K2749
$$ 647278 596068 546798 495262 613098 676593 571290 576896 537916 612855 577380 600129
5499F00129k0025J5630P506J0205M6541l6084j3346p4655K30340N0431l2947N7901
$$ 600129 580104 595734 603240 613445 659986 623902 610556 535901 766241 816672 783725 841626
5487H41626O589m8148n3752O5833j2235m0284m1598l1293l5796P6384k776J2586
$$ 841626 848215 800067 746315 812148 799913 759629 718031 686738 650942 727326 724550 737136
5475G37136q639l9450R0735J1180p1731M4524O4945q3175J03866K6826o355k9529
$$ 737136 728497 689047 779782 790962 719231 763755 828700 745525 849391 876217 869862 840333
5463H40333r6331j9980J2219L5881R1591r1654J42558m1229Q1523J2931M3226
$$ 840333 744002 724022 736241 772122 863713 772059 914617 873388 954911 967842 1011068
5452A011068p0150m7986L7551k6068J35416J0245p033o4118m0145J29214N8764
$$ 1011068 940918 892932 930483 904415 1039831 1050076 1043043 978925 938780 1067994 1126758
5441A126758j02825l755k4263N0135N7801J01928J00119j6260q3621K5934J24697
$$ 1126758 1023933 1020178 995915 1046050 1103851 1205779 1305898 1289638 1206017 1231951 1356648
5430A356648M3831J2763r3051k561L8717K5806Q7774O9950L9035Q4858J15730
$$ 1356648 1400479 1413242 1320191 1317630 1356347 1382153 1469927 1539877 1578912 1663770 1779500
5419A779500k2536J07108M3106J09057K05670M2661J74464J38002J75602J83645
$$ 1779500 1756964 1864072 1907178 2016235 2221905 2264566 2439030 2577032 2752634 2936279
5409B936279M0444K62807J54746K20770J53563K43694L96877L80362L15066J22863
$$ 2936279 2976723 3239530 3394276 3615046 3768609 4012303 4409180 4789542 5104608 5227471
5399E227471J59617k914j40485k06659k82303j14364j55339L9430j67775N9239
$$ 5227471 5387088 5384174 5243689 5037030 4754727 4640363 4485024 4524454 4356679 4415918
5389D415918J28206K00767K24114K15794J59081J40738K12583L24063K85921L68084
$$ 4415918 4544124 4744891 4969005 5184799 5343880 5484618 5697201 6021264 6307185 6675269
5379F675269N27611M89385P82781N06751M82455M88668J1382m92790p61327p55796
$$ 6675269 7202880 7692265 8475046 8981797 9464252 9952920 9964302 9471512 8710185 7954389
5369G954389o42364n43301m37313k42706k03155j85309j23531k1934k4589K5339
$$ 7954389 7312025 6768724 6331411 6088705 5885550 5700241 5576710 5554776 5530187 5555526
5359E555526J12409K4274k3116N2388J08387O9830J66666K80522K48791K23422
$$ 5555526 5667935 5692209 5669093 5721481 5829868 5899698 6066364 6346886 6595677 6819099
5349F819099K31264R6149l1281k94970k88715n74830m15157j98725l08741k00359
$$ 6819099 7050363 7146512 7115231 6820261 6531546 5956716 5541559 5342834 5034093 4833734
5339D833734j93279q7967k7420L426L8283R9643q0571m43856j74034q7816k79000
$$ 4833734 4640455 4552488 4525068 4528494 4566777 4666420 4585849 4141993 3967959 3880143 3601143
5328C601143j34246j21540N2652J4837k886r2370j04242l5031P4719j2121j1589
$$ 3601143 3466897 3345357 3398009 3412846 3409960 3317590 3213348 3178317 3253036 3240915 3229326
5317C229326O1231J4426J75098J04173P1281R7906J71104J05904N0049j51278
$$ 3229326 3290557 3304983 3480081 3584254 3655535 3753441 3924545 4030449 4080498 3929220
5307C929220j66361k66950k17941k43950j23803j04801j13334l1487l2690k4454
$$ 3929220 3762859 3495909 3277968 3034018 2910215 2805414 2692080 2660593 2627903 2603449
5297B603449R811n369R878R2803J54670L0580L2220J55576j8141J22691K05236
$$ 2603449 2613260 2607891 2617769 2710572 2865242 2895822 2928042 3083618 3065477 3188168 3393404
5286C393404J30856Q6411J18469r040j21294k22393k42210j76314j71457J7436
$$ 3393404 3524260 3610671 3729140 3720100 3598806 3376413 3134203 2957889 2786432 2803868
5276B803868L3122k3950J08555q2393J52063P1692p8539k53m4604R1118J42011
$$ 2803868 2836990 2813040 2921595 2839202 2991265 3062957 2984418 2984165 2939561 3030679 3172690
5265C172690K721J33989J79384K11421J42696M2016J54675J57584K7137o1244
$$ 3172690 3175411 3309400 3488784 3700205 3842901 3884917 4039592 4197176 4224313 4163069
5255D163069o5044j78364L294k4236l8455p2235o3553M081k962r6269O1134M3807
$$ 4163069 4098025 3919661 3922955 3898719 3860264 3788029 3724476 3728557 3725595 3629326 3690460 3734267
5243C734267M8229J79215P9955p9536K19776K01465K22685K29522J32854J97478
$$ 3734267 3782496 3961711 4041666 3962130 4181906 4383371 4606056 4835578 4968432 5165910
5233E165910P3308m7588j02210j66514l4343p4302p7882p3369j24497n3139k6589
$$ 5165910 5239218 5191630 5089420 4922906 4888563 4814261 4736379 4663010 4538513 4485374 4458785
5222D458785o5383P0394j1364J42763j6782J58215J77474m9268J30947j5724Q0847
$$ 4458785 4393402 4463796 4452432 4595195 4578413 4736628 4914102 4864834 4995781 4980057 5060904
5211E060904k5441k1009M5273n2431k18142m1109k5124j57947m5558J56996r0683
$$ 5060904 5035463 5014454 5059727 5007296 4789154 4748045 4722921 4564974 4519416 4676412 4585729
5200D585729M0392k8152J3102K02114J9816l5173R8852J66747J66749J42819q8456
$$ 4585729 4626121 4597969 4611071 4813185 4833001 4797828 4896680 5063427 5230176 5372995 5284539
5189E284539j33294j28996k49781k55063k46123k07377l34251J0918j19106q1758
$$ 5284539 5151245 5022249 4772468 4517405 4271282 4063905 3729654 3740572 3621466 3539708
5179C539708l8158j4344k897m6860k4161K0677N2873p8410O3467R1578N6504J48717
$$ 3539708 3501550 3487206 3484309 3437449 3413288 3433965 3486838 3408428 3471895 3563473 3619977 3768694
5167C768694k9375R2721o0756r2695j45848j62855Q2105j48606k00274j07883
$$ 3768694 3739319 3832040 3771284 3678589 3532741 3369886 3451991 3303385 3103111 2995228
5157B995228k4335j02987n4880q5828P4728K1843k0100j08072p3754l9562n494
$$ 2995228 2970893 2867906 2813026 2727198 2801926 2823769 2803669 2695597 2621843 2582281 2576787
5146B576787R3230O6635j12540o1083J17173n807l485R5545q8884m1274J62813
$$ 2576787 2670017 2736652 2624112 2563029 2680202 2674395 2670910 2766455 2677571 2636297 2799110
5135B799110m170p5980J065M494J52121J19685K0036K7104J767n5137Q5021O7987
$$ 2799110 2794940 2718960 2720025 2724519 2876640 2996325 3016361 3043465 3045232 2990095 3075116 3143103
5123C143103J01420O897J41094p8702k0133n4573J49440J47627J7979J65403n7923
$$ 3143103 3244523 3251420 3392514 3313812 3293679 3239106 3388546 3536173 3554152 3719555 3661632
5112C661632P9243J75285J14993k1317K2271m1904M2868j0650K0022j5374P9451
$$ 3661632 3740875 3916160 4031153 4009836 4032107 3990203 4033071 4022421 4042443 4027069 4106520
5101D106520k5403j4021j18550M2617P9056J99038N0863R9814J16319J96489J35290
$$ 4106520 4081117 4067096 3948546 3991163 4070219 4269257 4320120 4419934 4536253 4732742 4868032
5090D868032M6127L24760K61920L80348J84575K96184K44314J22662L9069k17899
$$ 4868032 4914159 5238919 5500839 5881187 6065762 6361946 6606260 6728922 6767991 6550092
5080F550092m10950j73116j68057j10592j4659Q8129J30993l5882O7702J84538
$$ 6550092 6139142 5966026 5797969 5687377 5672718 5760847 5891840 5855958 5923660 6108198
5070F108198J77939J31779J84320J39359L49517L95511M27342M15529N48424N32225
$$ 6108198 6286137 6417916 6602236 6741595 7091112 7486623 7913965 8329494 8877918 9410143
5060I410143N64096Q16528R28808Q35506Q42011P48549K39471l28155r12530q91460
$$ 9410143 9974239 10790767 11719575 12555081 13397092 14145641 14385112 14056957 13144427 12252967
5050A2252967o64628m42780k01692l1302O5707J0211K88808K60263K89499L72715
$$ 12252967 11588339 11145559 10943867 10912565 10978272 10988483 11277291 11537554 11827053 12199768
5040A2199768N06325N82918N78913O23105P28173R67496P96464P42448P18393
$$ 12199768 12706093 13289011 13867924 14491029 15219202 16186698 16983162 17725610 18444003
5031A8444003O82033O22799Q23051P94303Q53431P00111K73896l51278o85488
$$ 18444003 19126036 19748835 20571886 21366189 22219620 22919731 23193627 22842349 22156861
5022B2156861n47725j44467R6265J22166K56757N76464P07845P55126O33672P88966
$$ 22156861 21609136 21464669 21560934 21683100 21939857 22516321 23224166 23979292 24612964 25401930
5012B5401930R74447J007211J069285J027260R93847P07309M12740J93414M3953
$$ 25401930 26376377 27383588 28452873 29480133 30473980 31181289 31594029 31787443 31831396
5003C1831396N3421J37480L70604M97099P62784Q68655P89355P28002N41042K84179
$$ 31831396 31884817 32022297 32392901 32890000 33652784 34521439 35310794 36038796 36579838 36864017
4993C6864017M52460L40079J57161L01928M7066O153P0082o455j56897q8576J93
$$ 36864017 37316477 37656556 37813717 38115645 38162711 38168864 38238946 38232491 38075594 37987018 37987211
4982C7987211p944p0468k72559l26165k84126m11215j47985j06843j09475O7123
$$ 37987211 37979267 37908799 37636240 37310075 37025949 36614734 36466749 36359906 36250431 36317554
4972C6317554K53957L85228M83618O09146M08470L18598J72069J01760R1740m4916
$$ 36317554 36571511 36956739 37440357 38049503 38457973 38776571 38948640 39050400 39142140 39097224
4962C9097224k08766l24479m32987n44726m38712l16750k34769P7633J45593L12176
$$ 39097224 38888458 38563979 38130992 37586266 37147554 36830804 36596035 36673668 36819261 37131437
4952C7131437M32490O15926P63143P46868P29253P44977N82330M63242L75419
$$ 37131437 37563927 38179853 38942996 39689864 40419117 41164094 41746424 42209666 42585085
4943D2585085K98510K36186K89938L24385O2342J31337J51437J50312J2685N5148
$$ 42585085 42883595 43119781 43409719 43734104 43796446 43927783 44079220 44229532 44242217 44297365
4933D4297365r8088J02587J47292K58547M26726N20445O02629N73021N97168P27575
$$ 44297365 44199277 44301864 44449156 44707703 45134429 45654874 46257503 46830524 47427692 48155267
4923D8155267N68500O51905N70746L42632K32621L6518k4428j89206o44931q95776
$$ 48155267 48723767 49375672 49946418 50289050 50521671 50558189 50533761 50344555 49699624 48803848
4913D8803848j023995j024363q58577p72468p29255n23190m25453m28709m32794
$$ 48803848 47779853 46755490 45896913 45124445 44395190 43872000 43446547 43017838 42585044
4904D2585044k46081l86326k95650j15982K2453k7867J50806J69594K36061M14092
$$ 42585044 42338963 41952637 41656987 41541005 41563458 41535591 41686397 41855991 42092052 42506144
4894D2506144M40995L52509L33248K97674J09602j16324l03883n15209p35753
$$ 42506144 42947139 43299648 43632896 43930570 44040172 43923848 43619965 43104756 42369003
4885D2369003p97794r07809n76372n81935k64045L124j6553j0787K21597M01266
$$ 42369003 41571209 40663400 40087028 39505093 39241048 39244172 39227619 39216832 39438429 39839695
4875C9839695M52363M91202O50294Q10605R77192J119463J302273J493735J569785
$$ 39839695 40292058 40783260 41433554 42244159 43221351 44340814 45643087 47136822 48706607
4866D8706607J530916J376638J347257J020331P86735Q21469O97935P94462R13463
$$ 48706607 50237523 51614161 52961418 53981749 54768484 55589953 56287888 57082350 57995813
4857E7995813J070614J364799J676792J962049K405014K931068L498468L885855
$$ 57995813 59066427 60431226 62108018 64070067 66475081 69406149 72904617 76790472
4849G6790472M724452N501097O367814P525607Q737939J0020800J1380204J2506967
$$ 76790472 81514924 87016021 93383835 100909442 109647381 119668181 131048385 143555352
4841A43555352J3462564J3581744J2529582J0233170P417270K604424k609351
$$ 143555352 157017916 170599660 183129242 193362412 200779682 203384106 200774755
4834B00774755o153733r784018j2898356j4040071j3323850j2139617j0431061
$$ 200774755 194621022 184837004 171938648 157898577 144574727 132435110 122004049
4827A22004049r076202r021498q918673q274589o726914n423324m376252l740601
$$ 122004049 112927847 103906349 94987676 86713087 79986173 74562849 70186597 66445996
4819F6445996l109960k847452k632799k418625k621880k532112k370488k293439
$$ 66445996 63336036 60488584 57855785 55437160 52815280 50283168 47912680 45619241
$$ [...]
##END NTUPLES=NMR SPECTRUM
##END=
