##TITLE=1H_EC-3257(2)
 CDCl3, 8 sc, 
 27.07.2021
##JCAMPDX= 6.0         $$ Bruker NMR JCAMP-DX V2.0
##DATA TYPE= NMR SPECTRUM
##DATA CLASS= NTUPLES
##ORIGIN= UXNMR, Bruker Analytische Messtechnik GmbH
##OWNER= root
$$ XWIN-NMR		Version 3.5
$$ Tue Jul 27 09:30:38 2021 Russian Standard Time (UT+4h)  she@DPX200
##.OBSERVE FREQUENCY= 200.131506
##.OBSERVE NUCLEUS= ^1H
##.ACQUISITION MODE= SIMULTANEOUS
##.ACQUISITION SCHEME= undefined
##.AVERAGES= 8
##.DIGITISER RES= 18
##SPECTROMETER/DATA SYSTEM= spect
##.PULSE SEQUENCE= zg30
##.SOLVENT NAME= CDCl3
##.SHIFT REFERENCE= (INTERNAL, CDCl3, 0, 17.5008)
##AUDIT TRAIL= $$ (NUMBER, WHEN, WHO, WHERE, WHAT)
$$ ##TITLE= Audit trail, XWIN-NMR		Version 3.5
$$ ##JCAMPDX= 5.01
$$ ##ORIGIN= Bruker BioSpin GmbH
$$ ##OWNER= she
$$ F:/spectra/data/she/nmr/H-F/1/pdata/1/auditp.txt
$$ ##AUDIT TRAIL=  $$ (NUMBER, WHEN, WHO, WHERE, WHAT)
(   1,<2021-07-27 09:29:33.43 +0400>,<she>,<DPX200>,
      <created by zg, POWCHK disabled, PULCHK disabled
       configuration hash MD5:
       00 E9 B6 7A A2 85 ED C7 34 08 36 98 17 FE 4E 26
       data hash MD5: 16K
       0D C3 EA 17 D0 A5 C9 03 E0 33 AD FA 5B 11 6A 7C>)
(   2,<2021-07-27 09:29:35.75 +0400>,<she>,<DPX200>,
      <Start of raw data processing
       efp BC_mod = 2 LB = 0.24 FT_mod = 6 PKNL = 1 PHC0 = -12633.56 PHC1 = 9.60099 SI = 16K 
       data hash MD5: 16K
       57 51 98 8F 38 5A 96 03 CA 4C A3 25 C9 C4 70 48>)
(   3,<2021-07-27 09:29:53.17 +0400>,<she>,<DPX200>,
      <pk PHC0 = -0.6936879 PHC1 = 0.2 
       data hash MD5: 16K
       79 1D C4 75 26 FD 54 62 A2 18 F7 FC 9C 30 A7 7D>)
(   4,<2021-07-27 09:29:56.37 +0400>,<she>,<DPX200>,
      <abs ABSG = 5 
       data hash MD5: 16K
       57 6A FC A8 A3 9E 08 DD 5D C3 DF 5C 92 B4 2D 84>)
$$ ##END=
$$ 
$$ hash MD5
$$ 84 C6 14 55 60 D7 3F 88 27 F3 1E 1B 94 50 8A 0F
##$RELAX= 
##$RELAX= 
##$RELAX= 
##$RELAX= 
##$RELAX= 
##$RELAX= 
$$ Bruker specific parameters
$$ --------------------------
##$DU= <F:/spectra>
##$EXPNO= 1
##$NAME= <H-F>
##$PROCNO= 1
##$TYPE= <nmr>
##$USER= <she>
##$AMP= (0..31)
100 100 100 100 100 100 100 100 100 100 100 100 100 100 100 100 100 100 
100 100 100 100 100 100 100 100 100 100 100 100 100 100 
##$AQSEQ= 0
##$AQ_mod= 1
##$AUNM= <au_zg>
##$AUTOPOS= <>
##$BF1= 200.13
##$BF2= 200.13
##$BF3= 200.13
##$BF4= 200.13
##$BF5= 200.13
##$BF6= 200.13
##$BF7= 200.13
##$BF8= 200.13
##$BYTORDA= 1
##$CFDGTYP= 0
##$CFRGTYP= 5
##$CHEMSTR= <none>
##$CNST= (0..31)
1 1 145 1 1 1 1 1 1 1 1 1 1 1 1 1 1 1 1 1 1 1 1 1 1 1 1 1 1 1 1 1 
##$CPDPRG= <>
##$CPDPRG1= <>
##$CPDPRG2= <>
##$CPDPRG3= <>
##$CPDPRG4= <mlev>
##$CPDPRG5= <mlev>
##$CPDPRG6= <mlev>
##$CPDPRG7= <mlev>
##$CPDPRG8= <mlev>
##$CPDPRGB= <>
##$CPDPRGT= <>
##$D= (0..31)
0 1.2 0 0 0 0 0 0 0 0.06 0 0.03 0 0 0 0 0.0002 0 0 0 0 0 0 0 0 0 0 0 0 
0 0 0 
##$DATE= 1627363772
##$DBL= (0..7)
120 120 120 120 120 120 120 120 
##$DBP= (0..7)
150 150 150 150 150 150 150 150 
##$DBP07= 0
##$DBPNAM0= <>
##$DBPNAM1= <>
##$DBPNAM2= <>
##$DBPNAM3= <>
##$DBPNAM4= <>
$$ [...]
##$SUBNAM3= <"">
##$SUBNAM4= <"">
##$SUBNAM5= <"">
##$SUBNAM6= <"">
##$SUBNAM7= <"">
##$SUBNAM8= <"">
##$SUBNAM9= <"">
##$SW= 20.0188882624521
##$SWIBOX= (0..15)
0 0 2 0 0 0 0 0 0 0 0 0 0 0 0 0 
##$SW_h= 4006.41025641026
##$TD= 16384
##$TD0= 1
##$TE= 0
##$TE2= 300
##$TE3= 300
##$TEG= 300
##$TL= (0..7)
0 120 120 120 120 120 120 120 
##$TP= (0..7)
150 150 150 150 150 150 150 150 
##$TP07= 0
##$TPNAME0= <>
##$TPNAME1= <>
##$TPNAME2= <>
##$TPNAME3= <>
##$TPNAME4= <>
##$TPNAME5= <>
##$TPNAME6= <>
##$TPNAME7= <>
##$TPOAL= (0..7)
0.5 0.5 0.5 0.5 0.5 0.5 0.5 0.5 
##$TPOFFS= (0..7)
0 0 0 0 0 0 0 0 
##$TUNHIN= 0
##$TUNHOUT= 0
##$TUNXOUT= 0
##$USERA1= <user>
##$USERA2= <user>
##$USERA3= <user>
##$USERA4= <user>
##$USERA5= <user>
##$V9= 5
##$VALIST= <valist>
##$VCLIST= <CCCCCCCCCCCCCCC>
##$VD= 0
##$VDLIST= <DDDDDDDDDDDDDDD>
##$VPLIST= <PPPPPPPPPPPPPPP>
##$VTLIST= <TTTTTTTTTTTTTTT>
##$WBST= 1024
##$WBSW= 4
##$XGAIN= (0..3)
0 0 0 0 
##$XL= 0
##$YL= 0
##$YMAX_a= 370676
##$YMIN_a= -458827
##$ZGOPTNS= <>
##$ZL1= 120
##$ZL2= 120
##$ZL3= 120
##$ZL4= 120
##$ABSF1= 17.49955
##$ABSF2= -2.519489
##$ABSG= 5
##$ABSL= 3
##$ALPHA= 0
##$AQORDER= 0
##$ASSFAC= 0
##$ASSFACI= 0
##$ASSFACX= 0
##$ASSWID= 0
##$AUNMP= <proc_1d>
##$AZFE= 0.1
##$AZFW= 0.1
##$BCFW= 0
##$BC_mod= 2
##$BYTORDP= 0
##$COROFFS= 0
##$CY= -3
##$DATMOD= 1
##$DC= 0
##$DFILT= <>
##$DTYPP= 0
##$F1P= 0
##$F2P= 0
##$FCOR= 1
##$FTSIZE= 16384
##$FT_mod= 6
##$GAMMA= 0
##$GB= 0
##$INTBC= 1
##$INTSCL= 1.334414e-10
##$ISEN= 128
##$LB= 0.24
##$LEV0= 0
##$LPBIN= 0
##$MAXI= 10000
##$MC2= 0
##$MEAN= 0
##$ME_mod= 0
##$MI= 1.114404
##$NCOEF= 0
##$NC_proc= -5
##$NLEV= 6
##$NOISF1= 3.799351
##$NOISF2= 2.8
##$NSP= 0
##$NTH_PI= 0
##$NZP= 0
##$OFFSET= 17.50077
##$PC= 1
##$PHC0= -12634.25
##$PHC1= 9.80099
##$PH_mod= 1
##$PKNL= yes
##$PPARMOD= 0
##$PSCAL= 0
##$PSIGN= 0
##$REVERSE= no
##$SF= 200.13000677522
##$SI= 16384
##$SIGF1= 3
##$SIGF2= 2
##$SINO= 5.538805
##$SIOLD= 16384
##$SREGLST= <1H.CDCl3>
##$SSB= 0
##$STSI= 16384
##$STSR= 0
##$SW_p= 4006.41025641026
##$SYMM= 0
##$S_DEV= 0
##$TDeff= 16384
##$TDoff= 0
##$TI= <>
##$TILT= no
##$TM1= 0
##$TM2= 0
##$TOPLEV= 0
##$USERP1= <user>
##$USERP2= <user>
##$USERP3= <user>
##$USERP4= <user>
##$USERP5= <user>
##$WDW= 1
##$XDIM= 16384
##$YMAX_p= 297826588
##$YMIN_p= -166613
$$ End of Bruker specific parameters
$$ ---------------------------------
##NTUPLES= NMR SPECTRUM
##VAR_NAME=  FREQUENCY,     SPECTRUM/REAL,   SPECTRUM/IMAG
##SYMBOL=    X,             R,               I
##VAR_TYPE=  INDEPENDENT,   DEPENDENT,       DEPENDENT
##VAR_FORM=  AFFN,          ASDF,            ASDF
##VAR_DIM=   16384,         16384,           16384
##UNITS=     HZ,            ARBITRARY UNITS, ARBITRARY UNITS
##FACTOR=    0.24454680195387, 1,            1
##FIRST=     3502.42933251505, 0,            0
##LAST=      -503.980923895208, 0,           0
##MIN=       -503.980923895208, -166613,     0
##MAX=       3502.42933251505, 297826588,    0
$$ Real data points
##PAGE= N=1
##DATA TABLE= (X++(R..R)), XYDATA
$$ [...]
7095i5j9865N446J7747L0258m7187m4818K2278M2110k2776L1319m479m1631L0865
7082h28k3930r2793O192R005J5108m8664Q360M9075K2475K8259J0597O5J5233
7069a846o1391l0332J7696k6290P621k580P5664P75N545J4554P854l9168l4048
7056f5946K3117m7364p38J1124K184j297K4414n7764L2301J7412K2285M7969o2291
7043e4594n2888L1647K4927P032P781M332j5539M0982J4940j1865q8480K4122
7031f7603L0806n4602M5676K2411j927J7092O696l0309M2487J0601j602k5502
7019e776l1072K733j5614l1372J6935K7205l4048J0584L7116k685n2704o816L310
7006h2204K4696j4322J8102J4822j9332K1602K52J8954n5330l9828N5903P3524
$$ plain form
7095 -95 -19960 -14514 3233 33491 -13696 -58514 -36236 5874 -16902 14417 9938 -31693 -828
7082 -828 -24758 -117551 -111359 -102354 -87246 -135910 -127550 -78475 -56000 -27741 -17144 -17079 -1846
7069 -1846 -63237 -93569 -75873 -102163 -94542 -97122 -21458 -20683 -15138 -584 7270 -31898 -65946
7056 -65946 -42829 -90193 -90931 -79807 -77623 -78920 -54506 -112270 -79969 -62557 -40272 7697 -54594
7043 -54594 -107482 -75835 -50908 -43876 -36095 -31763 -47302 -6320 8620 -3245 -91725 -67603
7031 -67603 -36797 -91399 -45723 -23312 -25239 -8147 -1451 -31760 10727 21328 19726 -5776
7019 -5776 -36848 -34115 -49729 -81101 -64166 -36961 -71009 -60425 -23309 -25994 -78698 -85514 -82204
7006 -82204 -57508 -71830 -53728 -38906 -58238 -36636 -36384 -17430 -72760 -112588 -56685 16839
6994A6839m3899Q969J322p216j6896j8555O00M2220J1384n364J0306n9966N7814
6981b442k812m3614k6787j8888P1011P994M4240m8097J1280m7822o6217Q0856
6969d1298Q0478j4375p5382N8308k3657o9716n614l695L92k2383M0202L8623k5909
6956f4026N0855M670k3189m0803K8071M8102j8758m4417j2943K157R449K6811
6944c4021P1330o3497m1548N2843K0951J7918l4723L7957l4993k1043M0384o80
6932A0878m0370J6001m0849j1453K2793J7968L184K1510j0958q54M0080m0064
6920a2134N671q578M6765N391N291n9060M5901J7961o1380N6013l8059K8264m8758
6907a6712l748M2966q511l5582j9992k8939L845K3014L6615k8345M9437L6097
$$ plain form
6994 16839 -27060 -18091 -16769 -23985 -40881 -59436 -58836 -16616 -5232 -10596 -290 -60256 -2442
6981 -2442 -5254 -48868 -75655 -94543 -23532 -15538 28702 -19395 -8115 -55937 -122154 -41298
6969 -41298 39180 24805 -50577 7731 -15926 -85642 -91256 -94951 -94559 -116942 -76740 -38117 -64026
6956 -64026 -13171 -8501 -31690 -72493 -44422 3680 -15078 -59495 -72438 -70281 -60832 -34021
6944 -34021 37309 -26188 -67736 -14893 6058 23976 -10747 27210 -7783 -28826 11558 10878
6932 10878 -29492 -13491 -54340 -65793 -43000 -25032 -21848 -338 -11296 -12150 27930 -12134
6920 -12134 -6463 -15041 31724 37115 42406 -16654 29247 47208 -14172 41841 3782 32046 -16712
6907 -16712 -20460 22506 13995 -21587 -41579 -70518 -66673 -43659 -7044 -35389 14048 50145
6895E0145o592m5697j559M8336o878Q941J7969L1394L3623L1752n1704l3159N0098
6882A26669M1444q1043n0830M929M101K0274k4044j2142l484L8457J0033l060
6870G1304L1792q2361n0994j6094K9706L6612k8941K5157J0972j3904k8503L4527
6858A9273N8462m6248k9177l331l906P649M0141m0378l4094O849j4827K8918L6107
6845B5438j4223l9580k6884Q9730o790k2046L9814l4547m4563l3708M4075O644
6833a6640l2612l677j188p248J8794P2388J8495k430k6897J1668k8633p4327J5001
6820e7306k2218N0368M3122n754J6866k3753o124L7240M266n9000R230J5154N0497
6807E2588l285j5451J080l2871n3117N8113k6530J7105q937j8169J8003O113j4746
$$ plain form
6895 50145 43553 -2144 -3703 44633 37755 46696 64665 96059 129682 161434 109730 76571 126669
6882 126669 168113 87070 36240 41169 45270 65544 41500 29358 25874 64331 74364 71304
6870 71304 103096 20735 -30259 -46353 -16647 19965 -8976 16181 27153 13249 -15254 19273
6858 19273 77735 31487 2310 -1021 -4927 2722 42863 2485 -31609 -24760 -39587 -10669 25438
6845 25438 11215 -28365 -55249 34481 27691 5645 45459 10912 -33651 -67359 -23284 -16640
6833 -16640 -49252 -52929 -54117 -61365 -42571 29817 48312 45882 18985 30653 2020 -72307 -57306
6820 -57306 -79524 -29156 13966 8212 25078 1325 -4799 32441 36707 -22293 -13063 2091 52588
6807 52588 49303 33852 34932 2061 -51056 7057 -19473 -2368 -11305 -29474 -11471 -5358 -20104
6794b0104j299Q348J7904o208L855L4776r690q0039N82P5658K2482m0424j1624
6781e783k9257j7079M8584j6771k4079m555K5930k8558L248L5946k5351M3030
6769E305J8818j6450J0463l9318N2417Q994J4049m8732J0268j8961k7699n8449
6757h9295K6268L6360l048K7215M8616p6056q935N0684O3160r082l7939L2956
6745F0904K3330m4953l7812J9240N3966O36k2310j9267L0635J5204j3092n1924
6733A4557J3133k4289J2097L3070m9112O6576j1167L9313n99k7779r435M6574
6721A02939l0511j6558M483J7483l9932n5807M6433K2108N19L7247J9222k0480
6709H7146r1672L001K3984K6619J7895L8488k2032m482m0839m9740K2235J0693
$$ plain form
6794 -20104 -21403 -13055 4849 -1359 2496 37272 27582 -52457 -51875 23783 46265 5841 -5783
6781 -5783 -35040 -52119 -3535 -20306 -44385 -48940 -23010 -51568 -48320 -12374 -37725 5305
6769 5305 24123 7673 18136 -21182 31235 40229 54278 5546 15814 -3147 -30846 -89295
6757 -89295 -63027 -26667 -29715 -2500 46116 -29940 -38875 11809 74969 65887 27948 60904
6745 60904 84234 39281 1469 20709 74675 75311 53001 33734 64369 79573 66481 14557
6733 14557 27690 3401 15498 48568 -544 66032 54865 94178 93579 65800 56365 102939
6721 102939 72428 55870 60353 77836 37904 -17903 28530 50638 51157 88404 107626 87146
6709 87146 -4526 -1525 22459 49078 66973 105461 83429 78947 38108 -11632 10603 21296
6697B1296P6441k8873m9881j2585n787j4963m76K4892M4044m351n822J6591L0040
6684I0566J8864m850J3180k5494j9287J3119k1152J1806K8949J0135j3949j8593
6672H3294K4809K1089m5095l0639k1421k88M953P0593M6362k6923L068j0317K2888
6659A42373L189J9904n6945p8743J5147J0949K9549l625M3125N301l8897L3487
6647A24814J290L3427N778m849k1960K0201j8147j2652k6691k6569P2610l2109
6635A15143k5084J7238J5057P546J8873m3313M0822N4250P893m4205j4738q856
6623A40626N3926M4579q37j0631L5154Q776n325L5708j4508k0063m8706L4805
6611B53504J2208K6853L4281K4288J587J4814j457p105K6441l21K6041N5827j6869
$$ plain form
6697 21296 97737 68864 18983 6398 611 -14352 -14828 10064 54108 49757 43935 60526 90566
6684 90566 109430 104580 117760 92266 72979 86098 64946 76752 105701 115836 101887 83294
6672 83294 108103 129192 84097 53458 32037 31749 36702 107295 153657 126734 129802 119485 142373
6659 142373 145562 165466 108521 29778 44925 55874 85423 81798 124923 130224 91327 124814
6647 124814 126104 159531 165309 160460 138500 158701 140554 127902 101211 74642 147252 115143
6635 115143 90059 107297 122354 129900 148773 105460 146282 200532 208425 164220 149482 140626
6623 140626 194552 239131 238294 227663 262817 271593 266268 301976 287468 267405 218699 253504
6611 253504 265712 292565 326846 351134 352721 367535 366078 358973 385414 385093 411134 466961 450092
6598D50092O804J7362l76P033N0461L4567N0584j2131m0263K5180J6224N7817
6586F63354O0438o103j4903L274K1382L5167K9855M7498p3515l3993J37880P7480
6574I47814P934o3365J5686M2592L7006N4059M1903o0162j2613Q9594J03699J2427
6562A216574J2777O7391L6392N7036O7216R4559O4314O3168J07097O8515N6306
6551A911345J21661J50033J24124N2666J50564J72563K52415K15115K58985K33393
6541C642864L64878L47118M55556N82635O03241P77961Q40822R98459J150212
6532I763746J313827J452666J589466J777900K013426K168070K113805J581357
6524B3774263K21271j447962k805380l337345k960437k407492j813108j316048
$$ plain form
6598 450092 456896 474258 473882 480915 531376 565943 616527 604396 564133 589313 605537 663354
6586 663354 723792 717689 702786 706060 727442 762609 792464 839962 766447 732454 870334 947814
6574 947814 955748 892383 908069 950661 987667 1041726 1083629 1023467 1010854 1100448 1204147 1216574
6562 1216574 1229351 1296742 1333134 1390170 1457386 1551945 1616259 1679427 1786524 1855039 1911345
6551 1911345 2033006 2183039 2307163 2359829 2510393 2682956 2935371 3150486 3409471 3642864
6541 3642864 4007742 4354860 4810416 5393051 5996292 6774253 7615075 8613534 9763746
6532 9763746 11077573 12530239 14119705 15897605 17911031 20079101 22192906 23774263
6524 23774263 23995534 22547572 19742192 16404847 13444410 11036918 9223810 7907762
6516G907762p99575p17579n20747m83905m85510l84508k91780k96223k10113k35950
6506C481872k65707j96901k05235j68957j93043j29115p7360n0631r8282q5188
6496B011453l2379n3823r9721n2420m1376j8856o8317l4523K2899p0286k7948
6485A534703j4746k141M1229L5209j19326r8837m2195p2190o4234j13716p8118
6474A005638j8113J9654o1516L3764q3365m1284o4913L3899N5875j9524L769N1666
6462I15550j445M2945k2136L4924O9416K0435M0840J24164J9919J24418J49318
6451A518348O0204R7643k2583p2529j71641j16131j62674j66524p3683m3672k2505
6440H24253J1649j9946j8474L0019k4501n051K7099j7648j1643N5744N1135j7407
$$ plain form
6516 7907762 7108187 6390608 5869861 5385956 4900446 4515938 4224158 3927935 3717822 3481872
6506 3481872 3216165 3019264 2814029 2645072 2452029 2322914 2245554 2194923 2096641 2011453
6496 2011453 1979074 1925251 1825530 1773110 1731734 1712878 1644561 1610038 1632937 1562651 1534703
6485 1534703 1519957 1517816 1559045 1594254 1474928 1376091 1333896 1261706 1197472 1083756 1005638
6474 1005638 987525 1007179 945663 979427 896062 854778 789865 823764 879639 860115 863884 915550
6462 915550 914105 957050 934914 969838 1039254 1059689 1100529 1224693 1244612 1369030 1518348
6451 1518348 1578552 1676195 1653612 1581083 1409442 1293311 1130637 964113 890430 846758 824253
6440 824253 835902 815956 797482 827501 803000 797949 825048 807400 795757 851501 902636 885229
6428H85229J102K4333L5861L6201M0920M4195P1579K4175n9583n7919k4311k4151
6416I97631l1684L0811J7245l8589O7890R7886Q0674N1057Q0135K2627O31l4197
6404A342117l653n0929l1518j27663p7062q3636j09472k8612p4885q1442m7256
6393F25989p0201Q789N708k9476p0404N0500k0946J835j8823n12K815k2184M8524
6380E11614j03185k4251p9M7485K2630K8555o4329k6778R122m780J0477j493l0536
6367C74452p2658N6718q010l745K7927Q9732J6249J8210K692k9061L9778L8953
6355E51237L233n6666K8723P9396r79r978K2522L2963P1372L2893M4094l177P1004
6342H66637K9442M7288P5256K3840R3729J53807P6644J00487Q3205J25177J42598
$$ plain form
6428 885229 886331 910664 946525 982726 1023646 1067841 1139420 1163595 1104012 1046093 1021782 997631
6416 997631 965947 996758 1014003 975414 1043304 1141190 1221864 1272921 1353056 1375683 1376314 1342117
6404 1342117 1338464 1287535 1256017 1128354 1051292 967656 858184 829572 754687 673245 625989
6393 625989 555788 564577 570285 540809 470405 520905 499959 501794 482971 482459 485274 463090 511614
6380 511614 408429 384178 384099 431584 454214 482769 418440 391662 400784 396004 406481 404988 374452
6367 374452 301794 358512 350502 346757 374684 464416 480665 498875 501567 472506 512284 551237
6355 551237 554470 497804 526527 605923 604944 594966 617488 650451 721823 754716 798810 795633 866637
6342 866637 896079 943367 1018623 1042463 1136192 1289999 1366643 1467130 1550335 1675512 1818110
6331A818110J04732K6123P8492O6588N3231M2473K1112j43780o1374j5364j02531
6320A887812j20662j18314j27320j18021p8984o7411j37582k3931r8113q8914
6310I08560n4905p4581k2758r8404l7408k1202j9794o6602J5664k9072k3867M9975
6298E25606J2212n6549m1805k6560k668m1830K9393p7014O4693j7987p3651j3875
6286B79965K5165l0742N284m0902m2301L0941M4481l1273k0647j3174j6348j2475
6274A77974k6403K4826J5977j4072K9763Q8251j3479p1144n9102R101N4040J9508
6262B35240m7300Q168n803M2233p7724P3534k2335n5440J7884K1462m7242j8995
6250A23682j2123J4043j0932M7577n1834q437L1646n1346K9308m4852L2613n3887
$$ plain form
6331 1818110 1922842 1948965 2027457 2094045 2147276 2189749 2210861 2067081 2005707 1990343 1887812
6320 1887812 1767150 1648836 1521516 1403495 1324511 1257100 1119518 1095587 997474 908560
6310 908560 853655 779074 756316 657912 620504 599302 579508 512906 528570 499498 475631 525606
6298 525606 537818 481269 439464 412904 410236 368406 397799 320785 385478 367491 293840 279965
6286 279965 305130 274388 279672 238770 196469 227410 271891 240618 219971 206797 190449 177974
6274 177974 151571 176397 192374 178302 208065 296316 282837 211693 152591 161692 215732 235240
6262 235240 187940 196108 190305 232538 154814 228348 206013 150573 168457 189919 142677 123682
6250 123682 111559 125602 114670 162247 110413 101976 133622 82276 111584 66732 99345 45458
6238D5458O1824M3424m4552n4077k5586P6764q300o7479K2913J0290L2155J0571
6226A03405j3075l7711J7509l6134m1568l1656O8378K0390J1309K3807j8312K8612
6214I4954n1313K8553J153l6137L0237L4675m953k4561m952l0974k0847o154L5026
6201D4707M6777l7601K2090j2853n5154j9229M8329l8772R066J8806L954L833
6189C3953k817L3765j6739k9261L0146K7615l875J0568j8069m6174J0140k1083
6177H169j1945J9387J7371J03569l2020n0918L6825L9373J3628j6520j3302N3423
6165A67040n1529j0468J4624k9845O1429J7894k5843l5737j7074O45N644j2161
6153H4619n1517j8753M9520k4836k4743J6881j2897K1870R318N0809M582j5181
$$ plain form
6238 45458 107282 150706 106154 52077 26491 103255 94955 27476 50389 60679 92834 103405
6226 103405 90330 52619 70128 33994 -7574 -39230 29148 49538 60847 84654 66342 94954
6214 94954 43641 72194 73347 37210 67447 102122 97169 72608 67656 36682 15835 9681 44707
6201 44707 91484 53883 75973 63120 7966 -11263 37066 -1706 7360 26166 30120 33953
6189 33953 31136 64901 48162 18901 49047 76662 72787 83355 65286 19112 29252 8169
6177 8169 -3776 15611 32982 136551 104531 53613 90438 129811 143439 126919 113617 167040
6165 167040 115511 105043 119667 89822 151251 169145 143302 107565 90491 91136 96780 84619
6153 84619 33102 14349 63869 39033 14290 31171 18274 40144 49462 100271 104853 89672
6141H9672K3193l9808l6810L269L658J3925p095m0406M0408K7465L322o8519m2333
6128c0059J3544O283J4293n772Q2425L978m0486Q200j5990j258j9992J7041J2384
6115D4591J4205k093m2069K1152k6655p055L1552L0069k4368o590J0710K7126
6103G0575l2090m9999M9355j5176M4047k4936k7417o263K9839m472m2960J3148
6091C651M9859p033O1948l9099o2541k5991j4493J6284Q793Q806n7084M3964K8873
6078A5937j0502k2583K2237k112J4769o5176M4376K4901l0703j3073K9900q878
6066i07M7409o2834J7085k4186j5473K023M409J3641L04O5632j5207K4358j1878
6053D4376p60k3251k9014m0729M7132M1209R822j4452j3078l1152K1632K5258
$$ plain form
6141 89672 112865 73057 36247 39516 43174 57099 50004 9598 50006 77471 80793 12274 -30059
6128 -30059 -16515 -10232 4061 -1711 80714 84692 44206 52406 36416 35158 15166 32207 44591
6115 44591 58796 56703 14634 35786 9131 2076 33628 63697 39329 32739 43449 70575
6103 70575 38485 -11514 37841 22665 66712 41776 14359 8096 37935 33463 -9497 3651
6091 3651 53510 46477 108425 69326 6785 -19206 -33699 -17415 -8622 184 -56900 -12936 15937
6078 15937 5435 -17148 5089 2977 17746 -47430 -3054 21847 -8856 -21929 7971 -907
6066 -907 46502 -16332 753 -23433 -38906 -36883 -32474 -18833 -18529 47103 31896 56254 44376
6053 44376 43616 20365 -8649 -49378 -2246 38963 48785 34333 21255 -9897 11735 36993
6041C6993k6366l8511K2026k80M0042k5257p922l6163P6771O369m9570J4688o4482
6028e1662L9142j6736L4059P4254l8436j7678m4866L3919K3241r734k5587O122
6016F038K8666J5223j7281P720M6457m9507k1811K1985J346O12K424p1788L3009
6003C093L4248J8518m0390N288N02n4024J9557P024N581M6983j1877K685K2855
5990F0043O32l4943K4979M4108o8265r064r788k3731K5987q740J709M604J9546
5977B7077l6249k8205M4551L0051J8774l2223R26j390J2971k5999k3895K4378
5965A0767m226M614n056j3403m1646J6010K2856j3981J7546k1319N3172J943m1480
5952a4203K9128J0298o0254j8848N9743N09N1867n0982n7306M8240k6159j4736
$$ plain form
6041 36993 10627 -27884 -5858 -6138 33904 8647 725 -35438 41333 47702 -1868 12820 -51662
6028 -51662 -12520 -29256 4803 79057 40621 22943 -21923 11996 35237 25503 -84 6038
6016 6038 34704 49927 32646 40366 86823 37316 15505 37490 38836 39448 41872 -29916 3093
6003 3093 37341 55859 15469 20757 21259 -32765 -13208 -6184 -603 46380 34503 37188 60043
5990 60043 60675 25732 50711 94819 26554 17490 7702 -16029 9958 1218 2927 7531 27077
5977 27077 -9172 -37377 7174 37225 55999 23776 24702 23312 36283 10284 -13611 10767
5965 10767 6541 11155 6099 -7304 -48950 -32940 -10084 -24065 -6519 -27838 25334 27277 -14203
5952 -14203 14925 25223 -35031 -53879 5864 6373 58240 7258 -50048 -1808 -27967 -42703
5940d2703L0886l4841J1733M0393P301j6118r619K8805m510L5153N3859p0448
5928B9891k1157R292o5062O4023p961k2701L730M3304K552o110j8016J8336j1864
5915A8257k6022J6999o37o105l252K116K4726M6946k2925N161q4850M0568k0555
5902i573q834N1355J4024j7673l36N8300k0848M3145m2111l4896J5813J1715k2679
5889C7402n8717j8734M3552J3872m9295q672O2243j1988l6630J1149L1665J0526
5877B6373l3120K6173L468L3233k0045l8178N3882K3481j8771l658j5845R051
5865D6044o6018J3780k2900p325K6J1295k465J2519N249L2613L6293j0958K2671
5852G0824P854N322J2392o8631N580O1056n5604K4338o9363O4233k884q601j5102
$$ plain form
5940 -42703 -11817 -46658 -34925 5468 12769 -3349 -12968 15837 11327 46480 100339 29891
5928 29891 8734 18026 -47036 16987 9026 -13675 -9945 33359 35911 29801 11785 30121 18257
5915 18257 -7765 9234 8597 2492 -760 1356 26082 73028 50103 55264 -29586 10982 -9573
5902 -9573 -18407 32948 46972 29299 28963 87263 66415 109560 67449 32553 48366 60081 37402
5889 37402 -21315 -40049 3503 17375 -31920 -40592 21651 9663 -26967 -15818 15847 26373
5877 26373 -6747 19426 22894 56127 36082 -2096 51786 75267 56496 52838 36993 46044
5865 46044 -19974 -6194 -29094 -36419 -36393 -25098 -27563 -15044 -9795 22818 59111 48153 70824
5852 70824 78678 84000 96392 27761 33341 94397 38793 63131 -6232 58001 55117 46516 31414
5839C1414j5041j0795k8811L2224k5727J3977l1576j5562R7822O8909k0592J473
5827I7715m2404m8120N66r815M103j6412K5064K2795j3386k7490j2464L0108j5942
5814e682L5532l31J5022k7399K5203M1559l0083k3566o369L5163k3126J0364n6643
5801a0356J07526o953k7578j3824k5047M7916j4805n688Q268L6828k992l1792
5789F1503n1947Q02m3624n921J0746M6544J4628o0146K2433J7545L3833k0944
5777B5452n0595N211J5942N2046m3383o0091L7985K5399k8485k6415j532N6598
5765H132O0815l2512k9419k9349l758M0075J9158m6165O1456k9062m7559Q882
5753a9306O731k2245o1855P7683Q1668L4815m0853k0111L2141J9909n7746N7883
$$ plain form
5839 31414 16373 5578 -23233 8991 -16736 -2759 -34335 -49897 47925 116834 96242 97715
5827 97715 55311 7191 7757 -2058 2045 -14367 10697 33492 20106 -7384 -19848 10260 -5682
5814 -5682 29850 29519 44541 17142 42345 83904 53821 30255 23886 59049 35923 46287 -10356
5801 -10356 97170 90217 62639 48815 23768 71684 56879 51191 59459 96287 93295 61503
5789 61503 9556 10358 -33266 -39187 -28441 18103 32731 -27415 -4982 12563 46396 25452
5777 25452 -25143 -19932 -3990 48056 4673 -55418 -17433 7966 -20519 -46934 -48466 8132
5765 8132 68947 36435 7016 -22333 -26091 13984 33142 -13023 48433 19371 -28188 -19306
5753 -19306 -12575 -34820 -96675 -18992 62676 97491 56638 36527 68668 88577 30831 88714
5741H8714J6388r8616j4149O617k7333L0561M6934r053O399m4195K3375N8685
5729H4327M2517L8160n7167m4969l1689L8574L7887k6764q46r70P004L5868k3958
5716I7974j686l5915L8476j2952k1490k5645P6180m185o6402M6396O96M603K6472
5703A22522K1406l730N035p6235R0357K771m2372M4749Q086L9718j36776k0305
5691E5226N3447K1667M037n3564L5728k3984J1329K1433M9776J4000n7070n4561
5679G7464M0783L7404Q02N1524L6877M0134k6453m7414K96l7828J0020l7421m1439
5666A04749J8751K34J2937r0750l0354O2241J6108L26n0199L2691K3065M7884
5654A47683j0838r027L399l7894N8496J977o863j4400j5073k198l4083l0058L8776
$$ plain form
5741 88714 105102 6486 -7663 -1046 -28379 2182 49116 40063 46462 2267 25642 84327
5729 84327 126844 165004 107837 62868 31179 69753 107640 80876 80030 79060 86064 121932 97974
5716 97974 96288 60373 98849 85897 64407 38762 114942 110757 44355 90751 91447 96050 122522
5703 122522 143928 140198 145233 68998 159355 162126 119754 164503 172589 212307 75531 55226
5691 55226 108673 130340 134377 80813 116541 92557 103886 125319 175095 189095 132025 77464
5679 77464 118247 155651 156453 207977 244854 284988 258535 211121 211417 173589 183609 146188 104749
5666 104749 123500 123734 136671 45921 15567 77808 93916 94242 44043 76734 99799 147683
5654 147683 136845 127818 131217 93323 151819 153796 146933 132533 117460 115262 81179 51121 89897
5641H9897j1017m64m406M5141M0399j306j4350p7846j5053K1183l0820L6212L8803
5628A16373k0547o418L5885Q2934o7224k116J674K0671m6461K947J8896N693j7172
5615A25135j8807q985k0934J0401J192j4200O1130K2311o1338J2204N256k645
5603A10720N684l2798m9936P5985K3567l973R21k1058k0146K2339K7412q8869
5591D9848P3255J0198J2226J3173k7097K1873k2979j9926J7945P3034j9663r824
5579A72063n0685Q7303m2666m6301M0645j7341l069r781P871K7491m7430N565
5567A23665L6816m2891N65J3101q721N1425j462o2599J0973L3137M9354p1772
5555A31591n0276J05545M5411L4573n3620K0379k5486N814M115l5042O2365J6019
$$ plain form
5641 89897 78880 78416 74010 119151 159550 158244 143894 66048 50995 72178 41358 77570 116373
5628 116373 95826 89408 125293 208227 141003 138887 140561 161232 114771 117718 136614 142307 125135
5615 125135 106328 97343 76409 86810 88002 73802 134932 157243 95905 108109 113365 110720
5603 110720 116404 83606 33670 109655 133222 129249 130170 109112 88966 111305 138717 49848
5591 49848 123103 133301 145527 158700 131603 153476 130497 110571 128516 201550 181887 172063
5579 172063 121378 208681 166015 119714 160359 143018 139949 130168 138039 165530 118100 123665
5567 123665 160481 117590 118155 131256 122535 173960 172498 109899 120872 154009 203363 131591
5555 131591 81315 186860 232271 266844 213224 233603 208117 213931 218046 183004 245369 261388
5543B61388j3590m229l7101Q1034j160j3407k5969k3229J221q947j1680n352O1004
5530B59983L0100l8897j0759M2895N4358O146j12866N5492M4389J3345L1021l2550
5518C42657n3654J3965j9647J2969L6820p312j0140K3257M9507N813o0945K4413
5506C57703l8195k6986Q3936K3331j2532Q128L6746j4091j3236M9692l9395j5575
5494C99526J8412L5336j3206l420J0607p44M6221Q770N9755K2161j6426K8869
5482E95861J1096j6096q339Q3587k5762j657k1432O8423O7839j2338M9187P571
5470G97940l1339l081J2449K3939Q8700J3297P121j5442L4117N5682K9950P9708
5458A093041l6560L1136N9967k627M2004Q1289J2435R936M1526k049Q1304R0827
$$ plain form
5543 261388 247798 243569 206468 287502 286342 272935 246966 223737 224958 216011 204331 198979 259983
5530 259983 290083 251186 240427 283322 337680 343826 230960 286452 330841 344186 375207 342657
5518 342657 289003 302968 283321 296290 333110 325798 315658 338915 388422 394235 333290 357703
5506 357703 319508 292522 376458 399789 387257 395385 432131 418040 404804 454496 415101 399526
5494 399526 417938 453274 440068 436648 447255 446511 492732 501502 561257 583418 566992 595861
5482 595861 606957 590861 582522 666109 640347 638690 617258 685681 753520 741182 790369 797940
5470 797940 766601 763520 775969 799908 888608 901905 909026 893584 927701 983383 1013333 1093041
5458 1093041 1056481 1087617 1147584 1144957 1186961 1268250 1280685 1290621 1332147 1330098 1411402 1502229
5446A502229J9111M6527N3905J11583N0880p672M8926O4335O0686K8153J27293
5435B105956L5731Q5959R4366J00035Q3012O0231J38254R4883J43590J23263J28412
5424C193692J68300J85049K21473K18392K91602L06195L18626L39331M97268N74012
5414F313940N06462O82092O58248N83370P10583P98434Q51992Q26224Q53283P07208
5404A3491836K55598l45292q11437r61465p63423n60217l32973j47965n1185L8464
5394I811941J45700L80155M92082N60953P87904R17212R80040J056678J128594
5385A6261259J188857J274996J472390J631598J676375J323036P56115n59057
5377B5025569k016901k768183k575033k086907j583186j106002q63685o74175
$$ plain form
5446 1502229 1521340 1567867 1621772 1733355 1784235 1776563 1825489 1889824 1950510 1978663 2105956
5435 2105956 2141687 2227646 2322012 2422047 2505059 2565290 2703544 2798427 2942017 3065280 3193692
5424 3193692 3361992 3547041 3768514 3986906 4278508 4584703 4903329 5242660 5739928 6313940
5414 6313940 6820402 7502494 8160742 8744112 9454695 10253129 11105121 11931345 12784628 13491836
5404 13491836 13747434 13402142 12590705 11629240 10865817 10305600 9972627 9824662 9773477 9811941
5394 9811941 9957641 10337796 10829878 11390831 12178735 13095947 14075987 15132665 16261259
5385 16261259 17450116 18725112 20197502 21829100 23505475 24828511 25584626 25025569
5377 25025569 23008668 20240485 17665452 15578545 13995359 12889357 12025672 11351497
5369A1351497m53023k87767k38793o0335J13162J51039J82858K87310L93756M14879
5359A1854583L62076N34747O58272P62008O78413N15914J55089l90795j113655
5350A4016652j575311j525359j237405j082916q55589o45338m60405m26510l61021
5341E846798l26392k18784k09393k25943j79964q8826j06180j37465r8602o9569
5331D185680j19427q4068r2916r4788j66507p7093m3385r5201o1635r9614r9838
5320C151208j78878j25120o0905L411n7518m4794j14753J8859j21250q9472j2438
5309B368350p7237p3558k8940K2424j4068j0426K338j18993r0759M3189J94J6449
5297B038963k9406q2243r6974j55359k7467o4423J7191M0858J3591q864q5776
$$ plain form
5369 11351497 10898474 10610707 10371914 10311579 10424741 10575780 10758638 11045948 11439704 11854583
5359 11854583 12216659 12751406 13409678 14171686 14850099 15366013 15521102 15130307 14016652
5350 14016652 12441341 10915982 9678577 8595661 7740072 7094734 6634329 6207819 5846798
5341 5846798 5520406 5301622 5092229 4866286 4686322 4597496 4491316 4353851 4255249 4185680
5331 4185680 4066253 3982185 3889269 3794481 3627974 3550881 3507496 3412295 3350660 3251046 3151208
5320 3151208 2972330 2847210 2786305 2789716 2732198 2687404 2572651 2591510 2470260 2380788 2368350
5309 2368350 2291113 2217555 2188615 2211039 2196971 2186545 2188883 2069890 1979131 2022320 2022514 2038963
5297 2038963 2009557 1927314 1830340 1674981 1647514 1583091 1600282 1641140 1654731 1645867 1560091
5286A560091q5743O5951k9545l0476N242n2299N430k8073l2893K6035J6889n866
5274A414743K6747O163q2646l2758J9216P0856J5908j6171K9738K478M0076L2886
5262A527236R840J0422m8001k7558O5074M8496k9367j4555J6645j9965K9404k733
5250A564938l6804J5465k2066J4620P3693M0682R4937L3828M4090M5776J04437
5239A973596L0774k4532K6177Q0701j4250M2280O3390m0848o6380j13130k7927
5228A929851j14637q0596l2751r2217m3701M3502n5746j1715j3280K2763m8719
5217A502754L8100M5206P4803K6368j8573k7665o8144O329k6917j9098J8313j058
5205A550418q1974p5886j18272j0170l2787l1327r8068k3426o0762M0517k6192
$$ plain form
5286 1560091 1474348 1540299 1510754 1480278 1485520 1433221 1438651 1410578 1377685 1403720 1420609 1414743
5274 1414743 1441490 1447653 1365007 1332249 1351465 1422321 1438229 1422058 1451796 1454274 1494350 1527236
5262 1527236 1537076 1547498 1499497 1471939 1537013 1585509 1556142 1541587 1558232 1538267 1567671 1564938
5250 1564938 1528134 1543599 1521533 1536153 1609846 1650528 1745465 1779293 1823383 1869159 1973596
5239 1973596 2004370 1979838 2006015 2086716 2072466 2114746 2178136 2137288 2070908 1957778 1929851
5228 1929851 1815214 1734618 1701867 1609650 1565949 1609451 1553705 1541990 1528710 1551473 1502754
5217 1502754 1540854 1586060 1660863 1687231 1668658 1640993 1572849 1579178 1552261 1533163 1551476 1550418
5205 1550418 1468444 1392558 1274286 1264116 1231329 1200002 1101934 1078508 1017746 1058263 1032071
5194A032071m5656j3106l9094M4683K8406k0460q4565L3123p944k1772l0569j1468
5182H63649L3574m3679K0727r5016r625j8778O3511k4689k4942R3992k9183l8970
5170G90571j4486J429j8714k8381K2631o2194J8268L0688l6943N5738l9236l4818
5158F84553O4706r365m3371l93j7420M5201j9885M0424O2124R663L384L165n6072
5145G66714j1270M5215K9286O39j5147N173N2324L4764m3846K6365j8461j6379
5133H55377N8613J2766M6722P3276q3459p570J1813L9366N4997R470l3292J3719
5121A051798j0271Q6718J08093k7925J7286K776j5134O2688O3660O3217O838N5722
5109A465466R8635L3321P4587M2357J60149R1305P9024R4698R8949J22504J06533
$$ plain form
5194 1032071 986415 973309 934215 978898 1007304 986844 902279 935402 927458 905686 875117 863649
5182 863649 897223 853544 874271 779255 769630 750852 814363 789674 764732 858724 829541 790571
5170 790571 776085 777514 758800 730419 753050 690856 709124 739812 702869 758607 719371 684553
5158 684553 749259 739894 696523 696130 678710 723911 704026 744450 806574 816237 819621 822786 766714
5145 766714 755444 800659 829945 830584 815437 820610 872934 907698 863852 890217 871756 855377
5133 855377 913990 926756 973478 1046754 963295 955725 967538 1006904 1061901 1071371 1038079 1051798
5121 1051798 1041527 1128245 1236338 1208413 1225699 1228475 1213341 1276029 1339689 1402906 1409744 1465466
5109 1465466 1564101 1597422 1672009 1714366 1874515 1965820 2044844 2139542 2238491 2360995 2467528
5098B467528P4494O416j1333K0915L4812k9577q5363r8037n4238L2202m3391L3403
5086B347831l6115P2607R8895M8296J9613J26976M1044L3449O1133N5471P9670
5075B948870J08785L5006J81559J65066J21503J29140K44572K45351K09994K70814
5065D660660K97955L82766M07931N28742O47010N59895P00860Q75137R86724J047467
5055A1095147J005181R41367N42903M3886p37321j160256j085039q75861n88042
5046I181965l92915j78492m5942J9551J99598K68006L75987M77265N78867P31214
5036A1215104R21243J005280J130964J336043J606418J742440J890720J777762
5028B2625974J505642Q42397m15612j980230k644147k462526j981755j499541
$$ plain form
5098 2467528 2542022 2548438 2537105 2558020 2592832 2563255 2477892 2379855 2325617 2357819 2314428 2347831
5086 2347831 2311716 2384323 2483218 2531514 2551127 2678103 2719147 2752596 2813729 2869200 2948870
5075 2948870 3057655 3092661 3274220 3439286 3560789 3689929 3934501 4179852 4389846 4660660
5065 4660660 4958615 5341381 5749312 6278054 6925064 7484959 8185819 9060956 10047680 11095147
5055 11095147 12100328 13041695 13584598 13628484 12891163 11730907 10645868 9770007 9181965
5046 9181965 8789050 8610558 8564616 8584167 8783765 9051771 9427758 9905023 10483890 11215104
5036 11215104 12136347 13141627 14272591 15608634 17215052 18957492 20848212 22625974
5028 22625974 24131616 24974013 24558401 22578171 19934024 17471498 15489743 13990202
5020A3990202j143809q48575o38819m77484l45261k32141j26698J7178K14580
5011A0409173K59894M06488M81416N51134O03702P19074O56991N63083M58683
5002A5109638K82219k10274r83754j358842j458492j187515r83564p42665p09029
4993G757722n13112m48436m21029l22977k74831j38011j91166j93230j49633p4072
4983E031225j19186j20091j63190j19773j41827j26066j10549r6650o1807r5843
4973C876243o8381k0455m1820j2542M4455O4506m527j7865l5894O8899j6063j9085
4961C817471r185l6204J0598L7725l7159j4016p782r5670k4270m1503q2538M08
4949C517875J2812q2369P5707J18726K7594j1574M2193O6188R0582N0539j573
$$ plain form
5020 13990202 12846393 11997818 11358999 10881515 10536254 10304113 10177415 10194593 10409173
5011 10409173 10669067 11075555 11556971 12108105 12711807 13430881 14087872 14650955 15109638
5002 15109638 15391857 15181583 14197829 12838987 11380495 10192980 9209416 8466751 7757722
4993 7757722 7244610 6796174 6375145 6052168 5777337 5639326 5448160 5254930 5105297 5031225
4983 5031225 4912039 4791948 4628758 4508985 4367158 4241092 4130543 4033893 3972086 3876243
4973 3876243 3807862 3787407 3745587 3733045 3777500 3842006 3837479 3819614 3783720 3852619 3836556 3817471
4961 3817471 3808286 3772082 3782680 3820405 3783246 3769230 3761448 3665778 3641508 3600005 3517467 3517875
4949 3517875 3530687 3448318 3524025 3642751 3670345 3658771 3700964 3767152 3857734 3908273 3906700
4938C906700Q3481J07117J3219J34318K2366o153N2888J1473m4206M9724n986
4927D324941R676N4292J4655L7490k3494L9903r233o933M9830R7215Q2836N6081
4915D727259J40468J38093J63634J09937K64759K04204J88991J70250J55785J26523
4905F389903J239K9378L5649K9510O6671J19120J86775J978R7192J58384J46083
4894G261882J59227J46822J86627J78377J76887J57396K87589L16771K95204L21436
4884I488218L57822L15423K51645K15353J36673J802L7232J4078Q7231J09252
4874A1014729N2514J79936K24001J29199K18964K46929K24292L51449L46831L63831
4864A3352675M33004N27076N09566M75284N85829P03087O56655O67841O89921
$$ plain form
4938 3906700 3990181 4097298 4110517 4244835 4267201 4261048 4313936 4325409 4281203 4330927 4324941
4927 4324941 4334617 4388909 4403564 4441054 4417560 4457463 4448230 4441297 4491127 4588342 4671178 4727259
4915 4727259 4867727 5005820 5169454 5279391 5544150 5748354 5937345 6107595 6263380 6389903
4905 6389903 6391142 6420520 6456169 6485679 6552350 6671470 6858245 6860223 6957415 7115799 7261882
4894 7261882 7421109 7567931 7754558 7932935 8109822 8267218 8554807 8871578 9166782 9488218
4884 9488218 9846040 10161463 10413108 10628461 10765134 10766936 10804168 10818246 10905477 11014729
4874 11014729 11067243 11247179 11471180 11600379 11819343 12066272 12290564 12642013 12988844 13352675
4864 13352675 13785679 14312755 14822321 15297605 15883434 16586521 17243176 17911017 18600938
4855A8600938O24209O88385P68908Q05201Q36763Q60358R65426J157068J299163
4846B6606419J566180J878846K205489K553646L007672L479229L987012M751636
4838E0036129N420135O261701P288885Q357445R794535J1413211J3025189J4517895
4830A26115125J5901097J5401910J3024034J1410679O014789k891024p036340
4823A77940270j1066764j7348666j9360748j8019199j6426010j4172693j1331767
4816G0214423q802432o842302n574650m651832l889185l410263k942394k521233
4808C1580132k223648j991157j662078j513534j333050j228694j081891q90800
4800A9655280r13557q68691p86133p35249o94879o58069o26775o62579o43631
$$ plain form
4855 18600938 19225147 19913532 20682440 21487641 22324404 23184762 24150188 25307256 26606419
4846 26606419 28172599 30051445 32256934 34810580 37818252 41297481 45284493 50036129
4838 50036129 55456264 61717965 69006850 77364295 87158830 98572041 111597230 126115125
4830 126115125 142016222 157418132 170442166 181852845 187867634 184976610 177940270
4823 177940270 166873506 149524840 130164092 112144893 95718883 81546190 70214423
4816 70214423 61411991 54569689 48995039 44343207 40454022 37043759 34101365 31580132
4808 31580132 29356484 27365327 25703249 24189715 22856665 21627971 20546080 19655280
4800 19655280 18741723 17873032 17086899 16351650 15656771 14998702 14371927 13709348 13065717
4791A3065717n74666n68689n43072m99464m65473m00076m34336k74002l01055
4782I004884l59499l23671k65545k15061k61283k68523j54482k25850j56168j89400
4772F585402j82313j64157j18862j12281j64918j47410j98146p3073j21815j13977
4762E188450j27835j37334j18874j02913p9642p5098p3658j17163j79172j40861
4752D035900j08081n6574j13853j34416m8866n4787p8259r4202o2740J4790J7332
4741C316244m1010m2256k3287Q262N806p6859n2639m9431j03255p5117j8750o1351
4729B786357M4615p0147l7013o189n995o2409j5681p6313K516K5290L168m2649
4717B545550n2793q4176m1j7400l4515k1501q2683j2332J2750m691n4612k8375
$$ plain form
4791 13065717 12491051 11922362 11379290 10879826 10414353 10014277 9579941 9305939 9004884
4782 9004884 8645385 8321714 8056169 7841108 7579825 7311302 7156820 6930970 6774802 6585402
4772 6585402 6403089 6238932 6120070 6007789 5842871 5695461 5497315 5424242 5302427 5188450
4762 5188450 5060615 4923281 4804407 4701494 4621852 4546754 4473096 4355933 4176761 4035900
4752 4035900 3927819 3871245 3757392 3622976 3574110 3519323 3441064 3346862 3284122 3298912 3316244
4741 3316244 3275234 3232978 3209691 3217953 3223759 3146900 3094261 3044830 2941575 2866458 2847708 2786357
4729 2786357 2830972 2760825 2723812 2717623 2711628 2649219 2633538 2557225 2559741 2585031 2588199 2545550
4717 2545550 2492757 2408581 2408540 2391140 2356625 2335124 2252441 2240109 2252859 2248168 2193556 2165181
4705B165181m6074l2392p4647l0907L2978j8895m5173l6071o6480j7959k1329
4694A808232m7606n7588Q510m6490m2396L5786m3310m944n5818P372n0405O9494
4682A580837n4839j7640j9773k7580l5839j158k5877r1056J4201J7160p397K940
4670A333979j5528j07236j2215o3889P360P48K3133p0782j4042K6679p480o1215
4658A039512J7283j02757o1848n100L2647k2943l0285k242M402N990m0147m5054
4646G89458P7204k4399n4066k6562j0880M35L7916k0971k8471O000m1956o3974
4634F39734k7156J7344K4198j1071L800j6700o7254k3634m060j6313l343N6032
4622E71577r6J0124O517n1134p727k431R288J5349k1541k9227L8712K0226p898
$$ plain form
4705 2165181 2119107 2086715 2012068 1981161 2014139 1995244 1950071 1914000 1847520 1829561 1808232
4694 1808232 1760626 1703038 1711548 1665058 1622662 1658448 1615138 1610194 1554376 1561748 1511343 1580837
4682 1580837 1525998 1508358 1488585 1461005 1425166 1424008 1398131 1307075 1321276 1338436 1331039 1333979
4670 1333979 1318451 1211215 1199000 1135111 1142471 1143219 1166352 1095570 1081528 1108207 1100727 1039512
4658 1039512 1056795 954038 892190 887090 919737 896794 866509 864267 868669 874659 834512 789458
4646 789458 866662 842263 788197 761635 750755 751190 789106 768135 739664 745664 703708 639734
4634 639734 612578 629922 654120 643049 646849 630149 562895 539261 535201 518888 515545 571577
4622 571577 571481 581605 588122 536988 529261 526830 536118 551467 529926 500699 539411 559637 551739
4609E51739j7484o4347M4364M9152m3582L5814L2348j1452j1900K7392l6175K3114
4597E78983J4223l2651M5489L8826R441K5034l7568p1538j3586o740Q5822j3922
4585F21813n6073K9898N3408J0779k3252p2072R479N3265J0867K0250k175L3796
4573F89983O0130r739m8996j4320K8618K0292J8740L7032L8208j90M5719j4686
4561H50791O1252O4247N096N1079J68684O9724Q4387O1178O5501j2601Q651m6331
4549A431658j09836l0440k534j67337j10638j61592m3129j1724n800l3934p4238
4538F80456J2827k8091p300J3578l7744m1400L0360o2139J43P603K2577r864K8329
4525F09335l913l5097j7382m8457m259N201j6352j3319M1786N1474m9240k812
$$ plain form
4609 551739 534255 469908 514272 563424 519842 555656 588004 576552 564652 592044 555869 578983
4597 578983 593206 560555 606044 644870 654311 679345 641777 570239 556653 549913 635735 621813
4585 621813 565740 595638 649046 659825 636573 564501 573980 627245 638112 658362 656187 689983
4573 689983 750113 740374 691378 677058 705676 725968 744708 781740 819948 819758 865477 850791
4561 850791 912043 976290 981386 1032465 1201149 1270873 1355260 1416438 1481939 1469338 1477989 1431658
4549 1431658 1321822 1291382 1288848 1121511 1010873 849281 806152 794428 788628 754694 680456
4538 680456 693283 665192 657892 671470 633726 592326 622686 560547 560690 568293 590870 581006 609335
4525 609335 605422 570325 552943 504486 500227 505428 489076 475757 517543 569017 519777 516965
4513E16965K466j636M4633j01369o6319N7009P0090J1987o0295k8144m134L3874
4501D75127k3041J7692J7999R18L0732N4174k0355k5400m5423L8665k5261K6763
4489E22590J1298N199l258J9478q409M0111P491l3481J6727q131J5195k1103l0036
4476E33671j7519O154j1286K7736j2263o0275K4963j7794L0235n4628j456J741
4464D49279K9367P6821n9980K1770n7104J8188k924Q982K9968j1542r935L3572
4452E26462L1208l3272n1519M1941n849j3309M1085j8071j3674o1387M7004P7731
4440E68350K4892j831J5788k6484J8900L9277p486K4823M3955J8478k1923p7887
4428F18852m9575l1859q091P8358J6794k5375k0132j11971P769M4957M586J8425
$$ plain form
4513 516965 519431 517795 562428 461059 394740 451749 521839 533826 473531 445387 441253 475127
4501 475127 452086 469778 487777 488695 519427 573601 553246 527846 482423 521088 495827 522590
4489 522590 533888 539087 535829 555307 546898 587009 594500 561019 577746 569615 584810 563707 533671
4476 533671 516152 522306 511020 538756 526493 466218 491181 473387 503622 448994 447538 449279
4464 449279 478646 555467 495487 517257 460153 478341 475417 484399 514367 502825 492890 526462
4452 526462 557670 524398 472879 514820 508971 495662 536747 518676 505002 443615 490619 568350
4440 568350 593242 591411 607199 580715 599615 638892 631406 656229 700184 718662 696739 618852
4428 618852 569277 537418 529327 607685 624479 599104 578972 467001 474770 519727 524313 542738
4416E42738l3979N3667o17K44k8827j8463j6898j4982Q64L5286k2821M0785P5515
4403F12512m4578K994N2525K3608j4799p1793k2182n8300M871L7105k1327R950
4391E10586O0606L7054j6710k8386L3814N5723J4404l0810p6812l5466j0485K6077
4379E39595R607L1147K7348l0476K493K7535k71m4778k4076J1981J2838j9985
4367E42958N8113n6879O669K1475j3794L3052M5531j8970Q847P61m9238Q422K6835
4354F13782Q746q1740N1716k5294M4173k373k3080K6331P0495j1797l2155Q522
4342F47326P534l5773N0150j079l8635M0723K892n0838k5732j4035j3561J2709
4330E81681J4156M177L6112M809j10679N2966R1296j9634j4024j0698m8540N536
$$ plain form
4416 542738 508759 562426 561809 562053 533226 514763 497865 482883 483747 519033 496212 536997 612512
4403 612512 567934 570928 623453 647061 632262 560469 538287 479987 484858 521963 500636 510586
4391 510586 571192 608246 591536 563150 596964 652687 667091 636281 559469 524003 513518 539595
4379 539595 549202 580349 607697 577221 579714 607249 606978 562200 538124 550105 562943 542958
4367 542958 601071 544192 550861 572336 558542 591594 637125 618155 627002 627763 578525 586947 613782
4354 613782 622528 540788 592504 567210 611383 609010 585930 612261 682756 670959 638804 647326
4342 647326 654860 619087 669237 668158 629523 670246 673138 622300 596568 582533 568972 581681
4330 581681 595837 600014 636126 640935 530256 583222 674518 654884 640860 630162 581622 587158
4318E87158M3031J16632p0910J103k0167L1363n0266N9444L1426j0229o979o0270
4306F51336j1854R026J5761N655J0189o1343M7432j1770p774K2753j8603m4861
4294F05947N6414Q736l0534m3209J09470l0159m748P272K7102k653m5120k5565
4282F32953J9292J1111J6843k1369J2035K6765O825L295J3181J7632N5302r4150
4270F99715l4369O1623J8074k7516j2424N2187j7156l4551J2750J6169k1648k0768
4258F92086K0471J6483j0545L3962l8413N0248O928P392k7504L8451K1162O501
4246H17222m6952j8208J2858K2361j3512m2671M5846R633j7320P1470K0314l2955
4234H28086k9847N849N0036J9915m5479J8708M442O7063J3107j03369l1361N6028
$$ plain form
4318 587158 630189 746821 675911 677014 656847 688210 637944 697388 728814 718585 711606 651336
4306 651336 639482 648508 664269 669924 680113 618770 666202 654432 646658 669411 650808 605947
4294 605947 662361 671097 640563 597354 706824 676665 671917 679189 706291 703638 658518 632953
4282 632953 652245 663356 680199 658830 670865 697630 704455 707750 720931 738563 793865 699715
4270 699715 665346 726969 745043 717527 705103 757290 740134 705583 718333 734502 712854 692086
4258 692086 712557 729040 718495 752457 714044 764292 771220 778612 751108 789559 810721 817222
4246 817222 770270 752062 764920 787281 773769 731098 776944 786577 769257 840727 861041 828086
4234 828086 798239 804088 854124 874039 828560 847268 851710 918773 931880 828511 797150 853178
4222H53178L3014k7230o525L1177k3413l0921N1892J771k038m8M6309j6766m4493
4209H65907J8291j1622M0417l1695Q5225j8761n717k3662J125l4004Q2049m758
4197I62795o8404K6144N6165j2054M5637k4127j7463l44n4724Q7705m7331O4169
4185A018168M2929k0764l1862M3973J5561O2500m5953n645J1820P6752p656J2110
4173A171933J9229m482P6491L1563J8116J5537O2196J18136K1700m596j9017k3499
4161A483307p8891j3102n3479m3984n1374k0408k3293m0530P201L775N8709M8506
4149A276437l5363k1866L3961K3034R363l4451j566N1458o5403K7403L8414n7161
4137A244260K415M9244m4431j13592R9344K6569l4406P1847j4398p127K8136J300
$$ plain form
4222 853178 886192 858962 852437 883614 860201 829280 881172 882943 880905 880857 927166 910400 865907
4209 865907 884198 872576 912993 881298 966523 947762 942045 918383 919508 885504 967553 962795
4197 962795 894391 920535 976700 964646 1010283 986156 968693 968349 913625 1001330 953999 1018168
4185 1018168 1061097 1040333 1008471 1052444 1068005 1130505 1084552 1078907 1090727 1167479 1159823 1171933
4173 1171933 1191162 1186680 1263171 1294734 1312850 1328387 1390583 1508719 1530419 1525823 1506806 1483307
4161 1483307 1404416 1391314 1337835 1293851 1242477 1222069 1198776 1158246 1165447 1169222 1227931 1276437
4149 1276437 1241074 1219208 1253169 1276203 1285566 1251115 1249549 1301007 1235604 1263007 1301421 1244260
4137 1244260 1246675 1295919 1251488 1137896 1237240 1263809 1229403 1301250 1286852 1279725 1307861 1309161
4125A309161l3161k2386j6287M6519O2131P082n8927N3947K8870m4983O4345L6192
4113A432503J518n3438Q0060O0301l1364o5567L5091M2072J1528j2060K9093o994
4101A522743l709k6143k4211M6217J3712J4171K4786K9713Q0214K6712M2889J03080
4089A850174O4248J41643P2603M9198J21189J00776J11571J47239J66935J41750
4079B967326R2252m627k1647p2462k02373j52266j50856j36076j63281r0322k3180
4068B042488o0344m5331n3840r330K2531O2864j7094r7314q730J9043j5172P365
4056A847136L9194L3104l2955l3623K7774L5591Q1497M313o8535k231o538Q6980
4044B011707K7032K9129R70O5031O6018N4034M3080k9333M4052K2169L5625Q9526
$$ plain form
4125 1309161 1276000 1253614 1237327 1283846 1345977 1353059 1294132 1348079 1376949 1331966 1396311 1432503
4113 1432503 1434021 1380583 1460643 1520944 1489580 1424013 1459104 1501176 1512704 1500644 1529737 1522743
4101 1522743 1519034 1492891 1468680 1514897 1528609 1542780 1567566 1597279 1677493 1704205 1747094 1850174
4089 1850174 1914422 2056065 2128668 2177866 2299055 2399831 2511402 2658641 2825576 2967326
4079 2967326 3059578 3054951 3033304 2960842 2758469 2606203 2455347 2319271 2155990 2065668 2042488
4068 2042488 1982144 1936813 1882973 1873643 1896174 1959038 1941944 1844630 1835900 1854943 1839771 1847136
4056 1847136 1886330 1919434 1886479 1852856 1880630 1916221 1997718 2002031 1933496 1931265 1924727 2011707
4044 2011707 2038739 2067868 2068838 2133869 2199887 2253921 2297001 2267668 2311720 2333889 2369514 2459040
4032B459040k5922p8141J7725P285K6528J20752M0443m6138O2436P482j2250M7507
4020B626747j9048N9054P1958M4037K8960k7392j8457P1596M4593j0640l5775
4009B835633l3902l3599K3361N6895j3465N020J6889J3019L6777R019K2881m0855
3997B897673J13758R7239P3391L3659Q6347J6673j0182J13010L8916J34695m4841
3986C550338N8102Q6552K9993J20967Q1773J12112R6509J85143J63911J76874
3976D662274J80153J15021P8056l7942o6609j07481k1523l2875J5459J8962P3972
3965D877467M6038Q9107O2440R5255J21589O2122j4315M7216J04935Q6612J10757
3954E689223J05986J64806J54158J81599J34852O4243R0493J28316J62618P1584
$$ plain form
4032 2459040 2433118 2354977 2372702 2379987 2406515 2527267 2567710 2521572 2584008 2591490 2579240 2626747
4020 2626747 2607699 2666753 2738711 2782748 2811708 2784316 2765859 2837455 2882048 2871408 2835633
4009 2835633 2801731 2768132 2791493 2848388 2834923 2839943 2856832 2869851 2906628 2915647 2938528 2897673
3997 2897673 3011431 3108670 3182061 3215720 3302067 3318740 3308558 3421568 3460484 3595179 3550338
3986 3550338 3608440 3694992 3724985 3845952 3927725 4039837 4136346 4321489 4485400 4662274
3976 4662274 4842427 4957448 5035504 4997562 4930953 4823472 4801949 4769074 4784533 4803495 4877467
3965 4877467 4923505 5012612 5075052 5170307 5291896 5354018 5339703 5386919 5491854 5578466 5689223
3954 5689223 5795209 5960015 6114173 6295772 6430624 6494867 6585360 6713676 6876294 6947878
3944F947878J01910J35503N3590K07421K27217K36332K88654K94318K50847K32671
3934H976341L62768K97753L47638L95469L67224L85287M82562N05371N43735O03406
3924A3267554P54159Q22126Q86503J080780J281476J466025J689406J918634K267601
3915B5434264K616576L012088L407185M087668M713803N646665O729077Q043461
3907F3690787Q849895Q584733M677806k217517q712516j1652363j0254698p917204
3899D5048923n535705l841209k565604j790635j321221j223450j231678j297936
3891B6241485j328752j257723j125275r31414p48885n67394l86548m28082l80311
3882A9087101l90547l14101j46474j15724j56976J3178J55157J26729R0266J07715
$$ plain form
3944 6947878 7049788 7185291 7238881 7446302 7673519 7909851 8198505 8492823 8743670 8976341
3934 8976341 9339109 9636862 9984500 10379969 10747193 11132480 11615042 12120413 12664148 13267554
3924 13267554 14021713 14843839 15730342 16811122 18092598 19558623 21248029 23166663 25434264
3915 25434264 28050840 31062928 34470113 38557781 43271584 48918249 55647326 63690787
3907 63690787 72540682 81125415 85803221 83585704 74873188 63220825 52966127 45048923
3899 45048923 39513218 35672009 33106405 31315770 29994549 28771099 27539421 26241485
3891 26241485 24912733 23655010 22529735 21598321 20849436 20282042 19895494 19467412 19087101
3882 19087101 18696554 18382453 18235979 18120255 17963279 17976457 18131614 18258343 18348609 18456324
3872A8456324J22319J03825J28208R6812K8522Q6009J20247J70176J73484L08672
3862A9794598K90382L05939J33392J13158J16237J17431J39546K19912L16747
3853B1547342L60868M33685N62914O69586P71343P56365R04668R00247Q88567
3844B7795585J119896J132205J303193J467180J583854J772770J993839K280299
3836D0448821K544341K980855L453260L958439M471917N157518O099146O980183
3828G6094480Q141667R601073J1284413J3203389J5529152J8191406K1203311
3821A73248891K4044659K6131661K7874692K3944234J3971251Q611200k600894
3814B95225694k1240364k8762131k9906306l1675811k9399124k3561710j7656512
$$ plain form
3872 18456324 18578643 18682468 18810676 18907488 18936010 19022019 19142266 19312442 19485926 19794598
3862 19794598 20084980 20390919 20524311 20637469 20753706 20871137 21010683 21230595 21547342
3853 21547342 21908210 22341895 22904809 23574395 24345738 25102103 26006771 26907018 27795585
3844 27795585 28915481 30047686 31350879 32818059 34401913 36174683 38168522 40448821
3836 40448821 42993162 45974017 49427277 53385716 57857633 63015151 69114297 76094480
3828 76094480 84236147 93837220 105121633 118325022 133854174 152045580 173248891
3821 173248891 197293550 223425211 251299903 275244137 289215388 297826588 295225694
3814 295225694 273985330 245223199 215316893 183641082 154241958 130680248 113023736
3807A13023736j3252547j0293955q064241o582174n629753m836543m208816l777867
3799E6377840l378732k916422k503903k187593j923429j820235j539191j340353
3791C8767982j323203j118749j146491j143411j273004j196207j294909j245585
3783B9026423j173080j057148j014636q88371p59029p03163q37438q88158q26665
3774B0878735q37712q38177q86431p81648o32575n31463m40357m56156l11704
3765A5162512k23568k41809j23180j83916o456n6112k9699Q1911k5413J7615r7447
3754A4274438k49293k36704l88203l85796l47677l02854j86495j32008j41851
3745A1903557j30670k06823k79353l51783l04605j81831j62893j79803j34023
$$ plain form
3807 113023736 99771189 89477234 81412993 74830819 69201066 64364523 60155707 56377840
3799 56377840 52999108 50082686 47578783 45391190 43467761 41647526 40108335 38767982
3791 38767982 37444779 36326030 35179539 34036128 32763124 31566917 30272008 29026423
3783 29026423 27853343 26796195 25781559 24893188 24134159 23430996 22593558 21705400 20878735
3774 20878735 20041023 19202846 18316415 17534767 16902192 16370729 15930372 15474216 15162512
3765 15162512 14938944 14697135 14573955 14390039 14383583 14327471 14297772 14379683 14354270 14371885 14274438
3754 14274438 14025145 13788441 13400238 13014442 12666765 12363911 12177416 12045408 11903557
3745 11903557 11772887 11566064 11286711 10934928 10630323 10448492 10285599 10105796 9971773
3736I971773j91150j49116j55071o2122j4605k5618k2953q8039o5530j39360k53506
3725H804703k21301j67273r6225j07035q7221j05059j06104l4968l8562k8015
3715G812940J11639K01833J79601K27273K83657L90964N05736N29176M96816J00901
3705A0840536n91396r08454q58104o67085n32433m69358k78878k51854k57816
3696F025158j24525j47599j27997r6205j2621j5097n5838j2672j0456r677Q7433
3685E499904R2884J15063J22181K18262K67158K60433K09766Q5421j4782L4573
3675F890863J14701J52238J8332k36237l92587l30323k66865j65233k34413j48118
3665E402358n4257r4610q7000o3605j85316j60103p8236o3432m8526n0816k3868
$$ plain form
3736 9971773 9780623 9631507 9476436 9414314 9399709 9374091 9351138 9263099 9197569 9058209 8804703
3725 8804703 8583402 8416129 8319904 8212869 8125648 8020589 7914485 7879517 7840955 7812940
3715 7812940 7924579 8126412 8306013 8533286 8816943 9207907 9713643 10242819 10739635 10840536
3705 10840536 10249140 9340686 8482582 7815497 7283064 6813706 6534828 6282974 6025158
3696 6025158 5900633 5753034 5625037 5528832 5516211 5501114 5445276 5432604 5422148 5412471 5499904
3685 5499904 5592788 5707851 5830032 6048294 6315452 6575885 6785651 6871072 6856290 6890863
3675 6890863 7005564 7157802 7176134 6939897 6547310 6216987 5950122 5784889 5550476 5402358
3665 5402358 5348101 5253491 5166491 5102886 4917570 4757467 4679231 4615799 4567273 4516457 4492589
3654D492589J9433L8123n523M9219K9932Q0602J31828R9838N9702Q2862O4009
3643E142614R2307P3196O3367J03637J54427J21190J07770J21845J41835J30886
3633F253074l0795j5741K9058p0006o5249j01759J3347o5821K8600J22584J54645
3622F251937J79177J96386K49983L33439K86703M30345M46641M96029N89045O52869
3612A0112554O60694O58664O39160N48695L50663J86564P0851j90469l44110m15382
3602A2277884n22307n66111n07070m25828k69056j90292j4786R8689J81863K31772
3592A0294758J89101K07369J35002K06384K78862L21623N09735M86714N01158
3583A3130706N52705M40831K57818P8999r9754j28202p1751m8456j46359j01771
$$ plain form
3654 4492589 4512022 4550145 4544622 4593841 4623773 4704375 4836203 4936041 4995743 5078605 5142614
3643 5142614 5234921 5308117 5371484 5475121 5629548 5750738 5858508 5980353 6122188 6253074
3633 6253074 6222279 6206538 6235596 6165590 6100341 5998582 6011929 5946108 5974708 6097292 6251937
3622 6251937 6431114 6627500 6877483 7210922 7497625 7927970 8374611 8870640 9459685 10112554
3612 10112554 10773248 11431912 12071072 12619767 12970430 13156994 13227845 13037376 12693266 12277884
3602 12277884 11755577 11189466 10682396 10256568 9987512 9797220 9782434 9881123 10062986 10294758
3592 10294758 10483859 10691228 10826230 11032614 11311476 11633099 12142834 12629548 13130706
3583 13130706 13683411 14124242 14382060 14461059 14361305 14233103 14161352 14112896 13966537 13864766
3573A3864766k36372k28121j71525j36887j14374j99074j49142r2539k07024k97660
3563A2032048l18124l19011n3213L6300J52658K33435L15598K89157L38991L53004
3553A3060843L40283L59398K87459L33759K57314O6635j56676m61285n98882p22032
3543A2766816p64475o70438o14981n20725m24335l71945m72988m49521m30810
3534H046598l41208j34462j72443j12576j5727q178O7444J04619J34748O2048
3524G630863O2852N7497K0925j25364j68713k70012k90383k27188k12091k85058
3514F193328k03092j75094k07376k08255k14940j77844j25747p9724j0521p8258
3504D712477r9624j25270j2615j0202k1249k3587n2871n9328o21J2197k1236L3719
$$ plain form
3573 13864766 13628394 13400273 13228748 13091861 12977487 12778413 12629271 12536732 12329708 12032048
3563 12032048 11713924 11394913 11341700 11378000 11530658 11764093 12079691 12368848 12707839 13060843
3553 13060843 13401126 13760524 14047983 14381742 14639056 14705691 14549015 14087730 13488848 12766816
3543 12766816 12002341 11331903 10716922 10196197 9771862 9399917 8926929 8477408 8046598
3534 8046598 7705390 7570928 7398485 7285909 7270182 7262004 7329448 7434067 7568815 7630863
3524 7630863 7693715 7751212 7772137 7646773 7478060 7208048 6917665 6690477 6478386 6193328
3514 6193328 5990236 5815142 5607766 5399511 5184571 5006727 4880980 4801256 4790735 4712477
3504 4712477 4612853 4487583 4474968 4464766 4443517 4419930 4367059 4307731 4307110 4319307 4298071 4331790
3492D331790M7643k8620J1769R2945O2804L0134R3709J14908Q2054Q5546J58852
3481E083534J19548J63417K07092J31518J69560K12104J77815K64278J88065J38109
3471F855040K26609J26975K34627R1055J30614J78211J26632J20995K4236o7103
3461H047891j04611j18898o8840k9054l4128J7322J63999K24839L11871K64320
3451H674711M03330M84806M82476N19601N38008M89106M54075L71615M19560M71684
3441A3308972M44266L05565K7142o7800k31351m47300m29134k78906k19100j93881
3431A2218473j23397k9219m2631j02667l0132M0934J33362L01958L39736L83431
3421A3089848M56725M27188K68953J82235J54834J77668K88979K54138J20690
$$ plain form
3492 4331790 4379433 4350813 4362582 4455527 4518331 4548465 4642174 4757082 4839136 4924682 5083534
3481 5083534 5203082 5366499 5573591 5705109 5874669 6086773 6264588 6528866 6716931 6855040
3471 6855040 7081649 7208624 7443251 7534306 7664920 7843131 7969763 8090758 8114994 8047891
3461 8047891 7943280 7824382 7755542 7726488 7692360 7709682 7873681 8098520 8410391 8674711
3451 8674711 9078041 9562847 10045323 10564924 11102932 11592038 12046113 12417728 12837288 13308972
3441 13308972 13753238 14058803 14085945 14018145 13786794 13339494 12910360 12631454 12412354 12218473
3431 12218473 12095076 12065857 12023226 11920559 11890427 11931361 12064723 12366681 12706417 13089848
3421 13089848 13546573 13973761 14242714 14424949 14579783 14757451 15046430 15300568 15421258
3412A5421258J83838J58350J31132K01607M0083N0256P6638L4677k07459m39346
3402A5651034o85831o76413o64685n49409m05167k71096r2902k0380k0043o9142
3392A2195966r0613j53744p7256p5982O0604J73979K72013K53350L36185L08881
3382A3203383J48596N1190j68029k65114m58313m73437n26388o42817o83813o00401
3372I584857n75463m31740l76910k94883k49437k45256j59135j72211r1433j08499
3362F879890k9033n1756M6213P023O7734N2062k5232n5158j40839j92229j27845
3351F430830j37371j18999k00168k58037j58780k46911j81680j30485j55439j71005
3341D671955j04156o1698j24127m8940r3387n4350m9452k0497J0232n5283o6266
$$ plain form
3412 15421258 15605096 15763446 15894578 16096185 16136268 16186524 16263162 16297839 16090380 15651034
3402 15651034 14965203 14288790 13624105 13074696 12669529 12398433 12305531 12285151 12265108 12195966
3392 12195966 12105353 11951609 11874353 11798371 11858975 12032954 12304967 12558317 12894502 13203383
3382 13203383 13351979 13403169 13235140 12970026 12511713 12038276 11511888 10869071 10185258 9584857
3372 9584857 9009394 8577654 8200744 7905861 7656424 7411168 7252033 7079822 6988389 6879890
3362 6879890 6850857 6799101 6845314 6852337 6920071 6972133 6946901 6891743 6750904 6558675 6430830
3351 6430830 6293459 6174460 5974292 5716255 5557475 5310564 5128884 4998399 4842960 4671955
3341 4671955 4567799 4506101 4381974 4333034 4239647 4185297 4135845 4115348 4125580 4070297 4004031
3330D004031q8722o2134n0811n0374q4427j48468p1553k3472o6312l9754o2406
3319C255598j17703j09177l4833l5707N1K5562o0654m2365L9033o6250n3443j4764
3307B785348l5803m9523n5023m662n540q0179l3842n8032k5746m747r9058p364
3295B325829j14670o2455J2370m6460k21j4765n5109r313M045l172k5450j023
3283B009606n5307M6795k5255k1897Q333k6962l1980J5278k4758k2848l4975j225
3271A834805j9198p8556J959P631J3016P471j4143l034K4057P3554m4573j20367
3259A682622L1241M1827n0087N4598K3673k0563K7480n1075J4570K5791P460n8912
3247A728625J941K2378L2630l9851m2548J6411Q07q120j4574P463L7123l9660
$$ plain form
3330 4004031 3915309 3853175 3802364 3751990 3667563 3519095 3447542 3424070 3357758 3318004 3255598
3319 3255598 3137895 3028718 2993885 2958178 2958229 2983791 2923137 2880772 2919805 2853555 2800112 2785348
3307 2785348 2749545 2700022 2644999 2640337 2634797 2554618 2520776 2462744 2436998 2432251 2333193 2325829
3295 2325829 2211159 2148704 2161074 2114614 2114393 2099628 2044519 2035206 2039251 2036079 2010629 2009606
3283 2009606 1954299 2001094 1975839 1953942 1962275 1935313 1903333 1918611 1893853 1871005 1836030 1834805
3271 1834805 1815607 1737051 1739010 1746641 1759657 1767128 1752985 1749951 1774008 1847562 1802989 1682622
3259 1682622 1713863 1755690 1705603 1760201 1783874 1763311 1790791 1739716 1754286 1780077 1787537 1728625
3247 1728625 1730566 1752944 1785574 1745723 1703175 1719586 1720393 1712273 1697699 1705162 1742285 1702625
3235A702625n2373J2188N6496K8594k7129K4128Q365l6681N2729O5049J0660K7544
3223A872195J9991l0518j6539J3771M3200l0598j3737K5914k2276N4847N9825
3212A976075j25084K8874K4979L0883q0765l415K3315m0697K3440j7167N6024
3201A896462m5534J1701M4160J0881K7015N537N9273K9850O1917j1324m8343N8109
3189B099704k0803j9498K0343K7320J6097o8463o98K1374l1064k8115o1921J2524
3177A966800m3991K3683n3810r4806P3032k1509j6204N0863r234l9071k5066k7498
3165A783189O2975o1582J0573K0300o3086n7301r424L1826n8769O126L0561J5843
3153A711231n2099p1884k7831O7128j753m8088n1454j5176L3739l0946M282j5373
$$ plain form
3235 1702625 1650252 1662440 1718936 1747530 1720401 1744529 1752894 1716213 1768942 1833991 1844651 1872195
3223 1872195 1892186 1861668 1845129 1858900 1902100 1871502 1857765 1883679 1861403 1916250 1976075
3212 1976075 1850991 1879865 1904844 1935727 1854962 1851547 1874862 1834165 1857605 1840438 1896462
3201 1896462 1850928 1862629 1906789 1917670 1944685 1950222 2009495 2039345 2101262 2089938 2041595 2099704
3189 2099704 2078901 2059403 2079746 2107066 2123163 2054700 2054002 2075376 2044312 2016197 1954276 1966800
3177 1966800 1922809 1946492 1892682 1797876 1870908 1849399 1833195 1884058 1874824 1835753 1810687 1783189
3165 1783189 1846164 1784582 1795155 1815455 1752369 1695068 1685644 1717470 1658701 1664827 1695388 1711231
3153 1711231 1659132 1587248 1559417 1626545 1624792 1576704 1525250 1510074 1543813 1512867 1517149 1501776
3141A501776m6880m8711j2340p4997j8839J7416J156L4741l3198j6810L8P2177
3129A375529J2529k3075n0031m562n2914q4654m382O1261Q0129K9263m7429l5301
3117A256363j2816r8940N237K0321K2893l053o1979J0649J4433m8114K5420r157
3105A121257M3606m803m0188N4078j2599L2364r199N8404N8339k4071k5991k531
3093A248666K8487O6288J2738L8554j2220J3988J183J7501j07205j7280N0782
3082A341482o4372l9014J6031q974n5585j2111l4083j8475J403P2576L5342j5352
3070A218868p0105K5157N7697J4885j8284L1719M6199L8007k6064l0761M7735
3059A335053O6042L2592o942P1587M0977P4069l262N6383P8175N7054J41608J41776
$$ plain form
3141 1501776 1454896 1406185 1393845 1318848 1300009 1317425 1318581 1353322 1320124 1303314 1303352 1375529
3129 1375529 1388058 1364983 1314952 1310390 1257476 1172822 1168440 1229701 1309830 1339093 1291664 1256363
3117 1256363 1243547 1144607 1149844 1170165 1193058 1190005 1128026 1138675 1153108 1104994 1130414 1121257
3105 1121257 1164863 1160060 1119872 1173950 1161351 1193715 1184516 1242920 1301259 1277188 1251197 1248666
3093 1248666 1277153 1343441 1356179 1394733 1382513 1396501 1397684 1415185 1307980 1290700 1341482
3082 1341482 1277110 1238096 1254127 1245153 1189568 1177457 1143374 1124899 1126302 1198878 1234220 1218868
3070 1218868 1148763 1173920 1231617 1246502 1228218 1259937 1306136 1344143 1318079 1287318 1335053
3059 1335053 1401095 1433687 1426745 1498332 1539309 1613378 1610116 1666499 1744674 1801728 1943336 2085112
3047B085112J22019K39728J33939K60111K16671L28652M00455M29137N82070P12461
3037E510355P00394O29962J42843q86235j058080q89504n82418l78029k01207
3028B988081j30105m4906m5723p8831k799J18217O7367J28120J53209K55423K59903
3017C667956L00062L70791L88449L99525N82807N62932N02678R6342q34077j103771
3007D933694r42485o25195m10134l23597k48739j15719j63465j32950n4613j05471
2997A811326j02527l5591J3051O1760r1388m8661R362l7641q7966j02556n6441
2986A332728p5150m8211q2804l0008L394J5971n1620p0647p81o3501J228Q41k3390
2973I08050k3616n9278o138p5411l5246J3132J1654j621L6510k6365k1216l0554
$$ plain form
3047 2085112 2207131 2446859 2580798 2840909 3057580 3386232 3786687 4215824 4797894 5510355
3037 5510355 6210749 6840711 6983554 6097319 5039239 4149735 3567317 3189288 2988081
3028 2988081 2857976 2813070 2767347 2688516 2685717 2803934 2871301 2999421 3152630 3408053 3667956
3017 3667956 3968018 4338809 4727258 5126783 5709590 6272522 6775200 6871542 6037465 4933694
3007 4933694 3991209 3366014 2955880 2632283 2383544 2267825 2104360 1971410 1916797 1811326
2997 1811326 1708799 1673208 1686259 1748019 1656631 1607970 1617332 1579691 1491725 1389169 1332728
2986 1332728 1257578 1209367 1126563 1096555 1099949 1115920 1064300 993653 992872 929371 930599 931440 908050
2973 908050 884434 825156 819018 743607 708361 721493 733147 731526 768036 741671 720455 689901
2961F89901J4449L6420p0379J5022K063M159R513l1458l4962n5272J1682k3162
2949E67976J9613l159j5249j5195n9585l021L1157j7121K1178m456K352j2953
2937E11537K5289m5011j5358K054k15k2937l6059L780k3694K6043j0579J7102
2925D31952j2084j7488M5032J1493J5577m1555j3758m6261K7504L7454K317N9217
2913D99400L5899o0274p4717q661j4142o5448J8065L2802m1795O605o263J6913
2901C38384l0487j5565j791m5400J4917R6024m8178j4485j358M3842o8948K7105
2889B94060k3827J1308M2582q69J9205J9645p8867L2973J8605n3711J3417o9165
2877B25356j2576L1169R22l8002p558M8208L8563k2561q679j974o5428n250J413
$$ plain form
2961 689901 704350 740770 670391 685413 687476 691635 701148 669690 634728 579456 591138 567976
2949 567976 587589 584430 569181 553986 494401 491380 522537 505416 526594 522138 524490 511537
2937 511537 536826 491815 476457 478511 478296 455359 419300 423080 399386 425429 414850 431952
2925 431952 419868 402380 447412 458905 474482 432927 419169 372908 400412 437866 440183 499400
2913 499400 535299 475025 400308 391647 377505 312057 330122 362924 321129 327734 321471 338384
2901 338384 307897 292332 290541 245141 260058 356082 307904 293419 292061 335903 266955 294060
2889 294060 270233 281541 324123 323254 342459 362104 283237 316210 334815 281104 294521 225356
2877 225356 212780 243949 244871 206869 199311 247519 286082 263521 254842 252868 187440 182190 183603
2864A83603M199L0827l00l391n6284m576j3013l1099N0238j864Q108j0744L4918
2851A90622O446o778k182J0478K376m3454j4137l8478R902J918K63J1088K7098
2838A55162j1584n0463n899J6057k9109j3187L3660O6149l1049k2926L6674O197
2826A49682J6094j0933R173L0234l9117L641Q586r2327k9232K8952N3513K7631
2814A55897n5994M8502J1748L7677m6269N948O0366r561k1478j531J2987N1408
2802B49700l1413n0154o213N7529L656o3610k039k6517R480j2690O6504j0141
2790A84092K5174j0937k1171j9171j4656K1589K5728m0323n2322K2295O8454j7674
2778A71078m793k7729k2928L2652J9861n5092J579M363j1217K9858m6875L899
$$ plain form
2864 183603 187802 218629 218329 214938 158654 154078 141065 109966 160204 158340 166448 155704 190622
2851 190622 197068 190290 188108 198586 200962 157508 143371 104893 114795 116713 116976 128064 155162
2838 155162 143578 93115 87216 103273 74164 60977 94637 160786 129737 106811 143485 149682
2826 149682 165776 154843 164016 194250 155133 158774 167360 75033 45801 74753 128266 155897
2814 155897 99903 148405 160153 197830 151561 157509 217875 208314 186836 185305 198292 249700
2802 249700 218287 168133 161920 219449 223105 159495 157456 130939 140419 127729 194233 184092
2790 184092 209266 198329 177158 157987 143331 164920 190648 150325 98003 120298 188752 171078
2778 171078 166285 138556 115628 148280 168141 113049 114628 118991 107774 137632 90757 94656
2766I4656k6913O5131J3970M4410j204k2166j9358J4321M4199m3113K2286M55
2754A86674l4217L4604j9815k2724m3441M6586K3996k7680M128m2780N522J0191
2742A21044k1213K8892J8008P390m6183l412j4274R271J4980l726J0433o07k3803
2729I6800p809k619J6970k1670k7747K0232m9561N5721r33M6267j9190o9172K2090
2716E9379j2225J0566M9456m029l3734o618m8977P938R1824k0611k2209J9047
2704H9807j8314l4603n849j5138o0470N6509J8062R3200N056j1158o7415k4100
2692B5587M5668K1943o304K939j8226n0477K9939l7302O240O2073q991n1527j5271
2679F291O1972k6722k748J2689O136m2091K364O1877j3177j9325j1653L3240M034
$$ plain form
2766 94656 67743 132874 146844 191254 190050 167884 148526 162847 207046 163933 186219 186674
2754 186674 152457 187061 167246 144522 101081 147667 171663 143983 148111 105331 110853 121044
2742 121044 99831 128723 146731 154121 107938 104526 90252 99523 114503 110777 121210 120603 96800
2729 96800 88991 86372 103342 81672 53925 74157 24596 80317 79384 125651 106461 37289 59379
2716 59379 47154 57720 107176 103147 69413 62795 13818 21756 113580 92969 70760 89807
2704 89807 71493 36890 31041 15903 -44567 11942 30004 123204 128260 117102 49687 25587
2692 25587 71255 93198 86894 89833 71607 21130 51069 13767 20007 82080 73089 21562 6291
2679 6291 68263 41541 38793 51482 57618 15527 17891 79768 66591 47266 35613 68853 72887
2666G2887k0093k5689j3666M528N674M1635M0276q8632k5239M1208J4557j6540
2654C0906M2296l8075q513k6144j3573p2229M2016M4979k8859l88K1992J9059
2642A3467K0807j5097M57J9765K805K9375p4089l4695Q688O1964k8791p357N4230
2629E1529r1615K3733M317L93O7733j9640n1478P087m028L0317n5498N6817n0992
2616c1325k5177L5444N4431k4585m3059K6778j2744J6119j5355M6996r202j8149
2604A72j4985j1479Q829l0957L5093N6227K5099l5263n538j6764r877k3824K5053
2591A786J4158O102j4835r725k4446O97p982N773l166n2062O4583K9247m9398
2578c9268j7809K6766K1337L0218k1952K3589r714k1426m7311k8853J2040M7821
$$ plain form
2666 72887 52794 27105 13439 17967 23641 65276 105552 16920 -8319 32889 47446 30906
2654 30906 73202 35127 26614 470 -13103 -85332 -43316 1663 -27196 -27584 -5592 13467
2642 13467 34274 19177 19634 39399 42204 71579 -2510 -37205 -28517 33447 4656 -2701 51529
2629 51529 -40086 -16353 -12036 -11643 56090 36450 -15028 -7941 -11969 18348 -37150 19667 -31325
2616 -31325 -56502 -21058 33373 8788 -34271 -7493 -20237 -4118 -19473 27523 18321 172
2604 172 -14813 -26292 -17463 -48420 -13327 42900 67999 32736 27198 10434 557 -23267 1786
2591 1786 15944 22046 7211 -2514 -26960 -26263 -34245 -28472 -31638 -83700 -19117 10130 -39268
2578 -39268 -57077 -30311 -8974 21244 -708 22881 13167 -8259 -55570 -84423 -72383 -24562
2566b4562j6847K4157L7095r59l1111N042J2271L9337n0134K0574O205J9647p3728
2553c3013J2633j085n0273j6646Q6859j4987J9824N6853p200n684m4253m148K4518
2540B3398k2383j2843m029l181K2948M3220m7754k8021l1179n314K9583J1323
2528b4232j8115J7803L0102r7221J2833L3148P817N5037J4094o8035L7374l9820
2516c9215L0177J9606K6558p870p6987J7506j0303J3180J9424j7896l2553L1942
2504b6431L295K9054k6889P947k8416j3165P2797O2098k1575p6610L6393m0978
2492b2480J2640Q448N0194l4462m1372M3013m2408k5531j3080N8669P0474k035
2480F2070R266k7673N7457l0188o4270J9423l7764N766M8741p0199k6367O1317
$$ plain form
2566 -24562 -41409 -17252 19843 18884 -12227 -7185 5086 44423 -5711 14863 21068 40715 -33013
2553 -33013 -20380 -21465 -71738 -88384 -1525 -16512 3312 60165 52965 47281 3028 -1120 23398
2540 23398 1015 -11828 -15857 -19038 3910 47130 -624 -28645 -59824 -65138 -35555 -24232
2528 -24232 -42347 -24544 5558 -91663 -78830 -45682 -37865 17172 31266 -36769 605 -39215
2516 -39215 -9038 10568 37126 29256 -47731 -30225 -40528 -27348 -7924 -25820 -58373 -26431
2504 -26431 -23136 5918 -20971 -13024 -41440 -54605 18192 80290 58715 -17895 18498 -22480
2492 -22480 -9840 -1392 48802 14340 -27032 15981 -26427 -51958 -65038 -6369 64105 62070
2480 62070 71336 43663 101120 70932 6662 26085 -11679 -5913 42828 -27371 -53738 7579
2468G579J2308p1714p177P1780j5491J393l4865M6384p828m9282O9367M3861o2839
2455C476Q681j4306k393L327N510Q198l1075k6095j6728K084M5660O8418m8523
2442F234n0341M045Q720K4927N4719j7590k2217K8795j3428k8348M7967Q562l608
2429D8437o7773J1648j108N7456j4269j8659M0913l4179m2783M7479o8475K0516
2417b0797J6253K9929K6252l6039J7027m8962j06645Q5700R9042N1586m9249r6076
2405c1979k6691M8707R482l7397J39J6830L5305J1888n021m8288J9212m1377O592
2392d2598K2319J4841N3268K9417K6609q2191J3527K9559m8347m0078M051J562
2380a8061m1940j8383K938N0599j8111L9706J8679l0295j2959m1176L6047j7425
$$ plain form
2468 7579 19887 -51827 -59004 12776 -2715 -1322 -36187 10197 2369 -46913 22454 66315 3476
2455 3476 12157 -2149 -4542 -1215 4295 12493 -18582 -44677 -61405 -59321 -13661 54757 6234
2442 6234 -44107 -40062 -31342 -6415 48304 30714 8497 37292 23864 -4484 43483 52045 48437
2429 48437 -19336 -7688 -8796 48660 34391 15732 56645 22466 -20317 27162 -41313 -20797
2417 -20797 -4544 25385 51637 15598 32625 -16337 -122982 -37282 61760 113346 64097 -31979
2405 -31979 -58670 -9963 -481 -37878 -37739 -20909 14396 26284 21263 -27025 -7813 -49190 -42598
2392 -42598 -20279 -5438 47830 77247 103856 21665 35192 64751 16404 -23674 -19623 -18061
2380 -18061 -60001 -78384 -75446 -24847 -42958 -3252 15427 -14868 -27827 -69003 -32956 -50381
2368e0381j1728k6591j0233O0792m2658J8017N7122K8684k9142j499n7877M6646
2356a8848j3984L2599q1929J863P3676K526J8710j8562M2576n302o1387J9522
2344h540L3971j5772J5264K2762j4542K695o697n731J6898j4694l7935K471N1693
2331D1843l3383l0246Q0311J7335n704n1676J099J8441o5635M1887p309J6104
2319B3067K1536m093O461q700P4717l5062n2079K4816K6632m6625M2086n2486
2307B0270R998O0414K4081k353L7476P2087J7863r7131k5916N8250n6586k1761
2295I6692L7885m1764q2161Q500J8042k9466J1002l8835J8326L2283N3307o3779
2283B0032k6059P3462l443k991m8045q752k1064q76L4035M2571K4228J3627q2679
$$ plain form
2368 -50381 -62109 -88700 -98933 -38141 -80799 -62782 -5660 23024 -6118 -7617 -65494 -18848
2356 -18848 -32832 -233 -82162 -80299 -6623 -4097 14613 -3949 38627 33325 -28062 -8540
2344 -8540 25431 9659 24923 47685 33143 35838 29141 23410 40308 25614 -12321 -9850 41843
2331 41843 8460 -21786 58525 75860 70156 18480 19579 38020 -27615 14272 6963 23067
2319 23067 44603 40510 46971 38271 112988 77926 25847 50663 77295 30670 72756 20270
2307 20270 30268 90682 114763 112410 149886 221973 239836 142705 116789 175039 118453 96692
2295 96692 134577 92813 10652 19152 37194 7728 18730 -20105 -1779 30504 83811 20032
2283 20032 -6027 67435 63992 61001 12956 4204 -16860 -17736 16299 58870 83098 96725 14046
2270A4046Q256L5781P0946o6613l5985r23M8254J231q011J8061j9632l8375P570
2257C4606J5351L4002j8201L5706J8591r5610J9420M5428l0595k3061J5129o9814
2245a9048O0112q903P426K4679P071j0228J5206m937n1888J4207J081K6867j6657
2232D4988N582k6005M3741l7053N8061M373l2154K2859J8952n860l2926j4892
2220D9666N1754Q658r0081J1504O2580q0857K398N7624K2340l9618k5064P477
2208C8381O261Q7328J172k4715K6980j2918J0104l9471o8575O5994M3084l1280
2196A02345L3242J564j0212Q794p5354L2619K4228J1704K8977K0748l0659l4195
2184A13801J2431K569K8572J2610l0450J5232N1267l029j1321M9800k9556q3k1409
$$ plain form
2270 14046 22302 58083 129029 62416 26431 25508 73762 74993 66982 85043 65411 27036 34606
2257 34606 49957 83959 65758 101464 120055 24445 43865 89293 58698 35637 50766 -19048
2245 -19048 41064 32161 39587 64266 71337 61109 76315 71378 19490 33697 34778 61645 44988
2232 44988 50570 24565 68306 31253 89314 93687 61533 84392 103344 97484 64558 49666
2220 49666 101420 110078 19997 31501 94081 13224 15622 73246 95586 55968 30904 38381
2208 38381 44642 131970 133142 108427 135407 122489 132593 93122 24547 90541 133625 102345
2196 102345 135587 137151 126939 135733 60379 92998 117226 128930 157907 178655 147996 113801
2184 113801 126232 128801 157373 169983 139533 154765 206032 203003 191682 241482 211926 211843 190434
2171A90434k5142l1223K1671M4034l1480j4745o999O5038K5248M4221p3249J2284
2159B20092K7647J0836k8312N6344j9613K0445M6233n8969n38L8010k826O4998
2147C74347J6898k4031J7075m7249L9277M4115J7782o9l3160M9339J14331q77
2135E67778n0738N525R9862j3544j7147K381O6138J1335m7114r888k012M6150
2123F58726M3863J2102Q7942l902M068O031J6351j1544k4990J04528K1422K9518
2111I44115K9229j2744P0542m1660N4720L4271J6069M5763L4849m190N7230L0201
2099A258395J27948l5510R5053Q550L7961J04243J25025M4502O7254J46357L9828
2088B019606Q4770Q9867J65535J38955J19183J70682J51452K50360K54635K83248
$$ plain form
2171 190434 165292 134069 155740 199774 168294 153549 146550 211588 236836 281057 207808 220092
2159 220092 247739 258575 230263 286607 266994 287439 333672 274703 274165 312175 309349 374347
2147 374347 391245 367214 384289 337040 376317 420432 438214 438145 404985 454324 568655 567778
2135 567778 517040 522565 622427 608883 591736 594117 660255 671590 624476 614588 612576 658726
2123 658726 702589 714691 802633 798731 802799 808830 825181 813637 788647 893175 914597 944115
2111 944115 973344 960600 1031142 989482 1044202 1078473 1094542 1140305 1175154 1170964 1228194 1258395
2099 1258395 1386343 1350833 1445886 1454436 1492397 1596640 1721665 1766167 1833421 1979778 2019606
2088 2019606 2104376 2194243 2359778 2498733 2617916 2788598 2940050 3190410 3445045 3728293
2078C728293L26865M41907M79984N50249N67189O11956N48743P24726Q49273J210382
2068A0039567J302065J664100J773866K409302K824003L535619M572751M076544
2060C2197817L72659n154955n750487m780985l311158k474073j643094j145947
2052H309777r13273o88759n45622m61651l67738l82522m08229l73351k94214l55019
2042C519399k70785k00910k18908j66848j32449j40673j39639o3773j11788p0008
2032B003618q0414j00685q1470m3041p3153j25157k8324n5229p3934k2020p0437
2021A249754r2116o6551l5194o5560j2919l5586J0740m6280o5902m4511l3112
2010G62763k3268J9405L1106o1053o0204j1806k077n4973j1456n909j3594L6013
$$ plain form
2078 3728293 4055158 4497065 4977049 5527298 6094487 6706443 7255186 7979912 8829185 10039567
2068 10039567 11341632 13005732 14779598 17188900 20012903 23548522 28121273 32197817
2060 32197817 32570476 27415521 21665034 16884049 13572891 11098818 9455724 8309777
2052 8309777 7396504 6707745 6162123 5700472 5332734 4950212 4541983 4168632 3874418 3519399
2042 3519399 3248614 3047704 2828796 2661948 2529499 2388826 2249187 2185414 2073626 2003618
2032 2003618 1923204 1822519 1741049 1698008 1624855 1499698 1471374 1416145 1342211 1320191 1249754
2021 1249754 1157638 1091087 1055893 990333 977414 941828 952568 906288 840386 795875 762763
2010 762763 739495 758900 790006 728953 668749 656943 654866 599893 588437 582528 568934 604947
1998F04947m6501m6789m2938p759l6901L2239L0196M3043j3981j4700l2543P215
1986D75528p5015j7096K3005o816m3025K3002j11856n0038R0698l9836l3150K0020
1974B55421k5769J5921J6261n7432j5062K6132m9305J4724J11463m3834j5468
1963B33052P87K7604J1298j1149p0050K3878Q063l3210M7653o0690k2235R215
1951A64216r302J4656j7690J38j1217N841R049k3260Q590Q132K2460p128l8622
1938A25863L8760n6312N362K1245n4726P969K8432K8038l2958m1247K1937j8501
1926G3862K0324J8647K5453J05k4307K5600m9307J0383n3038P2378k7887k7380
1914F4833m2257J9159L2390j2838P051R0851l1522k5177J8251J4107L1202p5846
$$ plain form
1998 604947 558446 511657 468719 460960 424059 456298 486494 529537 515556 500856 468313 475528
1986 475528 400513 383417 406422 399606 356581 379583 267727 217689 308387 268551 235401 255421
1974 255421 229652 245573 261834 204402 189340 215472 166167 180891 292354 248520 233052
1963 233052 233839 261443 272741 261592 191542 215420 223483 190273 237926 177236 155001 164216
1951 164216 154914 169570 151880 152018 140801 146642 155691 132431 141021 149153 171613 164485 125863
1938 125863 164623 108311 113673 134918 80192 88161 116593 144631 111673 70426 92363 73862
1926 73862 94186 112833 138286 138391 114084 139684 90377 100760 47722 120100 92213 64833
1914 64833 22576 41735 74125 61287 68338 159189 127667 102490 120741 134848 166050 90204
1902I0204J5753J9547J1355p3637k4678L2276L5103n1361p2024M4988k3378k3884
1890a9736O8309J5453O309K3408J467j3300l1004M7059k34n3041K3674j9827j2728
1877C5809M318L8116Q851J1337l9165r6052Q999K0304N5747J7586m8491J7727
1865C5086o5831l0803L663L5380m9641Q2902O057k2784P1881k7662J7288L3465
1853H9001k3786k7129l9618j5349k3602J4943j0716j9272N7370K0025M5278J024
1841F8169j9001l4582r249L721K7948j6673K7519L4860k0298l7223q687K9144
1829D5648l87K1994L2111J2098l0568k284K9682j76l2237O3921N9493j7925k2977
1816A58393m2867k1063m4640J0766l2137j6758J4058r006J4955n463p865J9455
$$ plain form
1902 90204 105957 125504 136859 63222 38544 70820 105923 54562 -17462 27526 4148 -19736
1890 -19736 48573 64026 70335 93743 95210 81910 50906 97965 97731 44690 68364 48537 35809
1877 35809 40127 78243 87094 98431 59266 -36786 -27787 -7483 48264 65850 17359 35086
1865 35086 -30745 -61548 -57885 -22505 -72146 10756 16813 -5971 65910 38248 55536 89001
1853 89001 65215 38086 -1532 -16881 -40483 -25540 -36256 -55528 1842 21867 67145 68169
1841 68169 49168 14586 5337 9058 37006 20333 47852 82712 62414 25191 16504 45648
1829 45648 45261 67255 99366 111464 80896 78612 108294 108118 75881 139802 199295 181370 158393
1816 158393 115526 94463 49823 60589 28452 11694 25752 16746 31701 26238 18373 37828
1804C7828k5298l2P4361l3623j3546k1713m9283L411M734J6295M136k7102J1689
1791a8143k0747L2839J699j1053N1696j9699p5120M0644K6787Q1J8050k1849J4797
1778A9982o015n4976P0951l167n1256J9787N033L1667J820k3920n4958K9925O8284
1765E3157Q990o331k5192j441j6483j7229L5027k7260n271m6034J672Q4092L284
1752D0981n9061N6246l9432k8988N0517m2391k0813M0833J6108j0237k9864J1966
1740a4135L9863p42r982k2452Q1471n9572qo7216J3867O129r6756O0349M9830
1727a9354j6028K6802M569o638J9501N068P471n1918O782L0765K1157p269m0875
1714a9967J8626j1430n5164K4838N713P46j3480N5210l7349M1532j7537R210l771
$$ plain form
1804 37828 12530 12498 86859 53236 39690 17977 -31306 -27895 -23161 -6866 -2730 -29832 -18143
1791 -18143 -38890 -6051 -4352 -15405 36291 16592 -58528 -17884 8903 8984 27034 5185 19982
1778 19982 13967 -41009 29942 26775 -24481 -4694 339 32006 33826 9906 -45052 -15127 53157
1765 53157 62147 55816 30624 29183 12700 -4529 30498 3238 -2033 -48067 -46395 37697 40981
1752 40981 -18080 38166 -1266 -30254 20263 -22128 -42941 -2108 14000 3763 -26101 -14135
1740 -14135 25728 24986 15004 -7448 74023 14451 14443 -52773 -38906 -32777 -129533 -69184 -19354
1727 -19354 -35382 -8580 -4011 -10649 8852 13920 21391 -30527 -23745 7020 28177 20908 -19967
1714 -19967 -1341 -12771 -67935 -43097 -37384 -36638 -50118 5092 -32257 9275 -8262 948 -2823
1701b823K2647K655l4918J4449L9612m4794o2849M2732K6451K6075n0625M1854
1689B0466J3549n1252j9621K2729O3559m9109l495l504L27J7740l5331O691p352
1676b4603l0929K9456K8115L5382l5737N704j5610l3274J6062l4712N5300j2215
1664a7061j3312j0701N1609n4956k4391J2226M8783r685Q448N5101l1872o8315
1652e4126j9864J9937Q714j3569k5974O6954L4799k2697k9229L1354J0974l0331
1640b3058q61R222L3589L3790m4878m23m0980J8189j3445Q145L5579K620K4272
1627D1761l4462l5054M150J8562k5453o4650J1037J07727m029k6038k0260L3421
1615F712j765m1929J4586o469l101Q176l2967R0483k9254l832L6638k2321j0898
$$ plain form
1701 -2823 19824 22479 -12439 2010 41622 -3172 -66021 -23289 3162 29237 -21388 20466
1689 20466 34015 -17237 -36858 -14129 49430 321 -3174 -6678 -6351 11389 -23942 -17251 -24603
1676 -24603 -55532 -26076 2039 37421 1684 7388 -8222 -41496 -25434 -60146 -4846 -17061
1664 -17061 -30373 -41074 10535 -44421 -68812 -56586 -7803 -17488 -9040 46061 14189 -54126
1652 -54126 -73990 -54053 -45339 -58908 -84882 -17928 16871 -5826 -35055 -3701 7273 -23058
1640 -23058 -23919 -14697 18892 52682 7804 7381 -33599 -15410 -28855 -20710 14869 17489 41761
1627 41761 7299 -27755 -23605 -5043 -30496 -95146 -84109 23618 19589 -6449 -26709 6712
1615 6712 4947 -36982 -22396 -28865 -31966 -23790 -56757 33726 4472 640 37278 14957 4059
1602D059o2087K0099J6252K1627J7234l6303k5638L1777M686j3323o0286n352
1590h7255R459N1415L272J0160Q0543n3713J2707L3397m7870p24N0605n8909r2098
1577h9011J7177J524M4445l3808L5708R72j2911o872M3102J1897m7141k1897N599
1564e1216L9124p4548P511N9483l763k4888J4161L4208L4655n2015J5522l198
1552d964J5792n1014k5450K3643l1890k7144N1454L9691L3330J6832K340m1440
1540A180m9923j6787L0321J8556L6466L057k9109l3557O8855K5949j0087r530
1528C5391j8984j9513p337M8319j1852m2389l6775L0120K6725J5820O8379r3233
1516e329K3190N9565m4781j7246o905K3984J5791J8005j8910M0070m5048q6263
$$ plain form
1602 4059 -58028 -37929 -21677 -50 17184 -19119 -44757 -12980 -8294 -21617 -81903 -87255
1590 -87255 -77796 -26381 -23109 -12949 67594 13881 26588 59985 12115 11391 61996 3087 -89011
1577 -89011 -71834 -70310 -25865 -59673 -23965 -22993 -35904 -42776 326 12223 -34918 -56815 -51216
1564 -51216 -12092 -86640 -79129 -19646 -23409 -48297 -34136 72 34727 -17288 -1766 -4964
1552 -4964 10828 -40186 -65636 -41993 -73883 -101027 -49573 -9882 23448 40280 42620 1180
1540 1180 -48743 -65530 -35209 -16653 19813 22870 -6239 -39796 29059 55008 44921 35391
1528 35391 16407 -3106 -10443 37876 26024 -16365 -53140 -23020 3705 19525 87904 -5329
1516 -5329 17861 77426 32645 15399 8494 32478 48269 66274 47364 87434 42386 -43877
1504d3877N1180L722r391K2306l8117j9717K5118J598q2532L2662J2861K6634
1492a7553o38J0962l1280L1631j2245J412J3241M5707k3566J2431o4033n668J4417
1479b5182p836L396K7724K1572j7229N2154L8522n4996l6248k4866L802k8445
1467d7632O694J2900k6722k5071j1384L8156K9510k7995L2535J7105o3226K0257
1455d4873N645P753K2949J2592J914k5448N5228m2864k2241L6592l9080Q447n41
1442b3927J6871l9073L3883k7875p246l9485J9272K4545n099J7232L5614P961
1430A2673M0419J2929k5110j479K4740o1653l6555K0264k4406j8389M8921l6334
1418d3980J8902K994j7410k9190j2790M2092m592K1202k1779q394k8352O4985
$$ plain form
1504 -43877 7303 11025 1634 23940 -14177 -33894 -8776 -7178 -89710 -57048 -44187 -17553
1492 -17553 -18191 -7229 -38509 -6878 -19123 -17711 -4470 41237 17671 30102 -33931 -39599 -25182
1479 -25182 -33018 -29622 -1898 19674 2445 54599 93121 38125 1877 -22989 -19187 -47632
1467 -47632 -40938 -28038 -54760 -79831 -91215 -53059 -23549 -51544 -19009 -1904 -65130 -44873
1455 -44873 -39228 -31475 -8526 4066 5980 -19468 35760 -7104 -29345 7247 -31833 -23386 -23927
1442 -23927 -7056 -46129 -12246 -40121 -47367 -86852 -67580 -43035 -48134 -30902 4712 12673
1430 12673 53092 66021 40911 39432 64172 2519 -34036 -13772 -38178 -56567 -7646 -43980
1418 -43980 -25078 -22084 -39494 -68684 -81474 -39382 -43974 -22772 -44551 -52945 -81297 -16312
1406a6312J6269j6089q117m872L0786K1052J4703o6087k1570j7Q247P9959o8272
1393c0320l3910N9554M9233p569p5993j6552K2306P4986j03201N7993m2953l9721
1381h6147J4951L7798M6830l0763L7744j8533l2470k8083J9636l8154M4190K1103
1369a1898J9888n606k8657J0478k9989m82j6749R942N3038N9895l822l5953l888
1356A6197l9084K5596k7860k4057L4351J5560p982j2346l752L0456l7288m8653
1344g8862P1743m9958k463Q1373o6363j8034M3386L1561M290J4053J0339q4057
1332d2992K5625J2549m0582l0144N2299M2195p218J1313k6093n8601L2778L2338
1320C467O028K8525k4288n082l3914L0579j8434J4272K4881j0231L219j5413l8082
$$ plain form
1406 -16312 -43 -16132 -24249 -29121 1665 22717 37420 -28667 -50237 -50254 -42007 37952 -30320
1393 -30320 -64230 -4676 44557 36988 -39005 -55557 -33251 41735 -61466 -3473 -46426 -86147
1381 -86147 -71196 -33398 13432 -17331 20413 1880 -30590 -58673 -39037 -77191 -33001 -11898
1369 -11898 7990 2384 -26273 -15795 -45784 -46266 -63015 -53073 -35 59860 56038 20085 16197
1356 16197 -22887 2709 -25151 -49208 -14857 703 -7279 -19625 -23377 7079 -30209 -78862
1344 -78862 -7119 -57077 -59540 21833 -44530 -62564 -19178 12383 16673 30726 41065 -42992
1332 -42992 -17367 -4818 -45400 -75544 -23245 18950 11732 23045 -3048 -61649 -28871 3467
1320 3467 9495 38020 13732 8650 -25264 5315 -13119 1153 26034 15803 19022 3609 -34473
1307c4473j4312M368N0609j8642j3850J2972j5494j1985N5616N2840o0913m1873
1295c5137L0126k2777J4135l0361j6721Q0201m3614M5526m464k3025r423O659
1283h875J4604K7122J3118n5178Q541K0356r60q326K1883l2675j2865J898K6295
1270A4938k0691K0712m5023R98q200m1375j0460P6519J3283K1805k7731j3089
1258a8314J3111K3740l9839k9298L5765q920P0169j0068p2203J3977O9191j5046
1246C2265k2433l2547J245M2986k2394m8864K6694m5445J9393P2711N1460j11766
1234c6695k0379K6183P498k8904L2893M220M5822N791l1085K0238m9709J2803
1222a1324k845k0688M8079l06n0208M35j8525r730J6789N2898l234k6761n3637
$$ plain form
1307 -34473 -48785 -44417 6192 -12450 -26300 -13328 -28822 -40807 14809 67649 6736 -35137
1295 -35137 -5011 -27788 -13653 -44014 -60735 19466 -24148 21378 16914 -6111 -15534 -8875
1283 -8875 5729 32851 45969 -9209 -668 19688 18728 10402 32285 -390 -13255 -11357 14938
1270 14938 -5753 14959 -30064 -29066 -37266 -78641 -89101 -12582 701 22506 -5225 -18314
1258 -18314 -5203 18537 -21302 -50600 -14835 -23755 46414 36346 -35857 -21880 47311 32265
1246 32265 9832 -22715 -21470 21516 -878 -49742 -23048 -68493 -49100 23611 75071 -36695
1234 -36695 -57074 -30891 -23393 -52297 -19404 -15184 30638 36429 5344 25582 -24127 -11324
1222 -11324 -14169 -34857 13222 12916 -37292 -36857 -55382 -65112 -48323 4575 1341 -25420 -79057
1209g9057M8223k1319j034K3115l1469k4831L9833M0726l6878P0148k430K025
1197B7052K0740m0273m1880j3925R1O3903N0818m7749k5411N5399m7135M4001
1185D5631m4846n6400L4833M2339j1706j7270M6991j3672m0369L9297j7635k4301
1173a7108M019K0782L3285k3319k0491r770j0314L7601k8340j0316M1352j2194
1161E187J0276o3136L8052N60N1871m2593l5679O624J2286L7580l9019J1333l3937
1148d0595o5045Q4714K9941p030N2331K37n592l0556m8062O145K9218J9981k108
1135B3579n7000K9140K0057l0712K5825n167K907K1862k1491n0887J5430J0569
1123a5888K1309n8372N888K7373K0317M8909j2066l7966m2225R619k2673O1037
$$ plain form
1209 -79057 -30834 -52153 -53187 -30072 -61541 -86372 -46539 -5813 -42691 27457 25027 27052
1197 27052 47792 7519 -34361 -48286 -48195 15708 66526 18777 -6634 48765 1630 45631
1185 45631 785 -55615 -20782 21557 9851 -7419 39572 25900 -14469 24828 7193 -17108
1173 -17108 -13089 7693 40978 17659 -2832 -12602 -22916 14685 -13655 -23971 17381 5187
1161 5187 15463 -47673 -9621 -9061 42810 217 -35462 -28838 -16552 21028 -17991 -6658 -40595
1148 -40595 -105640 -20926 9015 1985 54316 54553 48961 18405 -29657 -23512 5706 25687 23579
1135 23579 -33421 -4281 15776 -14936 10889 5722 8629 30491 9000 -41887 -26457 -15888
1123 -15888 5421 -52951 -47063 -19690 627 49536 37470 -496 -42721 -33102 -55775 5262
1111E262K1697l2879O22L0373r968n7160r2750J01513P6982k5959k84P930j9761
1098E618j3921L9745l3178j8876k5050L2924L9931j5051l174P932j5084J3046
1086A4862j1410K1365j0883r5924M3175L1130P851j6133l939L5669j6653K0485
1074A9595j1969j3494p0M252j4269p896J4784p476K899o474l6587L2237J8512
1061e956L4841n4638j3148M9414O595k0128j0219K6129l2244j4378m6794P6762
1049c764j7453j6929j4880J6641J5876K861O6023l7431R889r6835J6397J0673
1037d8932N7718k8096j4385J8186P604K5289p57J2765j5087K509j2837l1300J7101
1024a0222o082q1105K2030O7950j129k1255M1131k4039j2659J2871K7889K2821
$$ plain form
1111 5262 26959 -5920 -5298 25075 15107 -42053 -134803 -33290 43692 17733 17449 25379 5618
1098 5618 -8303 31442 -1736 -20612 -45662 -12738 27193 12142 8968 16900 1816 14862
1086 14862 3452 24817 13934 -81990 -38815 -7685 166 -15967 -19906 15763 -890 19595
1074 19595 7626 -5868 -5938 -1686 -15955 -23851 -9067 -16543 -13644 -20118 -56705 -24468 -5956
1061 -5956 28885 -25753 -38901 10513 17108 -3020 -13239 12890 -19354 -33732 -80526 -3764
1049 -3764 -21217 -38146 -53026 -36385 -20509 -17648 48375 10944 20833 -76002 -59605 -48932
1037 -48932 8786 -19310 -33695 -15509 -7905 17384 16627 29392 14305 16814 3977 -27323 -10222
1024 -10222 -16304 -97409 -75379 -7429 -8558 -29813 11318 -12721 -25380 -12509 15380 38201
1012C8201m9959M4499k0713m9746M8093J1703j6733j9521L7727l1807L5298J168
1000B8210j5369r93m372k2126J0817r395k4982R613J2117K0112p73L8886k0589
987B1156k4502L0806l2777Q307N2927k6976p8166K0048P32J2842O376J0628L0110
974C1511l1127j5148N5899P95l0243k1981l5821O2647J2825k0681O723N667l3139
961a2073K3407L3648l9499l1846K4738k2970l6640J467L6998k4518J1151Q439
949b7698l2909M1686j1603P010O1960J4591K702M1063j09428K0172K8212m0033
937d275M3284J1931j3158j1720o9519K2566k913l6864l3467N772K3485L612j3708
924g4974M0546Q0927k3836K2887p8550K5516L7359j5051l1385J4404j573l7114
$$ plain form
1012 38201 -11758 32741 12028 -37718 10375 22078 5345 -14176 23551 -8256 27042 28210
1000 28210 12841 11848 7476 -14650 -3833 -13228 -38210 -28597 -16480 3632 2859 41745 21156
987 21156 -3346 27460 -5317 2990 55917 28941 -49225 -29177 -28445 -15603 -9227 1401 31511
974 31511 384 -14764 41135 41930 11687 -10294 -46115 16532 29357 8676 15399 21066 -12073
961 -12073 11334 44982 5483 -26363 -1625 -24595 -61235 -59768 -22770 -47288 -36137 -27698
949 -27698 -60607 -18921 -30524 -23514 38446 53037 55739 96802 -12626 7546 35758 -4275
937 -4275 39009 50940 37782 26062 -43457 -20891 -23804 -60668 -94135 -88363 -64878 -61266 -74974
924 -74974 -34428 46499 22663 45550 -33000 -7484 29875 14824 -16561 -2157 -3730 -40844
912d0844L7748k7374K1515k5159k6497J3143L1582P5051p3915l6290K5558K7792
900B310N1067J185K5506n2144k5813J77l8412l681M8977o3860L6909N357L1264
887A8842l3917n0089K8101k9749M4902j4162K3758j2710O702K2029L9126J0075
875E2908o7183k243L7875p6486J7725n472K5463M780k9655n6981k63N9800L6859
862b873J3954j4028j3817K9302p521L715K4049k7265L5906l4636n9192J5221n0369
849h7554J05979K2777J5266n027m1165n256k0774J1978L6298L4017n2700k2656
837h817R552K1749K992j2967j6005l43j173J6203m4463J6413M2461q7826K8586
824c3638R112J8608R960k9666j4419N3031K7320l3087j3311j0319k5892K2398
$$ plain form
912 -40844 -3096 -30470 -8955 -34114 -60611 -47468 -15886 59165 -14750 -51040 -25482 2310
900 2310 53377 54562 80068 27924 2111 2288 -36124 -39805 9172 -54688 -17779 -12422 18842
887 18842 -15075 -65164 -37063 -66812 -21910 -36072 -12314 -25024 -18322 3707 42833 52908
875 52908 -14275 -16518 21357 -55129 -37404 -42876 -17413 -12633 -42288 -99269 -99532 -39732 -2873
862 -2873 11081 -2947 -16764 12538 5017 8732 32781 5516 41422 6786 -52406 -37185 -87554
849 -87554 18425 41202 56468 51441 10276 5020 -15754 -3776 32522 66539 13839 -8817
837 -8817 735 22484 25476 12509 -3496 -3839 -5012 11191 -33272 -16859 25602 -62224 -33638
824 -33638 -24526 -5918 4042 -25624 -40043 12988 40308 7221 -6090 -16409 -42301 -19903
812a9903M1273m678j9033j0896L4784j3362q323Q815j8163P637J9311L6698M823
799E8983m6122L559J8405L3256m9803j6369j4525O2354l4292O0551M677O016o767
786G9923m1605n1739J1743j3208K8427J7811K2893l7257p4874K3311j3091J0202
774c7464L4700m9067J0330K9815j2556j0295q591J1717m2884M0930M0852J2301
762A9788k9042M740J2220N3635l8475J0860j3024p3617K5597k130L1895m023l807
749e383K4449R103M6159q9690l4762J7274r0002R7566N7879K9861n4802m5435
737c7783Q3030L663m0343L5282N31p8792J5933j4825K5292l0089Q864J9570M3078
724C3411l100l8446L0195q967l9246L4851O9339j9763J9381l2619q677k3508K8914
$$ plain form
812 -19903 21370 16692 -2341 -13237 21547 8185 -138 8677 -9486 -1849 17462 54160 58983
799 58983 12861 16420 34825 68081 18278 1909 -12616 49738 15446 75997 80674 86690 79923
786 79923 38318 -13421 -1678 -14886 13541 31352 54245 16988 -57886 -34575 -47666 -37464
774 -37464 -2764 -51831 -41501 -11686 -24242 -34537 -43128 -31411 -74295 -33365 7487 19788
762 19788 -9254 -4514 7706 61341 22866 33726 20702 -52915 -27318 -29448 2447 -1576 -5383
749 -5383 19066 28169 74328 -15362 -50124 -32850 -122852 -25286 32593 62454 7652 -37783
737 -37783 45247 48910 8567 43849 44380 -34412 -18479 -33304 -8012 -38101 -29237 -9667 33411
724 33411 30311 -8135 22060 13093 -26153 8698 78037 58274 77655 45036 36359 12851 41765
711D1765k9911N979l1659R903K6143J8936J5121m7180J264o9897J6708P270M7078
698A1520O5837n6620q6921L5384K6916p372j8625P1075k5567K5052m0317M0990
686D1352j3729k9542O6518O657o085q2223n0321K5694M2548K5891l997q167j8342
673c746N074K1407L4835j7132j1905L4772l0364j3965k6114j1236J092M2082n3708
660b8908j2486m889O189J9474Q045M6032j0836k0586k071m4787M3047J5957n4330
647d0149Q53O884K3022N775j3096n5451J2629J0652K7670K526q381M0675M3110
634E6719k2234K6058l3956m704J9575K9418o3796J805J0018k862K5783l0235l8910
621b7321N3312N5146q0838l5675j2297O399J0352N3094m9470O5641k7417l1466
$$ plain form
711 41765 11854 17833 -13826 -3923 22220 41156 56277 9097 10361 -59536 -42828 -35558 11520
698 11520 77357 20737 -66184 -30800 -3884 -11256 -29881 41194 15627 40679 362 41352
686 41352 27623 -1919 64599 71256 65171 -17052 -67373 -41679 869 26760 22763 14596 -3746
673 -3746 1328 22735 57570 40438 28533 63305 32941 18976 -7138 -18374 -17282 24800 -28908
660 -28908 -41394 -46283 -40094 -20620 -12575 33457 22621 2035 -36 -44823 -1776 14181 -40149
647 -40149 -39296 -32412 -9390 -3615 -16711 -72162 -59533 -48881 -21211 -18685 -27066 13609 56719
634 56719 34485 60543 26587 21883 41458 70876 7080 8885 18903 16041 41824 11589 -27321
621 -27321 25991 81137 299 -35376 -47673 -41274 -30922 22172 -27298 38343 10926 -20540
609b0540k135J1229L569L1420L7258m9404M1689M9540l2674n1757k9026j3434
597b4265L8359k58l8494M6679k4318K252R109o267J2789J5617J2452J2631K3561
584G9847N9004n0118m3339l0361r176J5923j1627K700N796J189q2495J8573P4520
571C0436K1274j3115R617m2456q676J3537k6354L2413J3961r743M2518J6371j7335
558F2448J2404o7376L1635J5182m9271o067k9284n267j5324Q1897k0175m437r436
545c071K2873N8771m6600n799j0110k5673j5669m969K6247M9770l1680m7602N2985
532A9473k0060m6957R2740m0153m2587o3107O5486M1735k9840O115L1560J5624
520C0029P326l6121n6521O2601k0465k4315k9062M9438M6502J8324j3690j4999
$$ plain form
609 -20540 -22675 -11446 -7877 23543 60801 11397 53086 102626 69952 18195 -10831 -24265
597 -24265 14094 13836 -24658 22021 -2297 -45 9064 2797 15586 31203 43655 56286 79847
584 79847 138851 88733 45394 15033 5857 21780 10153 12853 18649 19838 -62657 -44084 30436
571 30436 51710 38595 48212 5756 -2920 10617 -15737 16676 30637 20894 63412 79783 62448
558 62448 74852 7476 39111 54293 5022 -1045 -30329 -35596 -50920 30977 10802 6365 -3071
545 -3071 19802 78573 31973 26174 16064 -9609 -25278 -30247 -4000 45770 14090 -33512 19473
532 19473 -587 -47544 45196 5043 -37544 -100651 -35165 6570 -23270 -17155 14405 30029
520 30029 37355 1234 -55287 7314 -13151 -37466 -66528 -17090 29412 47736 34046 19047
508A9047k0873m4455K1128R0635l3652j1309k0908m3928J4584J849M9996K9584
496E1698r144m228m9012K1405K3623r890k783Q67J3205m2968k3005M6113Q02K8525
482D5208j269l0962J206j1561m140k9030k330M3360k501L2919K1999N972r153
469E9718l7568r868j3329J723j1535K8348j0454J0594j4148P439j2178o7778J11214
456D2178l2615k2687M856p0595M2280K8713l8924R705L7047P992M3248n2777l2753
443c4332J9905L8627R222k9404k6259L1125l1573M1794K3743m306n5694j4491
431c1643N6382l838k675L1729k4291L5193n1586M386O3654p3131L202M2114J7375
$$ plain form
508 19047 -1826 -46281 -25153 65482 31830 20521 -387 -44315 -29731 -27882 22114 51698
496 51698 42554 38326 -10686 10719 34342 24452 21669 22536 35741 -7227 -30232 15881 16683 45208
482 45208 43939 12977 14183 2622 -1518 -30548 -32878 10482 7981 40900 62899 68871 59718
469 59718 22150 12282 -1047 676 -10859 17489 7035 17629 3481 10920 -1258 -69036 42178
456 42178 9563 -13124 -8268 -78863 -36583 -7870 -46794 -37089 -42 7950 51198 -1579 -34332
443 -34332 -14427 24200 33422 4018 -22241 8884 -22689 19105 42848 38542 -17152 -31643
431 -31643 24739 20901 18226 49955 25664 60857 9271 13657 77311 4180 7382 49496 66871
$$ [...]
##END NTUPLES=NMR SPECTRUM
##END=
