##TITLE=1H_EC-3257(1)
 CDCl3, 8 sc, 
 27.07.2021
##JCAMPDX= 6.0         $$ Bruker NMR JCAMP-DX V2.0
##DATA TYPE= NMR SPECTRUM
##DATA CLASS= NTUPLES
##ORIGIN= UXNMR, Bruker Analytische Messtechnik GmbH
##OWNER= root
$$ XWIN-NMR		Version 3.5
$$ Tue Jul 27 09:24:54 2021 Russian Standard Time (UT+4h)  she@DPX200
##.OBSERVE FREQUENCY= 200.131506
##.OBSERVE NUCLEUS= ^1H
##.ACQUISITION MODE= SIMULTANEOUS
##.ACQUISITION SCHEME= undefined
##.AVERAGES= 8
##.DIGITISER RES= 18
##SPECTROMETER/DATA SYSTEM= spect
##.PULSE SEQUENCE= zg30
##.SOLVENT NAME= CDCl3
##.SHIFT REFERENCE= (INTERNAL, CDCl3, 0, 17.4995)
##AUDIT TRAIL= $$ (NUMBER, WHEN, WHO, WHERE, WHAT)
$$ ##TITLE= Audit trail, XWIN-NMR		Version 3.5
$$ ##JCAMPDX= 5.01
$$ ##ORIGIN= Bruker BioSpin GmbH
$$ ##OWNER= she
$$ F:/spectra/data/she/nmr/H-F/1/pdata/1/auditp.txt
$$ ##AUDIT TRAIL=  $$ (NUMBER, WHEN, WHO, WHERE, WHAT)
(   1,<2021-07-27 09:23:35.45 +0400>,<she>,<DPX200>,
      <created by zg, POWCHK disabled, PULCHK disabled
       configuration hash MD5:
       00 E9 B6 7A A2 85 ED C7 34 08 36 98 17 FE 4E 26
       data hash MD5: 16K
       0A EB 94 71 6F 5E F6 84 CC 93 C8 84 FD B0 AD 24>)
(   2,<2021-07-27 09:23:39.71 +0400>,<she>,<DPX200>,
      <Start of raw data processing
       efp BC_mod = 2 LB = 0.24 FT_mod = 6 PKNL = 1 PHC0 = -12635.68 PHC1 = 14.80099 SI = 16K 
       data hash MD5: 16K
       84 08 8E D9 79 2B 79 7E 20 1F 90 89 41 04 C3 06>)
(   3,<2021-07-27 09:24:03.92 +0400>,<she>,<DPX200>,
      <pk PHC0 = 2.123212 PHC1 = -5.199999 
       data hash MD5: 16K
       01 FC BF 23 34 00 24 23 E2 58 BE 38 D4 30 54 55>)
(   4,<2021-07-27 09:24:07.14 +0400>,<she>,<DPX200>,
      <abs ABSG = 5 
       data hash MD5: 16K
       70 B3 29 B1 C3 BC 2D 91 AD B8 25 B1 1E A6 67 3B>)
$$ ##END=
$$ 
$$ hash MD5
$$ 07 85 90 E9 F9 0B A1 E3 02 12 87 E3 89 56 E7 EE
##$RELAX= 
##$RELAX= 
##$RELAX= 
##$RELAX= 
##$RELAX= 
##$RELAX= 
$$ Bruker specific parameters
$$ --------------------------
##$DU= <F:/spectra>
##$EXPNO= 1
##$NAME= <H-F>
##$PROCNO= 1
##$TYPE= <nmr>
##$USER= <she>
##$AMP= (0..31)
100 100 100 100 100 100 100 100 100 100 100 100 100 100 100 100 100 100 
100 100 100 100 100 100 100 100 100 100 100 100 100 100 
##$AQSEQ= 0
##$AQ_mod= 1
##$AUNM= <au_zg>
##$AUTOPOS= <>
##$BF1= 200.13
##$BF2= 200.13
##$BF3= 200.13
##$BF4= 200.13
##$BF5= 200.13
##$BF6= 200.13
##$BF7= 200.13
##$BF8= 200.13
##$BYTORDA= 1
##$CFDGTYP= 0
##$CFRGTYP= 5
##$CHEMSTR= <none>
##$CNST= (0..31)
1 1 145 1 1 1 1 1 1 1 1 1 1 1 1 1 1 1 1 1 1 1 1 1 1 1 1 1 1 1 1 1 
##$CPDPRG= <>
##$CPDPRG1= <>
##$CPDPRG2= <>
##$CPDPRG3= <>
##$CPDPRG4= <mlev>
##$CPDPRG5= <mlev>
##$CPDPRG6= <mlev>
##$CPDPRG7= <mlev>
##$CPDPRG8= <mlev>
##$CPDPRGB= <>
##$CPDPRGT= <>
##$D= (0..31)
0 1.2 0 0 0 0 0 0 0 0.06 0 0.03 0 0 0 0 0.0002 0 0 0 0 0 0 0 0 0 0 0 0 
0 0 0 
##$DATE= 1627363414
##$DBL= (0..7)
120 120 120 120 120 120 120 120 
##$DBP= (0..7)
150 150 150 150 150 150 150 150 
##$DBP07= 0
##$DBPNAM0= <>
##$DBPNAM1= <>
##$DBPNAM2= <>
##$DBPNAM3= <>
##$DBPNAM4= <>
$$ [...]
##$SUBNAM3= <"">
##$SUBNAM4= <"">
##$SUBNAM5= <"">
##$SUBNAM6= <"">
##$SUBNAM7= <"">
##$SUBNAM8= <"">
##$SUBNAM9= <"">
##$SW= 20.0188882624521
##$SWIBOX= (0..15)
0 0 2 0 0 0 0 0 0 0 0 0 0 0 0 0 
##$SW_h= 4006.41025641026
##$TD= 16384
##$TD0= 1
##$TE= 0
##$TE2= 300
##$TE3= 300
##$TEG= 300
##$TL= (0..7)
0 120 120 120 120 120 120 120 
##$TP= (0..7)
150 150 150 150 150 150 150 150 
##$TP07= 0
##$TPNAME0= <>
##$TPNAME1= <>
##$TPNAME2= <>
##$TPNAME3= <>
##$TPNAME4= <>
##$TPNAME5= <>
##$TPNAME6= <>
##$TPNAME7= <>
##$TPOAL= (0..7)
0.5 0.5 0.5 0.5 0.5 0.5 0.5 0.5 
##$TPOFFS= (0..7)
0 0 0 0 0 0 0 0 
##$TUNHIN= 0
##$TUNHOUT= 0
##$TUNXOUT= 0
##$USERA1= <user>
##$USERA2= <user>
##$USERA3= <user>
##$USERA4= <user>
##$USERA5= <user>
##$V9= 5
##$VALIST= <valist>
##$VCLIST= <CCCCCCCCCCCCCCC>
##$VD= 0
##$VDLIST= <DDDDDDDDDDDDDDD>
##$VPLIST= <PPPPPPPPPPPPPPP>
##$VTLIST= <TTTTTTTTTTTTTTT>
##$WBST= 1024
##$WBSW= 4
##$XGAIN= (0..3)
0 0 0 0 
##$XL= 0
##$YL= 0
##$YMAX_a= 337561
##$YMIN_a= -447811
##$ZGOPTNS= <>
##$ZL1= 120
##$ZL2= 120
##$ZL3= 120
##$ZL4= 120
##$ABSF1= 17.51177
##$ABSF2= -2.507269
##$ABSG= 5
##$ABSL= 3
##$ALPHA= 0
##$AQORDER= 0
##$ASSFAC= 0
##$ASSFACI= 0
##$ASSFACX= 0
##$ASSWID= 0
##$AUNMP= <proc_1d>
##$AZFE= 0.1
##$AZFW= 0.1
##$BCFW= 0
##$BC_mod= 2
##$BYTORDP= 0
##$COROFFS= 0
##$CY= -3
##$DATMOD= 1
##$DC= 0
##$DFILT= <>
##$DTYPP= 0
##$F1P= 0
##$F2P= 0
##$FCOR= 1
##$FTSIZE= 16384
##$FT_mod= 6
##$GAMMA= 0
##$GB= 0
##$INTBC= 1
##$INTSCL= 1.334414e-10
##$ISEN= 128
##$LB= 0.24
##$LEV0= 0
##$LPBIN= 0
##$MAXI= 10000
##$MC2= 0
##$MEAN= 0
##$ME_mod= 0
##$MI= 1.114404
##$NCOEF= 0
##$NC_proc= -6
##$NLEV= 6
##$NOISF1= 3.799351
##$NOISF2= 2.8
##$NSP= 0
##$NTH_PI= 0
##$NZP= 0
##$OFFSET= 17.49955
##$PC= 1
##$PHC0= -12633.56
##$PHC1= 9.600991
##$PH_mod= 1
##$PKNL= yes
##$PPARMOD= 0
##$PSCAL= 0
##$PSIGN= 0
##$REVERSE= no
##$SF= 200.130007020243
##$SI= 16384
##$SIGF1= 3
##$SIGF2= 2
##$SINO= 5.538805
##$SIOLD= 16384
##$SREGLST= <1H.CDCl3>
##$SSB= 0
##$STSI= 16384
##$STSR= 0
##$SW_p= 4006.41025641026
##$SYMM= 0
##$S_DEV= 0
##$TDeff= 16384
##$TDoff= 0
##$TI= <>
##$TILT= no
##$TM1= 0
##$TM2= 0
##$TOPLEV= 0
##$USERP1= <user>
##$USERP2= <user>
##$USERP3= <user>
##$USERP4= <user>
##$USERP5= <user>
##$WDW= 1
##$XDIM= 16384
##$YMAX_p= 466004881
##$YMIN_p= -280470
$$ End of Bruker specific parameters
$$ ---------------------------------
##NTUPLES= NMR SPECTRUM
##VAR_NAME=  FREQUENCY,     SPECTRUM/REAL,   SPECTRUM/IMAG
##SYMBOL=    X,             R,               I
##VAR_TYPE=  INDEPENDENT,   DEPENDENT,       DEPENDENT
##VAR_FORM=  AFFN,          ASDF,            ASDF
##VAR_DIM=   16384,         16384,           16384
##UNITS=     HZ,            ARBITRARY UNITS, ARBITRARY UNITS
##FACTOR=    0.24454680195387, 1,            1
##FIRST=     3502.18503747817, 0,            0
##LAST=      -504.225218932093, 0,           0
##MIN=       -504.225218932093, -280470,     0
##MAX=       3502.18503747817, 466004881,    0
$$ Real data points
##PAGE= N=1
##DATA TABLE= (X++(R..R)), XYDATA
$$ [...]
6895B3954R5124R1894j8464n192j4923l0788j9021J17373O1765m3989l0983j09
$$ 23954 119078 210972 192508 187316 172393 141605 122584 239957 301722 257733 226750 226641
6883B26641j686q7373l1456j4205k2684J9615K5913M4751r5367L904R8787r3898
$$ 226641 224955 137582 106126 91921 69237 88852 114765 159516 64149 68053 166840 72942
6871G2942o5271P0926r5629j31416J02269J23808J36408n7894o0628R0342l7620
$$ 72942 7671 78597 -17032 -148448 -46179 77629 214037 156143 95515 185857 148237
6860A48237j66267J7942L7371q4347O0145j5698p427K8746l6527L552p5353m2800
$$ 148237 -18030 -88 37283 -47064 13081 -2617 -10044 18702 -17825 -14273 -89626 -132426
6848a32426J92559L6665j15702L8750j5361P5799M8997j9918O946L7900J1367
$$ -132426 60133 96798 -18904 19846 4485 80284 129281 109363 116309 154209 165576
6837A65576r2177N701o4911L3439j8153j0204k0874j08603J4271J47308n8317
$$ 165576 73399 79100 14189 47628 29475 19271 -1603 -110206 -95935 51373 -6944
6826f944j7433m1625O5418j0186R708j4495r1008M5865N3768m1240k4955L8823
$$ -6944 -24377 -66002 -584 -10770 -1062 -15557 -106565 -60700 -6932 -48172 -73127 -34304
6814c4304q2714j4734l6645J90789O2551m9912O8741K4088j0208q1311L7126n0814
$$ -34304 -117018 -131752 -168397 22392 84943 35031 103772 127860 117652 36341 73467 22653
6802B2653r1941J05690j10682M0204J02768m1710L045k5545o8811R164M1108j00103
$$ 22653 -69288 36402 -74280 -34076 68692 26982 30027 4482 -64329 -55165 -14057 -114160
6790a14160P3625J17451n6437j4592l5430P7975K1679j07273j3344p8822J34280
$$ -114160 -40535 76916 20479 5887 -29543 48432 70111 -37162 -50506 -129328 4952
6779D952j7929J253m706p3341O5076k023m354o7494J19554J22874q1854j12600
$$ 4952 -12977 -11724 -16430 -89771 -24695 -26718 -31072 -98566 20988 143862 62008 -50592
6767e0592K1215J05171r8993P4179J8745p8630J677n0301M408Q694K2927o561
$$ -50592 -29377 75794 -23199 50980 69725 -8905 -7228 -57529 -53121 -44427 -21500 -28061
6755b8061L5307j982N5022j12964j5333J18493n3897m373P7913n2676Q1943l7619
$$ -28061 7246 5264 60286 -52678 -68011 50482 -3415 -7788 70125 17449 99392 61773
6743F1773P446L6205o2956m0435J1556M696p3832l602J13043l246k9074J2226
$$ 61773 69219 105424 42468 2033 13589 18285 -55547 -59149 53894 50648 21574 33800
6731C3800R1510n2640l898m6011k4693l0456N9078O392l378l2363L9626j14163
$$ 33800 125310 72670 68772 22761 -1932 -32388 26690 33082 29704 -2659 36967 -77196
6719g7196R9540r42J9555o4128K0217J17960k2049m2332j84248J09306K3869M0820
$$ -77196 22344 21402 40957 -23171 -2954 115006 92957 50625 -133623 -24317 -448 40372
6707D0372o1747j1128j6578J34654L0202k5355M268K6757J3227L3428l9535J1500
$$ 40372 -21375 -32503 -49081 85573 115775 90420 94688 121445 134672 168100 128565 140065
6695A40065p2275P0363J1079K6900L9961j1291J4154k0822K9138r060P567P5954
$$ 140065 67790 138153 149232 176132 216093 204802 218956 198134 227272 218212 225779 301733
6683C01733op1483q6756N2173P481j7676k1613N0797q5146r0054j0924J83809
$$ 301733 301727 230244 143488 195661 203142 185466 163853 214650 129504 39450 28526 212335
6671B12335j08832l6253M0244J4747K6759N167l2251J7743m1119K3238M1760J11720
$$ 212335 103503 67250 107494 122241 149000 154167 121916 139659 98540 121778 163538 275258
6659B75258K6976n6613J1595J5117P8668J7726l3991q6605O3013R4532o0434J2808
$$ 275258 302234 245621 257216 272333 351001 368727 334736 248131 311144 405676 345242 358050
6647C58050L3378r7077L110J55631o9593j19801O8114P7804J6251K8453k9505
$$ 358050 391428 294351 297461 453092 383499 263698 331812 409616 425867 454320 424815
6636D24815N6251J03982j19167J7470K7588O419l4152M8029k7384k1080o5395
$$ 424815 481066 585048 465881 483351 510939 517358 483206 531235 503851 482771 417376
6625D17376J18400p7923M2142M7499L6566L113l0981O5130m8386o4162J12660
$$ 417376 535776 457853 499995 547494 584060 587173 556192 621322 572936 508774 621434
6614F21434J4076K6977j07682O9630P5076j12707N8474R9652K4359R6461K6246
$$ 621434 635510 662487 554805 624435 699511 586804 645278 744930 769289 865750 891996
6603H91996J29823J0835L2839l6760l4915K11300n606K9539L7437R6060n9280
$$ 891996 1021819 1032654 1065493 1028733 993818 1205118 1199512 1229051 1266488 1362548 1303268
6592A303268n7526Q7177Q1263o9188N0983N6950J05463R5451j550P65J12878L0862
$$ 1303268 1245742 1332919 1414182 1344994 1395977 1452927 1558390 1653841 1652291 1653056 1765934 1796796
6580A796796L101Q3679O2028N0901Q7261L8358L2882J07703J21943J77253l4702
$$ 1796796 1799897 1883576 1945604 1996505 2083766 2122124 2155006 2262709 2384652 2561905 2527203
6569B527203J68736L097J67186n8584J32246J65935K10431R6499M4936R9801J01144
$$ 2527203 2695939 2699036 2866222 2807638 2939884 3105819 3316250 3412749 3457685 3557486 3658630
6558C658630J84459J47872Q1342J67811L10781J51222K59353L58159M36760L93762
$$ 3658630 3843089 3990961 4072303 4240114 4550895 4702117 4961470 5319629 5756389 6150151
6548F150151M75304N09858O20116O47567Q86700R22390J028561J249161J592501
$$ 6150151 6625455 7135313 7755429 8402996 9289696 10212086 11240647 12489808 14082309
6539A4082309J756843K142373K435647K816094K975139L005132L039922L149299
$$ 14082309 15839152 17981525 20417172 23233266 26208405 29213537 32253459 35402758
6531C5402758L554255M022995M018264K876060L18211k729509n204913o336411
$$ 35402758 38957013 42980008 46998272 49874332 50192543 47463034 42258121 35921710
6523C5921710n907549m874102l755763k646719j940649j525953j315113r48126
$$ 35921710 30014161 25140059 21384296 18737577 16796928 15270975 13955862 13007736
6515A3007736r34300o66858o68072n99845o14485n84849n54522o15286m82058
$$ 13007736 12073436 11406578 10738506 10138661 9524176 8939327 8384805 7769519 7287461
6506G287461l94506k34993l04781j27217k71876j40699p8822j49663o9476Q0926
$$ 7287461 6892955 6657962 6353181 6225964 5954088 5813389 5734567 5584904 5515428 5596354
6496E596354j06765j0826j2458J24696K58638J11706K79578K00134M40638M43494
$$ 5596354 5489589 5478763 5466305 5591001 5849639 5961345 6240923 6441057 6881695 7325189
6486G325189P68202N94508N09054M2829m27429p69302r75587q59240r02199m97169
$$ 7325189 8093391 8687899 9196953 9239782 8812353 8043051 7067464 6208224 5306025 4808856
6476D808856l11126l86761l65862j83743m7589k00229j05655r4275j38852k05498
$$ 4808856 4497730 4110969 3745107 3561364 3513775 3313546 3207891 3113616 2974764 2769266
6466B769266o1267J63810N4694L5271J8315p415m2792K06785J02598J91322K89026
$$ 2769266 2707999 2871809 2926503 2961774 2980089 2972674 2929882 3136667 3239265 3430587 3719613
6455C719613L17553N4983L2052o2451k10051l22021l73752j81613k14216j10832
$$ 3719613 4037166 4092149 4124201 4061750 3851699 3529678 3155926 2974313 2760097 2649265
6445B649265j22435k03146o3141j4644R6425n5614o9266k1236O0637N1574k320
$$ 2649265 2526830 2323684 2260543 2245899 2342324 2286710 2217444 2196208 2256845 2308419 2306099
6434B306099Q2494K9492N3274q5846p7911k4335j4020J07369j01968q8185J08339
$$ 2306099 2388593 2418085 2471359 2385513 2307602 2283267 2269247 2376616 2274648 2186463 2294802
6423B294802O0630J24024n1149P3447J75892J55852K3855l6534l1677J439R710
$$ 2294802 2355432 2479456 2428307 2501754 2677646 2833498 2857353 2820819 2789142 2790581 2800291
6412B800291o8712o2328l23369q6784k13346j55964j70068j80552l1673m2768
$$ 2800291 2731579 2669251 2345882 2259098 2045752 1889788 1719720 1539168 1507495 1464727
6402A464727j30614j20283q7120n588N5136L9007o9234q1025k7927q3886j09594
$$ 1464727 1334113 1213830 1126710 1121122 1176258 1215265 1146031 1065006 1037079 953193 843599
6391H43599q3187K4955R722o5837R8526N97p3771k6453K4339J7709j0110Q4781
$$ 843599 760412 785367 795089 729252 827778 828375 754604 728151 752490 770199 760089 844870
6379H44870p6711q5310r2140K7042N8584r0243J26462l249n6809K4349o2220p7006
$$ 844870 768159 682849 590709 617751 676335 586092 712554 709305 652496 676845 614625 537619
6367E37619N3029J6974o4529l1007J12164N5865p6797J5834J9057l4427O1482
$$ 537619 590648 607622 543093 512086 624250 680115 603318 619152 638209 603782 665264
6356F65264O9628o865J4197l9560J5706k6919Q1368J7277O160J0474L492K2235
$$ 665264 734892 728027 742224 702664 718370 691451 772819 790096 796256 806730 810222 832457
6344H32457J10788N9080J302N9369J33657O6748Q5843K7075P4405J96096M9240
$$ 832457 943245 1002325 1003627 1062996 1196653 1263401 1349244 1376319 1450724 1646820 1696060
6333A696060J06477J59653P6404J93879K41844K32966K14880L33357K91471K32001
$$ 1696060 1802537 1962190 2038594 2232473 2474317 2707283 2922163 3255520 3546991 3778992
6323C778992K79321R4556l9044j2356j47174j91328k89775k74755l04325l12245
$$ 3778992 4058313 4152869 4113825 4101469 3954295 3762967 3473192 3198437 2894112 2581867
6313B581867k83319k06076k99036q3510j06152n3118j94637j46827M5508p988
$$ 2581867 2298548 2092472 1793436 1709926 1603774 1550656 1356019 1209192 1254700 1246712
6303A246712j35238r2410n364j54479m33r4885j7989k4500K1094n6147o2885N2734
$$ 1246712 1111474 1019064 1013700 859221 858788 763903 745914 721414 742508 686361 623476 676210
6291F76210n4657r4744k2031q047l547R793K5475O359m5444J8116r3308p2227
$$ 676210 621553 526809 504778 496731 493184 502977 528452 534811 489367 507483 414175 341948
6279C41948J00843J16048q7712L8346J320j73346k5371k7059P6072k827K3595
$$ 341948 442791 558839 471127 509473 510793 337447 312076 285017 361089 358262 381857
6268C81857j0051o87J32271J3345O2011r3542j02483m4346j06022N5401p625O7937
$$ 381857 371806 371119 503390 516735 578746 485204 382721 338375 232353 287754 280129 348066
6256C48066o9217J4483M9336j95206N2762P6081n2240n3403l9369K6396k4210
$$ 348066 278849 293332 342668 147462 200224 276305 224065 170662 131293 157689 133479
6245A33479P2601K9510O4996K699j8848l5600n7342j53370P8274J33605r3868
$$ 133479 206080 235590 300586 303285 284437 248837 191495 38125 116399 250004 156136
6234A56136L9496M3638r1072l132J4463k2551Q9001L1120j5117m2716j18940M983
$$ 156136 195632 239270 148198 145066 159529 136978 225979 257099 241982 199266 80326 85309
6222H5309K3143M1941J5515Q4437O5547j03718l1719O0313l8496j01227O9396
$$ 85309 108452 150393 165908 250345 315892 212174 180455 240768 202272 101045 170441
6211A70441J0257l4827L3764K1051q1385K9489O9837j54021J2727L0901R6408
$$ 170441 180698 145871 179635 200686 119301 148790 218627 64606 77333 108234 204642
6200B04642j62406K8665P9186M7823p1940k9493N0914P4167o3240q2495l1389
$$ 204642 42236 70901 150087 197910 125970 96477 147391 221558 158318 75823 44434
6189D4434J4679J33019J1770M6426o0591K9556Q3081p9552p4635N5366n0953J9516
$$ 44434 59113 192132 203902 250328 189737 219293 302374 222822 148187 203553 152600 172116
6177A72116K5557J12428j08318J2392j4589j4639J16936l427M0570m1507j7047
$$ 172116 197673 310101 201783 214175 199586 184947 301883 298456 339026 297519 280472
6166B80472J36343p5074J6698j6496o8196o4986K3003j09938J527k2922K7998
$$ 280472 416815 341741 358439 341943 273747 208761 231764 121826 123353 100431 128429
6155A28429K3498r5567L6861M5330N0564n2765j5318M6394q7808M7844q74Q5743
$$ 128429 151927 56360 93221 138551 189115 136350 121032 167426 79618 127462 126588 212331
6143B12331j39458N4693L9039p4020K0071L8142q2332o7814P1760k9173K1837
$$ 212331 72873 127566 166605 92585 112656 150798 68466 652 72412 43239 65076
6132F5076k9782P8002P7650n5274L1496O2389m7894m3677q0753k3293p229J12705
$$ 65076 35294 113296 190946 135672 167168 229557 181663 137986 57233 33940 26711 139416
6120A39416M1075N544j03832l5206N184J5149L9966K3766k6034n0838K9786Q6027
$$ 139416 180491 186035 82203 46997 52181 67330 107296 131062 105028 54190 83976 170003
6108A70003M1971j52640j03542J5259m0480J59790Q9691m1139p9954N1414k4051
$$ 170003 211974 59334 -44208 -28949 -69429 90361 180052 138913 58959 110373 86322
6097H6322q749p3771J01345n6058K0858K6787p3629j27452L0750P5737n1297J2835
$$ 86322 77573 3802 105147 49089 69947 96734 23105 -104347 -73597 2140 -49157 -36322
6085c6322K9818p8327O9719N4873R579l0965o1020R3255P6852j04941k2883L8696
$$ -36322 -6504 -84831 -15112 39761 49340 18375 -42645 50610 127462 22521 -362 38334
6073C8334K2980O6219L0299j47879J9620J01218m6216O2591l7955Q7077N9900
$$ 38334 61314 127533 157832 9953 29573 130791 84575 147166 109211 196288 256188
6062B56188j00267j13557k8548N0947j11914j27954J19815J54664l0418l4932
$$ 256188 155921 42364 13816 64763 -47151 -175105 -55290 99374 68956 34024
6052C4024L9823r3929R2074n7429k6229n1764L5866k7966n2999P3779P2438p0351
$$ 34024 73847 -20082 71992 14563 -11666 -63430 -27564 -55530 -108529 -34750 37688 -32663
6040c2663J8693J7232P5892R1277j18850j33564J05693K0209m8886L854P9488
$$ -32663 -13970 3262 79154 170431 51581 -81983 23710 43919 -4967 -1113 78375
6029G8375O1152j34239q787q164j01435k0220l2924J37098J8056N5741R0508m5712
$$ 78375 139527 5288 -3499 -11663 -113098 -133318 -166242 -29144 -11088 44653 135161 89449
6017H9449j96923M1302J05030L0334l5062j7033L1141J11532J2646p8936J6030
$$ 89449 -107474 -66172 38858 69192 34130 17097 48238 159770 172416 93480 109510
6006A09510r1424j07151M1986K8306O0722n6517l784N742K9088L54m5158j9458
$$ 109510 18086 -89065 -47079 -18773 41949 -14568 -18352 -12610 16478 16832 -28326 -47784
5994d7784J8562j4530k560P1414k0082J05o0441O0181j50911R1772n2714l7614
$$ -47784 -29222 -43752 -46312 25102 5020 5125 -55316 4865 -146046 -54274 -106988 -144602
5982a44602K6180L6769P5868M0481p2423J01519O3162M06m2059j11207O5032o9888
$$ -144602 -118422 -81653 -5785 34696 -37727 63792 126954 127360 85301 -25906 39126 -30762
5970c0762l0376J7449J1414M812K1994k8490l1227N2351P72L2874O4762K7574
$$ -30762 -61138 -43689 -32275 -27463 -5469 -33959 -65186 -12835 -12063 20811 85573 113147
5958A13147q276M8783k00763P7622p3545j2257K610k1515N9173Q4674P2787q1377
$$ 113147 104871 153654 -47109 30513 -43032 -55289 -52679 -74194 -15021 69653 142440 61063
5946F1063Q393j45990Q6683Q8434j07639K1021P5P3991j0815j16867r4008j233
$$ 61063 69456 -76534 10149 98583 -9056 11965 12040 86031 75216 -41651 -135659 -136892
5934a36892J98601l3359p3813m4728J187o8240J22397J5692J1479R4987J8404
$$ -136892 61709 28350 -45463 -90191 -89004 -157244 -34847 -19155 -7676 87311 105715
5923A05715j3263n9218M8440r2224J6132Q928O0118K7407j40967L4764J23936
$$ 105715 92452 33234 81674 -10550 5582 14510 74628 102035 -38932 -4168 119768
5912A19768q1447K484o4976J00131o8843l4663m5561P4891N4376p0183N0845J28696
$$ 119768 38321 40805 -24171 75960 7117 -27546 -73107 1784 56160 -14023 36822 165518
5900A65518j7974k8927K1702o5475J5362k9861J9058m5890O5946m1811K9824p2277
$$ 165518 147544 118617 140319 74844 90206 60345 79403 33513 99459 57648 87472 15195
5888A5195M4543o8236J816J79534k8019m0362j7694K674K7264j62841M8186J9871
$$ 15195 59738 -8498 -6682 172852 144833 104471 86777 89451 116715 -46126 2060 21931
5876B1931k3919J1646M0132l0992L7227j46092k3281N9729p9854N5157M9091Q1165
$$ 21931 -1988 9658 49790 18798 56025 -90067 -113348 -53619 -133473 -78316 -29225 51940
5864E1940J3065L9372m1729N108l9235m7772R7607P7983p6947j6864L2700r0611
$$ 51940 65005 104377 62648 67756 28521 -19251 78356 156339 79392 62528 95228 4617
5852D617k3632K6603r1704k475L525N2630P4056q1763Q8259k2903Q4527L0536
$$ 4617 -19015 7588 -84116 -86591 -83066 -30436 43620 -38143 50116 27213 111740 142276
5840A42276j37482P9291O5788q4764l9321j7374M5095J2398j9852m527M6851k2980
$$ 142276 4794 84085 149873 65109 25788 8414 53509 65907 46055 41528 88379 65399
5828F5399K7098m324j00000k4590R696p169M6242O2528o4502L8040k0884r4491
$$ 65399 92497 88173 -11827 -36417 -26721 -33890 12352 74880 10378 48418 27534 -66957
5816f6957p2217Q0873l0081n4175L5189N0741M4492n1291J317l1589O8895J02188
$$ -66957 -139174 -58301 -88382 -142557 -107368 -56627 -12135 -63426 -62109 -93698 -24803 77385
5804G7385m5914L5736j64377r1791M8958R6981j4149l7833Q0807N8724n5437p4529
$$ 77385 31471 67207 -97170 -188961 -140003 -43022 -57171 -95004 -14197 44527 -10910 -85439
5792h5439m4482Q5751N2745Q8801j06238k7706N6652j50873R4818m3893M6861
$$ -85439 -129921 -44170 8575 97376 -8862 -36568 20084 -130789 -35971 -79864 -33003
5781c3003N8417j1611p6371n5624k1649J68018N6870o6513p8124P8458L8613o9119
$$ -33003 25414 13803 -62568 -118192 -139841 28177 85047 18534 -59590 18868 57481 -11638
5769a1638m0079k7498K2193l7432J03428n023k06992J51804P0382k7578K9962
$$ -11638 -51717 -79215 -57022 -94454 8974 3951 -203041 -51237 19145 -8433 21529
5758B1529l2837m3801J6993O4781k0051K2054L7341K5099O3742L7406k30787N3097
$$ 21529 -11308 -55109 -38116 26665 6614 28668 66009 91108 154850 192256 -38531 14566
5746A4566K3355Q461m1700L7355Q2016O0525P8325j12285L7192P3775n1044J0971
$$ 14566 37921 46382 4682 42037 124053 184578 262903 150618 187810 261585 210541 221512
5734B21512q6424l2891R8660K5028j01824J6168o4196O3554p8152k8870j0038
$$ 221512 135088 102197 200857 225885 124061 140229 76033 139587 61435 32565 22527
5723B2527l1861J04023J16824o9622j24362J93155L3779k816K9164j72070J5942
$$ 22527 -9334 94689 211513 141891 17529 210684 244463 241647 270811 98741 114683
5712A14683k212K7924J09509J2762p3110l6767j6952j5931P6615N7029J44900
$$ 114683 112471 140395 249904 262666 189556 152789 135837 119906 196521 253550 398450
5701C98450j76438j06135J19736K7446n3513n864R1570o5379J1205p1388J6922
$$ 398450 222012 115877 235613 263059 209546 203682 295252 229873 241078 169690 186612
5690A86612P3467p614q9772l7453J18817J39643N2383m5558j41806Q28J20920
$$ 186612 260079 252465 162693 125240 244057 383700 436083 390525 248719 249547 370467
5679C70467J04238j06377q5419J08768j1224j06656p3993J19937L5053J5429L8350
$$ 370467 474705 368328 282909 391677 380453 273797 199804 319741 354794 370223 408573
5668D08573L5406r6091N3423j35736k799k0994j15805P8607J43344n6183N2151
$$ 408573 443979 347888 401311 265575 262776 241782 125977 204584 347928 291745 343896
5657C43896r9301P8227J32023o1911m7997m7697j5131L2062l0622p6684M0914
$$ 343896 244595 322822 454845 392934 344937 297240 282109 314171 283549 206865 247779
5646B47779J7745o0858m693j9929L5234p4990Q8679o038o5181P2284p3523Q6637
$$ 247779 265524 204666 199973 180044 215278 140288 228967 222929 157748 230032 156509 243146
5634B43146r079k6194m1k9206N2030J1263j33366q587J40800O5116J399o5416
$$ 243146 234067 207873 207832 178626 230656 241919 108553 99966 240766 305882 307281 241865
5622B41865n7199j5233R9769M8995n5690R138o4663M7904Q0528J886j11761j17441
$$ 241865 184666 169433 269202 318197 262507 271645 206982 254886 335414 337300 225539 108098
5610A08098P0064J3517O9696J9149l5181p279q381j15752L0349J92859o6918K8405
$$ 108098 178162 191679 261375 280524 245343 238064 229683 113931 144280 337139 270221 298626
5598B98626j2858r766j18799P9915J9516K2158l8943r126J38828K6839N042p1294
$$ 298626 285768 276002 157203 237118 256634 278792 239849 230723 369551 396390 401432 330138
5586C30138j15340J13348J8555j51478K3794j3814K578L4514L8681J20118k0506
$$ 330138 214798 328146 346701 195223 219017 205203 207781 242295 280976 401094 380588
5575C80588K2489p6606j1117Q3943r0248L9474m3182L347j4227J43990M3411j14878
$$ 380588 403077 326471 315354 399297 309049 348523 305341 308688 294461 438451 481862 366984
5563C66984Q5304o2153m2900m201J7403L6312R6232O549p6363n598k956K2651
$$ 366984 452288 390135 347235 343034 360437 396749 492981 499530 423167 417569 414613 437264
5551D37264r4384Q4512j13301K9932P4587k3156k6360J15006O4132J441K1732
$$ 437264 342880 427392 314091 344023 418610 395454 369094 484100 548232 549673 571405
5540E71405K0422P6048j25813L3508o336O7463j5215P777M3141l417l7385j9490
$$ 571405 591827 667875 542062 575570 569234 636697 621482 629259 672400 668983 631598 612108
5528F12108j0017O0214L478M5561o2551M9108J0148L783P0892P4408L010q6031
$$ 612108 602091 662305 665783 711344 648793 697901 708049 711832 782724 857132 860142 774111
5516G74111l0206J38466J03649r8808O9791O6706q111n671k8857N5744k0946m1955
$$ 774111 743905 882371 986020 887212 957003 1023709 1015598 1009927 981070 1036814 1015868 973913
5504I73913J05436L0118M1248m1030l4220j4593k3798J74551J9585K6092L1461
$$ 973913 1079349 1109467 1150715 1109685 1075465 1060872 1037074 1211625 1231210 1257302 1288763
5493A288763n5861L8926J1449M1542N7374J34936p1769n4935R8310J57069R4149
$$ 1288763 1232902 1271828 1283277 1324819 1382193 1517129 1445360 1390425 1488735 1645804 1739953
5482A739953n5674J6703P1454J07499l5788J27730J08168O5608K6054m2659L6359
$$ 1739953 1684279 1700982 1772436 1879935 1844147 1971877 2080045 2145653 2171707 2129048 2165407
5471B165407O5410Q1575L0793O9351J60344K09231M3338J05348l6127O9158R8049
$$ 2165407 2230817 2312392 2343185 2412536 2572880 2782111 2825449 2930797 2894670 2963828 3061877
5460C061877J01053J36338P1281Q5794J07474J21312J52781J73693J06738M2095
$$ 3061877 3162930 3299268 3370549 3456343 3563817 3685129 3837910 4011603 4118341 4160436
5450D160436K23338K27008K19293J15033K13358L13804K20989K42413L22830L10131
$$ 4160436 4383774 4610782 4830075 4945108 5158466 5472270 5693259 5935672 6258502 6568633
5440F568633L16649M06525N82975L57210L33892K22508J62474j4839K90407L04220
$$ 6568633 6885282 7291807 7874782 8231992 8565884 8788392 8950866 8936027 9226434 9530654
5430I530654K46511L18571K77219M58980O00020P69190P80454P68671J104485
$$ 9530654 9777165 10095736 10372955 10831935 11431955 12201145 12981599 13750270 14854755
5421A4854755J145720J397147J494660J578000J678452J432313J672719J589757
$$ 14854755 16000475 17397622 18892282 20470282 22148734 23581047 25253766 26843523
5413B6843523J855767K026667K157211J950500J487825K85151p21994j506802
$$ 26843523 28699290 30725957 32883168 34833668 36321493 36606644 35884650 34377848
5405C4377848j750400j544089j116296p12484j69012J16914L60503Q81135J061056
$$ 34377848 32627448 31083359 29967063 29254579 29085567 29202481 29562984 30444119 31505175
5396C1505175J298786J652866J732769J736942J860319J666820J322094J576310
$$ 31505175 32803961 34456827 36189596 37926538 39786857 41453677 42775771 44352081
5388D4352081K054756K507050L051439L333322K670699J078869j508844l855089
$$ 44352081 46406837 48913887 51965326 55298648 57969347 59048216 57539372 53684283
5380E3684283n008479n050285m395831l393020k469403j817120j527485r77863
$$ 53684283 48675804 43625519 39229688 35836668 33367265 31550145 30022660 29044797
5372B9044797o11977l99643k75560m8349R9470J23938K16348K53340L60126M71382
$$ 29044797 28432820 28033177 27757617 27709268 27808738 27932676 28149024 28402364 28762490 29233872
5362B9233872Q21952R04608J324333J497101J146707J85338j127897k278509k872088
$$ 29233872 30055824 30960432 32284765 33781866 34928573 35113911 33986014 31707505 28835417
5353B8835417k990573k681483k155672j805007j529321j268757r70801q26765
$$ 28835417 25844844 23163361 21007689 19202682 17673361 16404604 15433803 14607038
5345A4607038p94967n92524n39098l52823l12282m17610m47214j50493k46839
$$ 14607038 13812071 13219547 12680449 12327626 12015344 11597734 11150520 11000027 10753188
5336A0753188j91238j54546k79810k16431l26624k81125k25387k55505l0713j12716
$$ 10753188 10561950 10407404 10127594 9911163 9584539 9303414 9078027 8822522 8791809 8679093
5326H679093k35080l71804l19054l71394l30662j59297l28967j61000m2252K4217
$$ 8679093 8444013 8072209 7753155 7381761 7051099 6891802 6562835 6401835 6359583 6383800
5316F383800j32149j79490j99317l20186m0768j4182j36559R3281n6557r1528
$$ 6383800 6251651 6072161 5872844 5552658 5511890 5497708 5361149 5454430 5397873 5306345
5306E306345k16972L3822R5411P4170Q454j73014j48389k85214j31672j86172
$$ 5306345 5089373 5123195 5218606 5292776 5301230 5128216 4979827 4694613 4562941 4376769
5296D376769j00924n158r4411j98414q5883l018q8704k58394j44706J44815j23317
$$ 4376769 4275845 4270687 4176276 3977862 3891979 3888961 3800257 3541863 3397157 3541972 3418655
5285C418655j05368J04165l5178o0070n2794L680Q8474O9685O2537R0351q2562
$$ 3418655 3313287 3417452 3382274 3322204 3269410 3273090 3361564 3431249 3493786 3584137 3501575
5274C501575k800p3436n1979P5295p0316M3295m8050R7909J94450n5268m9710
$$ 3501575 3498775 3425339 3373360 3448655 3378339 3421634 3373584 3471493 3665943 3610675 3560965
5263C560965l0722J9018J4006n3399j47286m4750n3301K3995J21618j03260P5282
$$ 3560965 3530243 3549261 3563267 3509868 3362582 3317832 3264531 3288526 3410144 3306884 3382166
5252C382166L0263M1391J25191M2760J19380J41575K03628R3958Q3550L7985J06950
$$ 3382166 3412429 3453820 3579011 3621771 3741151 3882726 4086354 4180312 4263862 4301847 4408797
5241D408797L0474O3468J10852O067j41636j64153j84981k95391q0090j81042
$$ 4408797 4439271 4502739 4613591 4619658 4478022 4313869 4128888 3833497 3753407 3572365
5231C572365q0960n8405p3937j08394j7216m7629P284P5560k6540Q0588j6947
$$ 3572365 3491405 3433000 3359063 3250669 3233453 3185824 3193108 3268668 3242128 3322716 3305769
5220C305769J7737J97313L4765M296j832m384l0545j12581n4418j17832k01384
$$ 3305769 3323506 3520819 3555584 3559880 3558048 3553664 3523119 3410538 3356120 3238288 3036904
5209C036904p666r6505j52231K7366m988p614j32403n9583o4496j49826j25150
$$ 3036904 3029238 2932733 2780502 2807868 2802880 2795266 2662863 2603280 2538784 2388958 2263808
5198B263808q2923K7030K7899p2360j32746j04052R5690Q051j0611M6003k9592
$$ 2263808 2180885 2207915 2235814 2163454 2030708 1926656 2022346 2030397 2019786 2065789 2036197
5187B036197q7354m6069N9183M7169J9098j18371L7494k3808j48618K2028J52169
$$ 2036197 1948843 1902774 1961957 2009126 2028224 1909853 1947347 1923539 1774921 1796949 1949118
5176A949118j69234N3113M58n8961j2538n1773J03009j8851m0829q7390K2615
$$ 1949118 1779884 1832997 1833455 1774494 1761956 1710183 1813192 1794341 1753512 1666122 1688737
5165A688737o9599N050L7760J01592n9649j54147m7061m7728M4174j9794M7418
$$ 1688737 1619138 1624188 1661948 1763540 1703891 1549744 1502683 1454955 1499129 1479335 1526753
5154A526753N9086o4090R6465l6027K4300j07702m4820J50147r170l7292M4936
$$ 1526753 1585839 1521749 1618214 1582187 1606487 1498785 1453965 1604112 1594942 1557650 1602586
5143A602586N8307r0602O83K51168N736r1222O4661P807k8670k0148m5978J796
$$ 1602586 1660893 1570291 1570974 1822142 1827878 1736656 1801317 1809124 1780454 1760306 1714328 1716124
5131A716124J09940N9051N4210m2183P8435m1088R6023L0856O8406Q3108K527
$$ 1716124 1826064 1885115 1939325 1897142 1975577 1934489 2030512 2061368 2129774 2212882 2215409
5120B215409Q7880p3874Q5894J74069P6277J60635J06149J14101J05484J76775
$$ 2215409 2303289 2229415 2315309 2489378 2565655 2726290 2832439 2946540 3052024 3228799
5110C228799K25494J37248P1547K29897K16809O2476Q4409l6948O67j21854o4622
$$ 3228799 3454293 3591541 3663088 3892985 4109794 4172270 4256679 4219731 4220398 4098544 4033922
5099D033922m0582m2556j5378K4830o3781R6681J05642L9425Q8474o3953N2256
$$ 4033922 3993340 3950784 3935406 3960236 3896455 3993136 4098778 4138203 4226677 4162724 4214980
5088D214980J14384J01648K01224K33602J73838j0879J08869K43073K92273J46678
$$ 4214980 4329364 4431012 4632236 4865838 5039676 5028797 5137666 5380739 5673012 5819690
5078E819690K22013K01345K13853J23182K56436L54317K87994L18360M05868M52231
$$ 5819690 6041703 6243048 6456901 6580083 6836519 7190836 7478830 7797190 8203058 8655289
5068H655289O35865O95149P30936R50102J082587J064404J367564J476919J810358
$$ 8655289 9291154 9986303 10717239 11667341 12749928 13814332 15181896 16658815 18469173
5059A8469173K081363J901737K008744J237063J23908j076595j607612j921536
$$ 18469173 20550536 22452273 24461017 25698080 25821988 24745393 23137781 21216245
5051B1216245j642800j023649p98397o08362k46877M3872J05202L31149O51158
$$ 21216245 19573445 18549796 17751399 17143037 16896160 16940032 17045234 17376383 18027541
5042A8027541Q05078J048548J269367J561187J713750K200758K443359K837585
$$ 18027541 18832619 19881167 21150534 22711721 24425471 26626229 29069588 31907173
5034C1907173L304398L652625L905795L273235J535581q01598k731032m046380
$$ 31907173 35211571 38864196 42769991 46043226 47578807 46777209 44046177 39999797
5026C9999797m309342l880794l061698k313946j747212j281570j074481p69127
$$ 39999797 35690455 31809661 28747963 26434017 24686805 23405235 22330754 21561627
5018B1561627n00540l78090j5717K87022L34779O21218P87513J062308J162403
$$ 21561627 21061087 20682997 20667280 20954302 21289081 21910299 22697812 23760120 24922523
5009B4922523J179693J315824J373892J299577L66686n56018j500080k317187
$$ 24922523 26102216 27418040 28791932 30091509 30458195 29902177 28402097 26084910
5001B6084910k485150k218992j905721j536095j203748j109752r58822r69456
$$ 26084910 23599760 21380768 19475047 17938952 16735204 15625452 14666630 13697174
4993A3697174o07483n02116n61450m16495l48951k95266k10556l91263k27134
$$ 13697174 13089691 12587575 12026125 11609630 11260679 10965413 10754857 10363594 10136460
4984A0136460r3552l77212k99957k79117l01499j83431j77447j15129j37670k04989
$$ 10136460 10042908 9665696 9365739 9086622 8785123 8601692 8424245 8309116 8171446 7966457
4974G966457m0857p3256q0466l2276P202p1936k7746k2802p8708o9522l0457l2922
$$ 7966457 7925600 7852344 7771878 7739602 7746804 7674868 7647122 7624320 7545612 7476090 7445633 7412711
4962G412711j3671n2864m6170l2396n4228j3486j36294j24309p833K6949m3116
$$ 7412711 7399040 7346176 7300006 7267610 7213382 7199896 7063602 6939293 6931460 6958409 6915293
4951F915293M1952J3760O3038J02834P9643J20792J81036J21762K69456N7487
$$ 6915293 6957245 6971005 7034043 7136877 7216520 7337312 7518348 7640110 7909566 7967053
4941G967053J22906J81658O2834J45656J5919P8402J14797R6870O6354M633O3413
$$ 7967053 8089959 8271617 8334451 8480107 8496026 8574428 8689225 8786095 8852449 8857082 8920495
4930H920495j8987j42206o7868M3044Q176r8937m1854q4563J16187P0403l7713
$$ 8920495 8901508 8759302 8691434 8734478 8742654 8643717 8601863 8517300 8633487 8703890 8666177
4919H666177J93239L29096J4435K60128L87837M13564L36987L20130L72936J46258
$$ 8666177 8859416 9188512 9202947 9463075 9850912 10264476 10601463 10921593 11294529 11440787
4909A1440787m3716k1703M8945K5352k8593J77751J85603J64192K22289M2836
$$ 11440787 11397071 11375368 11424313 11449665 11421072 11598823 11784426 11948618 12170907 12213743
4899A2213743J24736L16110L68803L53660K10540L31144L88313N90353M77927
$$ 12213743 12338479 12654589 13023392 13377052 13587592 13918736 14307049 14897402 15375329
4890A5375329N07690O20745Q24473Q96502O51034N60800L81377K98315m3068P8626
$$ 15375329 15883019 16503764 17328237 18224739 18875773 19436573 19817950 20116265 20073197 20151823
4880B0151823K11910J38993J41603K14885K29784K85069L69764L48343O22018
$$ 20151823 20363733 20502726 20644329 20859214 21088998 21374067 21743831 22092174 22714192
4871B2714192O41830O91340P40801P02059P76155Q73467R49345P78631R70735
$$ 22714192 23356022 24047362 24788163 25490222 26266377 27139844 28089189 28867820 29838555
4862B9838555J258553J029927J044472J358135J302380J592225J704474J858965
$$ 29838555 31097108 32127035 33171507 34529642 35832022 37424247 39128721 40987686
4854D0987686J891412K052147K363342K848016L537891M147376M873372N691019
$$ 40987686 42879098 44931245 47294587 50142603 53680494 57827870 62701242 68392261
4846F8392261O826217P892494Q941854J0454414J2253310J4261029J6746244J9808110
$$ 68392261 75218478 83110972 92052826 102507240 114760550 129021579 145767823 165575933
4838A65575933K2698149K4081204K4670128K3114077J6503824Q363978L89307
$$ 165575933 188274082 212355286 237025414 260139491 276643315 285007293 285396600
4831B85396600j0392688j9213715k4248018k7867007k7646841k4554604k0911681
$$ 285396600 275003912 255790197 231542179 203675172 176028331 151473727 130562046
4824A30562046j7014208j3389117j0689510q745181p204935o122389n595985m797013
$$ 130562046 113547838 100158721 89469211 80724030 73519095 67396706 61800721 57003708
4816E7003708m198445l659726l213303k807073k507488k131900j800789j804590
$$ 57003708 52805263 49145537 45932234 43125161 40617673 38485773 36684984 34880394
4808C4880394j450387j464337j398121j376100j300065j321505j214090j005761
$$ 34880394 33430007 31965670 30567549 29191449 27891384 26569879 25355789 24350028
4800B4350028j230712j058716r60487j024577q82478p28491q39852o66877n67477
$$ 24350028 23119316 22060600 21100113 20075536 19193058 18464567 17624715 16957838 16390361
4791A6390361p11782o01127o17186n92166m00573m27931l63390l74538l14049
$$ 16390361 15678579 15077452 14460266 13868100 13467527 13039596 12676206 12301668 11987619
4782A1987619j39811l15211l43681j65084j92764k68971k27290j61926j69868
$$ 11987619 11847808 11532597 11188916 11023832 10831068 10562097 10334807 10172881 10003013
4773A0003013j77061j11545j16980k65047j95323j18490j97330j54758j14137
$$ 10003013 9825952 9714407 9597427 9332380 9137057 9018567 8821237 8666479 8552342
4764H552342k36010j64469j75561j72024j98165j29450k34793k27011k14719j28683
$$ 8552342 8316332 8151863 7976302 7804278 7606113 7476663 7241870 7014859 6800140 6671457
4754F671457j03997n0465m7812k44610l6803k190r1033L5917l9202k46899j60693
$$ 6671457 6567460 6516995 6469183 6224573 6187770 6185580 6094547 6130464 6091262 5844363 5683670
4743E683670J06600r6779k59692k27459j47071l1689j18566m0806l9738j74025
$$ 5683670 5790270 5693491 5433799 5206340 5059269 5027580 4909014 4868208 4828470 4654445
4733D654445k12132k3432j8796O983m6299J5735P4938P1739M554J43342M4804
$$ 4654445 4442313 4418881 4400085 4407068 4360769 4376504 4451442 4523181 4527735 4671077 4715881
4722D715881M1728q2359j06909J9920o8199j51708j6012q2562O8095m3902j17606
$$ 4715881 4757609 4675250 4568341 4588261 4520062 4368354 4352342 4269780 4337875 4293973 4176367
4711D176367K6429j74843j20224j5903l8971m1705n3700l0842k2134K4215p4186
$$ 4176367 4202796 4027953 3907729 3891826 3852855 3811150 3757450 3726608 3704474 3728689 3654503
4700C654503r8352n4092l4443k8000j04516j34674K5534N7688j55335o5905l5501
$$ 3654503 3556151 3502059 3467616 3439616 3335100 3200426 3225960 3283648 3128313 3062408 3026907
4689C026907p3049j03365K6049r0763j55326k8845q342k31206r162n3215p0403
$$ 3026907 2953858 2850493 2876542 2785779 2630453 2601608 2593266 2362060 2352898 2299683 2229280
4678B229280M0661n7159m8335j37060K8337J20966q0782j80423n9050j4986K9500
$$ 2229280 2269941 2212782 2164447 2027387 2055724 2176690 2095908 1915485 1856435 1841449 1870949
4667A870949p8116J57876n9221P0052q1972j83478l3285o6916J6417o8022K3499
$$ 1870949 1792833 1950709 1891488 1961540 1879568 1696090 1662805 1595889 1612306 1544284 1567783
4656A567783O5971N0665n5678q8120n02M5147R2688j36666j16409o299J91855
$$ 1567783 1633754 1684419 1628741 1540621 1540119 1585266 1677954 1541288 1424879 1418580 1610435
4645A610435k2963k75299m6990k9027M8110N9048J7591r6287j4728J20092J9114
$$ 1610435 1587472 1312173 1265183 1236156 1284266 1343314 1360905 1264618 1249890 1369982 1389096
4634A389096J0854r1040r5030K0941l2751l7162N2768K3651n7790j46028J32665
$$ 1389096 1399950 1308910 1213880 1234821 1202070 1164908 1217676 1241327 1183537 1037509 1170174
4623A170174l4863o4769O2545m9064M7602l7938K8N841n4884M7205J77416l2310
$$ 1170174 1135311 1070542 1133087 1084023 1131625 1093687 1093715 1099556 1044672 1091877 1269293 1236983
4611A236983n5066J2326l8928r1763J5441M9545J4679j43352O6635l5836m3080
$$ 1236983 1181917 1194243 1155315 1063552 1078993 1128538 1143217 999865 1066500 1030664 987584
4600I87584M8543L1147M2871r9154J2423k3195j03939J0679r0746K2281R7019
$$ 987584 1036127 1067274 1110145 1010991 1023414 1000219 896280 906959 816213 838494 935513
4589I35513N689j6902R1294l8048k8436q6716O7921N1604j0068j54699L6481J24282
$$ 935513 941202 924300 1015594 977546 949110 862394 930315 981919 971851 817152 853633 977915
4577I77915Q3459J8411J33344P2288L0830l5434J679n152N8558m7839J50590O7316
$$ 977915 1061374 1079785 1213129 1285417 1316247 1280813 1282492 1277340 1335898 1288059 1438649 1505965
4565A505965J68077J81477L62J17599J29593J66658J19175m1329j96678j564j71862
$$ 1505965 1674042 1855519 1855881 1973480 2103073 2269731 2388906 2347577 2150899 2149335 1977473
4554A977473j34098j60754j38814j04581r852n6422p1721q6951q5363j1798j7249
$$ 1977473 1843375 1682621 1543807 1439226 1429374 1372952 1301231 1214280 1128917 1117119 1099870
4543A099870j03150N9747J4904k3712j0569o4588K1270O8005r3607m6624J1130
$$ 1099870 996720 1056467 1071371 1047659 1037090 972502 993772 1061777 968170 921546 932676
4532I32676j7955J5971k4287k33j5694l3763L3746Q903k5685j86316K4172J25701
$$ 932676 914721 930692 906405 906172 890478 856715 890461 899364 873679 687363 711535 837236
4520H37236p7766J728N634K5722L9963j49615P8994M5205O208p0565r237n923
$$ 837236 759470 761198 766832 792554 832517 682902 761896 807101 813309 742744 733507 727584
4508G27584N8375k5856N3070l556k2605j44783N6661p024p6235J2772M8358R249
$$ 727584 785959 760103 813173 809617 787012 642229 698890 691866 615631 628403 676761 686010
4496F86010j28662L4166M7881j5902M7146n332L5306M9299Q060L1492l1458Q4031
$$ 686010 557348 591514 639395 623493 670639 665307 700613 749912 757972 789464 758006 842037
4484H42037L4611j09694o9569O3005P6757p1579o8813n9120J06501J6458k4555
$$ 842037 876648 766954 697385 760390 837147 765568 696755 637635 744136 760594 736039
4473G36039p7839Q855L6994k0830L2565O7542o055j26668j5591N4008O4760k9759
$$ 736039 658200 667055 704049 683219 715784 783326 777271 650603 635012 689020 753780 724021
4461G24021n0420N1172m4755J9517j4546N2186J88067j6191K1137j00667k6856
$$ 724021 673601 724773 680018 699535 684989 737175 925242 909051 930188 829521 802665
4450H02665r7198P8966k028Q1615n4776L285Q8752J4061r4695k4035L1151J4138
$$ 802665 705467 784433 782405 864020 809244 812529 901281 915342 820647 796612 827763 841901
4438H41901K02200j45517n3043J42269o4218j8795k7641K9595l0388j5320j30690
$$ 841901 1044101 898584 845541 987810 923592 904797 877156 906751 876363 861043 730353
4427G30353p1086J45236M2633J1843m8336K5073N0228j51108J16102K7529j21232
$$ 730353 659267 804503 847136 858979 810643 835716 885944 734836 850938 878467 757235
4416G57235m3989m6509K3182J22241L2683j41607r7895J90252p9272j33048J05197
$$ 757235 713246 666737 689919 812160 844843 703236 605341 795593 716321 583273 688470
4405F88470N4684J7476J16048P4078j46417o1779m063M2147R5210m650n1833n3625
$$ 688470 743154 760630 876678 950756 804339 742560 738497 780644 875854 871204 819371 765746
4393G65746J1763O4806J04054r935P681k1123M4257K0519j09672O4485l952m2811
$$ 765746 777509 842315 946369 936434 944115 922992 967249 987768 878096 942581 938629 895818
4381H95818m4290m2394N3276L275j9365n0077J4987O6398o6241J01433L1624j09575
$$ 895818 851528 809134 862410 865685 846320 796243 811230 877628 811387 912820 944444 834869
4369H34869N950N7310n8615O8048O4594p4889P503J12868j49456p1259o5929N7606
$$ 834869 840819 898129 839514 907562 972156 897267 904770 1017638 868182 796923 730994 788600
4357G88600M447M9873q857L5015R0406k3341N4840l1689J3007L4970k9281n4079
$$ 788600 793047 842920 834063 869078 959484 936143 990983 959294 972301 1007271 977990 923911
4345I23911K5170N145p8393j0242N6799m3452K878q8900Q1227j8951J28230K1672
$$ 923911 949081 954226 875833 865591 922390 878938 881816 792916 874143 855192 983422 1005094
4333A005094p2895M689K1856K2223O4553r125n3909M567o130j6344L793m0605
$$ 1005094 932199 936888 958744 980967 1045520 1036395 982486 987053 980923 964579 968372 927767
4321I27767o3128q2531J91859N8490m4514k3748j06028R2368l6780M666J02169
$$ 927767 864639 782108 973967 1032457 987943 964195 858167 950535 913755 918421 1020590
4310A020590n8M0697m485n4790P8521m3043K5679n0036J02094Q682K6109k5020
$$ 1020590 1020532 1061229 1056744 1001954 1080475 1037432 1063111 1013075 1115169 1123851 1149960 1124940
4298A124940l4812k6787J06843p3773j18476J45774J86298j30231l4325k5938
$$ 1124940 1090128 1063341 1170184 1096411 977935 1123709 1310007 1179776 1145451 1119513
4288A119513k6456P0899k5264N745Q9407J382j08171l1956K1012P4498P3371p6120
$$ 1119513 1093057 1163956 1138692 1144437 1233844 1235226 1127055 1095099 1116111 1190609 1263980 1187860
4276A187860j20947q5678J24249n3361J22785M5027o9007M9356j53336J5799m3021
$$ 1187860 1066913 981235 1105484 1052123 1174908 1219935 1150928 1200284 1046948 1062747 1019726
4265A019726J57747l1778k8651j471P5236l9312L6124P6625r5836J4730R3337
$$ 1019726 1177473 1145695 1117044 1115573 1190809 1151497 1187621 1264246 1168410 1183140 1276477
4254A276477N6407O7951r1483m4932R7558O7938J9950j27721j03955L8485p523
$$ 1276477 1332884 1400835 1309352 1264420 1361978 1429916 1449866 1322145 1218190 1256675 1249152
4243A249152J477J96732J5948o5030N1127j11079R485J07639m9871l7630L9183
$$ 1249152 1250629 1447361 1463309 1398279 1449406 1338327 1347812 1455451 1405580 1367950 1407133
4232A407133m3967P798J06286N4574N144m2590k1791l0878l1171p6899N5390J6796
$$ 1407133 1363166 1370964 1477250 1531824 1536968 1494378 1472587 1441709 1410538 1333639 1389029 1405825
4220A405825J93166q6434P7077R9737k05536M0168N6768m7316J04601m5338j04857
$$ 1405825 1598991 1512557 1589634 1689371 1483835 1524003 1580771 1533455 1638056 1592718 1487861
4209A487861K12j4920J5014L0394J22996j152m5519o8932R044K0299J24197j640
$$ 1487861 1488073 1473153 1488167 1518561 1641557 1640405 1594886 1525954 1534998 1555297 1679494 1677854
4197A677854P1763J04637l9542j17065O3786Q0211j24470k6278J44848J25772
$$ 1677854 1749617 1854254 1814712 1697647 1761433 1841644 1717174 1690896 1835744 1961516
4187A961516Q86k1612J17438l5538m9987l3299J206J35839j4005n9201M8596Q8468
$$ 1961516 1962402 1940790 2058228 2022690 1972703 1939404 1940610 2076449 2062444 2003243 2051839 2140307
4175B140307J17182J43802N8838J04008O1023J43385J89124k5180P706l0453q4541
$$ 2140307 2257489 2401291 2460129 2564137 2625160 2768545 2957669 2932489 2940195 2909742 2825201
4164B825201K118q0768j55582j06942o3557O1963J6815j30223j25309M6525J93450
$$ 2825201 2827319 2746551 2590969 2484027 2420470 2482433 2499248 2369025 2243716 2290241 2483691
4153B483691O8841k23026j04827P1581K8408l0925q6907l4933j5575P4584N6948
$$ 2483691 2552532 2329506 2224679 2296260 2324668 2293743 2206836 2171903 2156328 2230912 2287860
4142B287860R9554J07113l5702j50258r9690M37k7827O8257P2781J9484N9675
$$ 2287860 2387414 2494527 2458825 2308567 2208877 2209314 2181487 2249744 2322525 2342009 2401684
4131B401684K03466q0897p939k1848l5323N3068j1129o5419J965M5976N3507n1124
$$ 2401684 2605150 2524253 2516314 2494466 2459143 2512211 2501082 2435663 2437628 2483604 2537111 2485987
4119B485987k3489J05964q0345L0323L969O4544L4524k6859M7818J50946n3039
$$ 2485987 2462498 2568462 2488117 2518440 2522409 2586953 2621477 2594618 2642436 2793382 2740343
4108B740343k6185J17985O3050L9258k0859k4278J8175J10512J03146Q5140J55471
$$ 2740343 2714158 2832143 2895193 2934451 2913592 2889314 2907489 3018001 3121147 3206287 3361758
4097C361758N5062O9945P4579L8876K47428J31537K19611L87586J63820K16971
$$ 3361758 3416820 3486765 3561344 3600220 3847648 3979185 4198796 4586382 4750202 4967173
4087D967173L16327P2969J8284o6672q2812j45384j88533k63642l09954r0379
$$ 4967173 5283500 5356469 5374753 5308081 5225269 5079885 4891352 4627710 4317756 4227377
4077D227377m8350q7400r4742j2400j5286N1551p8810j00468J37384M0794L6100
$$ 4227377 4179027 4091627 3996885 3984485 3969199 4020750 3941940 3841472 3978856 4019650 4055750
4066D055750Q6133k2195m4228L5262k8113N0440M6333J2636j3117O5759k9203
$$ 4055750 4141883 4119688 4075460 4110722 4082609 4133049 4179382 4192018 4178901 4244660 4215457
4055D215457O5197R3115P024P7199l9666J74121R9281j06889P1252J52616j4132
$$ 4215457 4280654 4373769 4380793 4457992 4418326 4592447 4691728 4584839 4656091 4808707 4794575
4044D794575n7565L2410N6605L1953K34561M072N1520j09417J0511K08132j6769
$$ 4794575 4737010 4769420 4826025 4857978 5092539 5096611 5148131 5038714 5049225 5257357 5240588
4033E240588q3864M5743M0414J63483Q0377L3429j0812N6176J01735J06237n2385
$$ 5240588 5156724 5202467 5242881 5406364 5486741 5520170 5509358 5565534 5667269 5773506 5721121
4022E721121J48602J5011R8201J47360J31506J7473M1570P5172J28924O4237J18594
$$ 5721121 5869723 5884734 5982935 6130295 6261801 6279274 6320844 6396016 6524940 6589177 6707771
4011F707771P6829o1102P4691L8394O2574r9226R7616J66460L6351R1690M8855
$$ 6707771 6784600 6723498 6798189 6836583 6899157 6799931 6897547 7064007 7100358 7192048 7240903
4000G240903J9634O6608J31022J97473J06026K22934J28073J72638J88412L02246
$$ 7240903 7260537 7327145 7458167 7655640 7761666 7984600 8112673 8285311 8473723 8775969
3990H775969L83869M09297L57639L64968M49754O49439O67131P70598O52938M90957
$$ 8775969 9159838 9569135 9926774 10291742 10741496 11390935 12058066 12828664 13481602 13972559
3980A3972559q3157l14624o58370n37326l36435l26184j35483j00755k6356k2699
$$ 13972559 13889402 13574778 12916408 12379082 12042647 11716463 11580980 11480225 11453869 11431170
3970A1431170q27O2668O2439L4437K00969J80503J81749K40469K39236J99826
$$ 11431170 11430343 11493011 11555450 11589887 11790856 11971359 12153108 12393577 12632813 12832639
3960A2832639K78403L66726M44264K86337K63602K74917J94656K26274K15183
$$ 12832639 13111042 13477768 13922032 14208369 14471971 14746888 14941544 15167818 15383001
3951A5383001K71571N2281K43881L42508L52803L11552M88657M04978N38223N45134
$$ 15383001 15654572 15706853 15950734 16293242 16646045 16957597 17446254 17851232 18389455 18934589
3941A8934589N13471N59308N93883O75343O49681O72936O98719Q12381R91920
$$ 18934589 19448060 20007368 20601251 21276594 21926275 22599211 23297930 24110311 25102231
3932B5102231J035238J245359J274366J224431J437311J721216J854375K115200
$$ 25102231 26137469 27382828 28657194 29881625 31318936 33040152 34894527 37009727
3924C7009727K453307K851208L439262L671763M223700M916804N864677O896485
$$ 37009727 39463034 42314242 45753504 49425267 53648967 58565771 64430448 71326933
3916G1326933Q147171R343357J1035664J3336006J5985233J8590279K0286777
$$ 71326933 79474104 88817461 99853125 113189131 129174364 147764643 168051420
3909A68051420J7721606Q960609l106027j4053658j9623460k0425737j7700532
$$ 168051420 185773026 194733635 191627608 177573950 157950490 137524753 119824221
3902A19824221j4247557j1324338q604030o298974m557080l632485l476601l592828
$$ 119824221 105576664 94252326 85648296 79349322 74792242 71159757 67683156 64090328
3894F4090328l564503l534883l324204k909794k329863j895227j545046j302912
$$ 64090328 60525825 56990942 53666738 50756944 48427081 46531854 44986808 43683896
3886D3683896j169735r30534q17600n35881l70441j06548n3859j31737J02693
$$ 43683896 42514161 41583627 40766027 40230146 39859705 39753157 39699298 39567561 39670254
3877C9670254L3997O9479J37575K09102J54261J80207L6044L9731o3488Q7063
$$ 39670254 39704251 39773730 39911305 40120407 40274668 40454875 40490919 40530650 40467162 40554225
3867D0554225j83118p8550j84720k41336j85084O5223J70400L21890N46092P41351
$$ 40554225 40371107 40292557 40107837 39866501 39681417 39746640 39917040 40238930 40785022 41526373
3857D1526373O22434Q52934Q03352P30824R02728R42784J078108J370801J846515
$$ 41526373 42148807 43001741 43805093 44535917 45438645 46381429 47459537 48830338 50676853
3848E0676853J981488K284323K552743K873982L318201L601259M079720M656168
$$ 50676853 52658341 54942664 57495407 60369389 63687590 67288849 71368569 76024737
3840G6024737N579799O446066P378473Q668175J0184295J1911085J3769017J6111591
$$ 76024737 81604536 88050602 95429075 104097250 114281545 126192630 139961647 156073238
3832A56073238J8939727K2516230K7016307L2100620L8686922M4219200M3646657
$$ 156073238 175012965 197529195 224545502 256646122 295333044 339552244 383198901
3825C83198901L9798566L1593424J1413990j1056077k8042764m4310305n0852142
$$ 383198901 422997467 454590891 466004881 454948804 426906040 382595735 331743593
3818C31743593m7985183m3224448l5502291k6892667k0168164j5416656j2043019
$$ 331743593 283758410 240533962 205031671 178139004 157970840 142554184 130511165
3811A30511165r682571p974271p054388o217080n928357n547010n051043m593566
$$ 130511165 120828594 112854323 105799935 99582855 93654498 88107488 83056445 78462879
3803G8462879m176517l512713k773401k210435j703770j512586j160135q98391
$$ 78462879 74286362 70773649 68000248 65789813 64086043 62573457 61413322 60514931
3795F0514931q92035o80803l86658n45735l99439n47228p54150r66190j272817
$$ 60514931 59622896 58942093 58555435 58009700 57610261 57063033 56308883 55342693 54069876
3786E4069876j297563j220456j113337j177617j059146j123770j112026r13724
$$ 54069876 52772313 51551857 50438520 49260903 48201757 47077987 45965961 45052237
3778D5052237p26135n4531N01789J357010K022503K007800n2285k093418l311758
$$ 45052237 44326102 44271571 44773360 46130370 48152873 50160673 50108388 48014970 44703212
3769D4703212l876270l304594k221908j897759j287291r02511q21600n45488n72079
$$ 44703212 40826942 37522348 35300440 33402681 32115390 31212879 30391279 29845791 29273712
3760B9273712m24316k52284j42029j40156J7483P5215P8646L22212M00466L09691
$$ 29273712 28849396 28597112 28455083 28314927 28332410 28407625 28486271 28808483 29208949 29518640
3750B9518640L09719M83610O30709P16546Q10236R46068P05046K94488J6391l94451
$$ 29518640 29828359 30311969 30942678 31659224 32469460 33415528 34120574 34415062 34431453 34037002
3740C4037002p01337p57709p78941p66309p00116l33242j95513j48026K1004P1087
$$ 34037002 33335665 32577956 31799015 31032706 30332590 29999348 29803835 29655809 29676813 29747900
3730B9747900L46539M83267J051168J525008K104244K158826R00623n61202j700300
$$ 29747900 30094439 30577706 31628874 33153882 35258126 37416952 38317575 37756373 36056073
3721C6056073k001687j778187j316692q00573n77711l91033M8556K30034M20368
$$ 36056073 34054386 32276199 30959507 30158934 29581223 29190190 29238746 29468780 29889148
3712B9889148Q78230J262906O94900m44276j390980k176352k288211j832373j184413
$$ 29889148 30767378 32030284 32725184 32280908 30889928 28713576 26425365 24592992 23408579
3703B3408579j067459o87240o45300p01996o51164o57482n09089l91513m24210
$$ 23408579 22341120 21653880 21008580 20306584 19655420 18997938 18488849 18097336 17673126
3694A7673126l19896l53149k86779j95060n5703p6401L2552K18994K39095L72288
$$ 17673126 17353230 17000081 16713302 16518242 16462539 16386138 16418690 16637684 16876779 17249067
3684A7249067M51772L54344N0319J75871J01974J20536L29679R9727j83729l84608
$$ 17249067 17700839 18055183 18105502 18281373 18383347 18503883 18833562 18933289 18749560 18364952
3674A8364952o00599o84899n57424l86040j85973k30517n1381J20876L1203j41574
$$ 18364952 17764353 17079454 16522030 16135990 15950017 15719500 15668119 15788995 15820198 15678624
3664A5678624p3608J0691k27834j31666J70365O4519L740J4580N8763J45986Q5827
$$ 15678624 15605016 15615707 15387873 15256207 15426572 15491091 15494831 15509411 15568174 15714160 15799987
3653A5799987L03392J23771J02571K45649K66812M01409K86887M96573M74785
$$ 15799987 16103379 16227150 16329721 16575370 16842182 17243591 17530478 18027051 18501836
3644A8501836L88522L95244N72439L44574P5085j14806j12895j23469q0658j50060
$$ 18501836 18890358 19285602 19858041 20202615 20277700 20162894 20049999 19926530 19845872 19695812
3634A9695812q5486j1980j68283N2432J1046M4018M0527J73184J79790J33576
$$ 19695812 19610326 19598346 19430063 19482495 19493541 19537559 19578086 19751270 19931060 20064636
3624B0064636K82662M35988N24629M03513M81685O69280P64794Q44235J056179
$$ 20064636 20347298 20783286 21307915 21711428 22193113 22862393 23627187 24471422 25527601
3615B5527601J099416R09662P15877N25204M17336L50601K21601j9684p7316l33626
$$ 25527601 26627017 27536679 28252556 28777760 29195096 29545697 29767298 29747614 29670298 29336672
3605B9336672l52928m13539l76508j02783J41736L86842O35896O33010Q13035
$$ 29336672 28983744 28570205 28193697 28090914 28232650 28619492 29255388 29888398 30701433
3596C0701433R59115P50398N50144J71150J55124J20782L64827M75236P54631
$$ 30701433 31660548 32410946 32961090 33132240 33287364 33408146 33772973 34248209 35002840
3587C5002840Q33889P23305O79836J41015j21568k54601j06682k23293j59385
$$ 35002840 35836729 36560034 37239870 37380885 37259317 37004716 36898034 36674741 36515356
3578C6515356p1326r7564k48950j94266k91612l04766r9239j85630k76491k85732
$$ 36515356 36444030 36346466 36097516 35903250 35611638 35306872 35207633 35022003 34745512 34459780
3568C4459780k62630n80516l48414l48270J3489J68905M60417O05444N30802M42861
$$ 34459780 34197150 33616634 33268220 32919950 32933439 33102344 33562761 34168205 34699007 35141868
3558C5141868L57637P6739Q3562K63501L7885M08201J42176m611n15621j057023
$$ 35141868 35499505 35576244 35659806 35923307 35961192 36369393 36511569 36506958 35991337 34934314
3548C4934314j319816j378271j475747j211716r90376p55528j001754j146685
$$ 34934314 33614498 32236227 30760480 29548764 28558388 27802860 26801106 25654421
3540B5654421q98545r03927p67778o08065m78162l72315j21496k38839p0009M3773
$$ 25654421 24755876 23851949 23084171 22476106 21997944 21625629 21504133 21265294 21195285 21239058
3530B1239058j0520J66879L7438J51010n4387k56055n10819o89053o74341n66431
$$ 21239058 21228538 21395417 21432855 21583865 21529478 21273423 20762604 20073551 19399210 18832779
3520A8832779n72141n25231l97362l04183l57816l81233l78002m77887l60337
$$ 18832779 18260638 17735407 17338045 17033862 16676046 16294813 15916811 15438924 15078587
3511A5078587k85728k57316j88337k05302o4227j59624l17265k37218j63513j61843
$$ 15078587 14792859 14535543 14347206 14141904 14077677 13918053 13600788 13363570 13200057 13038214
3501A3038214j50102j05693j09745p9877j81644j46628q9534q7462l1294M9447
$$ 13038214 12888112 12782419 12672674 12592797 12411153 12264525 12174991 12087529 12056235 12105682
3491A2105682P811K69625J93834R8231K96174N9340K21947K39064J22559J89151
$$ 12105682 12113493 12383118 12576952 12675183 12971357 13030697 13252644 13491708 13614267 13803418
3481A3803418L82235M96290L82140L49377L43224M07330K16354L41783K96363
$$ 13803418 14185653 14681943 15064083 15413460 15756684 16164014 16380368 16722151 17018514
3472A7018514K74174L03456L37318K71201K14277M07978J49046j07978j85367
$$ 17018514 17292688 17596144 17933462 18204663 18418940 18826918 18975964 18867986 18682619
3463A8682619l45359k09203l41566K8929N0879K03661L38949N42767N90493P15781
$$ 18682619 18337260 18128057 17786491 17815420 17866299 18069960 18408909 18951676 19542169 20257950
3453B0257950R43372J073580R59928J074102R03409O86506Q44202P70250Q82724
$$ 20257950 21201322 22274902 23234830 24308932 25212341 25898847 26743049 27513299 28396023
3444B8396023P60832Q08146M07733l1195m58809q66388p39212n86321n24323l71066
$$ 28396023 29156855 29965001 30372734 30341539 29882730 29016342 28277130 27690809 27166486 26795420
3434B6795420j81877j05527j60557m3051j12489M4900K34492L86107O57383Q05992
$$ 26795420 26613543 26508016 26347459 26304408 26191919 26236819 26471311 26857418 27514801 28320793
3424B8320793R48185P00232O34681M78673L66419L36934M17701M82701L58407
$$ 28320793 29268978 29969210 30603891 31082564 31448983 31785917 32203618 32686319 33044726
3415C3044726L70612M40099L56745K89238L26102K97200K29502l0550k97134p60514
$$ 33044726 33415338 33855437 34212182 34501420 34827522 35124722 35354224 35323674 35026540 34266026
3405C4266026j262432j341132j288193j114837q38316n38628l99485k48847m0367
$$ 34266026 33003594 31662462 30374269 29259432 28421116 27882488 27483003 27234156 27193789
3396B7193789r3498k38529l33942j73287K7609j8719L2705N59974O24578O80741
$$ 27193789 27100291 26861762 26527820 26354533 26382142 26363423 26396128 26956102 27580680 28261421
3386B8261421N07533M69352K91304j90800l51956p27308r61829j162458j274343
$$ 28261421 28768954 29238306 29529610 29338810 28986854 28259546 27297717 26135259 24860916
3377B4860916j244314j236997j164650j124647q38209o02798n99766m92911l96799
$$ 24860916 23616602 22379605 21214955 20090308 19252099 18649301 18049535 17556624 17159825
3368A7159825m01325m00266k14852j28214j50570j8269M1037J00880J02391N903
$$ 17159825 16758500 16358234 16143382 16015168 15864598 15846329 15887366 15988246 16090637 16096540
3358A6096540j51254j43004k79903k91011l10824l07131l82490m10692m53463
$$ 16096540 15945286 15802282 15522379 15231368 14920544 14613413 14230923 13820231 13366768
3349A3366768m93246m65880k64238k24080k16730k96273l11495k70632k05776
$$ 13366768 12873522 12407642 12143404 11919324 11702594 11406321 11094826 10824194 10618418
3340A0618418p8303j86174j60510k8516j2019j88653j88008j86770k65972N116
$$ 10618418 10540115 10353941 10193431 10164915 10152896 9964243 9776235 9589465 9323493 9328609
3330I328609l5614j36314l19377k33114r4836k47306p1811j8301q3348k15899
$$ 9328609 9292995 9156681 8837304 8604190 8509354 8262048 8190237 8171936 8088588 7872689
3320G872689k62273Q6043r8003k04569N1750q5688j73176j9013j2700j00414j27543
$$ 7872689 7610416 7696459 7598456 7393887 7445637 7359949 7186773 7167760 7155060 7054646 6927103
3309F927103j52641j04857l0943q9270k57089j05917j47224l0559j58456j18302
$$ 6927103 6774462 6669605 6638662 6549392 6292303 6186386 6039162 6008603 5850147 5731845
3299E731845m0844l5482K3315j62752o5771j0485k851j13831j72418O6495K083
$$ 5731845 5691001 5655519 5678834 5516082 5450311 5439826 5436975 5323144 5150726 5217221 5219304
3288E219304J2527j48778o4962P6782r971m4379p9688p3123p6895q8027O2740
$$ 5219304 5231831 5083053 5018091 5094873 5084902 5040523 4960835 4887712 4810817 4722790 4785530
3277D785530j50471p0232r5978k829J9931p2681K6718j3098o1370j8625P3896
$$ 4785530 4635059 4564827 4468849 4466020 4485951 4413270 4439988 4426890 4365520 4346895 4420791
3266D420791n0475n5239o4814k9747o1041Q1429J98677O2624J7646J96815k014
$$ 4420791 4370316 4315077 4250263 4220516 4159475 4240904 4439581 4502205 4519851 4716666 4714652
3255D714652l9253J03371p4158j27963l747K8240n0848M5662O7018j57976m9607
$$ 4714652 4675399 4778770 4704612 4576649 4572902 4601142 4550294 4595956 4662974 4504998 4455391
3244D455391o7404l7849q3475P5353N6638l3647P8709q3024p064P6462M4660J5805
$$ 4455391 4387987 4350138 4266663 4342016 4398654 4365007 4443716 4360692 4353628 4430090 4474750 4490555
3232D490555n5700R5537K20550L1247o6549P5641K448M4601M0446Q0710Q5810
$$ 4490555 4434855 4530392 4750942 4782189 4715640 4791281 4793729 4838330 4878776 4959486 5045296
3221E045296k8278R5708k5654n5168j40777j7162k2732l9682p1840j05976k5129
$$ 5045296 5017018 5112726 5087072 5031904 4891127 4873965 4851233 4811551 4739711 4633735 4608606
3210D608606Q4334R3200j06063n2952R3460l8065O5296P4881J07654m9446N3722
$$ 4608606 4692940 4786140 4680077 4627125 4720585 4682520 4747816 4822697 4930351 4880905 4934627
3199D934627Q3871N0267j6977M8995J37916j10703J45107J08042j61282p825p7883
$$ 4934627 5018498 5068765 5051788 5100783 5238699 5127996 5273103 5381145 5219863 5212038 5134155
3188E134155J292J41j98775r6174J17589j31729j39862Q360j0301L7078j46574
$$ 5134155 5135447 5135588 4936813 4840639 4958228 4826499 4686637 4694997 4684696 4721774 4575200
3177D575200P2089j0346N5896j3731j34132n0763j1199L0599L2817K9740j06150
$$ 4575200 4647289 4636943 4692839 4679108 4544976 4494213 4483014 4513613 4546430 4576170 4470020
3166D470020q0733q7449R0024J31015o2857j07017J57455M1247j17236L596n6682
$$ 4470020 4389287 4301838 4391862 4522877 4460020 4353003 4510458 4551705 4434469 4438065 4381383
3155D381383j2357p6195J36481L4056k2048O3601J36649L7880p8318j19084k8841
$$ 4381383 4369026 4292831 4429312 4463368 4441320 4504921 4641570 4679450 4601132 4482048 4453207
3144D453207k23153j56915j02052m4406j91660j30868l1612J3325L3655q3970
$$ 4453207 4230054 4073139 3971087 3926681 3735021 3604153 3572541 3585866 3619521 3535551
3134C535551L7106O3483o2663K8367J7623n4731J9687N469k9849p8118p4527O8719
$$ 3535551 3572657 3636140 3573477 3601844 3619467 3564736 3584423 3589892 3560043 3481925 3407398 3476117
3122C476117L5451j23007J5705j8425l7992M410p9836O0423J8848M9027P4783
$$ 3476117 3511568 3388561 3404266 3385841 3347849 3352259 3272423 3332846 3351694 3400721 3475504
3111C475504m2054J2441L475k9584l2000M7815M7383m9180J0200J23999J20647
$$ 3475504 3433450 3445891 3449366 3419782 3387782 3435597 3482980 3433800 3444000 3567999 3688646
3100C688646O0824O633P0964R6845R625R7979P5290N8883J99176P1024J15707
$$ 3688646 3749470 3756103 3827067 3923912 3933537 4031516 4106806 4165689 4364865 4435889 4551596
3089D551596l6681j1283j23295J2710r0343j55163l5287P9846k05608m9504l3252
$$ 4551596 4514915 4503632 4380337 4393047 4302704 4147541 4112254 4192100 3986492 3936988 3903736
3078C903736m5504j3393m9289M1115N807J5296m505J56122j3313l0925p2539Q9780
$$ 3903736 3858232 3844839 3795550 3836665 3842472 3857768 3853263 4009385 3996072 3965147 3892608 3982388
3066C982388J5718M9532P2380n8692P037J45682P8734J51093P3072M7318J27190
$$ 3982388 3998106 4047638 4120018 4061326 4068363 4214045 4292779 4443872 4516944 4564262 4691452
3055D691452K45076K33965K09691L20833M22317L43735M59425M95393P28919R17489
$$ 4691452 4936528 5170493 5380184 5701017 6123334 6467069 6926494 7421887 8150806 9068295
3045I068295P98710Q44507J071905J609168J829102K377043K428765R39848r70708
$$ 9068295 9867005 10711512 11783417 13392585 15221687 17598730 20027495 20967343 19996635
3036A9996635k149930k927102k335029j452686j057942q01390m64892k40881j21430
$$ 19996635 17846705 14919603 12584574 11131888 10073946 9272556 8807664 8566783 8445353
3027H445353n3559M3356J39844J70373L24647M76456O19757P39147Q79027R85776
$$ 8445353 8391794 8435150 8574994 8745367 9070014 9546470 10166227 10905374 11784401 12770177
3017A2770177J205213J801966K136528K370891Q97892r98662k234162l119636
$$ 12770177 13975390 15777356 17913884 20284775 21182667 20184005 17949843 14830207
3009A4830207k532272j696804j191730r33626p19246m96886l98796m19557l81536
$$ 14830207 12297935 10601131 9409401 8475775 7756529 7259643 6860847 6441290 6059754
3000F059754l70983k84692j46090j04123r953l2506j97500k55137o4562k00340
$$ 6059754 5688771 5404079 5257989 5153866 5143913 5111407 4913907 4658770 4594208 4393868
2990D393868k43093O9094j14146j95253j89113J5135j91232l2474q7637j12515
$$ 4393868 4150775 4219869 4105723 3910470 3721357 3736492 3545260 3512786 3425149 3312634
2980C312634R15j39215j00499q0977j65615p6544M3410j52552k5262n1973L0990
$$ 3312634 3313549 3174334 3073835 2992858 2827243 2750699 2794109 2641557 2616295 2564322 2595312
2969B595312o6667j17003L3844Q8627o9552j54160j25645n3361J24664O2764R070
$$ 2595312 2528645 2411642 2445486 2534113 2464561 2310401 2184756 2131395 2256059 2318823 2327893
2958B327893j15197N9258j5572j41235o118J4521J0145p8746j54987J00236N5015
$$ 2327893 2212696 2271954 2256382 2115147 2109029 2123550 2133695 2054949 1899962 2000198 2055213
2947B055213o8634m5786O8439j0934q1133m6271j29189q0285J9624k1531J3889
$$ 2055213 1986579 1940793 2009232 1998298 1917165 1870894 1741705 1661420 1681044 1659513 1673402
2936A673402N4604P086r5109o1086p2607P6450J5724L0229Q5625p0701j3455K1180
$$ 1673402 1728006 1735092 1639983 1578897 1506290 1582740 1598464 1628693 1714318 1643617 1630162 1651342
2924A651342r008j72946K7619R1101n0502O070L2536j35523O1676n0965j84448
$$ 1651342 1642334 1469388 1497007 1588108 1537606 1543676 1576212 1440689 1502365 1451400 1266952
2913A266952o83O1108P3853r6328q3844j3058P2391R663q554j1052j19557K4434
$$ 1266952 1266269 1327377 1401230 1304902 1221058 1208000 1280391 1290054 1281500 1270448 1150891 1175325
2901A175325O0602m4481p1119j09400L1091J11521P1844n6392j6069O0199q6144
$$ 1175325 1235927 1191446 1120327 1010927 1042018 1153539 1225383 1168991 1152922 1213121 1126977
2890A126977l250j566j04608N5729J1525r1611p5637N6146R8478n2720m1213K1471
$$ 1126977 1123727 1122161 1017553 1073282 1084807 993196 917559 973705 1072183 1019463 978250 999721
2878I99721N5820r7715j524J10375k9359r6126p1686l9948J7171J5735k3658Q3609
$$ 999721 1055541 957826 956302 1066677 1037318 941192 869506 829558 846729 862464 838806 922415
2866I22415j2186k5564p6638k3871J91274p4751q476k7403j7294J2133q0321m3483
$$ 922415 910229 884665 808027 784156 975430 900679 892203 864800 847506 859639 779318 735835
2854G35835J08685q3724L1083R0000j6342q9803n1628O5567J574l9597m6154J16342
$$ 735835 844520 760796 791879 881879 865537 775734 724106 789673 791247 751650 705496 821838
2842H21838n0575L4683O7709m8056j12733O5125r714j4484l356M5986M3902j123
$$ 821838 771263 805946 873655 825599 712866 777991 768277 753793 750437 796423 840325 839202
2830H39202o3643j16416j8605k1540P0494j5845K6123j3927j15153L2813K03393
$$ 839202 775559 659143 640538 618998 689492 673647 699770 685843 570690 603503 806896
2819H06896N6118p858o5909Q479M3552o60o2879J02110K7489p4004k9221L9971
$$ 806896 863014 855156 789247 797726 841278 840618 777739 879849 907338 833334 804113 844084
2807H44084m4498K2568N4466N7503q4630j5235J2130q8659O0464J62504p5012
$$ 844084 799586 822154 876620 934123 849493 834258 846388 757729 818193 980697 905685
2796I05685m9176N6987K2109p6758p9996l0374j09430K6014L8275n429O6023Q1821
$$ 905685 856509 913496 935605 858847 778851 748477 639047 665061 703336 697907 763930 845751
2784H45751m457O6368Q5315L8989r8730j05118r3499k3467j34125J1168J33995
$$ 845751 841294 907662 992977 1031966 933236 828118 734619 711152 577027 588195 722190
2773G22190n7128j7250N6054L7701o172p7833J27929p6109j8565j3567K1069N524
$$ 722190 665062 647812 703866 741567 735395 657562 785491 709382 690817 677250 698319 703843
2761G03843L4009j04703J10615R835q4341J11206L4492j08334j58652M203k4837
$$ 703843 737852 633149 743764 753599 669258 780464 814956 706622 547970 552173 527336
2750E27336M4178r8724n8061K41416J8657j3434K7347l5556L466r4060n6992j7032
$$ 527336 571514 472790 414729 656145 674802 661368 688715 653159 656625 562565 505573 488541
2738D88541Q0875n6429k4070O6618L718K043j90376L7056M6258j03960R7845j5670
$$ 488541 569416 512987 488917 555535 559253 561296 370920 407976 454234 350274 448119 432449
2726D32449j48583P5359J09057j43734Q742k788K5471P3790N688N0416k0287r0917
$$ 432449 283866 359225 468282 324548 333290 330502 355973 429763 435451 485867 465580 374663
2714C74663J10395k8469k7080q7770q0380L1757m2954M6621l6946k2015j33343
$$ 374663 485058 456589 429509 341739 261359 293116 250162 296783 259837 237822 104479
2703A04479J36891J32724J8724o3867j5041O9543r0161j6013j8190p1576J00443
$$ 104479 241370 374094 392818 328951 313910 383453 293292 277279 259089 187513 287956
2692B87956j3992o0320M9369o3789M843j25993o4581J94719J06702j35279p6322
$$ 287956 273964 213644 263013 199224 204067 78074 13493 208212 314914 179635 103313
2681A03313j5004k542M9545J02360m3113J549J4349o763L6208K0593j991m6276
$$ 103313 88309 85767 135312 237672 194559 196108 210457 203694 239902 260495 258504 212228
2669B12228P73q4303o3344M9216q0729M172Q7583K7626J2839Q7290p271j29095
$$ 212228 213001 128698 65354 114570 33841 38013 125596 153222 166061 253351 246080 116985
2657A16985K2843M3718p2052M7819J05613n8394o0803m323K5064J9845r3262o0751
$$ 116985 139828 183546 111494 159313 264926 206532 145729 141406 166470 186315 93053 32302
2645C2302J07639P0631j83139P0130O276m2293O7198K7369p1372R8203R878m0437
$$ 32302 139941 210572 27433 97563 103839 61546 128744 156113 84741 182944 192822 152385
2633A52385L9974J5893J3616j907o6658q7075L5834k8626o082J9916L8186p8575
$$ 152385 192359 208252 221868 219961 153303 66228 102062 73436 67354 87270 125456 46881
2621D6881J03979K0596j5818q15k6258L7029J4584o6325m7841k3356L9028J23427
$$ 46881 150860 171456 155638 154823 128565 165594 180178 113853 66012 42656 81684 205111
2609B05111n8325n1757Q4519k3715Q556n6834q3625O9984L3427k8482J0861P8453
$$ 205111 146786 95029 179548 155833 164389 107555 23930 93914 127341 98859 109720 188173
2597A88173j20234j00601K4444M3899L1420l7546l3327R7901J3576m1393K9660
$$ 188173 67939 -32662 -8218 35681 67101 29555 -3772 94129 107705 66312 95972
2586I5972J1068m1000l0007m1461o3238P0276P2283L106j06980L9746r51O283
$$ 95972 107040 66040 36033 -5428 -68666 1610 73893 76999 -29981 9765 8814 15097
2574A5097K9881O1694p6870N4367K4038j4933J218R2243k9848l2699p6759J19678
$$ 15097 44978 106672 29802 84169 108207 93274 94492 186735 156887 124188 47429 167107
2562A67107m2480m3772n6951k9101R4295l695p7036O1852M3058j13053L2300J4473
$$ 167107 124627 80855 23904 -5197 89098 85403 8367 70219 113277 224 32524 46997
2550D6997L8020O2442j6294j30692P2781k9171J8292n8649P5940r9145P7524L8289
$$ 46997 85017 147459 131165 473 73254 44083 62375 3726 79666 -19479 58045 96334
2538I6334K3544k8543j2279j07728N7401P334p6489j4764m1672Q492K00759j9206
$$ 96334 119878 91335 79056 -28672 28729 36063 -40426 -55190 -96862 -88370 112389 93183
2526I3183o2410M2014p8081l6631R4317k2314o73P9682k0735q7040N6600J2139
$$ 93183 30773 72787 -5294 -41925 52392 30078 29405 109087 88352 1312 57912 70051
2514G0051j28704J17015K7335Q2766j32422J01179J1085r0959l8292q2669j8621
$$ 70051 -58653 58362 85697 168463 36041 137220 148305 57346 19054 -63615 -82236
2503h2236k0397Q7085R3971q1667K1517P9487l9718n171R0122J6235n0900N493
$$ -82236 -102633 -15548 78423 -3244 18273 97760 58042 52871 142993 159228 108328 113821
2491A13821j20428R4785j30388q3600J52358j2997J37997K2354q5075k1506j6622
$$ 113821 -6607 88178 -42210 -125810 26548 13551 151548 173902 88827 67321 50699
2480E0699O2841k3931N806p1584n7714Q4808r2456O7166m429n8708Q348P7712
$$ 50699 113540 89609 95415 23831 -33883 50925 -41531 25635 21206 -37502 -29154 48558
2468D8558K103K7698n3987J2470K9867j9087j0930K4705n4561K3198l4368J01289
$$ 48558 50661 78359 24372 36842 66709 47622 36692 61397 6836 30034 -4334 96955
2456I6955K9204j30757j5656O9603m9322M1022N3592J8819L9448k28428m6908
$$ 96955 126159 -4598 -20254 49349 27 41049 94641 113460 152908 -75520 -122428
2445a22428r823L6652J91653l1759r5276k4233L9914q0479M2527J73117n56j16360
$$ -122428 -132251 -95599 96054 64295 -30981 -55214 -15300 -95779 -53252 119865 119309 2949
2433B949J5573j9807p2232L271L2724J327l989L615R5154j18129n1316k6906K4905
$$ 2949 18522 -1285 -73517 -70246 -37522 -36195 -40184 -36569 58585 -59544 -110860 -137766 -112861
2420a12861J47360k7611R2540j11792k5115R8266L713j09262M5031r1768J62113
$$ -112861 34499 6888 99428 -12364 -37479 60787 64500 -44762 269 -91499 70614
2409G0614R913l7573l2679Q301j04610L3887K250N984R4165o3050j10903M5035
$$ 70614 80527 42954 10275 18576 -86034 -52147 -49897 -43913 50252 -12798 -123701 -78666
2397g8666M7634J6589J08143P3665n2859J8089n4838j08707J2743N9983r3323
$$ -78666 -31032 -14443 93700 167365 114506 132595 77757 -30950 -18207 41776 -51547
2386e1547r5480p888J06867J38965j36186k4265L2256N095L2713j01217N9217
$$ -51547 -147027 -154915 -48048 90917 -45269 -69534 -37278 -32183 530 -100687 -41470
2375d1470K8124m6501N8414N0743J6667j09328l6271J9198K3051K3736K9251j5875
$$ -41470 -13346 -59847 -1433 49310 65977 -43351 -79622 -60424 -37373 -13637 15614 -261
2363b61l4082j17973j3331R8635N7047m066L3986N8507j13476O2594n1202l8488
$$ -261 -34343 -152316 -165647 -67012 -9965 -14031 19955 78462 -35014 27580 -23622 -62110
2351f2110O4416O0382j08958L5971L5332j7657j6471m0095O2869p6365J21175
$$ -62110 2306 62688 -46270 -10299 25033 7376 -9095 -49190 13679 -62686 58489
2340E8489q2184M2183N7760L1279k9999q2351K6202J4006j27711L2207o6005M7816
$$ 58489 -23695 18488 76248 107527 77528 -4823 21379 35385 -92326 -60119 -126124 -78308
2328g8308L9090M8408R0936n0475j60687K6350J20786M9322j6250j39726J04939
$$ -78308 -39218 9190 100126 49651 -111036 -84686 36100 85422 69172 -70554 34385
2317C4385K00194j17750j5642M028J13537J9717r6362q2761J80941P4186j17123
$$ 34385 234579 116829 101187 105215 218752 238469 142107 59346 240287 314473 197350
2306A97350K3693L0948O5634P8654K3598M3194J6813o2742l4119k02587n0805
$$ 197350 221043 251991 317625 396279 419877 463071 479884 417142 383023 180436 129631
2295A29631O1396j11423q5723J92410p6537m2609O0717j5948L3110p8955o460
$$ 129631 191027 79604 -6119 186291 109754 67145 127862 111914 145024 66069 59609
2284E9609L748p989J6939J12797j02703J266M3130l3325J6206L681n7473j30293
$$ 59609 63357 55368 72307 185104 82401 83667 126797 93472 109678 113359 55886 -74407
2272g4407J31042L5322L0980n513k1210Q9874k2257N7627n3857n2053k8599O4636
$$ -74407 56635 91957 122937 117424 96214 186088 163831 221458 167601 115548 86949 151585
2260A51585m9045j28020P1022Q7445O6478k4758q3553j49423J20345Q878L33j7275
$$ 151585 102540 -25480 45542 132987 199465 174707 91154 -58269 62076 70954 71287 54012
2248E4012O9316j12996r5621Q9578L8721O4663M8275m6861L6636n4379K8778j5365
$$ 54012 123328 10332 -85289 4289 43010 107673 155948 109087 145723 91344 120122 104757
2236A04757Q5639r5058L0229r5748p6897Q2353j0522J02285L2168k7694m58l5571
$$ 104757 190396 95338 125567 29819 -47078 35275 24753 127038 159206 131512 131054 95483
2224I5483M3413j1085j569L2922m0841m2645o3884J32303K5873l6539n824R9832
$$ 95483 138896 127811 126242 159164 118323 75678 11794 144097 169970 133431 127607 227439
2212B27439R299j41472m4659O2847P1093N0185j35972N4151M9867p3689l3602
$$ 227439 236738 95266 50607 113454 184547 234732 98760 152911 202778 129089 95487
2201I5487p2182M3612J26135M7888K9971j3287o8328n5381p631l7253P9116J7344
$$ 95487 23305 66917 193052 240940 270911 257624 189296 133915 126284 89031 168147 185491
2189A85491R7055n5269j46894J4166L9673N4358L1945K8212O222k929J44184l5180
$$ 185491 282546 227277 80383 94549 134222 188580 220525 248737 254959 252030 396214 361034
2177C61034N5442r1722p2029K2478O9654N2445q4101J26162R6943o1733k1306
$$ 361034 416476 324754 252725 275203 344857 397302 313201 439363 536306 474573 453267
2166D53267K322L2597R1688O612l0498m5033K348K1318p9662M5583Q2953j3932
$$ 453267 455589 488186 579874 586486 555988 510955 513303 534621 454959 500542 583495 569563
2154E69563l5201m5019N6382o050O6016Q5809r0885m5991L6743P1422L1847N3634
$$ 569563 534362 489343 545725 539675 605691 691500 600615 554624 591367 662789 694636 748270
2142G48270l6817j09343N1168P5467J7427O8138J41662O060J4586J8487N2345
$$ 748270 711453 602110 653278 728745 746172 814310 955972 962032 976618 995105 1047450
2131A047450P170J16847K7719J07680j1260J3987j14812P0508R1648k5354R8498
$$ 1047450 1054620 1171467 1199186 1306866 1295606 1309593 1194781 1265289 1356937 1331583 1430081
2120A430081J85591K6351J56608Q1534n979L7568P9025Q019K5765J49618j536
$$ 1430081 1615672 1642023 1798631 1880165 1874186 1911754 1990779 1998798 2024563 2174181 2172645
2109B172645Q1921k432J15237N9445J47863n6002o839J19957K0350J38148R7824
$$ 2172645 2254566 2252134 2367371 2426816 2574679 2518677 2511838 2631795 2652145 2790293 2888117
2098B888117Q7387J69339Q8225J84944Q6359J67141J53872N3586K18950K41615
$$ 2888117 2975504 3144843 3233068 3418012 3504371 3671512 3825384 3878970 4097920 4339535
2088D339535J76209K77170J96091L50338L37724M75678M57055N32267N00528N59657
$$ 4339535 4515744 4792914 4989005 5339343 5677067 6152745 6609800 7142067 7642595 8202252
2078H202252P68273R21116J264166J159518J162507J316061J472844J885863K257986
$$ 8202252 8970525 9891641 11155807 12315325 13477832 14793893 16266737 18152600 20410586
2069B0410586K765353L022651L587172N036331O467502P985393J0792566Q474537
$$ 20410586 23175939 26198590 29785762 34822093 41289595 49274988 60067554 68542091
2061F8542091n15275o286048j0579478j1474368q125855n462480m055042k983983
$$ 68542091 68026816 61740768 51161290 39686922 31561067 26098587 22043545 19059562
2053A9059562j968437j562600j232047j033535p16061q15231q19396r02763r33973
$$ 19059562 17091125 15528525 14296478 13262943 12546882 11731651 10912255 10009492 9075519
2044I075519p67538o40167n64325m81624m72292l56827k90828j08868k11922j86327
$$ 9075519 8307981 7667814 7103489 6621865 6149573 5792746 5501918 5393050 5181128 4994801
2034D994801j29887k85596k90767l06514j11101j74776j92835j91287j80134r5091
$$ 4994801 4864914 4579318 4288551 3982037 3870936 3696160 3503325 3312038 3131904 3036813
2024C036813j35030k16951j22462r6531r6347p7944q4655j91015j72995l5528
$$ 3036813 2901783 2684832 2562370 2465839 2369492 2291548 2206893 2015878 1842883 1807355
2014A807355P2843m9880l0197K0236q3470k0809M088J364j2786j11830q9444L2555
$$ 1807355 1880198 1830318 1800121 1820357 1736887 1716078 1720166 1721530 1708744 1596914 1507470 1540025
2002A540025l5j38507q7242m6178p5886N3387j6652l878j6918p5273j06743j3440
$$ 1540025 1539990 1401483 1314241 1268063 1192177 1245564 1228912 1225034 1208116 1132843 1026100 1012660
1990A012660J2501o2434L1185Q42j10253K2941q2691l916n2140N8837J47951j23919
$$ 1012660 1025161 962727 993912 994754 884501 907442 824751 820835 768695 827532 975483 851564
1978H51564j20460k1682L0561p6186N2692j21340k5429N6892m4606j4181R459
$$ 851564 731104 709422 739983 663797 716489 595149 569720 626612 582006 567825 577284
1967E77284Q916J7676m7490n6473p3505n4784M2526m2250j4695j1984j29665P0547
$$ 577284 586200 603876 556386 499913 426408 371624 414150 371900 357205 345221 215556 286103
1955B86103N8189L5486n9212O5524o5225o1393m2432P1308J78819m5230k5863
$$ 286103 344292 379778 320566 386090 320865 259472 217040 288348 467167 421937 396074
1944C96074m4966P7268n2927M3009K8223m4235j00642j10904r0376O7369K2959
$$ 396074 351108 428376 375449 418458 446681 402446 301804 190900 100524 167893 190852
1933A90852O496J13751N561m8650l5072p4868Q945R1553Q0783J37339j08768k17302
$$ 190852 197348 311099 316660 268010 232938 158070 167015 258568 339351 476690 367922 150620
1921A50620J34503O5965j40865j71950j5453Q7604Q5599J1418q2297l2053k0159
$$ 150620 285123 351088 210223 38273 22820 110424 196023 207441 125144 93091 72932
1910G2932J3487N1983J02457o0483j18996P024J55923j20719N4549O7391o7242
$$ 72932 86419 138402 240859 180376 61380 68404 224327 103608 158157 225548 158306
1899A58306n1773Q9069P417r9644K3193L6314Q5473k8465k2481q6254K1787Q1503
$$ 158306 106533 195602 203019 103375 126568 162882 248355 219890 197409 111155 132942 214445
1887B14445j6528r0369M1198n3819J3912n0670M4745n3282j34754J44405J9604
$$ 214445 197917 107548 148746 94927 108839 58169 102914 49632 -85122 59283 78887
1876G8887j4513J32053j27050j0087l7806r874J27127l9719k2657N4k4333J12229
$$ 78887 64374 196427 69377 59290 21484 11610 138737 99018 76361 76415 52082 164311
1864A64311M773n7374L6752J571M3326j57581J32707k3708l616j1229P7549p2048
$$ 164311 169084 111710 148462 150033 193359 35778 168485 144777 141161 129932 207481 135433
1852A35433l5235L1605j13881R9606j0559Q2308q8157K8131J02105j15702P3316
$$ 135433 100198 131803 17922 117528 106969 189277 101120 129251 231356 115654 188970
1841A88970o7883j20972J8488R0457K2948J24l6964L165K5175R8548J11657r4596
$$ 188970 121087 115 18603 109060 132008 132132 95168 98333 123508 222056 333713 239117
1829B39117n6166r3882n7569j06400K09536O1903j7124J55547p1581m4696J71860
$$ 239117 182951 89069 31500 -74900 134636 196539 179415 334962 263381 218685 390545
1818C90545M0619j27092m0586k1708m4788o4966k8053J7541m4090l9178M4228
$$ 390545 431164 304072 263486 241778 196990 132024 103971 121512 77422 38244 82472
1807H2472n3385k4789J31736j3248M5535r8165q9183j6101K8717M4496m0070k3085
$$ 82472 29087 4298 136034 122786 168321 70156 -19027 -35128 -6411 38085 -1985 -25070
1795b5070R3778l2771K3530k7840P0479M7936j01135R2943j07042J1529Q7277
$$ -25070 68708 35937 59467 31627 102106 150042 48907 141850 34808 46337 133614
1784A33614n9893p2819O3696N2912k9798J9158L6436q3717l7765K9969L3980R7222
$$ 133614 73721 902 64598 117510 87712 106870 143306 59589 21824 51793 85773 182995
1772A82995Q3852l1750r2516q952q3792P0213P968k2370K4328q2412l7398r8362
$$ 182995 266847 235097 142581 133629 49837 120050 128018 105648 129976 47564 10166 -88196
1760h8196K1484Q6872r0477n1574O5839J997Q6520k858r0853r9560Q5409J12531
$$ -88196 -66712 20160 -70317 -121891 -56052 -54055 32465 29607 -61246 -160806 -75397 37134
1748C7134j1898p6007O7719O1224n7004j60810k6022J0740N8734K6948R8582p6211
$$ 37134 25236 -50771 16948 78172 21168 -139642 -165664 -154924 -96190 -69242 29340 -46871
1736d6871J08067J19091j18111m2630p3591J29601L2935p3382j28557m7285J41920
$$ -46871 61196 180287 62176 19546 -54045 75556 108491 35109 -93448 -140733 1187
1725A187l5080M8304k8464L3790j6902M308m1984J6157J47712q4855Q1580j00969
$$ 1187 -33893 14411 -14053 19737 2835 7143 -34841 -18684 129028 44173 125753 24784
1713B4784j36293J16395O0123o0942j0292n5018n9233R077J36046K5599q1858
$$ 24784 -111509 4886 65009 4067 -6225 -61243 -120476 -111399 24647 50246 -31612
1702c1612Q4987k0269m155Q57j11847o3996O0944J70261m5709k5304K0604o4645
$$ -31612 53375 33106 28951 29808 -82039 -146035 -85091 85170 39461 14157 34761 -29884
1690b9884j36207k6201J74613n1298k5922P0813P0550l6469k9990q0677k2631
$$ -29884 -166091 -192292 -17679 -68977 -94899 -24086 46464 9995 -19995 -100672 -123303
1679a23303J34759p0567j42043J13457J40319n0612l0874o3371L8922N4630r1180
$$ -123303 11456 -59111 -201154 -87697 52622 2010 -28864 -92235 -53313 1317 -89863
1668h9863O1129M0403o6134J65719j43611j3260J10029j36012q0526R9862M6760
$$ -89863 -28734 11669 -54465 111254 -32357 -45617 64412 -71600 -152126 -52264 -5504
1657e504J62656n9840r6560M9859o6288j0577n8814o1869P3350Q101M9725K1408
$$ -5504 157152 97312 752 50611 -15677 -26254 -85068 -146937 -73587 -65486 -15761 5647
1645E647j9715k8793m5448O7895p3339j4466O0550o921j1588L9144P5221j12705
$$ 5647 -14068 -42861 -88309 -20414 -93753 -108219 -47669 -54590 -66178 -27034 48187 -64518
1633f4518Q1789M7491L998J8305n1484K0379J838o1559J05634k4317j81032J72816
$$ -64518 17271 64762 68760 87065 35581 55960 57798 -3761 101873 77556 -103476 69340
1621F9340p0410l5231N0583n0387q1838m9365J19899P4608r341k59126K25626
$$ 69340 -1070 -36301 14282 -36105 -117943 -167308 -47409 27199 17858 -241268 -15642
1610a5642R4517r0012o1704L1100m739p6976o2147J03511M3062j8947Q7482j10098
$$ -15642 78875 -11137 -72841 -41741 -46480 -123456 -185603 -82092 -39030 -57977 29505 -80593
1598h0593L5969K1350k9211J0083J5292O9623j09114p6426J31464n9994n6441
$$ -80593 -44624 -23274 -52485 -42402 -27110 42513 -66601 -143027 -11563 -71557 -127998
1587a27998l9170Q4252j5831J35523j6747J01219J4817j17189j40214j5574J03759
$$ -127998 -167168 -82916 -98747 36776 20029 121248 136065 18876 -121338 -136912 -33153
1576c3153J4553m3323j7467L554n9423R9288L6477o7219K8182j6561Q4160p5557
$$ -33153 -18600 -61923 -79390 -75836 -135259 -35971 506 -66713 -38531 -55092 29068 -46489
1564d6489M4469L5568r6846r952J45395l1499p2274P7188n2312m0740J2186M4763
$$ -46489 -2020 33548 -63298 -73250 72145 40646 -31628 45560 -6752 -47492 -35306 9457
1552I457r7566N8873M0117l4783K9821N9263L9039J3326m8406L5507L3130m6770
$$ 9457 -88109 -29236 10881 -23902 5919 65182 104221 117547 69141 104648 137778 91008
1540I1008j00325K7496P7498R297n5166j56995P8308n9651o2029Q6166O1917q177
$$ 91008 -9317 18179 95677 104974 49808 -107187 -28879 -88530 -150559 -64393 -2476 -10653
1528a0653J8122j09192J27759R2636l8483j06514m7774K1782J21804L074K2427
$$ -10653 7469 -101723 26036 118672 80189 -26325 -74099 -52317 69487 72561 94988
1517I4988L9811j25002q1007n2960L6492r446K981M606P7931k8895N369J2403
$$ 94988 134799 9797 -71210 -124170 -87678 -97124 -94143 -89537 -11606 -40501 -35132 -22729
1505b2729P7991j29020r3899m753J829J73765K6646j59619j0356J95168l5345
$$ -22729 55262 -73758 -167657 -172410 -170581 3184 29830 -129789 -140145 55023 19678
1494A9678n2295K1539o3948o1720J1550N1807j6031L9234O5624N9462j42930O0265
$$ 19678 -32617 -11078 -75026 -136746 -125196 -73389 -89420 -50186 15438 74900 -68030 -7765
1482g765m975l2096N5266J8832j18310j2655K2824L0026m1071J12622j2886K2000
$$ -7765 -12740 -44836 10430 29262 -89048 -101703 -78879 -48853 -89924 22698 9812 31812
1470C1812r1727P544J36131m1859M7659l3136k03215N1527J94816q5455j5290
$$ 31812 -59915 -52371 83760 41901 89560 56424 -146791 -95264 99552 14097 -1193
1459a193J7002K6683M1795j10164k470L854j3783L989r1949k7918n8931J25372
$$ -1193 15809 42492 84287 -25877 -28347 -24493 -38276 -34287 -126236 -154154 -213085 -87713
1447h7713O47k640K5284k3456L9042J35454j27471q7103N5572O3089j29974P5795
$$ -87713 -87066 -89706 -64422 -87878 -48836 86618 -40853 -127956 -72384 -9295 -139269 -63474
1435f3474j3421J7631o1364l667J46138q07P6602l4005m3319M6699n400j49058
$$ -63474 -76895 -59264 -120628 -124295 21843 21036 97638 63633 20314 67013 61613 -87445
1423h7445R8476o4670j01915J21765N7889q707p2854l6673J7644N530Q233m6184
$$ -87445 11031 -53639 -155554 -33789 24100 15393 -57461 -94134 -76490 -70960 -62727 -108911
1411a08911J30108M2788J9945o0741K8059n0160K170n4713L2008J04635l9137
$$ -108911 21197 63985 83930 23189 51248 1088 3258 -51455 -19447 85188 46051
1400D6051K5017j17839r6210P2696J60946l7904q7768J7484j62862N8480R3328
$$ 46051 71068 -46771 -142981 -70285 90661 52757 -35011 -17527 -180389 -121909 -28581
1389b8581j14403M591M325j496O4421R222Q917K4095o3776Q0163L5157M1031n9755
$$ -28581 -142984 -138393 -134068 -135564 -71143 -61921 -53004 -28909 -92685 -12522 22635 63666 3911
1376C911O102M0561j13501Q7304J1876n4166K4901j8778l4213k6675O1378j04142
$$ 3911 10013 50574 -62927 24377 36253 -17913 6988 -11790 -46003 -72678 -11300 -115442
1364a15442J0680m8631L8114K1378K8031q174l9019k5355P9128P3268m7720l8997
$$ -115442 -104762 -153393 -115279 -93901 -65870 -74044 -113063 -138418 -59290 13978 -33742 -72739
1352g2739O2925n025j07392k238M7637J9584m0534N1258j3999O0770r804j9186
$$ -72739 -9814 -14839 -122231 -124469 -76832 -57248 -97782 -46524 -60523 247 -9557 -28743
1340b8743r9234L9200N938J14505M3761J5762J29246j02591q8314n0526K1482
$$ -28743 -127977 -88777 -82839 31666 75427 91189 220435 117844 29530 -20996 486
1329D86m3990M8436M2702k9963n4532l4563K3458Q8522p9488n0304P6654L9279
$$ 486 -43504 4932 47634 17671 -36861 -71424 -47966 40556 -38932 -89236 -12582 26697
1317B6697J4955K9176q049p9267j02055J3909l2402k8136n6167M3393P2421L4900
$$ 26697 41652 70828 62779 -16488 -118543 -104634 -137036 -165172 -221339 -177946 -105525 -70625
1305g0625O9882L3530L0237M131K167k0569P5432q4921k179K2783j6218j4655
$$ -70625 -743 32787 63024 67155 69322 48753 124185 39264 37085 59868 43650 28995
1293B8995n2625j22785Q3209l1041J0667O8940p4992L042J00599p3130p9606J95098
$$ 28995 -23630 -146415 -63206 -94247 -83580 -14640 -89632 -86590 14009 -59121 -138727 56371
1281E6371k4948J1918k5000M8974K8645j27163J0688o24j24277J8250J29931J45314
$$ 56371 31423 43341 18341 67315 95960 -31203 -20515 -21139 -145416 -127166 2765 148079
1269A48079q8031o5261l0166k4976J04888K9629j23492o5710O4890j5468K9592
$$ 148079 60048 -5213 -35379 -60355 44533 74162 -49330 -115040 -50150 -65618 -36026
1258c6026N4612L7900P9842m3727l562j13101n6206O527k1972P0566L3626o0874
$$ -36026 18586 56486 136328 92601 89039 -24062 -80268 -73741 -95713 -25147 8479 -52395
1246e2395M561k8258j0627r320O993Q5334O8950K7939o3064m3481Q544K397q8098
$$ -52395 -47834 -76092 -86719 -96039 -89046 -3712 65238 93177 30113 -13368 -4824 -2427 -90525
1233i0525M904o0145O8395J32131J2649j00346Q9170j00469M792M841O1114j3456
$$ -90525 -85621 -145766 -77371 54760 67409 -32937 56233 -44236 -39444 -34603 26511 13055
1221A3055N1940q8337M8392r1317N4275N4915N0600P1109q7089n3265j154p0926
$$ 13055 64995 -23342 25050 -66267 -11992 42923 93523 164632 77543 24278 23124 -47802
1209d7802P5808R8025m9374j16615o8593M3495j7818R4064l5912J2567r332M9745
$$ -47802 28006 126031 76657 -39958 -108551 -65056 -82874 11190 -24722 -12155 -21487 28258
1197B8258r9867l9780M4619K7589N5097R8228j01061n3027O0000J3335j52802
$$ 28258 -71609 -111389 -66770 -39181 15916 114144 13083 -39944 20056 33391 -119411
1186a19411J2018j9631R9748n674j16059L3844K2563J5209J06109J035R194j4473
$$ -119411 -107393 -127024 -27276 -32950 -149009 -115165 -92602 -77393 28716 29751 38945 24472
1174B4472o2244M241o9849k9539P7225J12302n1915l9479m889l4028k2275l1961
$$ 24472 -37772 -33531 -103380 -132919 -55694 56608 4693 -34786 -39675 -73703 -95978 -127939
1162a27939P6406J69709K1803k43050J043l8979J05482l6435j0306L4929K2099
$$ -127939 -51533 118176 139979 -103071 -102028 -141007 -35525 -71960 -82266 -47337 -25238
1151b5238j9813j1548N1022p389k2583r3169L5395N635L9721k6138J19075r4750
$$ -25238 -45051 -56599 -5577 -12966 -35549 -128718 -93323 -87688 -47967 -74105 44970 -49780
1139d9780m0234K2272k6458N0108L4714j1673q7646J39091q5778l8968P4134q2320
$$ -49780 -90014 -67742 -94200 -44092 -9378 -21051 -108697 30394 -55384 -94352 -20218 -102538
1127a02538j6801p3700k5808J82800N9977K5079P7417j10760P8356o5512j3318
$$ -102538 -119339 -193039 -218847 -36047 23930 49009 126426 15666 94022 28510 15192
1116A5192p843M834k5521K2729o3775p3860J04990m934P0619K0189o6766o1213
$$ 15192 7349 12183 -13338 9391 -54384 -128244 -23254 -28188 42431 62620 -4146 -65359
1104f5359P4751j3421N1522J3059K5741j55934l6151J5290m6483J14799l669l8348
$$ -65359 9392 -4029 47493 60552 86293 -69641 -105792 -90502 -136985 -22186 -25855 -64203
1092f4203p547O1083l6414o6469J44920J6047q4573P7868K7520k0375q1011k9039
$$ -64203 -71750 -10667 -47081 -113550 31370 47417 -37156 40712 68232 47857 -33154 -62193
1080f2193J18049M7421p119Q260j12168j0731n4001R2518j1059k8527o1123J4377
$$ -62193 55856 103277 96158 104418 -7750 -18481 -72482 20036 8977 -19550 -80673 -66296
1068f6296J4359J40026q057n0741J7889k3379n2276Q9267L7807n138o0773j32374
$$ -66296 -51937 88089 80032 29291 47180 23801 -28475 60792 98599 93461 32688 -99686
1056i9686P051j2450m7472J1316Q7963j1383P6248M0469R7761k25155L6797P4143
$$ -99686 -92635 -105085 -152557 -141241 -53278 -64661 11587 52056 149817 -75338 -38541 35602
1044C5602l4864J5853R0629j56613L6422J6602n3861q448N4063J84175m0547o1453
$$ 35602 738 16591 107220 -49393 -12971 3631 -50230 -58678 -4615 179560 139013 77560
1032G7560l0911L4378p2118q334L4333k037j15019L263L4335n441Q9873K0525
$$ 77560 46649 81027 8909 575 34908 32871 -82148 -78885 -44550 -49991 39882 60407
1020F0407p074L6514j27406j03966l7917J3793J44459k5060j16500L7521N1478
$$ 60407 53333 89847 -37559 -141525 -179442 -165649 -21190 -46250 -162750 -125229 -73751
1009g3751l8898J08790O2727m8440m9071K344R8272q6108k2326M4852m5974o2481
$$ -73751 -112649 -3859 58868 10428 -38643 -36299 61973 -24135 -46461 -1609 -47583 -110064
997a10064N0493L1972O609j7295O197J2556K5491L8433M3428j2449O2416J549
$$ -110064 -59571 -27599 -20990 -38285 -32088 -19532 5959 44392 87820 75371 137787 139336
985A39336J4474j9574j0443m9750j46961M5689q2572O2050j8109J9265j7264m1174
$$ 139336 153810 134236 123793 74043 -72918 -27229 -109801 -47751 -65860 -46595 -63859 -105033
973a05033J40080q1863p2660l481l4429j0026J14852K4649J27451J8903j34781
$$ -105033 35047 -46816 -119476 -122957 -157386 -167412 -52560 -27911 99540 118443 -16338
962a6338J21564L0426j36979p1322M7667M9331r0971r6574O4405Q7323o8567Q4402
$$ -16338 105226 135652 -1327 -72649 -24982 24349 -66622 -163196 -98791 -11468 -80035 4367
950D367n887n4962m1330l2216L8800R9917l5920k2873J2442L1371M4182j00502
$$ 4367 -1520 -56482 -97812 -130028 -91228 8689 -27231 -50104 -37662 -6291 37891 -62611
938f2611O1706j56712k6858R4158Q6937N0773Q598N1057o8145k0770l4639K173
$$ -62611 -905 -157617 -184475 -90317 -3380 47393 55991 107048 38903 18133 -16506 -14333
926a4333K2460Q9284p1386l7071K0739m889j8121l3028N5159M9724o4987j0047
$$ -14333 8127 97411 26025 -11046 9693 4804 -13317 -46345 8814 58538 -6449 -16496
914a6496O3628p9296J48560q9377j01587J67212p6237j13723J06794o1408K8854
$$ -16496 47132 -32164 116396 27019 -74568 92644 16407 -97316 9478 -51930 -23076
903b3076M4443j10276Q477O3651k0481N0656j4294n5494k7042J75454o5123O679
$$ -23076 21367 -88909 -80432 -16781 -37262 13394 -900 -56394 -83436 92018 26895 33574
891C3574N7663j06071n94L9368K9875K0470q0346R1294M818q5169M1534o972j04055
$$ 33574 91237 -14834 -15428 23940 53815 74285 -6061 85233 90051 4882 46416 39444 -64611
878f4611O8695P304N6038O125j31080m1982L0750L2627L0104L0151N7785q6336
$$ -64611 4084 11388 67426 73551 -57529 -99511 -68761 -36134 -6030 24121 81906 -4430
866d430k8543P9363J2934M2534j25424m7042j04807J56628Q3937k2819k4151L0810
$$ -4430 -32973 46390 59324 101858 -23566 -70608 -175415 -18787 65150 42331 18180 48990
854D8990o3160j24944O7037J85113j6917K297n606M3435j05256L1008j3461r0935
$$ 48990 -14170 -139114 -72077 113036 96119 98416 92810 136245 30989 61997 48536 -42399
842d2399k9431K3003o711Q1660j18756m6714J11916q8163O500P5402r271p1078
$$ -42399 -71830 -48827 -55538 26122 -92634 -139348 -27432 -115595 -109095 -33693 -42964 -114042
830a14042Q8325k4231J7355k7796k9047o215L7909n4924J28434L2052o6232P8826
$$ -114042 -25717 -49948 -32593 -60389 -89436 -95651 -57742 -112666 15768 47820 -18412 60414
818F0414p0951Q161j3940j9484j5504J7764r535J07311r0406l6817M4403J6440
$$ 60414 -10537 -2376 -16316 -35800 -51304 -33540 -43075 64236 -26170 -62987 -18584 -2144
806b144k4709k0821R2843p3412p2563J68268q3221q1336R4910n0544M7480O3558
$$ -2144 -26853 -47674 45169 -28243 -100806 67462 -15759 -97095 -2185 -52729 -5249 58309
794E8309k6759M710O2201o7093j8432L0036p1748M6553L0726k2419j06474j20998
$$ 58309 31550 36260 98461 31368 12936 42972 -28776 17777 48503 26084 -80390 -201388
782b01388J50573J09599J5172r4857k8810L1265P8043j05822R2424M8347O1027
$$ -201388 -50815 58784 73956 -20901 -49711 -18446 59597 -46225 46199 94546 155573
771A55573n1895p3090J36803j8194j18805o6754L8645J9573M8828j18388j6979
$$ 155573 103678 30588 167391 149197 30392 -36362 2283 21856 70684 -47704 -64683
760f4683J0251j1436J7294J14803o4838n2340k3952m5632J13356O2636p5075o095
$$ -64683 -54432 -65868 -48574 66229 1391 -50949 -74901 -120533 -7177 55459 -19616 -25711
748b5711R0560l9381L6887p2105q8847j466O8028m2065J8184J15564p7936o2497
$$ -25711 64849 25468 62355 -9750 -98597 -100063 -32035 -74100 -55916 59648 -18288 -80785
736h0785N1911P4076k8773M3020J7204J0457j09701N2062J5899j41496L0662J8036
$$ -80785 -28874 45202 16429 59449 76653 87110 -22591 29471 45370 -96126 -65464 -47428
724d7428Q3218K3386n1920O4234J62123k3653p4846m6248j25702L3662k1778J5596
$$ -47428 35790 59176 7256 71490 233613 209960 135114 88866 -36836 -3174 -24952 -9356
712i356J33881j30128j1028j429n5329J29576p9558P553Q0416n712n9451r6021
$$ -9356 124525 -5603 -16631 -18060 -73389 56187 -23371 -15818 64598 58886 -565 -96586
700i6586J33321p038p9517r3948O2586J02502L279n4523l1760q3724M2833K4375
$$ -96586 36735 29697 -49820 -143768 -81182 21320 24599 -29924 -61684 -145408 -102575 -78200
688g8200N0428j8969P985J71535k0748j17375L079J0453j6445j4235j7208M8685
$$ -78200 -27772 -46741 -38756 132779 112031 -5344 -2265 8188 -8257 -22492 -39700 8985
676H985O5666m7443L0077J2390M4073j05668j5488L2703l035n2224J10488R243
$$ 8985 74651 27208 57285 69675 113748 8080 -7408 25295 22260 -29964 80524 89767
664H9767o6074o2633O4933L7167r9110R9971j08683J21602M3856p8102K1807j404
$$ 89767 23693 -38940 25993 63160 -35950 64021 -44662 76940 120796 42694 64501 63097
652F3097l559R2140j32282n6138K7904P29L1594Q1734L1553m1126o1498K7132
$$ 63097 59538 151678 19396 -36742 -8838 -8109 23485 105219 136772 95646 34148 61280
640F1280j9572j6424p250L4757n8651n7568m1180J6353K9101K9229j7149P7258
$$ 61280 41708 25284 18034 52791 -5860 -63428 -104608 -88255 -59154 -29925 -47074 30184
628C0184L2065o6638p4790K198Q8059n0344n1798K8275O3011L0022J2258Q3874
$$ 30184 62249 -4389 -79179 -76981 11078 -39266 -91064 -62789 222 30244 42502 126376
$$ [...]
##END NTUPLES=NMR SPECTRUM
##END=
