##TITLE=1H_EC-3256(XV-4)
 CDCl3
 8 sc, 
 26.9.2023
##JCAMPDX= 6.0         $$ Bruker NMR JCAMP-DX V2.0
##DATA TYPE= NMR SPECTRUM
##DATA CLASS= NTUPLES
##ORIGIN= UXNMR, Bruker Analytische Messtechnik GmbH
##OWNER= root
$$ XWIN-NMR		Version 3.5
$$ Tue Sep 26 14:01:38 2023 Russian Standard Time (UT+4h)  she@DPX200
##.OBSERVE FREQUENCY= 200.13135
##.OBSERVE NUCLEUS= ^1H
##.ACQUISITION MODE= SIMULTANEOUS
##.ACQUISITION SCHEME= undefined
##.AVERAGES= 8
##.DIGITISER RES= 18
##SPECTROMETER/DATA SYSTEM= spect
##.PULSE SEQUENCE= zg30
##.SOLVENT NAME= CDCl3
##.SHIFT REFERENCE= (INTERNAL, CDCl3, 0, 15.781)
##AUDIT TRAIL= $$ (NUMBER, WHEN, WHO, WHERE, WHAT)
$$ ##TITLE= Audit trail, XWIN-NMR		Version 3.5
$$ ##JCAMPDX= 5.01
$$ ##ORIGIN= Bruker BioSpin GmbH
$$ ##OWNER= she
$$ F:/spectra/data/she/nmr/H-F/1/pdata/1/auditp.txt
$$ ##AUDIT TRAIL=  $$ (NUMBER, WHEN, WHO, WHERE, WHAT)
(   1,<2023-09-26 13:59:22.21 +0400>,<she>,<DPX200>,
      <created by zg, POWCHK disabled, PULCHK disabled
       configuration hash MD5:
       00 E9 B6 7A A2 85 ED C7 34 08 36 98 17 FE 4E 26
       data hash MD5: 16K
       1B 3E 59 37 67 3E D2 15 AD 6F C4 CA 90 60 B1 D7>)
(   2,<2023-09-26 13:59:24.60 +0400>,<she>,<DPX200>,
      <Start of raw data processing
       efp BC_mod = 2 LB = 0.24 FT_mod = 6 PKNL = 1 PHC0 = -21712.85 PHC1 = 12.45271 SI = 16K 
       data hash MD5: 16K
       92 A5 FD 2D BF EA 1E 92 10 51 83 A9 58 45 6E E6>)
(   3,<2023-09-26 13:59:28.26 +0400>,<she>,<DPX200>,
      <abs ABSG = 5 
       data hash MD5: 16K
       DA 95 EE BD 11 23 C8 C3 FA AC 6B FA 6B A1 83 CE>)
(   4,<2023-09-26 13:59:44.71 +0400>,<she>,<DPX200>,
      <pk PHC0 = -0.5231922 PHC1 = 0.9999999 
       data hash MD5: 16K
       1A E0 00 8E 1D EE E4 B3 C3 01 B6 6D 5D 49 9F E9>)
(   5,<2023-09-26 13:59:48.56 +0400>,<she>,<DPX200>,
      <abs ABSG = 5 
       data hash MD5: 16K
       D1 51 24 11 14 69 EA 68 4F 03 7F 48 85 E6 0C 43>)
(   6,<2023-09-26 14:00:39.28 +0400>,<she>,<DPX200>,
      <pk PHC0 = 0.7655267 PHC1 = -1.199999 
       data hash MD5: 16K
       D0 5B CE D7 CE DF B6 2F 2D ED E0 86 F1 E8 DC 67>)
(   7,<2023-09-26 14:00:43.90 +0400>,<she>,<DPX200>,
      <abs ABSG = 5 
       data hash MD5: 16K
       67 43 38 58 9D 83 E0 52 D6 F3 62 45 68 E4 68 C8>)
$$ ##END=
$$ 
$$ hash MD5
$$ 8A C6 45 B6 34 11 33 B6 28 6A 87 09 09 40 8B 22
##$RELAX= 
##$RELAX= 
##$RELAX= 
##$RELAX= 
##$RELAX= 
##$RELAX= 
$$ Bruker specific parameters
$$ --------------------------
##$DU= <F:/spectra>
##$EXPNO= 1
##$NAME= <H-F>
##$PROCNO= 1
##$TYPE= <nmr>
##$USER= <she>
##$AMP= (0..31)
100 100 100 100 100 100 100 100 100 100 100 100 100 100 100 100 100 100 
100 100 100 100 100 100 100 100 100 100 100 100 100 100 
##$AQSEQ= 0
##$AQ_mod= 1
##$AUNM= <au_zg>
##$AUTOPOS= <>
##$BF1= 200.13
##$BF2= 200.13
##$BF3= 200.13
##$BF4= 200.13
##$BF5= 200.13
##$BF6= 200.13
##$BF7= 200.13
##$BF8= 200.13
##$BYTORDA= 1
##$CFDGTYP= 0
##$CFRGTYP= 5
##$CHEMSTR= <none>
##$CNST= (0..31)
$$ [...]
##$SUBNAM3= <"">
##$SUBNAM4= <"">
##$SUBNAM5= <"">
##$SUBNAM6= <"">
##$SUBNAM7= <"">
##$SUBNAM8= <"">
##$SUBNAM9= <"">
##$SW= 18.05172834244
##$SWIBOX= (0..15)
0 0 2 0 0 0 0 0 0 0 0 0 0 0 0 0 
##$SW_h= 3612.71676300578
##$TD= 16384
##$TD0= 1
##$TE= 0
##$TE2= 300
##$TE3= 300
##$TEG= 300
##$TL= (0..7)
0 120 120 120 120 120 120 120 
##$TP= (0..7)
150 150 150 150 150 150 150 150 
##$TP07= 0
##$TPNAME0= <>
##$TPNAME1= <>
##$TPNAME2= <>
##$TPNAME3= <>
##$TPNAME4= <>
##$TPNAME5= <>
##$TPNAME6= <>
##$TPNAME7= <>
##$TPOAL= (0..7)
0.5 0.5 0.5 0.5 0.5 0.5 0.5 0.5 
##$TPOFFS= (0..7)
0 0 0 0 0 0 0 0 
##$TUNHIN= 0
##$TUNHOUT= 0
##$TUNXOUT= 0
##$USERA1= <user>
##$USERA2= <user>
##$USERA3= <user>
##$USERA4= <user>
##$USERA5= <user>
##$V9= 5
##$VALIST= <valist>
##$VCLIST= <CCCCCCCCCCCCCCC>
##$VD= 0
##$VDLIST= <DDDDDDDDDDDDDDD>
##$VPLIST= <PPPPPPPPPPPPPPP>
##$VTLIST= <TTTTTTTTTTTTTTT>
##$WBST= 1024
##$WBSW= 4
##$XGAIN= (0..3)
0 0 0 0 
##$XL= 0
##$YL= 0
##$YMAX_a= 514870
##$YMIN_a= -678673
##$ZGOPTNS= <>
##$ZL1= 120
##$ZL2= 120
##$ZL3= 120
##$ZL4= 120
##$ABSF1= 15.78105
##$ABSF2= -2.2708
##$ABSG= 5
##$ABSL= 3
##$ALPHA= 0
##$AQORDER= 0
##$ASSFAC= 0
##$ASSFACI= 0
##$ASSFACX= 0
##$ASSWID= 0
##$AUNMP= <proc_1d>
##$AZFE= 0.1
##$AZFW= 0.1
##$BCFW= 0
##$BC_mod= 2
##$BYTORDP= 0
##$COROFFS= 0
##$CY= -3
##$DATMOD= 1
##$DC= 0
##$DFILT= <>
##$DTYPP= 0
##$F1P= 0
##$F2P= 0
##$FCOR= 1
##$FTSIZE= 16384
##$FT_mod= 6
##$GAMMA= 0
##$GB= 0
##$INTBC= 1
##$INTSCL= 3.70164e-10
##$ISEN= 128
##$LB= 0.24
##$LEV0= 0
##$LPBIN= 0
##$MAXI= 10000
##$MC2= 0
##$MEAN= 0
##$ME_mod= 0
##$MI= 1.114404
##$NCOEF= 0
##$NC_proc= -4
##$NLEV= 6
##$NOISF1= 3.799351
##$NOISF2= 2.8
##$NSP= 0
##$NTH_PI= 0
##$NZP= 0
##$OFFSET= 15.78105
##$PC= 1
##$PHC0= -21712.6
##$PHC1= 12.25271
##$PH_mod= 1
##$PKNL= yes
##$PPARMOD= 0
##$PSCAL= 0
##$PSIGN= 0
##$REVERSE= no
##$SF= 200.129998098511
##$SI= 16384
##$SIGF1= 3
##$SIGF2= 2
##$SINO= 5.538805
##$SIOLD= 16384
##$SREGLST= <1H.CDCl3>
##$SSB= 0
##$STSI= 16384
##$STSR= 0
##$SW_p= 3612.71676300578
##$SYMM= 0
##$S_DEV= 0
##$TDeff= 16384
##$TDoff= 0
##$TI= <>
##$TILT= no
##$TM1= 0
##$TM2= 0
##$TOPLEV= 0
##$USERP1= <user>
##$USERP2= <user>
##$USERP3= <user>
##$USERP4= <user>
##$USERP5= <user>
##$WDW= 1
##$XDIM= 16384
##$YMAX_p= 304446163
##$YMIN_p= -110572
$$ End of Bruker specific parameters
$$ ---------------------------------
##NTUPLES= NMR SPECTRUM
##VAR_NAME=  FREQUENCY,     SPECTRUM/REAL,   SPECTRUM/IMAG
##SYMBOL=    X,             R,               I
##VAR_TYPE=  INDEPENDENT,   DEPENDENT,       DEPENDENT
##VAR_FORM=  AFFN,          ASDF,            ASDF
##VAR_DIM=   16384,         16384,           16384
##UNITS=     HZ,            ARBITRARY UNITS, ARBITRARY UNITS
##FACTOR=    0.220516191357247, 1,           1
##FIRST=     3158.26145213591, 0,            0
##LAST=      -454.455310869871, 0,           0
##MIN=       -454.455310869871, -110572,     0
##MAX=       3158.26145213591, 304446163,    0
$$ Real data points
##PAGE= N=1
##DATA TABLE= (X++(R..R)), XYDATA
$$ [...]
$$ plain form
6618 8048 16832 1969 -9060 3156 113 4838 12924 4880 -15666 -22410 -331 12618 1687
6605 1687 -12423 -23287 -22484 -12892 1356 87 -21089 -17580 -28617 -39883 -20825 -9969 -5277
6592 -5277 362 5536 -14335 -15085 -18582 -51526 -47105 -25500 -25041 -13471 -20374 -27300 -25286 5226
6578 5226 36387 24153 -1573 -12562 -18373 -2036 -5417 -24519 -11063 -3959 -47389 -45247 -20132
6565 -20132 3331 4279 10630 -11377 -9862 -17926 -35972 -16604 -25013 -26235 -19721 -19114 -12567 -29105
6551 -29105 -41260 -17535 -46259 -40013 -40564 -37326 -15371 -14830 -26239 -17975 -20540 -18646 -12342 -21596
6537 -21596 -36222 -9734 -7423 -17555 -40069 -20740 -6432 -5531 -20271 -31242 -42684 -46600 -31725
6524 -31725 -10372 1347 -4708 10918 -3814 -21977 -19251 -35681 -43915 -27817 -31942 -47716 -26110
$$ packed form
6618H048Q784j4863j1029J2216l043M725Q086q044k0546o744K2079J2949j0931
6605A687j4110j0864Q03R592J4248j269k1176L509j1037j1266J9058J0856M692
6592e277N639N174j9871p50l497l2944M421K1605M59J1570o903o926K014L0512
6578E226L1161j2234k5726j0989n811J6337l381j9102J3456P104m3430K142K5115
6565b0132K3463R48O351k2007J515q064j8046J9368q409j222O514O07O547j6538
6551b9105j2155K3725k8724O246n51L238K1955N41j1409Q264k565J894O304r254
6537b1596j4626K6488K311j0132k2514J9329J4308R01j4740j0971j1442l916J4875
6524c1725K1353J1719o055J5626j4732j8163K726j6430q234J6098m125j5774K1606
$$ plain form
6511 -26110 -19792 -2865 -6404 -25267 -30068 -29815 -44746 -24207 -230 16768 4078 438 6533
6498 6533 5927 -6864 -19539 -3807 -27095 -23705 -17419 2971 -3364 -6284 -21056 -13291 -18579 -19124
6484 -19124 -39116 -38087 -33731 -46286 -27941 -31541 -25353 17109 7769 -20171 -26553 -24110 -32972
6471 -32972 -21857 -13234 -17432 -18609 -9295 -8703 -8196 -20662 -17042 -7986 -25319 -22222 -28686 -38661
6457 -38661 -35559 -25655 -15530 -29264 -11728 -12177 -618 -10009 -5740 -12806 -26803 -11421 10670
6444 10670 -7104 -45112 -34936 -23139 -19441 -22306 -10205 -7460 -27497 -27864 -29688 -28279 -22372
6431 -22372 -17883 -31554 -14799 -26983 -16245 -26874 -44914 -36849 -30660 -15252 -7671 -24462 -33582
6418 -33582 -39316 -59050 -48570 -51316 -32861 -32816 -45161 -40549 -44788 -36872 -18192 -9818 -17815 -20048
$$ packed form
6511b6110O318J6927l539j8863m801K53j4931K0539K3977J6998j2690l640O095
6498F533o06j2791j2675J5732k3288L390O286K0390o335k920j4772P765n288n45
6484a9124j9992J029M356j2555J8345l600O188M2462r340k7940o382K443q862
6471c2972J1115Q623m198j177R314N92N07j2466L620R056j7333L097o464r975
6457c8661L102R904J0125j3734J7536m49J1559r391M269p066j3997J5382K2091
6444A0670j7774l8008J0176J1797L698k865J2101K745k0037l67j824J409N907
6431b2372M489j3671J6755j2184J0738j0629j8040Q065O189J5408P581j6791r120
6418c3582n734j9734J0480k746J8455M5j2345M612m239P916J8680Q374p997k233
$$ plain form
6404 -20048 -15541 4079 10328 6495 -17820 -18512 -13591 -21130 13057 13088 10468 -28579 -29675 -15204
6390 -15204 -7198 -42622 -25323 -17718 -26889 -14076 -8417 -6186 6021 -13499 -17933 -24418 -15887
6377 -15887 -24404 -31212 -42256 -49760 -22496 -14360 -31936 -19028 -6004 -7938 -24102 -26457 -32685
6364 -32685 -27236 6648 8977 14246 -3905 -18206 3113 -20340 -19175 -8296 -6613 18245 13377
6351 13377 -15580 -36467 -35564 -31552 -9802 -15448 -9664 292 8585 2321 -25526 4605 10362 16777
6337 16777 -17891 -36638 -29186 -26075 -27684 -21731 815 -5176 -12768 -30354 -30780 4187 -10440
6324 -10440 -8989 -11674 -30456 -8085 -84 -16211 -37340 -31412 -23030 -26063 -3429 6078 7067 19343
6310 19343 2648 -3644 -6366 -6234 -32136 -22918 -17740 -11342 -31543 -16334 -5371 2469 1524 2451
$$ packed form
6404b0048M507J9620O249l833k4315o92M921p539L4187L1k620l9047j096J4471
6390a5204Q006l5424J7299P605r171J2813N659K231J2207j9520m434o485Q531
6377a5887q517o808j1044p504K7264Q136j7576J2908J3024j934j6164k355o228
6364c2685N449L3884K329N269j8151j4301K1319k3453J165J0879J683K4858m868
6351A3377k8957k0887R03M012K1750n646N784R956Q293o264k7847L0131N757O415
6337A6777l4668j8747P452L111j609N953K2546n991p592j7586m26L4967j4627
6324a0440J451k685j8782K2371Q001j6127k1129N928Q382l033K2634R507R89J2276
6310A9343j6695o292k722J32k5902R218N178O398k0201J5209J0963P840r45R27
$$ plain form
6296 2451 -20090 -47333 -4634 246 -10323 -10461 -23441 -7748 -7982 -21446 -15386 -11483 -10553 -7331
6282 -7331 -8147 -20334 -23838 4841 9943 -17592 -34238 -9673 -11438 -12501 -27506 -18510 -23051 -48536
6268 -48536 -24636 -2566 6815 -2077 -17272 -27833 -14490 -9538 -20820 -9766 -15110 -17055 -11740
6255 -11740 -38384 -18605 -21003 -21753 9845 -1137 -8629 -270 -29189 -49979 -37811 -20842 -39462
6242 -39462 -58909 -38393 -34525 -18027 -3236 -5517 1006 -4467 -227 -2729 380 -12523 -236
6229 -236 7238 -21602 954 -5164 -8915 -7525 -31603 -25009 -22980 -34760 -7125 -21333 -4770
6216 -4770 -24714 -20248 -12952 -12757 -272 1963 -3298 -16785 -21157 -19449 -19931 -8369 -14140 -19509
6202 -19509 -10335 -10109 -12066 -2256 2966 -12423 -18139 -21228 -22731 -7390 -18333 -30601 -18401 -38055
$$ packed form
6296B451k2541k7243M2699M880j0569j38j2980J5693k34j3464O060L903R30L222
6282g331q16j2187l504K8679N102k7535j6646K4565j765j063j5005Q996m541k5485
6268d8536K3900K2070R381q892j5195j0561J3343M952j1282J1054n344j945N315
6255a1740k6644J9779k398p50L1598j0982p492Q359k8919k0790J2168J6969j8620
6242c9462j9447K0516L868J6498J4791k281O523n473M240k502L109j2903J2287
6229b36P474k8840K2556o118l751J390k4078O594K029j1780K7635j4208J6563
6216d770j9944M466P296J95J2485K235n261j3487m372J708m82J1562n771n369
6202a9509R174K26j957R810N222j5389n716l089j503J5341j0943j2268J2200j9654
$$ plain form
6188 -38055 -28935 -2257 18358 -30655 -22289 8657 17996 -15478 -7088 -2497 -11156 -26837 -17042
6175 -17042 12201 22359 -8200 -25889 -8520 -25612 -31800 -20148 -15288 -26983 -24485 -12542
6163 -12542 10678 -7271 -19978 -764 12126 2331 -12858 -23714 -39297 -34358 -34311 -42679 -27511
6150 -27511 -24464 -20557 -33975 -32756 -3105 -4743 12963 81 -17983 -7979 -13102 -8573 -9979
6137 -9979 824 -7319 26397 31289 18776 15156 17598 -7072 5167 15901 -15001 -675 1616
6124 1616 10670 -181 -8298 -32103 925 -15946 -13666 -15917 5025 18728 12481 -15093 -16975
6111 -16975 -10612 2242 -10828 -7875 2218 -2779 6852 19868 16234 27344 9487 -21685 -28123
6098 -28123 -62717 -42081 -33016 -28464 -13102 -5259 102 15707 3863 -9338 11684 15860 -3857
$$ packed form
6188c8055R120K6678K0615m9013Q366L0946R339l3474Q390M591q659j5681R795
6175a7042K9243J0158l0559j7689J7369j7092o188J1652M860j1695K498J1943
6163a2542K3220j7949j2707J9214J2890r795j5189j0856j5583M939M7q368J5168
6150b7511L047L907j3418J219K9651j638J7706j2882j8064J0004n123M529j406
6137i979J0803q143L3716M892j2513l620K442k4670J2239J0734l0902J4326K291
6124A616R054j0851q117k3805L3028j6871K280k251K0942J3703o247k7574j882
6111a6975O363J2854j3070K953J0093m997R631J3016l634J1110j7857l1172o438
6098b8123l4594K0636R065M552J5362P843N361J5605j1844j3201K1022M176j9717
$$ plain form
6085 -3857 -658 -3332 -5914 -7250 1733 7198 13102 7964 -3097 -17872 -53245 -61505 -23714 -13145
6071 -13145 -24151 -13422 7735 -4618 -14368 -17352 -7770 14550 15342 2802 -2693 1779 3364
6058 3364 11445 12071 15327 -3825 -7687 -6583 -21982 -26178 -19371 -22861 -16762 -4072 10494 11971
6044 11971 -11805 -31446 -23401 2046 -10454 4632 -5929 -4358 -25253 -20964 -12931 -10366 -14797
6031 -14797 -16325 -16491 -3895 17230 12020 2785 -4540 -1914 -8289 13028 18758 15695 -16332 -5471
6017 -5471 -13468 -26310 -15571 11982 35609 -7316 -24329 -35245 -22365 -2444 13450 -317
6005 -317 -7460 -13358 1103 -15314 -9945 -9579 12405 5466 15206 20769 4684 -18249 -22097 -20849
5991 -20849 -9406 -2176 -22915 -54527 -34247 -35098 -39078 -27741 -19395 -15084 -10988 21563 12661
$$ packed form
6085c857L199k674k582j336Q983N465N904n138j1061j4775l5373q260L7791J0569
6071a3145j1006J0729K1157j2353r750k984R582K2320P92j2540n495M472J585
6058C364Q081O26L256j9152l862J104j5399m196O807l490O099J2690J4566J477
6044A1971k3776j9641Q045K5447j2500J5086j0561J571k0895M289Q033K565m431
6031a4797j528j66J2596K1125n210r235p325K626o375K1317N730l063l2027J0861
6017e471p997j2842J0739K7553K3627m2925j7013j0916J2880J9921J5894j3767
6005c17p143n898J4461j6417N369L66K1984o939R740N563j6085k2933l848J248
5991b0849J1443P230k0739l1612K0280q51l980J1337Q346M311M096L2551q902
$$ plain form
5978 12661 1108 -3381 8070 5842 -10666 -6312 4083 -4821 -842 -19607 -4488 -6083 -18396
5965 -18396 -13486 17410 4049 6540 25162 6233 13708 -2507 -2990 -12778 -11789 8464 12208 31271
5951 31271 -4661 -24957 -27762 3563 26584 22665 1830 18775 14379 -13760 -35822 -31872 1713
5938 1713 6699 -11251 -12601 4051 4005 6665 18169 -2334 -2288 534 -4520 12061 10604 -19407
5924 -19407 -10483 -21279 26572 27573 17093 33483 13617 1731 -371 -4429 6147 17828 18726
5911 18726 16000 27080 26770 20779 21842 590 -5247 1487 15071 17196 -7655 -3235 26292 46541
5897 46541 51436 38407 41008 27574 19669 20958 50950 39149 14649 834 1130 16931 44192
5884 44192 32501 -1085 13727 38783 40302 61654 38848 4487 23997 33 -2999 15248
$$ packed form
5978A2661j1553m489J1451k228j6508M354J0395q904L979j8765J5119j595j2313
5965a8396M910L0896j3361K491J8622j8929P475j6215m83r788R89K0253L744J9063
5951C1271l5932k0296k805L1325K3021l919k0835J6945m396k8139k2062L950L3585
5938A713M986j7950j350J6652m6K660J1504k0503M6K822n054J6581j457l0011
5924a9407Q924j0796M7851J001j0480J6390j9866j1886k102m058J0576J1681Q98
5911A8726k726J1080l10n991J063k1252n837O734J3584K125k4851M420K9527K0249
5897D6541M895j3029K601j3434p905J289K9992j1801k4500j3815K96J5801K7261
5884D4192j1691l3586J4812K5056J519K1352k2806l4361J9510k3964l032J8247
$$ plain form
5872 15248 12888 15846 7417 20210 12228 18985 14841 -3525 6738 12372 29347 47478 34602
5859 34602 32214 25365 24398 14779 -5722 -13375 -29829 -16990 4645 15981 2289 24387 56009
5846 56009 42596 13748 -5827 3958 -2836 -1530 25802 39523 29509 33399 24586 31087 30353
5833 30353 5759 35496 26044 24658 35333 40161 20478 17695 23835 7162 20425 20875 12332
5820 12332 23793 20066 27363 25987 42935 19901 10641 -4102 12383 27490 21191 52716 47215
5807 47215 50784 46610 33999 26548 32211 37643 15325 755 17055 32203 54264 43461 34896
5794 34896 46534 46729 56942 46923 32839 66002 78782 57307 47668 60368 54322 71533 73627
5781 73627 90339 76482 100476 94165 85372 94833 83736 80952 94094 94765 93674 96249 92896 88956
$$ packed form
5872A5248k360K958q429J2793p982O757m144j8366J0263N634J6975J8131j2876
5859C4602k388o849r67r619k0501p653j6454J2839K1635J1336j3692K2098L1622
5846E6009j3413k8848j9575R785o794J306K7332J3721j0014L890q813O501p34
5833C0353k4594K9737r452j386J0675M828j9683k783O140j6673J3263M50q543
5820A2332J1461l727P297j376J6948k3034r260j4743J6485J5107o299L1525n501
5807D7215L569m174j2611p451N663N432k2318j4570J6300J5148K2061j0803q565
5794C4896J1638J95J0213j0019j4084L3163J2780k1475r639J2700o046J7211K094
5781G3627J6712j3857K3994o311q793R461j1097k784J3142O71j091K575l353l940
$$ plain form
5767 88956 97441 120401 114274 141414 138872 167919 186404 203615 226132 235886 245548 250865 254311
5754 254311 230832 196776 167929 137799 105048 116445 96209 90673 108605 114552 107577 124490
5742 124490 100591 113634 102275 99453 119775 119523 93292 94370 95660 98770 78928 80792 84678
5729 84678 72891 68843 105763 128585 118335 137885 118442 77105 86756 93003 78328 77621 52135
5716 52135 52032 67864 91151 70394 45263 59909 61751 61877 58938 61587 72548 60842 71790
5703 71790 44165 52888 55744 34818 55578 41241 25042 65694 69624 59610 40360 36530 32625
5690 32625 44939 65399 52542 54506 45698 44553 43928 34694 37775 30709 66200 60324 80248 62845
5676 62845 48320 39229 39186 33392 45383 56318 76778 48080 45294 52497 43649 34078 43977 37531
$$ packed form
5767H8956Q485K2960o127K7140k542K9047J8485J7211K2517R754R662N317L446
5754B54311k3479l4056k8847l0130l2751J1397k0236n536J7932N947o975J6913
5742A24490k3899J3043j1359k822K0322k52k6231J078J290L110j9842J864L886
5729H4678j1787m048L6920K2822j0250J9550j9443m1337R651O247j4675p07k5486
5716E2135j03J5832K3287k0757k5131J4646J842J26k939K649J0961j1706J0948
5703G1790k7625Q723K856k0926K0760j4337j6199M0652L930j0014j9250l830l905
5690C2625J2314K0460j2857J964q808j145o25r234L081p066L5491n876J9924j7403
5676F2845j4525r091m3n794J1991J0935K0460k8698k786P203q848r571R899o446
$$ plain form
5662 37531 32756 60174 70650 54954 63238 57481 55619 69904 56573 55718 52347 34123 56216
5649 56216 75644 78022 79999 82931 77334 79154 72775 54635 62383 72080 81949 84049 80837 83624
5635 83624 91450 85680 77283 84859 94958 124572 122887 95254 95341 80531 45640 23041 47337
5622 47337 45555 62583 61542 93370 80741 59191 77927 93128 96188 115628 106358 95217 95800
5609 95800 93545 77571 72286 79689 78122 97550 97854 78283 88492 68993 63086 64105 55974 78626
5595 78626 78866 70546 65511 80360 103617 88088 99813 96825 100548 94020 87816 84152 104580 102669
5581 102669 86369 72248 107712 117309 99406 134737 156369 132139 120227 128872 129734 113542
5569 113542 124118 139911 118916 110227 110163 124737 115070 134163 121738 126938 159614 158390 161462
$$ packed form
5662C7531m775K7418J0476j5696Q284n757j862J4285j3331q55l371j8224K2093
5649E6216J9428K378J977K932n597J820o379j8140P748R697R869K100l212K787
5635H3624P826n770q397P576J0099K9614j685k7633Q7j4810l4891k2599K4296
5622D7337j782J7028j041L1828j2629k1550J8736J5201L060J9440r270j1141N83
5609I5800k255j5974n285P403j567J9428L04j9571J0209j9499n907J019q131K2652
5595G8626K40q320n035J4849K3257j5529J1725k988L723o528o204l664K0428j911
5581A02669j6300j4121L5464R597j7903L5331K1632k4230j1912Q645Q62j6192
5569A13542J0576J5793k0995q689o4J4574r667J9093j2425N200L2676j224L072
$$ plain form
5556 161462 157051 154867 153618 156957 165150 177421 155634 144805 161326 164537 178657 174047 185506
5543 185506 194009 186703 199868 186404 181570 185462 160944 156120 149641 176508 185860 186472 185658 167652
5529 167652 165205 201165 209861 196666 196547 225923 247417 230768 238909 229684 232791 213593 227531
5516 227531 231830 235377 244461 246762 240925 248404 258937 282528 290992 276434 286958 297086 318262
5503 318262 318308 358944 379882 404924 450038 470623 471393 436410 404433 375410 354679 310964 274119
5490 274119 251019 256290 233309 211401 208431 227104 229916 196003 212621 239302 247584 249205 245322
5477 245322 210121 204865 221701 206010 188091 174405 199261 200642 222056 224473 205333 233722
5465 233722 199148 179743 197282 217348 222714 218268 217762 249252 210291 211845 252020 268646 271160
$$ packed form
5556A61462m411k184j249L339Q193J2271k1787j0829J6521L211J4120m610J1459
5543A85506Q503p306J3165j3464m834L892k4518m824o479K6867R352O12q14j8006
5529A67652k447L5960Q696j3195j19K9376K1494j6649Q141r225L107j9198J3938
5516B27531M299L547R084K301n837P479J0533K3591Q464j4558J0524J0128K1176
5503C18262M6M0636K0938K5042M5114K0585P70l4983l1977k9023k0731m3715l6845
5490B74119k3100N271k2981k1908k970J8673K812l3913J6618K6681Q282J621l883
5477B45322l5201n256J6836j5691j7919j3686K4856J381K1414K417j9140K8389
5465B33722l4574j9405J7539K0066N366m446n06L1490l8961J554M0175J6626K514
$$ plain form
5452 271160 273499 297798 337375 368658 369935 364341 387672 390661 387536 364362 336635 350625 320238
5439 320238 303710 285539 260418 263868 266134 269179 276300 277033 302803 309124 293859 322985 358490
5426 358490 365866 385378 412187 438237 490270 517015 566158 618487 671102 711743 746808 779377
5414 779377 789569 769534 766835 706481 612528 543695 491234 453813 411466 382052 385562 357052
5402 357052 328437 348733 374467 355972 352261 385074 377109 378321 386351 397819 433770 468613
5390 468613 515341 547655 586005 633558 687506 732646 799082 803600 797386 818371 767028 692798
5378 692798 624365 546437 480748 431117 397646 352501 323239 321352 288890 287954 276147 267029
5366 267029 242240 230594 250405 242549 228977 243948 263730 260429 262542 274991 273992 291073 307614
$$ packed form
5452B71160K339K4299L9577L1283J277n594K3331K989l125k3174k7727J3990l0387
5439C20238j6528j8171k5121L450K266L045P121P33K5770O321j5265K9126L5505
5426C58490P376J9512K6809K6050N2033K6745M9143N2329N2615M0641L5065L2569
5414G79377J0192k0035k699o0354r3953o8833n2461l7421m2347k9414L510k8510
5402C57052k8615K0296K5734j8495l711L2813p965J212Q030J1468L5951L4843
5390D68613M6728L2314L8350M7553N3948M5140O6436M518o214K0985n1343p4230
5378F92798o8433p7928o5689m9631l3471m5145k9262j887l2462r36j1807r118
5366B67029k4789j1646J9811p856j3572J4971J9782l301K113J2449r99J7081J6541
$$ plain form
5353 307614 345081 347855 330656 345421 347241 333702 292865 262064 256300 235298 196270 171049
5341 171049 170383 171934 164968 165741 139442 133095 156089 151856 154582 133456 132568 109133 121823 145657
5327 145657 165135 130804 99165 126152 131444 125814 138223 130086 114286 106845 107096 118207 123651
5314 123651 117964 119164 115422 114697 116951 109806 112263 111481 118749 108481 99226 101971 108690 96089
5300 96089 101646 115251 111889 124333 123678 100071 99175 113590 92635 135461 128401 107473 91027
5287 91027 98190 80573 64319 74516 78086 112753 110396 113516 107457 105368 97008 86585 99428
5274 99428 102233 137793 132185 124733 131543 104807 94476 101908 74346 88583 91443 107522 99221
5261 99221 103693 126534 117244 103096 105784 97811 100558 78044 87203 88634 88199 122969 106772 109527
$$ packed form
5353C07614L7467K774j7199J4765J820j3539m0837l0801n764k1002l9028k5221
5341A71049o66J551o966P73k6299o347K2994m233K726k1126q88k3435J2690K3834
5327A45657J9478l4331l1639K6987N292n630J2409q137j5800p441K51J1111N444
5314A23651n687J200l742p25K254p145K457p82P268j0268r255K745O719j2601
5300I6089N557J3605l362J2444o55k3607q96J4415k0955M2826p060k0928j6446
5287I1027P163j7617j6254J0197L570L4667k357L120o059k089q360j0423J2843
5274I9428K805L5560n608p452O810k6736j0331P432k7562J4237K860J6079q301
5261I9221M472K2841r290j4148K688p973K747k2514R159J431m35L4770j6197K755
$$ plain form
5247 109527 105229 84031 96748 114128 97940 128141 128243 121761 104907 135318 147389 131956
5235 131956 98714 118660 135326 117867 110694 98200 119723 117680 110976 110715 128742 131679 101348
5222 101348 97843 120928 151338 142170 128783 112334 127270 149935 149536 138493 160159 140548
5210 140548 135272 128237 121164 139306 151975 125334 139510 165200 165952 126657 140349 186235 180330
5197 180330 166671 184233 163664 168113 177188 177575 186677 169495 172885 179135 185750 222253 237670
5184 237670 222363 234700 254226 274743 280497 275732 288242 312682 272688 251816 304041 282425
5172 282425 272391 286381 277968 244220 266883 250285 256033 267021 259150 237283 253123 244586
5160 244586 224983 234844 251868 261870 247999 259012 265375 264679 229254 244186 254586 246051 233829
$$ packed form
5247A09527m298k1198J2717J7380j6188L0201J02o482j6854L0411J2071j5433
5235A31956l3242J9946J6666j7459p173j2494K1523k043o704k61J8027K937l0331
5222A01348l505K3085L0410r168j3387j6449J4936K2665l99j1043K1666j9611
5210A40548n276p035p073J8142J2669k6641J4176K5690P52l9295J3692M5886n905
5197A80330j3659J7562k0569M449R075L87R102j7182L390O250O615L6503J5417
5184B37670j5307J2337J9526K0517N754m765J2510K4440l9994k0872N2225k1616
5172B82425j0034J3990q413l3748K2663j6598N748J0988p871k1867J5840q537
5160B44586j9603R861J7024J0002j3871J1013O363o96l5425J4932J0400q535j2222
$$ plain form
5147 233829 213843 205263 200792 202055 214028 203681 182833 177417 173327 155343 142818 144543 148474
5134 148474 168666 172709 140645 120127 139699 149781 130000 137342 127557 141655 113879 103740
5122 103740 110797 115123 122398 108876 126470 125546 126777 142235 138909 114968 130905 151534 145448
5109 145448 168767 137765 150350 143936 155335 150169 144945 139287 139553 147887 155021 130448 146530
5096 146530 164628 146421 133966 152291 166097 172964 176089 171321 162354 178229 189495 195076 197103
5083 197103 190496 179771 179680 192135 224310 256771 245614 238047 268000 269401 286949 296172 316273
5070 316273 336607 355237 368780 391623 369131 373784 358822 336585 324978 306694 329609 329573
5058 329573 344856 345349 351381 333307 353959 368109 355114 380932 371361 378586 397826 427271 433821
$$ packed form
5147B33829j9986q580m471J263J1973j0347k0848n416m090j7984j2525J725L931
5134A48474K0192M043l2064k0518J9572J0082j9781P342r785J4098k7776j0139
5122A03740P057M326P275j3522J7594r24J231J5458l326k3941J5937K0629o086
5109A45448K3319l1002J2585o414J1399n166n224n658K66Q334P134k4573J6082
5096A46530J8098j8207j2455J8325J3806O867L125m768q967J5875J1266N581K027
5083A97103o607j0725r1J2455L2175L2461j1157p567K9953J401J7548R223K0101
5070C16273K0334J8630J3543K2843k2492M653j4962k2237j1607j8284K2915l6
5058C29573J5283M93O032j8074K0652J4150j2995K5818r571P225J9240K9445O550
$$ plain form
5045 433821 436358 433176 408381 397024 394026 377034 362866 372464 378234 365751 406175 409610 393234
5032 393234 392082 411141 447559 449091 449201 426459 445961 451197 430534 413250 404240 413055 407043
5019 407043 392864 366776 353552 365021 365854 381540 376399 379967 371173 376173 343969 330191 355537
5006 355537 362932 338465 320951 326968 313874 257350 268636 256209 240535 214002 233720 214125
4994 214125 192940 170813 155144 158743 154220 144903 115186 129383 170457 176221 146382 120262
4982 120262 143329 153322 160250 150373 147433 133966 125597 140376 159897 137185 128671 161084 162217
4969 162217 128774 116331 118671 108888 93500 120091 152591 140699 110315 137875 158943 141989
4957 141989 162824 147762 137432 151292 164285 145621 119087 138034 151789 137597 128851 140763
$$ packed form
5045D33821K537l182k4795j1357k998j6992j4168R598N770j2483M0424L435j6376
5032C93234j152J9059L6418J532J10k2742J9502N236k0663j7284r010Q815o012
5019D07043j4179k6088j3224J1469Q33J5686n141L568q794N000l2204j3778K5346
5006C55537P395k4467j7514O017j3094n6524J1286j2427j5674k6533J9718j9595
4994B14125k1185k2127j5669L599m523r317k9717J4197M1074N764k9839k6120
4982A20262K3067R993O928r877k940j3467q369J4779J9521k2712q514L2413J133
4969A62217l3443j2443K340r783j5388K6591L2500j1892l0384K7560K1068j6954
4957A41989K0835j5062j0330J3860J2993j8664k6534J8947J3755j4192q746J1912
$$ plain form
4945 140763 140718 139791 121517 140372 144310 155169 162556 139125 121934 113942 104117 111361 116841 129409
4931 129409 128809 128549 136607 149510 151762 153321 126061 107484 143376 153315 158448 128120 111108
4918 111108 138766 134669 104376 88785 98078 120208 123478 118222 140985 108865 101652 117630 110770
4905 110770 137649 150777 162367 152926 148409 150736 154263 149429 140866 118517 113711 126535 132379
4892 132379 108579 113713 105304 139244 126744 110833 105734 131701 156026 119179 107993 133110
4880 133110 142965 150517 139725 143570 138789 151717 114444 149327 174118 157995 129697 133783 160217
4867 160217 175541 148922 150264 159215 148829 165177 171630 153489 129017 105495 134685 160812
4855 160812 155482 142296 181567 188593 191758 154736 127602 136003 165363 181710 194051 172031
$$ packed form
4945A40763m5r27j8274J8855L938J0859P387k3431j7191p992r825P244N480J2568
4931A29409o00k60Q058J2903K252J559k7260j8577L5892R939N133l0328j7012
4918A11108K7658m097l0293j5591R293K2130L270n256K2763l2120p213J5978o860
4905A10770K6879J3128J1590r441m517K327L527m834q563k2349m806J2824N844
4892A32379k3800N134q409L3940j2500j5911n099K5967K4325l6847j1186K5117
4880A33110R855P552j0792L845m781J2928l7273L4883K4791j6123k8298M086K6434
4867A60217J5324k6619J342Q951j0386J6348O453j8141k4472k3522K9190K6127
4855A60812n330j3186L9271P026L165l7022k7134Q401K9360J6347J2341k2020
$$ plain form
4843 172031 155069 177942 161169 160582 150337 148957 165135 170037 162294 185087 170416 165387 156966
4830 156966 155438 159491 162415 169240 174713 176590 182504 205899 205783 220110 250752 258329 257489 238713
4816 238713 223133 216020 235933 256180 249020 223289 230468 244920 226737 239924 278459 282400
4804 282400 285713 264308 279367 291284 325868 312482 306350 300224 292387 299060 318099 325426 315975
4791 315975 311729 311862 306767 299454 319516 310485 323525 308310 325343 324059 361732 362714 355917 350602
4777 350602 355985 384075 354338 358714 362103 392281 379196 391280 390419 392746 399036 406992 414760
4764 414760 416865 433033 444158 444540 452054 459714 434279 429799 417517 429516 455080 441512 448305
4751 448305 436221 456248 452282 441977 431047 422494 431711 452772 446527 457846 462835 463111 444842
$$ packed form
4843A72031j6962K2873j6773n87j0245j380J6178M902p743K2793j4671n029q421
4830A56966j528M053K924O825N473J877N914K3395j16J4327L0642P577q40j8776
4816B38713j5580p113J9913K0247p160k5731P179J4452j8183J3187L8535L941
4804B82400L313k1405J5059J1917L4584j3386o132o126p837O673J9039P327r451
4791C15975m246J33n095p313K0062r031J3040j5215J7033j284L7673R82o797n315
4777C50602N383K8090k9737M376L389L0178j3085J2084q61K327O290P956P768
4764D14760K105J6168J1125L82P514P660k5435m480j2282J1999K5564j3568O793
4751D48305j2084K0027l966j0305j0930q553R217K1061o245J1319M989K76j8269
$$ plain form
4738 444842 462934 478105 480105 492129 474790 478567 508835 497518 508623 520243 496508 496856
4726 496856 508634 498787 514537 536033 544753 554184 550085 534672 523013 542221 572596 579624 593036
4713 593036 580177 597418 625504 639281 626748 607739 590717 555860 538642 533496 505419 507866
4701 507866 506397 501193 468576 500234 482371 471987 494877 493087 507225 489041 478108 473305
4689 473305 452077 463213 469066 435475 455787 472058 456296 450346 451706 445395 480979 470729
4677 470729 452561 468692 475640 469870 465622 491795 522295 478358 469097 478435 444982 464068 487605
4664 487605 457925 440439 438880 434847 422597 419502 405541 407351 411583 390660 381250 414794 411310
4651 411310 433700 421461 403576 412836 406581 402510 440758 433169 456161 475678 477192 493242 473886
$$ packed form
4738D44842J8092J5171K000J2024j7339L777L0268j1317J1105J1620k3735L48
4726D96856J1778r847J5750K1496Q720R431m099j5413j1659J9208L0375P028J3412
4713E93036j2859J7241K8086J3777j2533j9009j7022l4857j7218n146k8077K447
4701E07866j469n204l2617L1658j7863j0384K2890j790J4138j8184j0933m803
4689D73305k1228J1136N853l3591K0312J6271j5762n950J360o311L5584j0250
4677D70729j8168J6131O948n770m248K6173L0500m3937r261R338l3453J9086K3537
4664D87605k9680j7486j559m033j2250l095j3961J810M232k0923r410L3544l484
4651D11310K2390j2239j7885R260o255m071L8248p589K2992J9517J514J6050j9356
$$ plain form
4638 473886 481500 513348 500247 494140 471095 452100 444995 429701 418718 416005 389020 371872
4626 371872 361329 386065 376132 365376 362713 387869 394668 396400 388940 391487 377775 380883 369854
4613 369854 355211 342707 354299 358476 356153 338598 329306 343823 350272 325723 316932 285867 309607
4600 309607 314983 311525 310373 282186 257439 299223 305793 314914 307921 302684 311483 327066 338661
4587 338661 335401 369129 360582 378922 384970 378774 372484 366943 372586 373773 352794 350096 358965 374653
4573 374653 358782 333245 333550 347199 333727 311201 297357 300140 320711 314099 307320 336656 308588
4560 308588 311373 312712 315082 298234 306595 305132 317690 332543 342232 340069 339583 313837 317965 324831
4546 324831 327197 317894 341145 360893 340167 355680 374982 356808 356106 341012 339663 344089 368406
$$ packed form
4638D73886P614L1848j3101o107k3045j8995p105j5294j0983k713k6985j7148
4626C71872j0543K4736r933j0756k663K5156O799J732p460K547j3712L108j1029
4613C69854j4643j2504J1592M177k323j7555r292J4517O449k4549q791l1065K3740
4600C09607N376l458j152k8187k4747M1784O570R121o993n237Q799J5583J1595
4587C38661l260L3728q547J8340O048o196o290n541N643J187k0979k698Q869J5688
4573C74653j5871k5537L05J3649j3472k2526j3844K783K0571o612o779K9336k8068
4560C08588K785J339K370j6848Q361j463J2558J4853R689k163m86k5746M128O866
4546C24831K366r303K3251J9748k0726J5513J9302j8174p02j5094j349M426K4317
$$ plain form
4533 368406 359236 354841 334106 339860 332694 337940 369000 355828 359381 366251 383856 399305 385757
4520 385757 365945 353708 352300 335675 372340 385400 377009 386419 382399 394829 390886 389039 383967
4507 383967 359859 402368 396533 388766 394829 418915 394282 417966 426872 415060 417287 420881 402742
4494 402742 424126 442947 451361 434935 434667 458626 468327 488895 471479 458552 468511 510488 519828
4481 519828 517960 529997 533039 526331 530473 540657 548454 541348 546528 578167 548531 569404 561285
4468 561285 569100 589359 603553 634560 621244 615694 617918 644012 680277 696722 696212 706553 731653
4455 731653 738801 765971 799150 794397 805639 793733 814476 832229 843284 873734 918969 970099
4443 970099 1004858 1039126 1123075 1163470 1179322 1224832 1267060 1283659 1281869 1287724 1291700 1297171
$$ packed form
4533C68406r170m395k0735N754p166N246L1060j3172L553O870J7605J5449j3548
4520C85757j9812j2237j408j6625L6665J3060q391R410m020J2430l943j847n072
4507C83967k4108M2509n835p767O063K4086k4633K3684Q906j1812K227L594j8139
4494D02742K1384J8821Q414j6426k68K3959R701K0568j7416j2927R959M1977R340
4481E19828j868J2037L042o708M142J0184P797p106N180L1639k9636K0873q119
4468E61285P815K0259J4194L1007j3316n550K224K6094L6265J6445n10J0341K5100
4455G31653P148K7170L3179m753J1242j1906K0743J7753J1055L0450M5235N1130
4443I70099L4759L4268Q3949M0395J5852M5510M2228J6599j790N855L976N471
$$ plain form
4431 1297171 1294836 1331436 1354086 1336690 1387295 1427273 1463873 1490315 1557672 1610441 1671952 1735394
4419 1735394 1815198 1888284 1962156 2024583 2122697 2198698 2298002 2417749 2529111 2651264 2724052
4408 2724052 2809607 2919401 3023370 3080389 3111139 3149204 3160939 3186407 3197282 3245650 3256018
4397 3256018 3302943 3352299 3469713 3545185 3673295 3798015 3902506 3990643 4107767 4210159
4387 4210159 4249664 4332283 4407289 4426931 4451151 4442907 4447873 4423611 4408966 4356167 4296023 4244195
4375 4244195 4159496 4127890 4090466 4051548 4074388 4094085 4176008 4254349 4334627 4403008 4490601
4364 4490601 4533504 4562857 4582774 4612616 4618622 4608125 4639258 4672262 4676555 4693980 4711899 4668105
4352 4668105 4636409 4568267 4442802 4308781 4192304 4026885 3826686 3612588 3406490 3239527
$$ packed form
4431A297171k335L6600K2650j7396N0605L9978L6600K6442O7357N2769O1511O3442
4419A735394P9804P3086P3872O2427R8114P6001R9304J19747J11362J22153P2788
4408B724052Q5555J09794J03969N7019L0750L8065J1735K5468J0875M8368J0368
4397C256018M6925M9356J17414P5472J28110J24720J04491Q8137J17124J02392
4387D210159L9505Q2619P5006J9642K4220q244M966k4262j4645n2799o0144n1828
4375D244195q4699l1606l7424l8918K2840J9697Q1923P8341Q0278O8381Q7593
4364D490601M2903K9353J9917K9842O006j0497L1133L3004M293J7425J7919m3794
4352D668105l1696o8142j25465j34021j16477j65419k00199k14098k06098j66963
$$ plain form
4342 3239527 3070004 2937115 2797515 2678945 2590054 2500516 2411210 2334780 2285114 2219399 2185265
4331 2185265 2150329 2135348 2122305 2106924 2096597 2101707 2051844 2053524 2070775 2078274 2077642 2088288
4319 2088288 2112874 2085139 2108406 2154898 2200186 2260917 2302899 2349330 2423323 2512274 2578207
4308 2578207 2683043 2815512 2945925 3078853 3252245 3380439 3531556 3622873 3719670 3742288
4298 3742288 3725592 3685309 3637349 3579099 3560689 3564223 3591092 3657493 3725727 3820742 3904085 3993036
4286 3993036 4122648 4226981 4327185 4425092 4573073 4658884 4766670 4841042 4946835 5000467
4276 5000467 5056017 5092187 5133802 5147376 5167522 5116554 5101800 5086515 5086434 5044471 5026233 4967652
4264 4967652 4911585 4860437 4799194 4725963 4665912 4591605 4578132 4535819 4514360 4521025 4523436 4551728
$$ packed form
4342C239527j69523j32889j39600j18570q8891q9538q9306p6430m9666o5715l4134
4331B185265l4936j4981j3043j5381j0327N110m9863J680J7251P499o32J0646
4319B088288K4586k7735K3267M6492M5288O0731M1982M6431P3993Q8951O5933
4308B578207J04836J32469J30413J32928J73392J28194J51117R1317R6797K2618
4298C742288j6696m0283m7960n8250j8410L534K6869O6401O8234R5015Q3343Q8951
4286C993036J29612J04333J00204R7907J47981Q5811J07786P4372J05793N3632
4276E000467N5550L6170M1615J3574K0146n0968j4754j5285q1m1963j8238n8581
4264D967652n6067n1148o1243p3231o0051p4307j3473m2313k1459O665K411K8292
$$ plain form
4252 4551728 4585411 4586948 4590543 4603199 4628072 4619733 4648742 4671095 4673320 4657297 4654604 4651943 4617809
4239 4617809 4633452 4596269 4501624 4443795 4394252 4355005 4287297 4194777 4101273 4047778 3997916
4228 3997916 3970314 3947916 3902350 3842742 3812500 3809192 3752762 3681084 3630918 3595547 3517386 3477061
4216 3477061 3398347 3318156 3271592 3226424 3209733 3200032 3176732 3176976 3148710 3116595 3131225 3184569
4204 3184569 3194708 3223013 3252690 3335826 3411265 3493035 3566472 3623019 3648996 3687419 3648585
4193 3648585 3578611 3463405 3365810 3235180 3133817 3025516 2998612 3015682 3025248 3018637 3047396
4182 3047396 3077562 3111282 3121353 3150628 3153456 3175888 3147312 3186231 3155083 3182745 3187027 3223004
4170 3223004 3208164 3209170 3192807 3244859 3262228 3304652 3303545 3302432 3294486 3310200 3300825 3337372
$$ packed form
4252D551728L3683J537L595J2656K4873q339K9009K2353K225j6023k693k661l4134
4239D617809J5643l7183r4645n7829m9543l9247o7708r2520r3504n3495m9862
4228C997916k7602k2398m5566n9608l0242l308n6430p1678n0166l5371p8161m0325
4216C477061p8714q0191m6564m5168j6691r701k3300K44k8266l2115J4630N3344
4204C184569J0139K8305K9677Q3136P5439Q1770P3437N6547K5977L8423l8834
4193C648585o9974j15206r7595j30630j01363j08301k6904J7070R566o611K8759
4182C047396L0166L3720J0071K9275K828K2432k8576L8919l1148K7662M282L5977
4170C223004j4840J006j6363N2052J7369M2424j107j113p946J5714r375L6547
$$ plain form
4158 3337372 3349495 3384005 3407502 3462902 3473340 3517494 3526264 3546590 3572503 3639291 3703498 3791098
4146 3791098 3855398 3902533 3947452 4039659 4102855 4191688 4237122 4311268 4365324 4403121 4444121
4135 4444121 4485799 4514655 4544381 4568608 4639500 4676023 4735112 4763724 4798896 4799355 4831880 4917414
4123 4917414 4987207 5034224 5110217 5149750 5211949 5284433 5385043 5505923 5632939 5756410 5914955
4112 5914955 6068606 6237974 6361374 6514666 6673033 6866082 7101175 7346027 7603293 7871311
4102 7871311 8169025 8461608 8728927 8883426 9080761 9262527 9402080 9486138 9583436 9645381
4092 9645381 9749548 9815660 9938556 10007305 10137834 10234515 10365176 10489614 10656307 10784745
4082 10784745 10942813 11114718 11413554 11646682 11931996 12242948 12635428 12983706 13419486
$$ packed form
4158C337372J2123L4510K3497N5400J0438M4154Q770K0326K5913O6788O4207Q7600
4146C791098O4300M7135M4919R2207O3196Q8833M5434P4146N4056L7797M1000
4135D444121M1678K8856K9726K4227P0892L6523N9089K8612L5172M59L2525Q5534
4123D917414O9793M7017P5993L9533O2199P2484J00610J20880J27016J23471J58545
4112E914955J53651J69368J23400J53292J58367J93049K35093K44852K57266K68018
4102G871311K97714K92583K67319J54499J97335J81766J39553Q4058R7298O1945
4092I645381J04167O6112J22896O8749J30529R6681J30661J24438J66693J28438
4082A0784745J58068J71905K98836K33128K85314L10952L92480L48278M35780
$$ plain form
4073 13419486 13844355 14350564 14742684 15223198 15639455 16120799 16498917 17023691 17499880
4064 17499880 18080568 18606638 19307391 19940659 20634845 21281986 21985387 22487929 22996817
4055 22996817 23412092 24031070 24568250 25232805 25828316 26608002 27276555 28034315 28627440
4046 28627440 29427105 30210296 31226637 32250463 33476625 34626588 35957108 37200721
4038 37200721 38689764 40018253 41630303 43304232 45377534 47437102 50040474 52855591
4030 52855591 56352907 60223429 65201954 70992099 78485258 87162317 96293842 105558793
4022 105558793 117752275 131431865 145895487 160781431 177866043 202628415 233933300
4015 233933300 263016267 273011887 275770496 280209130 258358878 207048723 165429283
$$ packed form
4073A3419486M24869N06209L92120M80514M16257M81344L78118N24774M76189
4064A7499880N80688N26070P00753O33268O94186O47141P03401N02542N08888
4055B2996817M15275O18978N37180O64555N95511P79686O68553P57760N93125
4046B8627440P99665P83191J016341J023826J226162J149963J330520J243613
4038C7200721J489043J328489J612050J673929K073302K059568K603372K815117
4030E2855591L497316L870522M978525N790145P493159Q677059R131525R264951
4022A05558793J2193482J3679590J4463622J4885944J7084612K4762372L1304885
4015B33933300K9082967R995620K758609M438634k1850252n1310155m1619440
$$ plain form
4008 165429283 138038035 118424910 102944761 90898122 81169042 73310469 66843506
4001 66843506 61723098 57585992 54398393 51898846 49576218 47324954 45474564 43971662
3993 43971662 42640431 41635294 40946132 40583002 40456789 40694055 41262340 42164353 43294416
3984 43294416 44909581 46968836 49425123 51992198 55050893 58612788 62507102 65547719
3976 65547719 66864549 66503558 64126606 58657894 51827171 45819651 41206498 37684246
3968 37684246 35108556 33207320 31766527 30615155 29785132 29020075 28389935 27698319 27079759
3959 27079759 26381903 25720008 25006412 24373110 23742479 23295352 22886826 22652261 22461085
3950 22461085 22398713 22274147 22127853 21955193 21776013 21484336 21196226 20832411 20569539 20257957
$$ packed form
4008A65429283k7391248j9613125j5480149j2046639r729080p858573o466963
4001F6843506n120408m137106l187599k499547k322628k251264j850390j502902
3993D3971662j331231j005137o89162l63130j26213K37266N68285R02013J130063
3984D3294416J615165K059255K456287K567075L058695L561895L894314L040617
3976F5547719J316830l60991k376952n468712o830723o007520m613153l522252
3968C7684246k575690j901236j440793j151372q30023p65057o30140o91616o18560
3959B7079759o97856o61895p13596o33302o30631m47127m08526k34565j91176
3950B2461085o2372j24566j46294j72660j79180k91677k88110l63815k62872l11582
$$ plain form
3940 20257957 20061624 19858101 19663063 19340265 19046223 18634375 18239874 17809037 17460617
3931 17460617 17172136 17030780 16940305 16995659 17112730 17403230 17720848 18144521 18610008 19153593
3921 19153593 19659144 20162773 20510961 20723537 20728926 20563609 20126287 19563398 18859257 18150445
3911 18150445 17407593 16736541 16115144 15644498 15209427 14906817 14636511 14488943 14423015 14442414
3901 14442414 14490602 14574758 14662009 14697422 14636652 14520067 14204210 13783696 13236790 12634724
3891 12634724 12016347 11431832 10910884 10479960 10145723 9878583 9668807 9538664 9443717 9410832
3881 9410832 9385461 9409995 9442618 9547974 9673150 9789021 9916858 9983014 9976167 9870898 9700541
3870 9700541 9482651 9194902 8944115 8701328 8526538 8436238 8360870 8396061 8460160 8584474
$$ packed form
3940B0257957j96333k03523j95038l22798k94042m11848l94501m30837l48420
3931A7460617k88481j41356r0475N5354J17071K90500L17618M23673M65487N43585
3921A9153593N05551N03629L48188K12576N389j65317m37322n62889p04141p08812
3911A8150445p42852o71052o21397m70646m35071l02610k70306j47568o5928J9399
3901A4442414M8188Q4156Q7251L5413o0770j16585l15857m20514n46906o02066
3891A2634724o18377n84515n20948m30924l34237k67140k09776j30143r4947l2885
3881I410832k5371K4534L2623J05356J25176J15871J27837O6156o847j05269j70357
3870I700541k17890k87749k50787k42787j74790r0300p5368L5191O4099J24314
$$ plain form
3860 8584474 8780317 9015756 9254168 9473642 9680873 9902132 10007774 10071210 10076606 9957321
3850 9957321 9682768 9334717 8916330 8538963 8185551 7986074 7845768 7756215 7694579 7700150
3840 7700150 7757066 7828742 7840566 7866471 7833864 7769785 7598892 7457049 7281875 7136440 7039993
3829 7039993 6967349 6887103 6852820 6812473 6848887 6923328 7053998 7166134 7352547 7538351 7788184
3818 7788184 8059255 8397150 8769080 9174617 9595724 10106436 10525068 10905721 11193566 11398944
3808 11398944 11381149 11224455 10878927 10434466 9951999 9518756 9102278 8782189 8508079 8324614
3798 8324614 8214049 8155610 8132895 8211268 8326924 8525434 8736688 8993459 9278578 9584907
3788 9584907 9928169 10309791 10621132 10901808 11025145 10975308 10745010 10380425 10010263 9658808
$$ packed form
3860H584474J95843K35439K38412K19474K07231K21259J05642O3436N396j19285
3850I957321k74553l48051m18387l77367l53412j99477j40306q9553o1636N571
3840G700150N6916P1676J1824K5905l2607o4079j70893j41843j75174j45435r6447
3829G039993p2644q0246l4283m0347L6414P4441J30670J12136J86413J85804K49833
3818G788184K71071L37895L71930M05537M21107N10712M18632L80653K87845K05378
3808A1398944j7795j56694l45528m44461m82467m33243m16478l20089k74110j83465
3798H324614j10565n8439k2715P8373J15656J98510K11254K56771K85119L06329
3788I584907L43262L81622L11341K80676J23337m9837k30298l64585l70162l51455
$$ plain form
3778 9658808 9408555 9254385 9201298 9214272 9278072 9414618 9647005 9911050 10166665 10458390
3768 10458390 10730572 10951026 11103682 11167361 11156755 11116975 11061814 11022019 11045054 11155527
3758 11155527 11331113 11563012 11827496 12104423 12332229 12444957 12408281 12226482 11933125 11565037
3748 11565037 11198512 10818501 10516856 10277885 10120487 9973110 9891134 9793459 9691910 9578361
3738 9578361 9387617 9147078 8905031 8718442 8589981 8496074 8500939 8561680 8695697 8881214
3728 8881214 9176384 9475879 9796392 10136078 10471585 10752721 10946225 11071049 11143662 11109527
3718 11109527 11051944 10904033 10747221 10602248 10474678 10334663 10156033 9850767 9452713 8937837
3708 8937837 8306024 7701002 7165243 6684487 6338317 6073435 5888022 5744705 5663688 5612655
$$ packed form
3778I658808k50253j54170n3087J2974O3800J36546K32387K64045K55615K91725
3768A0458390K72182K20454J52656O3679j0606l9780n5161l9795K3035J10473
3758A1155527J75586K31899K64484K76927K27806J12728l6676j81799k93357l68088
3748A1565037l66525l80011l01645k38971j57398j47377q1976r7675j01549j13549
3738I578361j90744k40539k42047j86589j28461r3907M865O0741J34017J85517
3728H881214K95170K99495L20513L39686L35507K81136J93504J24824P2613l4135
3718A1109527n7583j47911j56812j44973j27570j40015j78630l05266l98054n14876
3708H937837o31813o05022n35759m80756l46170k64882j85413j43317q1017n1033
$$ plain form
3698 5612655 5591739 5626220 5702126 5753970 5879777 6021700 6174108 6279193 6399818 6508283
3688 6508283 6564330 6571108 6549617 6499742 6515877 6527120 6545777 6547631 6554641 6479886 6353944 6122815
3676 6122815 5828998 5475877 5128475 4831313 4550040 4305820 4080669 3898620 3793860 3710721
3666 3710721 3653543 3611395 3639319 3637638 3651194 3685332 3706564 3705390 3706743 3653940 3584389 3505131
3654 3505131 3412349 3344900 3265792 3228409 3229669 3223069 3235842 3301308 3365511 3429895 3402589 3297428
3642 3297428 3172412 2957414 2724043 2507052 2351648 2228710 2106053 2005284 1910296 1862078
3632 1862078 1825920 1787109 1748815 1728963 1710404 1724478 1705184 1679287 1683927 1717027 1748291 1785812
3620 1785812 1816933 1888155 1920228 1965724 2008624 2020474 2021740 2021894 1957953 1874606 1783687 1684306
$$ packed form
3698E612655k0916L4481P5906N1844J25807J41923J52408J05085J20625J08465
3688F508283N6047O778k1491m9875J6135J1243J8657J854P010p4755j25942k31129
3676F122815k93817l53121l47402k97162k81273k44220k25151j82049j04760q3139
3666C710721n7178m2148K7924j681J3556L4138K1232j174J353n2803o9551p9258
3654C505131r2782o7449p9108l7383J260o600J2773O5466O4203O4384k7306j05161
3642C297428j25016k14998k33371k16991j55404j22938j22657j00769r4988m8218
3632A862078l6158l8811l8294j9852j8559J4074j9294k5897M640L3100L1264L7521
3620A785812L1121P1222L2073M5496M2900J1850J266J54o3941q3347r0919r9381
$$ plain form
3608 1684306 1603213 1486369 1385254 1337389 1285051 1209570 1154834 1126158 1088026 1072561 1029312
3597 1029312 1006671 986297 987636 952950 973010 947651 956746 949773 947254 919298 904495 910096
3585 910096 920509 913706 913204 902872 899179 909275 912056 884154 887135 874919 842175 830277 805099
3572 805099 801841 785629 780195 782594 770614 810012 828102 820834 832479 857688 870024 878675 881477
3559 881477 859624 858785 882399 880761 882512 862203 872047 853834 858881 856794 856319 850246 861493 869980
3545 869980 874396 885380 881569 870017 890114 900851 944990 978944 989922 1016802 1026181 1014739
3533 1014739 1036290 1064473 1088957 1097440 1097880 1096462 1115970 1112926 1105073 1102624 1085673 1107096 1098054
3520 1098054 1096430 1084881 1076117 1077066 1073962 1084462 1092645 1096966 1135767 1113482 1119774 1188852 1243171
$$ packed form
3608A684306q1093j16844j01115m7865n2338p5481n4736k8676l8132j5465m3249
3597A029312k2641k0374J339l4686K0060k5359R095o973k519k7956j4803N601
3585I10096J0413o803n02j0332l693J0096K781k7902K981j2216l2744j1898k5178
3572H05099l258j6212n434K399j1980L9398J8090p268J1645K5209J2336Q651K802
3559H81477k1853q39K3614j638J751k0309R844j8213N047k087m75o073J1247Q487
3545H69980M416J0984l811j1552K0097J0737M4139L3954J0978K6880R379j1442
3533A014739K1551K8183K4484Q483M40j418J9508l044p853k449j6951K1423r042
3520A098054j624j1549q764R49l104J0500Q183M321L8801k2285O292O9078N4319
$$ plain form
3507 1243171 1264500 1331734 1377958 1425891 1503287 1592250 1698358 1803335 1893932 2002087 2109977
3496 2109977 2176735 2241877 2258446 2214721 2136668 2027011 1894187 1777584 1698859 1633594 1523841
3485 1523841 1433706 1385686 1342409 1311333 1286639 1275585 1239929 1225600 1205752 1193383 1174422
3474 1174422 1184056 1170598 1159543 1169238 1215277 1223225 1204464 1194945 1205407 1204791 1233601 1241348 1234595
3461 1234595 1244931 1271032 1260463 1256595 1246215 1246952 1243791 1280832 1306777 1296972 1267018 1263907 1264500
3448 1264500 1283934 1283974 1312791 1330398 1338441 1351843 1384191 1440123 1463321 1483466 1510639 1519999
3436 1519999 1532284 1533704 1563241 1565983 1591180 1596726 1618129 1617307 1605930 1628034 1648912 1633357
3424 1633357 1654836 1682764 1725019 1739796 1760178 1773158 1775732 1793084 1774471 1799825 1811670 1801892
$$ packed form
3507A243171K1329O7234M6224M7933P7396Q8963J06108J04977R0597J08155J07890
3496B109977O6758O5142J6569m3725p8053j09657j32824j16603p8725o5265j09753
3485A523841r0135m8020m3277l1076k4694j1054l5656j4329j9848j2369j8961
3474A174422R634j3458j1055R695M6039P948j8761r519J0462o16K8810P747o753
3461A234595J0336K6101j0569l868j0380P37l161L7041K5945r805k9954l111N93
3448A264500J9434M0K8817J7607Q043J3402L2348N5932K3198K0145K7173R360
3436A519999J2285J420K9537K742K5197N546K1403q22j1377K2104K0878j5555
3424A633357K1479K7928M2255J4777K0382J2980K574J7352j8613K5354J1845r778
$$ plain form
3412 1801892 1822275 1831883 1860334 1900553 1929331 1941470 1941262 1980586 2021451 2068477 2117164 2148986
3400 2148986 2177032 2239230 2269609 2303546 2328596 2361930 2389466 2438772 2475994 2501856 2506940 2539155
3388 2539155 2568781 2574813 2581210 2601799 2637954 2691857 2767169 2848519 2896390 2943395 3023163 3074835
3376 3074835 3138403 3241538 3273753 3288247 3338215 3382255 3419277 3482333 3542265 3605652 3655800
3365 3655800 3709070 3740889 3812832 3892911 3956311 4024841 4072635 4111055 4168762 4237954 4314108
3354 4314108 4404521 4455711 4520482 4625228 4724096 4804075 4888792 5003163 5118430 5228451 5353952
3343 5353952 5499409 5659097 5781216 5916047 6072931 6197661 6350521 6500010 6675044 6861612
3333 6861612 7069816 7238285 7413053 7588573 7780964 7994885 8219487 8453042 8698213 8934124
$$ packed form
3412A801892K0383R608K8451M0219K8778J2139k08L9324M0865M7026M8687L1822
3400B148986K8046O2198L0379L3937K5050L3334K7536M9306L7222K5862N084L2215
3388B539155K9626O032O397K0589L6155N3903P5312Q1350M7871M7005P9768N1672
3376C074835O3568J03135L2215J4494M9968M4040L7022O3056N9932O3387N0148
3365C655800N3270L1819P1943Q0079O3400O8530M7794L8420N7707O9192P6154
3354D314108R0413N1190O4771J04746R8868P9979Q4717J14371J15267J10021J25501
3343E353952J45457J59688J22119J34831J56884J24730J52860J49489J75034J86568
3333F861612K08204J68469J74768J75520J92391K13921K24602K33555K45171K35911
$$ plain form
3323 8934124 9216503 9510088 9871806 10241181 10694287 11208321 11816021 12505235 13237499 14030678
3313 14030678 15004404 16037614 17151959 18342280 19698649 21372026 23272396 24844196
3305 24844196 25643108 26010039 25737019 23978363 21619160 19885992 18782700 18107922 17734066
3296 17734066 17543810 17466415 17523568 17636367 17811485 18060487 18396319 18863928 19420097 20076052
3286 20076052 20839437 21698582 22617093 23634317 24750069 25945262 27260770 28732629 30421670
3277 30421670 32207271 33824697 34956207 35683481 35984587 35520375 34456506 33459972 32946065
3268 32946065 32873900 33132147 33688229 34476828 35448096 36581491 37892662 39449294 41186390
3259 41186390 42870907 44362619 45623318 46451584 46942535 47638039 48740897 50249720 52028373
$$ packed form
3323H934124K82379K93585L61718L69375M53106N14034O07700O89214P32264P93179
3313A4030678R73726J033210J114345J190321J356369J673377J900370J571800
3305B4844196P98912L66931k73020j758656k359203j733168j103292o74778l73856
3296A7734066j90256p7395N7153J12799J75118K49002L35832M67609N56169O55955
3286B0076052P63385Q59145R18511J017224J115752J195193J315508J471859J689041
3277C0421670J785601J617426J131510P27274L01106m64212j063869r96534n13907
3268C2946065p2165K58247N56082P88599R71268J133395J311171J556632J737096
3259D1186390J684517J491712J260699Q28266M90951O95504J102858J508823J778653
$$ plain form
3250 52028373 54101969 56383854 58862341 61474241 64182942 66821549 69253873 71302748
3242 71302748 72789934 73553934 73554533 72811803 71540027 69941323 68290314 66808686 65655329
3233 65655329 64908278 64604511 64788235 65421257 66491605 68088149 70291702 73165817 76782801
3224 76782801 81313090 86945674 93920391 102403464 112277317 123304449 135748964 150300801
3216 150300801 167094792 185642927 205946976 228310163 253194518 278422196 297444107
3209 297444107 304446163 297310722 271004789 230653100 191503873 159991805 135839727
3202 135839727 117395308 103098734 91640386 82116796 74003121 67005572 60997298 55899601
3194 55899601 51577881 47894632 44689522 41864271 39289038 36859873 34506602 32297401
$$ packed form
3250E2028373K073596K281885K478487K611900K708701K638607K432324K048875
3242G1302748J487186P64000N99p42730j271776j598704j651009j481628j153357
3233F5655329p47051l03767J83724O33022J070348J596544K203553K874115L616984
3224G6782801M530289N632584O974717Q483073R873853J1027132J2444515J4551837
3216A50300801J6793991J8548135K0304049K2363187K4884355K5227678J9021911
3209B97444107P002056p135441k6305933m0351689l9149227l1512068k4152078
3202A35839727j8444419j4296574j1458348r523590q113675o997549o008274n097697
3194E5899601m321720l683249l205110k825251k575233k429165k353271k209201
$$ plain form
3186 32297401 30238053 28381350 26723701 25220804 23896440 22766732 21780711 20915996
3178 20915996 20089295 19213857 18335940 17468027 16591511 15817430 15064961 14408343 13837839
3169 13837839 13340150 12937868 12559455 12223611 11947946 11700373 11537647 11420481 11350600 11251480
3159 11251480 11125974 10920754 10627623 10257375 9823627 9403313 9042184 8694759 8398807
3150 8398807 8158485 7937665 7711356 7512637 7308047 7137609 6971417 6815830 6656673 6508080
3140 6508080 6342500 6201808 6081264 5935350 5783451 5688149 5587781 5478144 5414974 5394813
3130 5394813 5366420 5332208 5318135 5221450 5119332 4991304 4824638 4653947 4534786 4403012
3120 4403012 4310878 4239155 4178501 4111322 4065966 4002975 3904616 3833767 3784240 3716493 3654656
$$ packed form
3186C2297401k059348j856703j657649j502897j324364j129708r86021q64715
3178B0915996q26701q75438q77917q67913q76516p74081p52469o56618n70504
3169A3837839m97689m02282l78413l35844k75665k47573j62726j17166o9881r9120
3159A1251480j25506k05220k93131l70248m33748m20314l61129l47425k95952
3150H398807k40322k20820k26309j98719k04590j70438j66192j55587j59157j48593
3140F508080j65580j40692j20544j45914j51899r5302j00368j09637o3170k0161
3130E394813k8393l4212j4073r6685j02118j28028j66666j70691j19161j31774
3120D403012r2134p1723o0654o7179m5356o2991r8359p0849m9527o7747o1837
$$ plain form
3109 3654656 3588280 3531042 3497078 3442663 3395899 3342410 3289180 3193078 3089003 2989858 2913850
3098 2913850 2833121 2764317 2716470 2638379 2585458 2566717 2547610 2513367 2498563 2483093 2455693
3087 2455693 2458960 2458862 2491917 2517490 2559492 2608310 2689623 2766369 2818236 2899416 2988245 3034718
3075 3034718 3073205 3060108 2991690 2851293 2724582 2574968 2416511 2269934 2145403 2053576
3065 2053576 1968600 1876499 1801950 1702939 1642036 1594653 1528632 1450762 1388164 1331316 1308048
3054 1308048 1277935 1264424 1213112 1178214 1160835 1125600 1124425 1121278 1114111 1085684 1021423 1026765
3042 1026765 1051498 1060897 1072132 1080068 1118259 1122620 1121004 1121203 1102087 1087536 1067320 1007842 972329
3029 972329 926470 895979 870741 905565 924054 909232 901713 912748 924010 922997 917984 915033
$$ packed form
3109C654656o6376n7238l3964n4415m6764n3489n3230r6102j04075r9145p6008
3098B913850q0729o8804m7847p8091n2921j8741j9107l4243j4804j5470k7400
3087B455693L267r8L3055K5573M2002M8818Q1313P6746N1867Q1180Q8829M6473
3075C034718L8487j3097o8418j40397j26711j49614j58457j46577j24531r1827
3065B053576q4976r2101p4549r9011o0903m7383o6021p7870o2598n6848k3268
3054A308048l0113j3511n1312l4898j7379l5235j175l147p167k8427o4261N342
3042A026765K4733R399J1235P936L8191M361j616J99j9116j4551k0216n9478l5513
3029I72329m5859l0491k5238L4824J8489j4822p519J1035J1262j013n013k951
$$ plain form
3017 915033 927599 965967 957020 994571 954375 936751 933357 922274 900733 888574 843707 819865
3005 819865 780836 736178 718388 712097 705951 707005 697983 717570 712784 707341 704696 716370 716330 720068
2991 720068 749193 731676 689344 679355 695384 690258 685323 699417 705300 688419 684501 683676 702387
2978 702387 690937 690884 719375 715873 722494 732468 730994 735633 748867 743888 731823 737802 744465 734659
2964 734659 759335 754889 751257 733450 750369 731197 773410 802298 771105 776962 803962 849019
2952 849019 840058 837974 829469 830698 845240 837938 808760 796709 826166 817938 794554 781429 780746
2939 780746 800007 821864 831709 840426 850964 878882 926340 957182 1017960 1085453 1166538 1243463
2927 1243463 1337427 1431605 1538877 1634046 1742418 1791133 1814898 1802480 1754315 1644613 1504100
$$ packed form
3017I15033J2566L8368q947L7551m0196j7624l394j1083k1541j2159m4867k3842
3005H19865l9029m4658j7790o291o146J054r022J9587m786n443k645J1674m0L738
2991G20068K9125j7517m2332r989J6029n126m935J4094N883j6881l918q25J8711
2978G02387j1450n3K8491l502O621R974j474M639J3234m979j2065N979O663r806
2964G34659K4676m446l632j7807J6919j9172M2213K8888l1193N857K7000M5057
2952H49019q961k084q505J229J4542p302k9178j2051K9457q228k3384j3125o83
2939G80746J9261K1857R845Q717J0538K7918M7458L0842O0778O7493Q1085P6925
2927A243463R3964R4178J07272R5169J08372M8715K3765j2418m8165j09702j40513
$$ plain form
2916 1504100 1397426 1241509 1113787 1023182 945698 908421 851036 797439 740484 713248 680041
2905 680041 651348 616841 585856 556193 547678 538051 523424 515117 508299 491772 481175 488671 450059
2892 450059 416541 442504 448619 448938 416460 393960 390108 385279 398296 420206 423512 393896 399738
2879 399738 407782 412859 429739 427470 420498 413583 422352 410890 415344 410042 410927 390058 393316 401419
2865 401419 398938 367687 372549 392737 385909 370256 376261 378897 375226 381265 377427 381972 373872 355801
2851 355801 354813 352258 367567 370214 307596 288160 281153 270885 268272 259316 248080 236028 255935
2838 255935 257668 272071 282998 295719 303474 328369 327648 346780 354545 348234 340567 335554 346964
2825 346964 325264 339443 319504 304040 281473 281555 292528 296437 277341 255420 276954 276333 263823
$$ packed form
2916A504100j06674j55917j27722r0605p7484l7277n7385n3597n6955k7236l3207
2905F80041k8693l4507l0985k9663q515r627j4627q307o818j6527j0597P496l8612
2892D50059l3518K5963O115L19l2478k2500l852m829J3017K1910L306k9616N842
2879C99738Q044N077J6880k269o972o915Q769j1462M454n302Q85k0869L258Q103
2865D01419k481l1251M862K0188o828j5653O005K636l671O039l838M545q100j8071
2851C55801r88k555J5309K647o2618j9436p007j0268k613q956j1236j2052J9907
2838B55935J733J4403J0927J2721P755K4895p21J9132P765o311p667n013J1410
2825C46964k1700J4179j9939j5464k2567Q2J0973L909j9096k1921K1534o21j2510
$$ plain form
2812 263823 239848 224997 235845 227443 204068 215190 216399 219786 209931 206761 200021 196937 196429
2799 196429 170348 171157 194755 219582 189252 177869 190104 191530 210237 204832 215806 235711
2787 235711 237863 236478 236833 219096 223355 243158 220507 235706 205886 188426 180334 197865 190486
2774 190486 178877 182104 187558 169713 173838 171000 166182 161044 137595 129119 135044 124972 127088
2761 127088 157511 166607 145603 162389 162513 145074 146577 154976 127625 148366 148407 154175 139256
2748 139256 154297 156046 135354 123705 132843 112695 102571 107124 117830 124937 110370 121407
2736 121407 128889 121791 128911 134253 145884 127263 98767 97548 121141 137762 112824 109878 97156
2723 97156 77092 63961 59594 55626 56281 85106 122706 119575 133642 121652 95237 86279 89554
$$ packed form
2812B63823k3975j4851J0848q402k3375J1122J209L387r855l170o740l084n08
2799A96429k6081Q09K3598K4827l0330j1383J2235J426J8707n405J0974J9905
2787B35711K152j385L55j7737M259J9803k2651J5199k9820j7460q092J7531p379
2774A90486j1609L227N454j7845M125k838m818n138k3449q476N925j0072K116
2761A27088L0423R096k1004J6786J24j7439J503Q399k7351K0741M1N768j4919
2748A39256J5041J749k0692j1649R138k0148j0124M553J0706P107j4567J1037
2736A21407P482p098P120N342J1631j8621k8496j219K3593J6621k4938k946j2722
2723I7156k0064j3131m367l968O55K8825L7600l131J4067j1990k6415q958L275
$$ plain form
2710 89554 85944 71928 56002 86175 104053 84139 87166 64797 64726 79109 94739 85280 56648
2697 56648 73573 67710 85886 88031 103910 106101 49034 43271 60931 72148 79742 85017 72561
2684 72561 62288 61553 44005 65839 57680 74892 50624 45145 79652 73714 88238 66582 54632
2671 54632 49949 51973 59210 60321 57732 78577 66009 41018 53530 68660 71456 97002 94734
2658 94734 71247 81368 76768 86707 85398 56042 48181 50733 36156 52451 50069 73176 35223
2645 35223 56042 62433 62414 56351 44829 52011 57968 31726 31841 31491 24691 30174 39758 55543 30700
2630 30700 9938 35155 52987 79675 50133 45641 43105 65024 28667 27884 24277 21722 25366
2617 25366 73553 67901 50439 34736 21380 27990 19151 43425 46116 32999 13826 33689 36787
$$ packed form
2710H9554l610j4016j5926L0173J7878j9914L027k2369p1J4383J5630r459k8632
2697E6648J6925n863J8176K145J5879K191n7067n763J7660J1217P594N275j2456
2684G2561j0273p35j7548K1834q159J7212k4268n479L4507n938J4524k1656j1950
2671E4632m683K024P237J111k589K0845j2568k4991J2512J5130K796K5546k268
2658I4734k3487J0121m600R939j309k9356p861K552j4577J6295k382K3107l7953
2645C5223K0819O391j9o063j1522P182N957k6242J15l50o800N483R584J5785k4843
2630C0700k0762K5217J7832K6688k9542m492k536K1919l6357p83l607k555L644
2617B5366M8187n652j7462j5703j3356O610q839K4274K691j3117j9173J9863L098
$$ plain form
2604 36787 29381 36200 48105 25537 26357 51537 51567 22103 33877 9152 -3207 24367 50863
2591 50863 38885 42428 46961 50497 46271 44652 45404 63892 61262 52290 27019 21125 19372 20685
2577 20685 25333 36031 40209 32530 29787 51326 41043 37879 20496 10169 37204 34133 24003
2564 24003 17646 7553 23925 23137 14170 21388 2481 -9288 2611 778 12718 17585 -1231
2551 -1231 -12573 7628 -9799 -19401 -12139 18370 26540 11225 11780 14831 10643 44085 41182 37331
2537 37331 27514 33097 29015 53898 42705 44556 42140 37914 13715 41971 28930 13260 27672
2524 27672 30644 30801 26926 9798 8961 17446 22878 19639 33050 30998 11337 10876 29124 24235
2510 24235 9811 15464 -880 20575 15483 23938 35607 10480 10431 20903 4285 19666 18174
$$ packed form
2604C6787p406O819J1905k2568Q20K5180L0k9464J1774k4725j2359K7574K6496
2591E0863j1978L543M533L536m226j619P52J8488k630q972k5271n894j753J313
2577B0685M648J0698M178p679k743K1539j0283l164j7383j0327K7035l071j0130
2564B4003o357j0093J6372p88q967P218j8907j1769J1899j833J1940M867j8816
2551a231j1342K0201j7427r602P262L0509Q170j5315N55L051m188L3442k903l851
2537C7331r817N583m082K4883j1193J851k416m226k4199K8256j3041j5670J4412
2524B7672K972J57l875j7128q37Q485N432l239J3411k052j9661m61J8248m889
2510B4235j4424N653j6344K1455n092Q455J1669k5127m9J0472j6618J5381j492
$$ plain form
2497 18174 2099 718 5218 -4230 17916 9158 17214 15618 20613 24948 38439 21435 16354 4821
2483 4821 11572 13160 -2421 -2612 20287 39371 18856 -9525 -923 21762 37254 33865 6321
2470 6321 4620 11609 1425 -8842 -3081 20660 22997 3938 -22410 -31227 -37262 5584 923
2457 923 -5504 -4295 25880 29318 18353 23244 28967 30346 21012 3910 5990 2980 -14837 5090
2443 5090 11933 6422 6292 16959 37471 16281 7791 4307 33643 11374 9821 21033 23466 33121
2429 33121 30102 36992 -607 -437 26805 29979 24779 10950 -24846 -21493 7053 27199 3999
2416 3999 12298 21613 20307 30900 36638 30616 33741 55304 59870 47813 31275 25271 45337 55325
2402 55325 16039 -4821 -1496 4125 855 13324 4762 -12018 -8867 -26225 -15104 -10832 -24667
$$ packed form
2497A8174j6075j381M500r448K2146q758Q056j596M995M335J3491j7004n081j1533
2483D821O751J588j5581j91K2899J9084k0515k8381Q602K2685J5492l389k7544
2470F321j701O989j0184j0267N761K3741K337j9059k6348q817o035M2846m661
2457I23o427J209L0175L438j0965M891N723J379r334j7102K080l010j7817J9927
2443E090O843n511j30J0667K0512k1190q490l484K9336k2269j553J1212K433R655
2429C3121l019O890l7599J70K7242L174n200j3829l5796L353K8546K0146k3200
2416C999Q299R315j306J0593N738o022L125K1563M566j2057j6538o004K0066R988
2402E5325l9286k0860L325N621l270J2469q562j6780L151j7358J1121M272j3835
$$ plain form
2389 -24667 -11146 18998 31651 27444 22214 4949 -6361 -7821 8124 26374 13394 20254 21239
2376 21239 24116 22616 -5491 1409 -19450 -15891 -3317 3188 14258 -16192 -1317 -2692 -8433
2363 -8433 -13016 12733 10480 10411 -1311 7278 -4267 -1544 22653 29153 12504 14005 24723 25388
2349 25388 20935 13601 24399 16180 -2297 13973 7793 245 168 -3138 16445 26616 29624 25842
2335 25842 43460 36592 20880 26208 40236 43696 45935 40206 49817 47986 35163 59439 59175 45808
2321 45808 40896 27345 32232 35174 35046 28620 32690 -6542 9665 31074 11013 -14326 9591
2308 9591 42297 32980 26282 -8168 -9103 2614 13056 20195 3872 -2653 27119 25450 8997
2295 8997 7342 -30182 -14541 9609 32802 44690 39110 38142 24751 15661 26841 38335 7844
$$ packed form
2389b4667J3521L0144J2653m207n230j7265j1310j460J5945J8250j2980O860R85
2376B1239K877j500k8107O900k0859L559J2574O505J1070l0450J4875j375n741
2363h433m583K5749k253o9j1722Q589j1545K723K4197O500j6649J501J0718O65
2349B5388m453p334J0798q219j8477J6270o180p548p7l306J9583J0171L008l782
2335B5842J7618o868j5712N328J4028L460K239n729R611j831j2823K4276k64j3367
2321D5808m912j3551M887K942j28o426M070l9232J6207K1409k0061k5339K3917
2308I591L2706r317o698l4450r35J1717J0442P139j6323o525K9772j669j6453
2295H997j655l7524J5641K4150K3193J1888n580r68j3391r090J1180J1494l0491
$$ plain form
2282 7844 1447 -3037 31161 16408 6567 36497 29720 -311 -480 -5086 -6154 4783 3589 6165
2268 6165 16411 -330 26431 14193 30479 37951 17416 34395 29147 47773 14468 3995
2256 3995 9112 -9688 3726 5972 -6785 24270 44068 19575 19024 13640 21402 36249 26664
2243 26664 39160 39051 14750 14427 21611 17951 9040 -4380 34177 42541 42405 33851 37504 28613
2229 28613 36414 21888 31630 28702 42988 36507 34907 46440 53274 69983 45038 55071 52430
2216 52430 43779 60617 59592 28568 31616 23729 24500 14711 38871 47519 36871 19326 24791 42788
2202 42788 49288 54744 20212 20576 29064 36482 47530 50919 40407 32549 51834 69057 61407 41273
2188 41273 51436 68736 75034 72998 62690 68409 62910 67079 93853 90762 68852 61675 54026
$$ packed form
2282G844o397m484L4198j4753r841K9930o777l0031j69m606j068J0937j194K576
2268F165J0246j6741K6761j2238J6286P472k0535J6979n248J8626l3305j0473
2256C995N117j8800J3414K246j2757L1055J9798k4493n51n384P762J4847r585
2243B6664J2496j09k4301l23P184l660q911j3420L8557Q364j36q554L653q891
2229B8613P801j4526R742k928J4286o481j600J1533O834J6709k4945J0033k641
2216E2430q651J6838j025l1024L048p887P71r789K4160Q648j0648j7545N465J7997
2202D2788O500N456l4532L64Q488P418J1048L389j0512p858J9285J7223p650k0134
2188D1273J0163J7300O298k036j0308N719n499M169K6774l091k1910p177p649
$$ plain form
2175 54026 61612 75702 64760 75214 69683 39164 50428 60334 74771 98061 103344 76270 92403
2162 92403 103826 76004 100714 98518 110320 92900 104297 135716 137584 142078 128104 137164 132458
2149 132458 127459 141608 150465 148435 179582 189941 187652 178107 147399 173253 171040 169102 152385
2136 152385 173457 211862 219779 235420 254409 238134 243962 239022 201046 215680 256166 266400
2124 266400 268327 283731 293808 317772 314526 323917 323117 348852 362864 378116 387778 413486 408393
2111 408393 412882 423378 463493 495639 504063 526633 554807 557139 574555 586649 594567 617909
2099 617909 651300 658214 679614 705223 728158 746169 785137 812025 837042 856805 898928 941797
2087 941797 974367 1005263 1044115 1091612 1151035 1228538 1324221 1402019 1490923 1600325 1736264
$$ packed form
2175E4026P586J4090j0942J0454n531l0519J1264R906J4437K3290N283k7074J6133
2162I2403J1423k7822K4710k196J1802j7420J1397L1419J868M494j3974R060m706
2149A32458m999J4149Q857k030L1147J0359k289r545l0708K5854k213j938j6717
2136A52385K1072L8405P917J5641J8989j6275N828m940l7976J4634M0486J0234
2124B66400J927J5404J0077K3964l246R391q00K5735J4012J5252R662K5708n093
2111D08393M489J0496M0115L2146Q424K2570K8174K332J7416J2094P918K3342
2099F17909L3391O914K1400K5609K2935J8011L8968K6888K5017J9763M2123M2869
2087I41797L2570L0896L8852M7497N9423P7503R5683P7798Q8904J09402J35939
$$ plain form
2076 1736264 1871121 2024668 2163439 2376677 2625426 2956992 3287040 3742912 4353303 5062385
2066 5062385 5785632 6566672 7543622 8859753 9699481 9857099 9207582 7012369 5199906
2057 5199906 4075507 3308429 2751726 2371280 2089001 1853173 1639915 1471609 1378311 1300638
2047 1300638 1215098 1150717 1077514 957933 869990 788203 718936 670254 612899 577074 545348
2036 545348 497864 461521 462525 446099 447744 419897 410783 379966 351264 349698 323998 311042
2024 311042 275988 272034 271701 243347 241701 237136 217917 237590 216789 195253 201397 201834 195057
2011 195057 199646 188935 185405 188462 186641 170034 167109 164571 148962 177841 165127 132795 118319
1998 118319 130423 133267 117120 106512 97388 111010 107259 112129 99269 97472 105342 117632 104711
$$ packed form
2076A736264J34857J53547J38771K13238K48749L31566L30048M55872O10391P09082
2066E062385P23247P81040R76950J316131Q39728J57618o49517k195213j812463
2057E199906j124399p67078n56703l80446k82279k35828k13258j68306r3298p7673
2047A300638q5540o4381p3203j19581q7943q1787o9267m8682n7355l5825l1726
2036E45348m7484l6343J004j6426J645k7847r114l0817k8702j566k5700j2956
2024C11042l5054l954l33k8354j646m565j9219J9673k0801k1536O144M37o777
2011A95057M589j0711l530L057j821j6607k925k538j5609K8879j2714l2332j4476
1998A18319J2104K844j6147j0608r124J3622l751M870j2860j797P870J2290j2921
$$ plain form
1985 104711 112665 96403 74241 84236 105843 95588 98543 77193 84835 69728 59967 48848 76946
1972 76946 74079 81050 70134 61189 76890 60563 59486 75440 72263 66745 56645 44160 49143
1959 49143 49133 51801 58646 44465 43645 11454 12623 17280 25119 25443 22368 48705 32411 17933
1945 17933 10869 -4982 12063 9611 2305 7587 15170 29881 43374 66453 24272 26377 20842
1932 20842 25003 16320 6173 -4361 17416 4855 10344 31860 26924 13787 4692 11609 2358
1919 2358 14953 10899 24395 8350 22468 39388 37803 24552 48313 20947 6734 5089 15399
1906 15399 33664 34132 13324 8374 16643 4717 7413 30134 -427 -9443 -10580 -9888 19039 6569
1892 6569 8459 9794 28984 29704 47788 36421 33216 26580 -2976 5436 13604 4856 3273 1813
$$ packed form
1985A04711P954j6262k2162R995K1607j0255K955k1350P642j5107r761j1119K8098
1972G6946k867O971j0916q945J5701j6327j077J5954l177n518j0100j2485M983
1959D9143j0K668O845j4181q20l2191J169M657P839L24l075K6337j6294j4478
1945A7933p064j5851J7045k452p306N282P583J4711J3493K3079m2181K105n535
1932B0842M161q683j0147j0534K1777j2561N489K1516m936j3137r095O917r251
1919B358J2595m054J3496j6045J4118J6920j585j3251K3761k7366j4213j645J0310
1906A5399J8265M68k0808m950Q269j1926K696K2721l0561r016j137O92K8927j2470
1892F569J890J335J9190P20J8084j1367l205o636k9556Q412Q168q748j583j460
$$ plain form
1878 1813 -26290 -13814 -6363 3686 -16661 -23668 -12454 -17828 -7306 -11477 -2219 4577 6122
1865 6122 6764 991 29718 11372 4886 6366 -22029 -8808 -4741 366 1484 6865 -8766 -11470
1851 -11470 -36853 -16250 -17482 -5081 -37713 -27547 -9527 -32828 -12712 9139 5867 7218
1839 7218 -12368 1040 -8896 -27037 -11680 -24281 -20281 -204 -4544 724 -8411 -7245 -17391
1826 -17391 -14267 11379 28976 32424 31052 16754 4021 -2733 10277 16247 12205 4221 12543
1813 12543 7291 11471 25663 11706 10281 -1486 3261 11569 3380 17217 3066 -18966 -4453
1800 -4453 14545 12291 29716 31368 18865 13683 15013 25541 31147 42647 37048 18784 1948
1787 1948 -4298 24810 36190 780 -7634 19144 -5313 -20842 -16046 -11144 3408 2403 10046
$$ packed form
1878A813k8103J2476P451J0049k0347p007J1214n374J0522m171R258O796J545
1865F122O42n773K8727j8346o486J480k8395J3221M067N107J118N381j5631k704
1851a1470k5383K0603j232J2401l2632J0166J8020k3301K0116K1851l272J351
1839G218j9586J3408r936j8141J5357j2601M000K0077m340N268r135J166j0146
1826a7391L124K5646J7597L448j372j4298j2733o754J3010N970m042p984Q322
1813A2543n252M180J4192j3957j425j1767M747Q308q189J3837j4151k2032J4513
1800d453J8998k254J7425J652j2503n182J330J0528N606J1500n599j8264j6836
1787A948o246K9108J1380l5410q414K6778k4457j5529M796M902J4552j005P643
$$ plain form
1774 10046 -5643 -16256 -18697 -21523 -21215 14861 -1003 -14471 -18432 -16481 -10809 -4697 15077
1761 15077 13429 -10084 -7813 -34376 -24214 -4502 1392 -922 -6694 -30152 -9430 10689 2794
1748 2794 -20182 -14111 -2877 -21571 -62012 -46409 -15595 3228 12533 -14106 -5680 -20782 -3763
1735 -3763 -441 -21812 -28641 -14244 -15998 -19189 -7630 -13264 -9547 -12860 -1208 7512 -3033 14051
1721 14051 26818 24322 20179 13566 7496 -9815 -2791 -25261 -2701 1741 1668 -7988 2461 1751
1707 1751 11723 12663 771 1940 -39598 -31297 -14657 -1627 12858 10229 7549 -7802 -1579 -9325
1693 -9325 5800 -5822 -10804 -6598 -15291 -14241 -27749 -8576 -12045 -32133 -14999 -26883 -27774
1680 -27774 12223 34906 8901 -4932 -16461 -16674 12947 -10217 -5465 -7730 28 -9961 -17406
$$ packed form
1774A0046j5689j0613k441k826L08L6076j5864j3468l961J951N672O112J9774
1761A5077j648k3513K271k6563J0162J9712N894k314n772k3458K0722K0119p895
1748B794k2976O071J1234j8694m0441J5603L0814J8823R305k6639Q426j5102J7019
1735c763L322k1371o829J4397j754l191J1559n634L717l313J1652Q720j0545J7084
1721A4051J2767k496m143o613o070j7311P024k2470K2560M442p3r656J0449p10
1707A751R972R40j1892J169m1538Q301J6640J3030J4485k629k680j5351O223p746
1693i325J5125j1622m982M206q693J050j3508J9173l469k0088J7134j1884q91
1680b7774L9997K2683k6005j3833j1529k13K9621k3164M752k265P758r989p445
$$ plain form
1667 -17406 9186 3913 -16937 -22928 -25609 -20244 -17039 -15945 -29349 -20244 -24223 -44440 -3230
1654 -3230 1265 -30355 -16310 -3467 -6160 -18472 -8217 -22756 -22987 -8083 -13999 -26132 -30296
1641 -30296 -24309 -26093 -36383 -22014 -11593 -11068 -8931 -11186 -11543 -4790 -22486 -32842 -19114 -15374
1627 -15374 -26163 -10976 -35300 -29809 1199 22181 5081 1953 -16707 -13270 -12987 -12185 -18361
1614 -18361 -15132 355 -12833 -26057 -40929 -42695 -51086 -35292 -33414 -15873 -48820 -68931 -77836
1601 -77836 -44339 -4418 2992 8578 4206 2972 -26749 -27236 -18754 -19951 -22238 -24132 -38818 -25699
1587 -25699 -17590 -9248 -32166 -23456 -13549 -17523 -31543 -23917 -25760 -4789 -18589 -24569 -3957
1574 -3957 -4509 2055 5111 69 -22255 -12918 -23643 -9411 2838 8452 -3599 4576 -3350 -21347
$$ packed form
1667a7406K6592n273k0850n991k681N365L205J094j3404R105l979k0217M1210
1654c230M495l1620J4045J2843k693j2312J0255j4539k31J4904n916j2133m164
1641c0296N987j784j0290J4369J0421N25K137k255l57O753j7696j0356J3728L740
1627a5374j0789J5187k4324N491L1008K0982j7100l128j8660L437K83Q02o176
1614a8361L229J5487j3188j3224j4872j766q391J5794J878J7541l2947k0111q905
1601g7836L3497L9921P410N586m372j234k9721m87Q482j197k287j894j4686J3119
1587b5699Q109Q342k2918Q710R907l974j4020P626j843K0971j3800n980K0612
1574c957n52O564L056n042k2324R337j0725J4232J2249N614j2051Q175p926j7997
$$ plain form
1560 -21347 -37076 -27072 -15894 -28869 -41435 -35316 -18876 -19350 -14657 -24929 -12036 -17208 -10361
1547 -10361 -70 -4818 -15951 -22677 14933 21179 29695 16444 -8406 -24672 -11908 -24036 -36961
1534 -36961 -26161 -19851 -11794 -9741 -26350 -11888 -10308 -12848 -6347 2516 -32846 -35553 -47873
1521 -47873 -57696 -34612 -43770 -23281 -22928 -21184 -5632 -13852 -18304 -31179 -9194 -9601 -13457 5872
1507 5872 5565 -13577 -31355 -44701 -53985 -36496 -31858 -26599 -15780 -16680 -24595 -5494 17152 15874
1493 15874 -11740 -19198 -7330 -19563 -166 8316 17578 13349 20260 39284 34675 912 6863
1480 6863 850 -2962 -2945 8185 -3562 -22272 -19095 3446 18769 -4962 -8112 1971 5483 -8439
1466 -8439 2732 6312 12983 -2853 16223 3705 -26018 -1926 14772 1039 -29878 -21188 -6139
$$ packed form
1560b1347j5729J0004J1178j2975j2566O119J6440m74M693j0272J2893n172O847
1547a0361J0291m748j1133o726L7610O246Q516j3251k4850j6266J2764j2128j2925
1534c6961J0800O310Q057K053j6609J4462J580k540O501Q863l5362k707j2320
1521d7873r823K3084r158K0489L53J744J5552q220m452j2875K1985m07l856J9329
1507E872l07j9142j7778j3346r284J7489M638N259J0819r00p915J9101K2646j278
1493A5874k7614p458J1868j2233J9397Q482R262m229O911J9024m609l3763N951
1480F863o013l812J7J1130j1747j8710L177K2541J5323k3731l150J0083L512j3922
1466h439J1171L580O671j5836J9076j2518k9723K4092J6698j3733l0917Q690J5049
$$ plain form
1453 -6139 -21144 -27552 -3797 -11482 -33938 -9165 643 -3543 -31696 -14029 -29647 -35071 -14975
1440 -14975 -2942 -14651 -32747 -31119 -37840 -19806 -29262 1233 8371 -34804 -17421 -24613 -21112
1427 -21112 -2516 -10713 -40055 -41642 -40922 -24915 -13097 -4489 -6482 2385 -263 -9895 2368 -37867
1413 -37867 -38616 -23987 -20879 -7737 4950 -7505 -8637 -14605 -23562 -20048 -42917 -50551 -31443
1400 -31443 -27793 -14154 -16266 -15078 -14434 -7248 10106 13196 -11114 -20380 -10634 -9180 16477 -2683
1386 -2683 -19533 -9596 -5044 -23944 -35347 -26991 -23321 -34605 -2603 -94 -17370 7148 -13403
1373 -13403 -15879 -9616 -15388 380 -9808 -7234 -2167 21058 11682 1456 1963 -24546 -44087
1360 -44087 -23800 -11087 -4729 -954 -30915 -38541 -7457 32698 16389 2949 -11957 -4227 18019
$$ packed form
1453f139j5005o408K3755p685k2456K4773R808m186k8153J7667j5618n424K0096
1440a4975J2033j1709j8096J628o721J8034r456L0495P138m3175J7383p192L501
1427b1112J8596q197k9342j587P20J6007J1818Q608j993Q867k648r632J2263m0235
1413c7867p49J4629L108J3142J2687j2455j132n968q957L514k2869p634J9108
1400c1443L650J3639k112J188O44P186J7354L090k4310r266R746J454K5657j9160
1386b683j6850R937M552j8900j1403Q356L670j1284L2002K509j7276K4518k0551
1373a3403k476O263n772J5768j0188K574N067K3225r376j0226N07k6509j9541
1360d4087K0287J2713O358L775k9961p626L1084M0155j6309j3440j4906P730K2246
$$ plain form
1347 18019 20242 -24847 -29602 -21728 -36760 -16811 -12795 -310 -3958 -15032 -12903 -217 -3127
1334 -3127 10366 18959 7670 3724 -10346 -12507 -6574 6425 -19197 -31782 -26476 -22769 -14346
1321 -14346 -3144 9772 9482 8150 761 -2349 -36128 -33138 -22341 -18822 -12333 14716 -2552
1308 -2552 -13017 -4889 2568 22145 20114 -2213 -17893 -1063 1379 -16952 -26261 -19434 -18295
1295 -18295 -23854 -11753 3747 -19097 -37991 -13965 2796 -8012 -28643 -28818 -23525 -18259 7865
1282 7865 5019 11297 -9745 -23240 -37848 -33071 -6481 -21394 -16258 -169 7075 12832 -7455
1269 -7455 -14867 -15234 -12382 -36872 -19091 -12417 -6668 -22669 -8901 -19400 -15690 -7396 1640 9700
1255 9700 -18255 -1626 15563 -12063 -32253 -34818 -29091 -21395 -24681 -26165 -25266 -35968 -20994
$$ packed form
1347A8019K223m5089m755P874j5032J9949M016J2485l648j1074K129J2686k910
1334c127J3493Q593j1289l946j4070k161N933J2999k5622j2585N306L707Q423
1321a4346J1202J2916k90j332p389l110l3779K990J0797L519O489K7049j7268
1308b552j0465Q128P457J9577k031k2327j5680J6830K442j8331r309O827J139
1295a8295n559J2101J5500k2844j8894K4026J6761j0808k0631j75N293N266K6124
1282G865k846O278k1042j3495j4608M777K6590j4913N136J6089P244N757k0287
1269g455p412l67K852k4490J7781O674N749j6001J3768j0499L710Q294R036Q060
1255I700k7955J6629J7189k7626k0190k565N727P696l286j484Q99j0702J4974
$$ plain form
1242 -20994 -15275 -34373 -28417 7208 10961 -11227 -28014 -11692 -5787 15208 10135 -10264 -40373
1229 -40373 -27565 -3664 -13639 -2591 6655 -3068 -24745 -7657 546 646 -3369 -19087 -41539
1216 -41539 -9125 2835 -8867 -1648 -5999 -7169 -22624 -28838 2458 -14914 -19414 -27988 -18249
1203 -18249 -19307 -6179 9276 11152 -18466 18863 5993 14739 7619 -11618 -41065 -45677 -2115
1190 -2115 13991 16203 17294 21012 12280 -1132 3386 -42529 -39833 -33889 -25536 -10810 2325 5563
1176 5563 -5251 -22809 -33579 -25432 -3691 9183 -20678 -2646 522 4298 3385 9878 12108
1163 12108 11557 -28872 -25123 -8582 -13650 -15359 -17958 -15376 -3500 -27088 -28343 -17355 -21128 -30147
1149 -30147 -18540 16970 7198 -14433 -6247 -38337 -27897 11701 18103 2007 -17235 -2207
$$ packed form
1242b0994N719j9098N956L5625L753k2188j6787J6322N905K0995n073k0399l0109
1229d0373J2808K3901r975J1048R246r723k1677J7088Q203J00m015j5718k2452
1216d1539L2414J1960j1702P219m351j170j5455o214L1296j7372m500q574R739
1203a8249j058J3128J5455J876k9618L7329j2870Q746p120j9237k9447m612M3562
1190b115J6106K212J091L718q732j3412M518m5915K696N944Q353J4726J3135L238
1176E563j0814j7558j0770Q147K1741J2874k9861J8032L168L776r13O493K230
1163A2108n51m0429L749J6541n068j709k599K582J1876k3588j255J0988l773r019
1149c0147J1607L5510r772k1631Q186l2090J0440L9598O402j6096j9242J5028
$$ plain form
1137 -2207 -8936 -27444 -31397 -21589 -21581 -13949 13874 -4220 11652 2841 -12763 -3176 25527 13827
1123 13827 3867 -36124 -49510 -34821 -30613 -23655 -6111 -5263 -4117 2844 3832 -623 -15613 -27717
1109 -27717 -23393 -17633 -21079 12661 -6976 -14638 14062 1679 14915 -7971 -20887 2267 7942
1096 7942 -2130 -8465 14411 5377 -14194 -22043 17495 -1524 -8662 -11882 197 15338 14175
1083 14175 10756 19280 6457 5778 2224 5266 -3056 2623 8423 21334 13792 8086 -2728 -21733
1069 -21733 3995 -7438 -2465 5721 4683 12933 4919 11948 -22720 -16565 7379 3714 -8371
1056 -8371 -20829 -13908 -13674 -32421 -31012 -6147 -4159 -16392 -12299 -30124 -30574 -33941 -38721 -19557
1042 -19557 -31011 -13613 -49072 -41875 -18829 -11876 -19394 -37287 -32302 -10719 -6082 25306 17945
$$ packed form
1137b207o729j8508l953R808QP632K7823j8094J5872q811j5604R587K8703j1700
1123A3827r960l9991j3386J4689M208O958J7544Q48J146O961R88m455j4990j2104
1109b7717M324N760l446L3740j9637p662K8700j2383J3236k2886j2916K3154N675
1096G942j0072o335K2876r034j9571p849L9538j9019p138l220J2079J5141j163
1083A4175l419Q524j2823o79l554L042q322N679N800J2911p542n706j0814j9005
1069b1733K5728j1433M973Q186j038Q250q014P029l4668O155K3944l665j2085
1056h371j2458O921K34j8747J409K4865J988j2233M093j7825m50l367m780J9164
1042a9557j1454J7398l5459P197K3046O953p518j7893M985K1583M637L1388p361
$$ plain form
1029 17945 -10724 -21236 -2831 -8891 -15425 -20463 -26511 2902 59 -12712 -10655 -23582 -23769
1016 -23769 -32559 -42390 -22083 -13030 -24849 -9644 590 6961 11947 8006 9162 -751 -13974
1003 -13974 -39974 -35454 -35965 -1415 15312 20779 -2909 6344 -11873 -22429 -6652 8183 23738
990 23738 -22841 -21090 -4291 -13500 -44215 -45622 -12076 1001 -7134 -28153 -26779 -38064 -15980
977 -15980 -12572 -22250 -17682 -4685 6063 -13974 -13889 5148 21406 22467 27539 24567 43844 17798
963 17798 15523 -1110 -7093 -766 -1164 11291 13903 -1092 -9437 -12059 -19384 -28417 -33945 -25007
949 -25007 7288 5106 13575 -5712 692 -257 -8221 -7250 -18492 -27715 -21965 -25268 -39906 -10221
935 -10221 -24640 -22508 -4289 6802 -8576 -3794 1637 -11063 -27617 -11194 -4106 7261 10612
$$ packed form
1029A7945k8669j0512J8405o060o534n038o048K9413k843j2771K057j2927j87
1016b3769q790r831K0307R053j1819J5205J0234O371M986l941J156r913j3223
1003a3974k6000M520n11L4550J6727N467k3688R253j8217j0556J5777J4835J5555
990B3738m6579J751J6799r209l0715j407L3546J3077q135k1019J374j1285K2084
977a5980L408r678M568J2997J0748k0037Q5J9037J6258J061N072k972J9277k6046
963A7798k275j6633n983O327l98J2455K612j4995q345k622p325r033n528Q938
949b5007L2295k182Q469j9287O404r49p964R71j1242r223N750l303j4638K9685
935a0221j4419K132J8219J1091j5378M782N431j2700j6554J6423P088J1367L351
$$ plain form
922 10612 16964 8375 -5216 -31360 -28306 -10832 -20764 -13790 -12425 -3688 12335 20462 22588 14063
908 14063 -21679 -27489 -11446 6161 3521 -3019 -1216 -10810 -5397 14147 6131 14709 3189 -6398
894 -6398 -4738 -10094 -6905 -20077 -15062 1910 27503 22419 3820 5696 8318 408 10129 11441
880 11441 29132 19597 5624 -13261 1137 19526 6145 8332 1037 -14219 -10350 -21237 -27990
867 -27990 -36712 -11631 6603 -21322 -43009 -41004 -16850 -16592 -7889 696 -203 -11408 17050 33853
853 33853 8717 262 -7454 19147 16237 9507 3527 16649 22681 16366 12819 -8426 -18316 -26311
839 -26311 3979 -11130 -26836 -8636 3105 7551 22996 7573 4305 5054 -4165 -17451 -15232
826 -15232 -17778 -19532 -20215 -29805 -1144 8904 9740 -2946 -15515 -28370 -8000 -10688 10041 7097
$$ packed form
922A0612O352q589j3591k6144L054J7474r932O974J365Q737J6023Q127K126q525
908A4063l5742n810J6043J7607k640o540J803r594N413J9544q016Q578j1520r587
894f398J660n356L189j3172N015J6972K5593n084j8599J876K622p910R721J312
880A1441J7691r535j3973j8885J4398J8389j3381K187p295j5256L869j0887o753
867b7990q722K5081J8234k7925k1687K005K4154K58Q703Q585q99j1205K8458J6803
853C3853k5136q455p716K6601k910o730n980J3122O032o315l547k1245r890p995
839b6311L0290j5109j5706J8200J1741M446J5445j5423l268P49r219j3286K219
826a5232k546j754o83r590K8661J0048Q36j2686j2569j2855K0370k688K0729k944
$$ plain form
812 7097 6044 2160 -9006 -8027 -8615 8345 1743 -9370 -1699 5004 5593 7275 -11166 18078 15348
797 15348 2471 -195 5921 16063 3383 -19934 20998 7853 4160 -14832 2759 6627 -11227
784 -11227 7737 -9390 -4977 -2281 15751 -2943 -20503 -8798 5229 8404 -1509 6600 20213
771 20213 33951 -1950 -11146 -4701 -14003 -38472 -44699 -30905 -27166 -17648 -48432 -39572 -22123
758 -22123 -6755 -12971 4548 27240 12422 -1949 10487 -1833 -23856 -14216 -32723 -15305
746 -15305 -15828 -29252 -30771 -12703 5677 3821 7012 133 7265 10102 -15797 -33017 -15753 80
732 80 -12437 -10355 8262 -4923 -317 7220 1194 -24813 -35252 -2852 16562 553 8939 206
718 206 24084 5585 1946 -3449 -10181 17249 15415 6963 -9020 -13612 2671 39484 24467 24546
$$ packed form
812G097j053l884j1166R79n88J6960o602j1113P671O703N89J682j8441K9244k730
797A5348j2877k666O116J0142j2680k3317M0932j3145l693j8992J7591L868j7854
784a1227J8964j7127M413K696J8032j8694j7560J1705J4027L175r913Q109J3613
771B0213J3738l5901r196O445r302k4469o227J3794L739R518l0784Q860J7449
758b2123J5368o216J7519K2692j4818j4371J2436j2320k2023R640j8507J7418
746a5305n23j3424j519J8068J8380j856L191o879P132K837k5899j7220J7264J5833
732H0j2517K082J8617j3185M606P537o026k6007j0439L2400J9414j6009Q386q733
718B06K3878j8499l639n395o732K7430j834q452j5983m592J6283L6813j5017P9
$$ plain form
704 24546 14998 3854 7397 -18216 -24177 19510 11569 16146 -1259 -26577 -9237 8954 6919
691 6919 -291 856 3070 7733 6410 5511 9355 -7311 -5556 14601 23207 -1855 -3098 2419 18485
676 18485 20231 -5351 9175 28434 -769 -32774 -12372 16593 10559 -1893 17187 12023 -7471
663 -7471 13616 13631 10227 12764 6073 10587 24937 33360 26553 45386 45376 16552 -8762 -3780 2008
648 2008 16367 -2162 4963 19446 18705 2420 7264 16065 -2612 -13964 -21390 -31384 -22922 -21445
634 -21445 14736 895 4776 4728 20510 18015 -3954 6439 16950 1655 24368 25693 15845
621 15845 8605 -15049 -9171 -14574 -5900 -3760 24220 22358 24432 23702 11610 6771 6932 -98 3493
606 3493 -7451 -13719 1898 -13745 4703 3587 -2138 9500 12131 2538 -6574 -17981 427
$$ packed form
704B4546r548j1144L543k5613n961M3687p941M577j7405k5318J7340J8191k035
691F919p210J147K214M663j323q99L844j6666J755K0157Q606k5062j243N517J6066
676A8485J746k5582J4526J9259k9203l2005K0402K8965o034j2452J9080n164j9494
663g471K1087J5l404K537o691M514J4350Q423o807J8833j0k8824k5314M982N788
648B008J4359j8529P125J4483p41j6285M844Q801j8677j1352p426r994Q462J477
634b1445L6181j3841L881m8J5782k495k1969J0393J0511j5295K2713J325r848
621A5845p240k3654N878n403Q674K140K7980j862K074p30j2092m839J61p030L591
606C493j0944o268J5617j5643J8448j116n725J1638K631r593r112j1407J8408
$$ plain form
593 427 21291 3121 -3644 -9828 1140 12398 30863 -2293 25012 19367 8858 8332 -7737
580 -7737 6413 15085 19591 24398 20330 12086 -269 154 5773 4282 23974 10720 -6790 -24243
566 -24243 -2858 16108 30527 7133 -16637 -9835 -14383 22567 18414 27765 30130 11344 33104
553 33104 35038 23320 12702 28332 39848 35945 37349 22833 16108 -4310 3550 22757 30724
540 30724 9713 9958 420 5327 -3432 -1384 22180 16220 -10552 -1250 28344 10594 1803 1505
526 1505 4486 -10430 14306 10538 -4268 -3083 11721 9527 -14916 -10456 -17961 -14229 -2631 24886
512 24886 9425 5344 36975 41381 21192 12624 25682 34432 15257 4069 -13200 -27703 -21921
499 -21921 -1050 8312 -4363 18983 10892 6806 17654 -15159 -5059 6483 638 16296 7302
$$ packed form
593D27K0864j8170o765o184J0968J1258J8465l3156K7305n645j0509n26j6069
580g737J4150Q672M506M807m068q244j2355M23N619j491J9692j3254j7510j7453
566b4243K1385J8966J4419k3394k3770O802m548L6950m153R351K365j8786K1760
553C3104J934j1718j0618J5630J1516l903J404j4516o725k0418P860J9207P967
540C0724k1011K45r538M907q759K048K3564n960k6772R302K9594j7750q791k98
526A505K981j4916K4736l768j4806J185J4804k194k4443M460p505L732J1598K7517
512B4886j5461m081L1631M406k0189q568J3058Q750j9175j1188j7269j4503N782
499b1921K0871R362j2675K3346q091m086J0848l2813J0100J1542n845J5658q994
$$ plain form
486 7302 14586 23900 5529 -4284 -5133 19049 35626 19766 29503 39485 44661 39763 16740 13747
472 13747 -4213 34013 26869 14864 39947 33029 33690 14565 21605 -1075 878 9263 14328 22129
458 22129 14030 18146 27975 8702 34660 53088 14381 25067 33822 7831 -1735 -8924 -22446
445 -22446 -717 7290 19493 11198 13712 29305 26029 26329 31592 46588 29676 31504 17378 11655
431 11655 21839 25777 13199 -2470 4789 16685 28707 37251 14054 9760 -778 -2074 7964
418 7964 19328 18411 17180 31603 30084 12893 1930 -6355 -10754 -27883 13982 38019 9386
405 9386 -3990 15891 1878 -27671 -21726 -10642 -3541 -2914 -6689 -7566 -632 11265 10356 4214
391 4214 5822 8522 15136 -646 9661 -26080 -36511 -35072 -20974 -15951 -19471 -24226 -24952 -1092
$$ packed form
486G302P284R314j8371r813q49K4182J6577j5860R737R982N176m898k3023k993
472A3747j7960L8226p144j2005K5083o918O61j9125P040k2680J953Q385N065P801
458B2129q099M116R829j9273K5958J8428l8707J0686Q755k5991r566p189j3522
445b2446K1729Q007J2203q295K514J5593l276L00N263J4996j6912J828j4126n723
431A1655J0184L938j2578j5669P259J1896J2022Q544k3197m294j0538j296J0038
418G964J1364r17j231J4423j519j7191j0963q285m399j7129M1865K4037k8633
405I386j3376J9881j4013k9549N945J1084P101O27l775q77O934J1897r09o142
391D214J608K700O614j5782J0307l5741j0431J439J4098N023l520m755p26K3860
$$ plain form
377 -1092 -16688 6196 20400 -20 31561 25052 11730 23504 25104 16315 4515 2542 9811
364 9811 37760 10518 -625 -5794 -13868 -19538 -10227 2301 25255 27847 18491 8734 15050 9247
350 9247 -16797 -9412 9733 -1278 -7408 -4700 1568 20378 11633 12759 356 -9460 -13888 14050
336 14050 1255 -3480 7030 3821 -8541 -13949 -28819 -17440 6310 7680 5721 3914 -27500
323 -27500 12559 13061 10270 9609 -3121 2709 -20663 5493 12643 7813 -1104 27474 29734 -409
309 -409 -11763 11043 986 14512 10225 6898 -3294 350 18389 19779 17973 10849 12974 -22203
295 -22203 -19465 -11544 12946 -3996 -9641 -18530 -21314 -17338 -4908 -19145 -27734 14367 27685
282 27685 5929 186 1591 14326 -1318 -94 13350 10374 29699 29193 -2298 -513 13247
$$ packed form
377a092j5596K2884J4204k0420L1581o509j3322J1774J600q789j1800j973P269
364I811K7949k7242j1143n169q074n670R311J2528K2954K592r356r757O316n803
350I247k6044P385J9145j1011o130K708O268J8810q745J126j2403r816m428K7938
336A4050j2795m735J0510l209j2362n408j4870J1379K3750J370j959j807l1414
323b7500M0059N02k791o61j2730N830k3372K6156P150m830q917K8578K260l0143
309d09j1354K2806j0057J3526m287l327j0192L644J8039J390j806p124K125l5177
295b2203K738P921K4490j6942n645q889k784L976J2430j4237q589M2101J3318
282B7685k1756n743J405J2735j5644J224J3444k976J9325n06l1491J785J3760
$$ plain form
269 13247 18084 -3326 -8141 8484 15859 22041 -1280 -10601 -3770 20050 13394 -623 -19028
256 -19028 -33717 -8250 4481 8099 8963 -5906 9952 14515 26739 10042 -4815 6168 15703
243 15703 7069 -2086 21315 43982 15207 -185 6546 -3758 -5878 15453 4133 9310 6734
230 6734 -1932 6629 12421 7161 23475 26076 9670 -6961 -1070 27656 8845 -724 -13685 7326
216 7326 24041 36843 13982 7559 -3721 3310 23865 -5456 -21905 -19379 2480 -8472 6097
203 6097 25016 9123 6023 13542 8602 17523 23032 28243 -2596 -14813 -21952 -19745 15864 5491
189 5491 3527 5977 23718 15644 6125 13112 103 -10060 -11608 16225 8175 373 -7677 -1264
175 -1264 18456 12915 26661 25573 10677 -1600 3663 30643 26315 -10303 -6020 9476 19318
$$ packed form
269A3247M837k1410m815J6625P375O182k3321r321O831K3820o656j4017j8405
256a9028j4689K5467J2731L618Q64j4869J5858M563J2224j6697j4857J0983R535
243A5703q634r155K3401K2667k8775j5392O731j0304k120K1331j1320N177k576
230F734q666Q561N792n260J6314K601j6406j6631N891K8726j8811r569j2961K1011
216G326J6715J2802k2861o423j1280P031K0555k9321j6449K526K1859j0952J4569
203F097J8919j5893l100P519m940Q921N509N211l0839j2217p139K207L5609j0373
189E491j964K450J7741q074r519O987j3009j0163j548K7833q050p802q050O413
175a264J9720n541J3746j088j4896j2277N263K6980m328l6618M283J5496R842
$$ plain form
162 19318 10396 -1067 10623 24270 11881 -1637 13166 22720 19275 32267 35938 27851 24440
149 24440 8451 30922 12093 13547 17044 14851 34790 29040 -2378 1083 -5441 23833 12324
136 12324 2541 6447 -10430 25574 37512 12680 -414 -13253 -2046 11395 23624 27995 44205
123 44205 24291 20340 26664 12017 -2431 11124 29016 882 17139 18036 8895 18713 28456
110 28456 6299 8871 -6356 -5764 5458 40113 36586 6990 3382 15981 -10974 -16666 -1820
97 -1820 15871 -5059 -199 -76 10097 -3522 -19104 -15641 -22003 5499 -10918 -5723 5955 11424
83 11424 17677 14191 25321 43246 37855 23019 18682 21913 16735 20047 29389 14467 23615 15497
69 15497 19517 10620 -1777 12358 28939 14152 11705 11784 -4776 2470 8006 8423 27053 21636
$$ packed form
162A9318q922j1463J1690J3647j2389j3518J4803R554l445J2992L671q087l411
149B4440j5989K2471j8829J454L497k193J9939n750l1418L461o524K9274j1509
136A2324r783L906j6877L6004J1938k4832j3094j2839J1207J3441J2229M371J6210
123D4205j9914l951O324j4647j4448J3555J7892k8134J6257Q97r141R818R743
110B8456k2157K572j5227N92J1222L4655l527k9596l608J2599k6955n692J4846
97a820J7691k0930M860J23J0173j3619j5582L463o362K7502j6417N195J1678N469
83A1424O253l486J1130J7925n391j4836m337L231n178L312R342j4922R148q118
69A5497M020q897j2397J4135J6581j4787k447P9j6560P246N536M17J8630n417
$$ plain form
55 21636 13791 16231 16528 12874 18080 35920 28191 24690 27502 46180 32902 25501 30500 10262
41 10262 2497 307 6711 22273 26221 21111 18885 16684 495 7397 9896 15484 10686 -2270
27 -2270 6487 11734 10429 3345 7809 15863 2148 10549 9719 10998 42455 29090 12696 13784 -2295
12 -2295 1224 8377 16801 30777 47401 27460 12455 18005 20763 21799 30367 8659
0 8659
$$ packed form
55B1636p845K440K97l654N206J7840p729l501K812J8678j3278p401M999k0238
41A0262p765k190O404J5562L948n110k226k201j6189O902K499N588m798j2956
27b270Q757N247j305p084M464Q054j3715Q401q30J279L1457j3365j6394J088j6079
12b295L519P153Q424J3976J6624j9941j5005N550K758J036Q568k1708
0H659
$$ Imaginary data points
##PAGE= N=2
##DATA TABLE= (X++(I..I)), XYDATA
$$ plain form
16383 -649572 -641022 -658546 -644724 -622458 -598146 -573022 -562737 -553573 -577770 -588422 -578900 -557133
16371 -557133 -531696 -520697 -516478 -515735 -500869 -503296 -504921 -473747 -476141 -477288 -445125 -430617 -423480
16358 -423480 -415688 -397184 -373706 -380717 -368796 -350203 -353605 -351443 -356002 -343921 -333726 -323934 -315094
16345 -315094 -305712 -271726 -269339 -281329 -263300 -256633 -231100 -219431 -209977 -205394 -203224 -190958 -178626
16332 -178626 -172251 -174947 -168622 -154082 -144900 -126575 -114012 -90150 -85365 -84818 -90871 -90165 -76855
16319 -76855 -70163 -55112 -34350 -28721 -31872 -36336 -28573 -7481 155 29340 46884 49526 42495
16306 42495 63533 73322 65174 58883 62937 100883 97798 87116 94977 109947 123453 108499 129547
16293 129547 141769 142085 144870 168540 198641 190722 210365 212335 216706 212111 198885 197834 204483
$$ packed form
16383f49572Q550j7524J3822K2266K4312K5124J0285R164k4197j0652R522K1767
16371e57133K5437J0999M219P43J4866k427j625L1174k394j147L2163J4508P137
16358d23480P792J8504K3478p011J1921J8593l402K162m559J2081J0195R792Q840
16345c15094R382L3986K387j1990J8029O667K5533J1669R454M583K170J2266J2332
16332a78626O375k696O325J4540R182J8325J2563K3862M785N47o053P06J3310
16319g6855O692J5051K0762N629l151m464P763K1092P636K9185J7544K642p031
16306D2495K1038R789q148o291M054L7946l085j0682P861J4970J3506j4954K1048
16293A29547J2222L16K785K3670L0101p919J9643J970M371m595j3226j051O649
$$ plain form
16280 204483 232629 231624 256257 280533 277204 277914 277147 288228 294021 299843 296099 319805 321728
16267 321728 321389 347200 357079 378331 380704 374060 368512 382063 377685 411041 419673 429609 434212
16254 434212 441002 444441 422885 412651 440043 438506 445248 457286 473087 441608 437751 460134
16242 460134 478967 477410 494172 491412 468970 468455 477568 494668 495764 513398 519726 536348 541355
16229 541355 529028 533741 540374 539126 539081 563683 559763 559792 585182 597794 606013 586566 601360 609599
16215 609599 595300 602066 604388 622865 636938 636596 662858 654562 646590 642287 656238 648704 638240
16202 638240 643878 640616 647292 643257 648771 649894 658083 665595 664309 673961 669968 660912 673133 682400
16188 682400 674395 689922 697016 702031 702554 714262 710080 692619 682876 673737 697161 675831 664096
$$ packed form
16280B04483K8146j005K4633K4276l329P10p67J1081N793N822l744K3706J923
16267C21728l39K5811R879K1252K373o644n548J3551m378L3356Q632R936M603
16254D34212O790L439k1556j0234K7392j537O742J2038J5801l1479l857K2383
16242D60134J8833j557J6762k760k2442n15R113J7100J096J7634O328J6622N007
16229E41355j2327M713O633j248m5K4602l920K9K5390J2612Q219j9447J4794Q239
16215F09599j4299O766K322J8477J4073l42K6262q296p972m303J3951p534j0464
16202F38240N638l262O676m035N514J123Q189P512j286R652l993r056J2221R267
16188F82400q005J5527P094N015N23J1708m182j7461r743r139K3424k1330j1735
$$ plain form
16175 664096 705141 720946 726457 713839 743613 712278 712295 731842 730758 731180 726646 726872 756966
16162 756966 756771 743717 757145 779942 752775 757655 747175 757090 746014 742202 779821 764130
16150 764130 766438 763339 760372 761106 765256 770379 801853 796621 788957 794527 810958 790800 770776
16137 770776 783369 787583 784877 803840 789662 783353 799299 793802 800886 809706 812593 815019 808376
16124 808376 799525 822316 811523 808095 813214 821261 808510 812511 808212 817477 818806 803192 793810
16111 793810 808907 840725 847067 840576 841989 855089 862479 867293 855913 861793 830051 836199 840201
16098 840201 828496 825944 829658 837348 821137 815741 823211 849229 840974 829010 850961 859226 860172
16085 860172 857291 862124 864534 842718 858880 863638 832555 852446 851466 838717 840479 852828 861566
$$ packed form
16175F64096M1045J5805N511j2618K9774l1335J7J9547j084M22m534K26L0094
16162G56966j95j3054J3428K2797k7167M880j0480R915j1076l812L7619j5691
16150G64130K308l099k967P34M150N123L1474n232p664N570J6431k0158k0024
16137G70776J2593M214k706J8963j4178o309J5946n497P084Q820K887K426o643
16124H08376q851K2791j0793l428N119Q047j2751M001m299R265J329j5614r382
16111G93810J5097L1818O342o491J413J3100P390M814j1380N880l1742O148M002
16098H40201j1705k552L714P690j6211n396P470K6018q255j1964K1951Q265R46
16085H60172k881M833K410k1816J6162M758l1083J9891r80j2749J762J2349Q738
$$ plain form
16072 861566 876785 875724 872862 861373 853155 870587 846852 843375 860163 854509 835442 837928 847859
16059 847859 847971 863697 862855 876498 880404 867186 873180 865111 860131 864513 856001 842068 853763
16046 853763 868751 872407 875940 884600 896142 874170 859962 856424 893051 882704 882998 870535 860713
16033 860713 857915 840961 835619 864656 892974 902860 896508 900607 892570 867835 856548 874022 860860
16020 860860 874381 885882 875501 857033 829256 843866 873706 864397 868866 861105 866708 874939
16008 874939 879153 873351 878791 875713 878777 876271 861289 856674 859270 857357 851939 873946 879944 855112
15994 855112 861255 873995 875519 867288 831450 864371 873032 853896 877239 864698 850362 884659
15982 884659 877865 886934 878686 886443 867238 871549 863457 838416 837123 863219 889031 882318 885520
$$ packed form
16072H61566J5219j061k862j1489q218J7432k3735l477J6788n654j9067K486R931
16059H47859J12J5726q42J3643L906j3218N994q069m980M382q512j3933J1695
16046H53763J4988L656L533Q660J1542k1972j4208l538L6627j0347K94j2463r822
16033H60713k798j6954n342K9037K8318R886o352M099q037k4735j1287J7474j3162
16020H60860J3521J1501j0381j8468k7777J4610K9840r309M469p761N603Q231
16008H74939M214n802N440l078L064k506j4982m615K596j913n418K2007N998k4832
15994H55112O143J2740J524q231l5838L2921Q661j9136K3343j2541j4336L4297
15982H84659o794R069q248P757j9205M311q092k5041j293K6096K5812o713L202
$$ plain form
15969 885520 878356 850846 863692 870476 854095 867972 909846 875739 859960 856149 865682 880133
15957 880133 900404 882582 901915 898320 884544 879574 877844 870891 859419 869216 879637 875559 864055
15944 864055 880270 870034 860552 889990 876542 871333 882515 892742 888898 891296 880581 891533
15932 891533 878885 873013 857007 862756 900273 910533 927472 903253 873668 855961 876943 884248
$$ packed form
15969H85520p164k7510J2846O784j6381J3877M1874l4107j5779l811R533J4451
15957H80133K0271j7822J9333l595j3776m970j730o953j1472R797J0421m078j1504
15944H64055J6215j0236r482K9438j3448n209J1182J0227l844K398j0715J0952
15932H91533j2648n872j6006N749L7517J0260J6939k4219k9585j7707K0982P305
$$ [...]
##END NTUPLES=NMR SPECTRUM
##END=
