##TITLE=1H_EC-3256(XII-3)
 CDCl3
 8 sc, 
 6.9.2023
##JCAMPDX= 6.0         $$ Bruker NMR JCAMP-DX V2.0
##DATA TYPE= NMR SPECTRUM
##DATA CLASS= NTUPLES
##ORIGIN= UXNMR, Bruker Analytische Messtechnik GmbH
##OWNER= root
$$ XWIN-NMR		Version 3.5
$$ Wed Sep  6 15:15:30 2023 Russian Standard Time (UT+4h)  she@DPX200
##.OBSERVE FREQUENCY= 200.13135
##.OBSERVE NUCLEUS= ^1H
##.ACQUISITION MODE= SIMULTANEOUS
##.ACQUISITION SCHEME= undefined
##.AVERAGES= 8
##.DIGITISER RES= 18
##SPECTROMETER/DATA SYSTEM= spect
##.PULSE SEQUENCE= zg30
##.SOLVENT NAME= CDCl3
##.SHIFT REFERENCE= (INTERNAL, CDCl3, 0, 15.7689)
##AUDIT TRAIL= $$ (NUMBER, WHEN, WHO, WHERE, WHAT)
$$ ##TITLE= Audit trail, XWIN-NMR		Version 3.5
$$ ##JCAMPDX= 5.01
$$ ##ORIGIN= Bruker BioSpin GmbH
$$ ##OWNER= she
$$ F:/spectra/data/she/nmr/H-F/1/pdata/1/auditp.txt
$$ ##AUDIT TRAIL=  $$ (NUMBER, WHEN, WHO, WHERE, WHAT)
(   1,<2023-09-06 15:14:11.84 +0400>,<she>,<DPX200>,
      <created by zg, POWCHK disabled, PULCHK disabled
       configuration hash MD5:
       00 E9 B6 7A A2 85 ED C7 34 08 36 98 17 FE 4E 26
       data hash MD5: 16K
       43 05 1E A0 3A CB EE E6 20 3E 9F E6 A0 26 58 B8>)
(   2,<2023-09-06 15:14:13.90 +0400>,<she>,<DPX200>,
      <Start of raw data processing
       efp BC_mod = 2 LB = 0.24 FT_mod = 6 PKNL = 1 PHC0 = -21043.04 PHC1 = 12.85271 SI = 16K 
       data hash MD5: 16K
       BB 16 9A 5F DD 2D 04 4D 51 09 2C BE AF 1D 76 47>)
(   3,<2023-09-06 15:14:32.81 +0400>,<she>,<DPX200>,
      <pk PHC0 = 1.615567 PHC1 = -1.4 
       data hash MD5: 16K
       12 6B 6E D4 2F E8 D4 BE 09 67 3D 39 A9 54 9F 64>)
(   4,<2023-09-06 15:14:37.29 +0400>,<she>,<DPX200>,
      <abs ABSG = 5 
       data hash MD5: 16K
       B1 7F AF 21 61 FC 67 D2 BE D6 71 C7 A9 ED F5 4D>)
$$ ##END=
$$ 
$$ hash MD5
$$ EB EC B4 C1 3B DD 6F DC AF 1A C1 0D ED A7 60 5D
##$RELAX= 
##$RELAX= 
##$RELAX= 
##$RELAX= 
##$RELAX= 
##$RELAX= 
$$ Bruker specific parameters
$$ --------------------------
##$DU= <F:/spectra>
##$EXPNO= 1
##$NAME= <H-F>
##$PROCNO= 1
##$TYPE= <nmr>
##$USER= <she>
##$AMP= (0..31)
100 100 100 100 100 100 100 100 100 100 100 100 100 100 100 100 100 100 
100 100 100 100 100 100 100 100 100 100 100 100 100 100 
##$AQSEQ= 0
##$AQ_mod= 1
##$AUNM= <au_zg>
##$AUTOPOS= <>
##$BF1= 200.13
##$BF2= 200.13
##$BF3= 200.13
##$BF4= 200.13
##$BF5= 200.13
##$BF6= 200.13
##$BF7= 200.13
##$BF8= 200.13
##$BYTORDA= 1
##$CFDGTYP= 0
##$CFRGTYP= 5
##$CHEMSTR= <none>
##$CNST= (0..31)
1 1 145 1 1 1 1 1 1 1 1 1 1 1 1 1 1 1 1 1 1 1 1 1 1 1 1 1 1 1 1 1 
##$CPDPRG= <>
##$CPDPRG1= <>
##$CPDPRG2= <>
##$CPDPRG3= <>
##$CPDPRG4= <mlev>
##$CPDPRG5= <mlev>
##$CPDPRG6= <mlev>
##$CPDPRG7= <mlev>
##$CPDPRG8= <mlev>
##$CPDPRGB= <>
##$CPDPRGT= <>
##$D= (0..31)
0 1.2 0 0 0 0 0 0 0 0.06 0 0.03 0 0 0 0 0.0002 0 0 0 0 0 0 0 0 0 0 0 0 
0 0 0 
##$DATE= 1693998851
##$DBL= (0..7)
120 120 120 120 120 120 120 120 
##$DBP= (0..7)
150 150 150 150 150 150 150 150 
##$DBP07= 0
##$DBPNAM0= <>
##$DBPNAM1= <>
##$DBPNAM2= <>
##$DBPNAM3= <>
##$DBPNAM4= <>
$$ [...]
##$SUBNAM3= <"">
##$SUBNAM4= <"">
##$SUBNAM5= <"">
##$SUBNAM6= <"">
##$SUBNAM7= <"">
##$SUBNAM8= <"">
##$SUBNAM9= <"">
##$SW= 18.05172834244
##$SWIBOX= (0..15)
0 0 2 0 0 0 0 0 0 0 0 0 0 0 0 0 
##$SW_h= 3612.71676300578
##$TD= 16384
##$TD0= 1
##$TE= 0
##$TE2= 300
##$TE3= 300
##$TEG= 300
##$TL= (0..7)
0 120 120 120 120 120 120 120 
##$TP= (0..7)
150 150 150 150 150 150 150 150 
##$TP07= 0
##$TPNAME0= <>
##$TPNAME1= <>
##$TPNAME2= <>
##$TPNAME3= <>
##$TPNAME4= <>
##$TPNAME5= <>
##$TPNAME6= <>
##$TPNAME7= <>
##$TPOAL= (0..7)
0.5 0.5 0.5 0.5 0.5 0.5 0.5 0.5 
##$TPOFFS= (0..7)
0 0 0 0 0 0 0 0 
##$TUNHIN= 0
##$TUNHOUT= 0
##$TUNXOUT= 0
##$USERA1= <user>
##$USERA2= <user>
##$USERA3= <user>
##$USERA4= <user>
##$USERA5= <user>
##$V9= 5
##$VALIST= <valist>
##$VCLIST= <CCCCCCCCCCCCCCC>
##$VD= 0
##$VDLIST= <DDDDDDDDDDDDDDD>
##$VPLIST= <PPPPPPPPPPPPPPP>
##$VTLIST= <TTTTTTTTTTTTTTT>
##$WBST= 1024
##$WBSW= 4
##$XGAIN= (0..3)
0 0 0 0 
##$XL= 0
##$YL= 0
##$YMAX_a= 582991
##$YMIN_a= -780607
##$ZGOPTNS= <>
##$ZL1= 120
##$ZL2= 120
##$ZL3= 120
##$ZL4= 120
##$ABSF1= 15.76893
##$ABSF2= -2.282919
##$ABSG= 5
##$ABSL= 3
##$ALPHA= 0
##$AQORDER= 0
##$ASSFAC= 0
##$ASSFACI= 0
##$ASSFACX= 0
##$ASSWID= 0
##$AUNMP= <proc_1d>
##$AZFE= 0.1
##$AZFW= 0.1
##$BCFW= 0
##$BC_mod= 2
##$BYTORDP= 0
##$COROFFS= 0
##$CY= -3
##$DATMOD= 1
##$DC= 0
##$DFILT= <>
##$DTYPP= 0
##$F1P= 0
##$F2P= 0
##$FCOR= 1
##$FTSIZE= 16384
##$FT_mod= 6
##$GAMMA= 0
##$GB= 0
##$INTBC= 1
##$INTSCL= 3.70164e-10
##$ISEN= 128
##$LB= 0.24
##$LEV0= 0
##$LPBIN= 0
##$MAXI= 10000
##$MC2= 0
##$MEAN= 0
##$ME_mod= 0
##$MI= 1.114404
##$NCOEF= 0
##$NC_proc= -4
##$NLEV= 6
##$NOISF1= 3.799351
##$NOISF2= 2.8
##$NSP= 0
##$NTH_PI= 0
##$NZP= 0
##$OFFSET= 15.76893
##$PC= 1
##$PHC0= -21041.42
##$PHC1= 11.45271
##$PH_mod= 1
##$PKNL= yes
##$PPARMOD= 0
##$PSCAL= 0
##$PSIGN= 0
##$REVERSE= no
##$SF= 200.130000523983
##$SI= 16384
##$SIGF1= 3
##$SIGF2= 2
##$SINO= 5.538805
##$SIOLD= 16384
##$SREGLST= <1H.CDCl3>
##$SSB= 0
##$STSI= 16384
##$STSR= 0
##$SW_p= 3612.71676300578
##$SYMM= 0
##$S_DEV= 0
##$TDeff= 16384
##$TDoff= 0
##$TI= <>
##$TILT= no
##$TM1= 0
##$TM2= 0
##$TOPLEV= 0
##$USERP1= <user>
##$USERP2= <user>
##$USERP3= <user>
##$USERP4= <user>
##$USERP5= <user>
##$WDW= 1
##$XDIM= 16384
##$YMAX_p= 471964199
##$YMIN_p= -88160
$$ End of Bruker specific parameters
$$ ---------------------------------
##NTUPLES= NMR SPECTRUM
##VAR_NAME=  FREQUENCY,     SPECTRUM/REAL,   SPECTRUM/IMAG
##SYMBOL=    X,             R,               I
##VAR_TYPE=  INDEPENDENT,   DEPENDENT,       DEPENDENT
##VAR_FORM=  AFFN,          ASDF,            ASDF
##VAR_DIM=   16384,         16384,           16384
##UNITS=     HZ,            ARBITRARY UNITS, ARBITRARY UNITS
##FACTOR=    0.220516191357247, 1,           1
##FIRST=     3155.83605625536, 0,            0
##LAST=      -456.880706750423, 0,           0
##MIN=       -456.880706750423, -88160,      0
##MAX=       3155.83605625536, 471964199,    0
$$ Real data points
##PAGE= N=1
##DATA TABLE= (X++(R..R)), XYDATA
$$ [...]
8821 8583485 9197852 9909669 10741877 11708596 12685726 13464020 14048892 14336367 14228850 13717132
8811 13717132 12973424 12227410 11647537 11273817 11098728 11027657 10989463 10854158 10701602 10558197
8801 10558197 10495206 10521862 10643715 10869931 11200748 11691831 12296890 12949067 13694005 14462424
8791 14462424 15181008 15822221 16514743 17355259 18432916 19752399 21276269 22888653 24496506
8782 24496506 25815048 26637302 26861762 26562998 25827290 24743246 23466846 22296779 21297664
8773 21297664 20290727 19094263 17795817 16644199 15766124 15118538 14622273 14237471 14008893
8764 14008893 13905062 13966234 14219231 14576673 14995577 15436547 15837125 16145078 16459770 16733190
8754 16733190 17075876 17424942 17854730 18306570 18636781 18815192 18986280 19322300 19842194
8745 19842194 20340075 20697213 20718017 20248522 19199156 17759649 16237642 14963672 13965413
8736 13965413 13265778 12781950 12496498 12247745 12057834 11865117 11728064 11587628 11552499 11534961
8726 11534961 11590650 11696161 11900575 12105678 12387149 12672738 12934607 13010259 12939843 12752877
8716 12752877 12635984 12595907 12762040 13026644 13552858 14196565 15023282 15924494 17157103
8707 17157103 18610558 20650791 23243460 26881650 31840997 38903089 48324130 60522702
8699 60522702 65966310 59772659 49029912 37597537 29801890 24492351 20592007 17535074
8691 17535074 15260596 13457996 12158380 11118823 10272167 9535083 8985037 8470477 7962449
8682 7962449 7495796 7079125 6733324 6455908 6238353 6124665 5940654 5772867 5605461 5442311
8672 5442311 5320407 5189908 5062588 4955081 4849931 4751324 4645407 4530067 4494792 4488505
8662 4488505 4453001 4453135 4467558 4462913 4454825 4498346 4497168 4475774 4467622 4452459 4446471 4449437 4435583
8649 4435583 4447556 4472670 4510996 4557031 4621449 4670089 4748648 4811184 4879747 5014565 5162225
8638 5162225 5327262 5540747 5818805 6098710 6450036 6871494 7382645 7948500 8601967 9215864
8628 9215864 9709171 10130148 10544103 10968212 11401926 11531018 11260393 10759968 10306392 9976318
8618 9976318 9619704 9128420 8559460 7976216 7527447 7216544 7031930 6935471 6939353 6949712
8608 6949712 7034309 7165987 7360213 7625269 7974707 8383361 8887543 9434726 10003791 10592066
8598 10592066 11179475 11679952 12169622 12675308 13274842 13999411 14700155 15219936 15333389
8589 15333389 14869766 13970034 12802308 11593254 10552995 9794618 9206757 8761051 8371672
8580 8371672 7954169 7501943 7113901 6785052 6529161 6402545 6358707 6384592 6406378 6499936
8570 6499936 6590945 6702127 6862775 7057853 7342058 7694298 8056104 8344020 8505418 8492656
8560 8492656 8328377 8139951 7986911 7859192 7641118 7268964 6846502 6434365 6052157 5658628
8550 5658628 5252143 4838123 4440580 4111989 3858477 3632115 3452665 3313854 3198587 3114570
8540 3114570 3045825 2998093 2989615 2969456 2968261 2972828 2951387 2894301 2854281 2828567 2816105 2768251
8528 2768251 2662856 2558195 2434958 2314466 2225033 2148996 2035234 1887640 1764698 1686250
8518 1686250 1627176 1560619 1483074 1433615 1370941 1353723 1318842 1285533 1277974 1260367 1207827 1173077
8506 1173077 1139477 1120122 1108046 1095853 1060063 1015165 997750 988971 963966 949220 905133 907327
8494 907327 888524 838347 809876 816293 785040 788272 785893 774747 771051 742883 711997 692903
8482 692903 686830 699920 701397 703095 709906 698051 697985 666199 660069 640779 627332 628597 627681 611559
8468 611559 584866 554332 569374 575747 576545 563848 549681 521805 520043 529411 533825 530994 543686
8455 543686 523980 503652 512779 488692 464454 472702 487038 476503 486604 479822 470284 445546
8443 445546 440899 448963 433091 427667 429524 388089 400395 393474 390777 384679 386396 377960 377837 380379
8429 380379 363888 374974 368871 363596 378704 383102 393361 397090 368337 350682 365394 374739 370573
8416 370573 376371 400293 397924 395230 396518 390180 402424 384233 382811 366075 374516 375594 347210
8403 347210 344798 361690 354835 328752 314328 321971 314675 308068 297950 297607 291376 278193 284733
8390 284733 281124 289997 280867 297315 316740 288037 291173 282541 271648 286617 301881 286819 275191
8377 275191 297463 271893 261743 259479 245030 246265 238581 241905 235477 222622 201108 217260 212996
8364 212996 214689 221679 203326 177044 180982 177681 207937 211117 176397 171923 157345 173070 182049
8351 182049 183409 190123 190217 178640 176664 168095 177499 170945 188021 188018 191779 178203 177040 169903 169729
8336 169729 196420 171638 169129 180708 184793 144025 147359 182609 169582 170376 176382 170092 171510
8323 171510 147105 159316 150136 156039 148013 159691 154155 150741 172717 175944 173163 149397 159794
8310 159794 139169 145263 168328 149037 159805 150423 135344 127028 144911 158126 132059 157595
8298 157595 153599 149564 162843 147682 138560 154630 156383 163071 167259 160468 139978 148004 132299
8285 132299 132839 153736 158289 176800 167082 170182 176748 186363 174152 185640 206332 197825 191254
8272 191254 188419 199377 199110 212388 208367 206858 214635 223607 221873 219985 229197 227797 235563 242717
8258 242717 246474 226493 232276 247405 241265 229524 240681 242021 222084 201746 232347 226833 226256
8245 226256 226981 215139 229953 218817 204605 213163 228349 207357 207497 254882 260984 286442 247284
8232 247284 234643 283476 305714 315112 341308 373443 399232 430350 443671 504228 569380 586520
8220 586520 550378 485629 413341 383821 384745 353852 286864 270840 274435 249818 233215 243500
8208 243500 222800 220843 211583 214137 200777 205070 196695 228062 244731 230626 193506 238846 256109
8195 256109 292385 296972 425912 133481 -88160 36741 33094 76254 74838 107196 75219
8184 75219 108245 129649 131825 106961 133412 111707 93530 92966 110549 95911 63091 86628
8172 86628 87130 75137 60563 45165 62138 57435 78136 81363 87724 78965 59449 62792 59924
8159 59924 64866 82740 57244 71238 81923 57006 50579 65697 44831 53430 60696 56125 75335
8146 75335 63989 81088 74869 62757 64916 44686 39525 45579 46732 40599 32602 22718 23647 9942
8132 9942 4098 12281 12259 16716 25312 2504 20837 44402 44093 42135 16765 31476 12406 19321
8118 19321 29682 25791 17900 16601 18705 25158 22151 20339 53284 62066 45936 32716 41309 60287
8104 60287 70383 36074 17765 13488 17725 9658 4280 24549 26414 36543 28065 29379 23260
8091 23260 17478 38953 49540 25220 26943 24845 25724 -566 -19819 -20333 12671 14599 19946 32061
8077 32061 8434 -11454 4471 15469 -7187 15192 -9935 7251 20507 415 18828 24652
8065 24652 17537 3355 -9394 20221 44381 46303 925 -15768 -14712 -1752 -11146 -2068 14618
8052 14618 -7074 4987 5659 974 -65 9830 11323 4637 -11357 -14057 -11144 4203 25217 22452
8038 22452 5982 -691 -2026 -15603 3658 19639 20186 -1551 19585 13213 10455 16581 4897
8025 4897 -2130 26387 20509 10042 15798 10702 600 -10165 4924 -2670 8429 48733 62530
8012 62530 30732 25700 33129 34107 21819 20626 -8350 -27530 -42800 -18368 8914 19205 29765
7999 29765 26126 -6211 -20421 -19694 -20688 -5053 19113 23478 4901 -12210 2355 5710 14335
7986 14335 6793 13324 16226 22788 8182 -2931 -2574 -3252 -4727 8789 7236 -10018 -14728 11514
7972 11514 8620 -11659 -8112 -28734 -30331 -16073 -4287 -909 -18590 -16182 -7025 -19246 -32278
7959 -32278 -27052 -3024 3629 -9601 -26251 801 5477 3134 -251 -4224 576 13453 28158
7946 28158 29640 2494 -11277 -9907 -11982 -1179 2309 -8361 16870 1158 -9085 -5107 -6256
7933 -6256 2825 10919 29606 -11374 -26241 -9899 -7483 23019 17121 18051 5628 12214 27055
7920 27055 28237 37864 32343 15873 8193 -3016 -7944 -19170 -1245 17568 8778 23355 13020
7907 13020 -8531 39190 49838 49268 49420 55123 44835 30942 46121 41984 27029 2105 1233
7894 1233 2979 -2445 598 -281 -22721 -16487 -18886 -23577 -18686 5512 21112 -6255 -25015 -8353
7880 -8353 -9059 9277 11341 8765 4573 -5560 -11155 9074 28083 19037 20704 39444 37784 21868
7866 21868 11066 5520 8869 4082 -2318 4228 9304 -8329 -1130 23527 14756 8893 -5934 -30626
7852 -30626 -29743 -12255 5654 9555 -12746 -4494 5144 12340 37830 27228 27606 33515 22698 5427
7838 5427 3374 10490 18269 18210 16616 20294 3034 -16615 -17515 8347 21326 30406 21747 21874 29962
7823 29962 24668 14404 21362 22275 7751 13711 6809 9875 14862 24518 29888 42432 59615 67166
7809 67166 82907 143415 112220 85350 81669 73712 72201 81320 69544 60769 79098 74344 55038
7796 55038 66586 52656 57449 58404 49778 58101 66647 81007 76753 76135 74662 72711 55313 49159
7782 49159 64567 85621 82103 88406 107544 134977 123610 123175 92225 62270 60461 83305 89257
7769 89257 75534 81679 60693 64067 76673 70405 81008 96047 96810 81993 106641 108023 110625
7756 110625 101078 99690 96736 118802 135951 129221 126748 148768 164403 165581 150326 155636 180931
7743 180931 187684 236506 275365 285339 307543 321072 304663 273759 262096 268099 256802 266043
7731 266043 260031 294259 319539 282878 265206 228638 192751 173534 161291 144112 122719 133763
7719 133763 116435 84380 72514 89182 99446 99241 98222 74621 73849 81305 73723 95679 104977
7706 104977 83720 89614 103660 107123 105064 95212 85924 101555 122410 118181 112369 96504 104202
7693 104202 104570 111349 110520 123934 138145 124409 141739 120495 126727 166692 156896 164997 165113 174619
7679 174619 192921 199233 194317 194994 219565 216747 237685 275590 292280 304458 357431 379386 404613
7666 404613 485027 551560 602672 673099 699413 686328 651503 630882 628653 629241 648500 644509
7654 644509 677648 673395 640744 590020 504265 400812 363977 331745 291120 279678 276602 247884
7642 247884 250701 230681 229583 228686 195505 192500 184049 184890 179237 177627 170625 164349 160935 172551
7628 172551 155658 157000 169033 186556 173195 175784 166035 170874 187003 171473 153561 168935
7616 168935 161477 157511 176388 199889 218315 213099 177528 169866 180880 172545 198764 197767 212050
7603 212050 185558 179499 211535 204861 206679 206495 199315 241528 249302 228972 254441 257836 272948
7590 272948 305223 292182 319130 366856 370240 376622 407688 444039 490215 570815 632251 657908
7578 657908 682995 655024 594865 533870 494110 457818 417552 414661 422902 395207 400222 384993
7566 384993 370709 360597 351786 348768 342813 354979 344254 357000 355661 373800 376034 397745 416701
7553 416701 410449 404433 391273 432271 458090 473764 471363 486101 520217 533147 558193 589166
7541 589166 612623 662404 710039 772907 845479 883121 944530 988123 1010857 967081 920048 877456
7529 877456 819473 756857 740998 751397 741377 726654 732040 741422 765248 771808 772048 775829 800187
7516 800187 833616 862332 889877 915553 931788 944959 992168 1029322 1080151 1102740 1125082 1150352
7504 1150352 1194590 1267881 1299761 1324085 1365246 1394146 1376995 1408525 1465186 1480618 1500472
7493 1500472 1562952 1623243 1669390 1743354 1823399 1893387 1982919 2070431 2151174 2251307 2345271
7482 2345271 2440437 2562069 2696928 2818485 2916172 2991957 3045944 3089092 3157121 3167004 3153860
7471 3153860 3138784 3076642 3005892 2921678 2868886 2794445 2677297 2568405 2443781 2368225 2268500
7460 2268500 2186325 2119440 2040509 1904446 1800291 1707556 1600512 1500929 1397738 1321660 1247322
7449 1247322 1198146 1138290 1082358 1051090 985120 942599 928756 908504 867202 816628 813400 814629
7437 814629 808023 778321 741050 732623 730758 711941 691468 677645 683186 694133 682178 664389
7425 664389 634518 620811 622095 612155 598226 574779 557146 554453 547185 518731 521258 520723 514206
7412 514206 488255 487818 459278 440772 440740 410572 397538 432859 422819 371141 349433 339627 324103
7399 324103 298458 312045 312654 308082 314742 297965 284040 256521 263680 258960 258369 259350 242835 253085
7385 253085 258497 242065 215977 222469 247464 233853 204670 190766 213963 222559 203996 200821
7373 200821 196173 180759 182665 178341 171125 165612 149603 138314 161137 168821 173623 185124 147920
7360 147920 155585 165306 137885 122470 145537 152641 173906 170772 151726 130414 151943 164672
7348 164672 160229 151983 169323 184436 180850 172423 168027 162816 180680 180137 173407 180686 149922 144508
7334 144508 140418 152943 158296 145220 154775 159010 170045 164592 162717 148691 152528 146454 160472
7321 160472 156141 148488 130166 123549 156029 161379 155788 154011 187189 180712 184174 185586 177770 184888
7307 184888 157256 152632 152606 160879 174568 164564 162134 163801 167987 130848 136821 162805 163983 149912
7293 149912 152722 162859 175737 158444 141259 145971 160137 170821 179938 158063 163521 195862
7281 195862 194311 193066 212017 199600 205956 209407 204114 205039 213346 227498 235222 243709 233816 236574
7267 236574 223847 236741 268079 274422 259370 286006 279263 254723 269334 258432 285994 287502
7255 287502 281349 286182 295667 320958 331190 329094 328316 332473 345292 353648 337513 349541 349360 335866
7241 335866 346052 364278 372209 387716 436354 420724 425265 473787 479550 469495 477949 486908 514819
7228 514819 496057 478976 513347 505321 482865 471561 488226 495653 501719 493654 507685 495964
7216 495964 497945 504919 471157 527322 540030 538142 528442 522550 536804 544877 548875 542406 537037
7203 537037 545429 554921 561554 551816 559133 557674 548988 528518 547843 538261 540676 580229 573439 570042
7189 570042 587058 597042 581460 570306 535660 549088 538796 536746 501287 509432 510132 504706 480368
7176 480368 483523 457180 440493 453049 485865 505491 498274 482403 458388 466818 475989 460128
7164 460128 465993 445043 439002 431941 441732 456931 436516 442330 434966 443963 453221 447975 450653 481205
7150 481205 492739 475272 487369 482420 493999 515178 508202 481301 483844 508501 520674 518352
7138 518352 523141 533756 550635 563771 560194 583556 569116 597188 619701 653718 658283 666855
7126 666855 714450 757912 755995 772224 823296 894873 947389 1004991 1072722 1132295 1146480 1136873
7114 1136873 1122986 1093665 1101196 1133898 1128401 1173915 1217042 1186210 1140182 1084224 1061075 1025939
7102 1025939 997529 994809 983872 956521 964569 987117 1010299 1030064 1035541 1050299 1063394 1099465
7090 1099465 1122455 1132494 1172004 1172982 1221974 1246544 1272078 1292456 1310322 1370682 1429212 1480356
7078 1480356 1515520 1571927 1631738 1680714 1729850 1791923 1816300 1844708 1861244 1854446 1882299 1915007
7066 1915007 1932340 1984238 2039350 2053436 2021894 2001311 1986722 1982779 2009399 2023546 2042877 2064048
7054 2064048 2091385 2140677 2157177 2199703 2260337 2292471 2328318 2401471 2441642 2496550 2546020
7043 2546020 2605047 2663122 2713856 2795384 2867375 2942768 3023211 3092883 3191875 3297761 3379542
7032 3379542 3489554 3602524 3719621 3833980 3958059 4110966 4257533 4372515 4531607 4710356
7022 4710356 4877699 5046914 5230158 5412638 5661561 5863444 6093516 6360879 6638736 6920915
7012 6920915 7214920 7569075 7915344 8325812 8757493 9225388 9741234 10273560 10838419 11484365
7002 11484365 12214517 12988726 13798305 14699626 15629737 16593193 17616686 18673550 19710898
6993 19710898 20688242 21592927 22339676 22937995 23338446 23544282 23556835 23354286 22950600 22371724
6983 22371724 21683875 20889424 20003879 19003029 18001394 16984326 15969250 14991549 14041479
6974 14041479 13150951 12286178 11489063 10758669 10078567 9442352 8863208 8338444 7842030
6965 7842030 7420208 7023245 6629642 6287178 5968798 5694333 5400797 5123810 4879050 4677152
6955 4677152 4483506 4279134 4096730 3947074 3808443 3646209 3501145 3375607 3235320 3114381
6945 3114381 3006710 2900012 2812686 2730970 2655666 2601102 2487450 2383612 2312052 2231841 2166835
6934 2166835 2127269 2068017 2004010 1939708 1887067 1822616 1746583 1710238 1668987 1627386 1580337
6923 1580337 1554373 1495254 1468213 1436751 1393577 1336249 1283084 1253681 1190551 1181135 1175262 1141006
6911 1141006 1131797 1092904 1037550 994224 996026 994535 959334 929732 903340 887237 840774 821041
6899 821041 828369 826132 794488 787417 779396 747728 713511 705043 702073 675740 648394 624613 611116
6886 611116 625875 626566 620740 611168 612315 598075 589358 564047 562747 568729 559383 547850 525876
6873 525876 504773 491008 503163 493264 522148 514845 482296 445235 443024 458036 458440 429038 424170
6860 424170 411501 406342 407617 388422 368918 366624 373287 363348 340848 330655 328322 312706 318258
6847 318258 317605 317090 334170 333271 332150 319906 313868 273214 259679 271671 274470 285686 275875 279756
6833 279756 259559 280987 313262 286430 260100 242621 260147 229577 219401 219402 214469 214241 199440
6820 199440 223313 231277 256832 225490 212507 218101 207665 234892 224638 230894 249180 237270
6808 237270 228643 240694 238037 225224 203027 196803 210425 214525 202073 202844 219299 196278 203284
6795 203284 215380 196758 226068 238554 219434 217139 228042 235041 211737 202370 205215 174911
6783 174911 162353 183608 178931 189833 179649 177775 157319 145395 123310 131070 117273 128594
6771 128594 143523 120351 122447 110637 96395 100879 111923 98718 114418 113853 132489 123896 116249
6758 116249 133785 133808 124034 125751 122417 126611 156818 145875 127645 108570 90878 76450 67590
6745 67590 78375 71802 79441 115788 92319 71467 57114 73074 76769 67264 61397 52001 47220
6732 47220 25569 38660 40142 52399 49953 54118 60892 62580 78427 50336 43744 39996 22548
6719 22548 44837 57197 60830 42600 32019 20898 7065 15815 6706 1025 34012 39264 48917
6706 48917 43027 24451 5333 25584 19712 50043 46823 38949 37696 32236 27650 3232 24143
6693 24143 8047 27646 18358 21667 14777 21970 42851 26518 -5047 7849 49118 30520 32526
6680 32526 18341 14535 25700 -11167 -24139 -13339 -30321 888 22259 16321 12324 6127 30122
6667 30122 16476 22092 10972 -14147 -10216 16010 35424 33967 9481 20142 25924 13202 -8549
6654 -8549 -38271 -45950 -14591 -12372 -25785 -18179 -9861 -2974 2735 -9367 -2896 1469 11175 -18
6640 -18 -3393 3206 -25904 5067 5400 -18880 -2347 -1035 -8041 1321 10289 -20408 -18288 -19663
6626 -19663 -6664 -28778 -22521 8421 -14490 -8146 -13476 7802 1775 -8771 -26729 -30761 -40090
6613 -40090 -32126 -24330 -9003 -12384 -6504 367 -5343 -17440 -29548 -29792 -21128 -17311 -24357 -29521
6599 -29521 -28805 -35529 -49555 -29413 -2631 27931 -3049 -29699 -27840 -11088 -33022 -31870 -23819
6586 -23819 -24996 -36500 -31862 -9270 -12035 -29328 -21225 -15449 -19234 430 -15661 -20883 -26148
6573 -26148 -11976 -1304 -21155 -27678 -24675 -39481 -39576 -35921 -34337 -21537 -1590 -14594 -28780
6560 -28780 -36203 -31785 -46488 -29034 -52742 -45997 -12996 -12121 -25051 -20236 -25874 -35020 -51337
6547 -51337 -42182 -37354 -39380 -27123 -16469 -13747 -17750 -21783 -45907 -34669 -62634 -31159 -7056
6534 -7056 -27855 -33262 -25367 -37151 -59368 -56140 -39794 -19631 -22405 -23956 -40331 -27696 -10685
6521 -10685 -33829 -17617 4390 -33215 -50635 -23593 -22209 -35948 -52269 -20281 -28758 -45224
6509 -45224 -23821 -25719 -1636 -14472 -26339 -35838 -22410 -10400 -13362 -8345 -19547 -27375 -28165
6496 -28165 -11991 -13735 -31964 -47728 -40791 -30481 -37183 -17579 -33316 -48636 -23711 1910
6484 1910 4809 -21183 -29617 -39301 -23946 -33298 -27773 -32936 -41879 -40056 -54280 -54572 -36875 -41915
6470 -41915 -29606 -14722 -19560 -23745 -26639 -38598 -29584 -46557 -40898 -2708 16669 -31198 -50519
6457 -50519 -29380 -15238 -27894 -33421 -38860 -40934 -23182 -7014 -8578 -10443 15116 -7334 -39651
6444 -39651 -42676 -30221 -18274 -22555 -44712 -44835 -40482 -37618 -51539 -30753 -10318 -19028 -34145
6431 -34145 -36395 -26170 -30983 -41108 -38629 -21613 -20485 -23646 -8382 -3572 -14298 -24273 -12974
6418 -12974 -11215 -13870 -1542 -3841 -12754 -15643 -16468 -33324 -20287 -21664 -23143 -35352 -28862 -43461
6404 -43461 -51779 -51052 -48878 -48497 -69399 -63159 -70955 -68211 -48749 -29960 -11249 -7186 -30745 -8713
6390 -8713 -40229 -34866 -26211 -13284 -28181 -33817 -24886 -33273 -30624 -12946 -35586 -54557 -38820
6377 -38820 -21970 -28057 -22571 -3998 -22807 -15124 -28086 -19207 -31440 -26882 -28324 -9235 -34313
6364 -34313 -23892 -14346 -26010 -28993 -35079 -45172 -59607 -29722 -25779 -8584 2352 6439 -7245
6351 -7245 -5822 -22408 -33216 -9370 -469 -17979 -30537 -27327 -2542 -8873 -18156 -19202 -34253
6338 -34253 -49400 -44120 -55857 -29829 -33620 -21050 -23346 -22360 -14232 -5903 -11254 -18453 -38848 -26569
6324 -26569 -9965 861 12991 -445 1831 -23685 -25632 -21465 -16960 -15131 -5887 -2182 -16549
6311 -16549 -7913 -3936 -23796 -30279 -46713 -10236 -24287 -14246 -12658 -3750 20662 11556 22597
6298 22597 12126 9402 -11791 -19536 -36424 -24877 2974 -13901 -34116 -35030 -11585 1584 1786
6285 1786 -19137 -34711 -36338 -8467 -7455 -18496 -15325 -29487 -22047 -4868 -17967 -14330 -30490
6272 -30490 -29297 -3845 -30452 -59769 -46711 -61998 -70017 -34193 -35760 -61669 -60940 -72307 -64308
6259 -64308 -53663 -29811 -23102 -14084 -25398 -10392 -21974 -34093 -23412 -3803 5691 -3204 3448
6246 3448 -19506 -19179 -32489 -23980 -18348 -20593 -42760 -36525 -31858 -38451 -27166 -32862 -19202 -17957
6232 -17957 -11154 -5896 -9471 -4868 -416 -1513 -13924 -29006 -18561 -34397 -22780 -21691 -46236
6219 -46236 -53057 -36136 -45282 -24983 -11193 -15687 3639 -12610 -24650 -14272 -24483 -24188 -26391
6206 -26391 -29149 -38472 -40277 -54077 -35322 -15057 -49617 -31790 -29764 612 -42524 -30800 -38627
6193 -38627 -38944 -23719 -38206 -33714 -12274 -6978 -39295 -42876 -25891 -26055 -15508 -24458 -42139
6180 -42139 -19597 -32927 -38786 -28553 -13839 3836 -20793 -21963 -23744 -22550 -21378 -46667 -47028
6167 -47028 -32332 -30959 -23549 -7359 -23163 -31671 -46335 -54464 -49395 -35120 -32577 -27007 -34134
6154 -34134 -24510 -30737 -53334 -50598 -53140 -35289 -29224 -35664 -45328 -35005 -39618 -50391 -50114 -46024
6140 -46024 -60168 -49204 -22824 -17667 -15327 -32857 -43098 -39475 -37899 -32779 -54735 -49442 -49856
6127 -49856 -40219 -34511 -49403 -49818 -58188 -67561 -55742 -51193 -50555 -36268 -16212 -7902 2067 -11166
6113 -11166 -30135 -11816 -13047 -25716 -37462 -40956 -52713 -38098 -20660 -9074 -23838 -39588
6101 -39588 -45080 -21137 -7072 -30887 -20636 -10285 -6089 -27280 -43900 -23524 -29788 -42653
6089 -42653 -39269 -25502 -31833 -34604 -30842 -29090 -24661 -28950 -34974 -38756 -40111 -49329 -46713 -58655
6075 -58655 -35616 -25767 -52244 -47532 -17516 -4850 -12838 -34460 -24508 -13053 -32150 -31405 -15982
6062 -15982 -22767 -30818 -27419 -37792 -17020 -29930 -34083 -23746 -43699 -26498 -25491 -15382 -9109
6049 -9109 -27543 -21535 -19846 -16686 -17539 -18657 -33636 -28854 -32417 -39214 -54952 -29877 -31533 -31188
6035 -31188 -27701 -28881 -45296 -34871 -47588 -55441 -32703 -21729 4547 -281 461 19421 9589
6022 9589 -4093 -21252 -51707 -31371 -15076 7468 279 -24717 -13902 -25334 -39030 -39213 -30393
6009 -30393 -26828 -8992 -25149 -42298 -1334 -16876 -22522 -8695 -8144 -17815 -13797 -4697 -9876
5996 -9876 -23734 -28739 -32427 -27517 -21933 -25242 -12101 -1769 -7178 -1313 -217 -9852 -5700 -16506
5982 -16506 2590 -7579 -8608 -15485 -35791 -40131 -32635 -38781 -53808 -21086 -11624 -18667 -41681
5969 -41681 -30668 -29401 -38489 -19923 -28217 -5178 9199 -3171 -5098 -2986 -8249 -30733 -37327
5956 -37327 -13313 -3907 -17833 -12477 -2373 -14525 -26563 -17411 -7583 1094 -7711 -3183 -2448 4165
5942 4165 -6990 13258 -4425 -19540 -4002 -3557 -1072 -7996 7961 4784 -12401 -38012 -27938
5929 -27938 -17714 -14881 -2608 -31135 -40519 -34866 -27675 -9772 -13483 -23065 -22394 -16602 -12015 -13280
5915 -13280 -11803 -37343 -18592 2702 19879 10007 -5263 -27305 -29635 -6288 4962 8040 2911
5902 2911 396 -2950 -15716 -13590 10974 -11315 1494 16296 880 7823 18062 5153 -15013
5889 -15013 -17559 -23851 -5460 -16088 15418 5238 -7473 6670 8249 -3509 -10317 22184 23752
5876 23752 10644 -1628 -24522 -22180 9306 -12760 2774 -3861 11556 4504 -4135 -7139 21030
5863 21030 24786 12484 7326 14179 24923 21809 31484 31810 11884 24256 35778 9175 1986
5850 1986 5409 10594 -4291 430 4801 9739 32216 19916 -3046 5462 13935 12799 12841 20601
5836 20601 8141 4843 6366 28144 40314 31778 22385 10349 -738 -7585 20633 33173 32035
5823 32035 32876 40840 24777 55176 45571 16848 27712 42675 46119 56014 46096 54690 85249
5810 85249 68214 65022 66160 52366 40649 56955 41550 30972 54888 69026 60179 62110 75377
5797 75377 58574 42115 56792 72159 61465 65496 52156 69825 65547 77468 87362 94083 85070
5784 85070 72045 57804 36588 49329 55817 77874 86751 93053 75533 94355 103244 120718 136788
5771 136788 137656 116146 143525 171478 180022 175190 187159 242665 281577 288660 352556 408405 442678
5758 442678 408050 356172 304049 225515 186678 198987 195874 140165 100612 112920 101615 84355
5746 84355 109271 101680 93674 94732 83385 75742 77839 69889 80555 77678 80189 107734 116318 99421
5732 99421 107641 99895 83790 95376 126792 104862 98093 109404 114850 98256 71662 62009 78645
5719 78645 87000 76398 79927 94310 81012 75575 61464 59208 40260 23442 25546 33294 55221
5706 55221 36815 32808 40559 50340 69536 55687 47055 52689 13616 35793 23011 11772 31044
5693 31044 30941 42762 33074 27361 17963 13184 -11808 661 15808 22613 39570 38122 40954 25138
5679 25138 17185 13487 28631 23525 20179 16809 20408 18548 34525 44961 52613 47215 41914 35785
5665 35785 31714 33389 47098 59430 60241 40346 25478 31116 40792 25167 14906 35648 37538
5652 37538 53694 55005 49072 30201 16086 33926 55241 60216 57614 60395 48011 36853 26476
5639 26476 24784 15708 11630 23559 18625 22004 49072 67104 51765 43299 32640 24847 38569
5626 38569 45474 60647 67826 46907 53728 46089 60860 56768 54856 55769 50341 52562 50570 53654
5612 53654 68612 66650 65848 44928 38663 71943 72035 63859 62664 79821 98762 111574 95840 83148
5598 83148 81722 85830 99624 100817 89456 78700 94990 107834 109422 134199 133836 107504 116257
5585 116257 121436 101872 90946 104921 127783 127269 115654 115822 103482 114659 135748 150017 125537
5572 125537 118957 120281 139682 150103 153051 151876 140898 152734 145621 157211 193117 187773 211174
5559 211174 216686 196926 196763 211879 235140 221917 252083 291052 274159 255095 247420 250069 255138
5546 255138 246511 237935 239835 263663 239833 222788 233113 240352 253450 268460 269364 269390 261762 290025
5532 290025 298801 314501 300373 317671 343638 373867 379766 368688 384688 394073 385171 418195
5520 418195 439752 418348 416492 439046 419115 416198 426377 431103 441995 444594 458034 492411
5508 492411 545164 582234 621502 683285 767242 855936 913679 888666 823610 705398 621421
5497 621421 560879 518592 493132 481874 447411 444201 421963 413493 405335 416573 412038 426469
5485 426469 421458 437208 428214 384317 377117 365040 373241 391755 380794 394676 434054 432798 438899
5472 438899 447413 420793 381892 387615 385072 387995 399181 408456 396948 431454 425297 428993 443806
5459 443806 458091 497464 548931 564516 624689 681559 695013 759450 844396 916115 970075 1010331
5447 1010331 1016933 967541 916019 867584 790938 751410 709155 692286 686996 665548 682675 673298
5435 673298 670053 669404 690769 729853 753555 792640 833400 887079 969694 1057051 1106921 1195163
5423 1195163 1309011 1446882 1594861 1793570 1971214 2154161 2317615 2405976 2375056 2224489
5413 2224489 2001365 1754761 1564950 1409765 1266111 1183139 1127647 1031665 992562 972099
5403 972099 935585 937735 922018 935464 938645 942161 981228 1014349 1068129 1124108 1210736 1259666
5391 1259666 1377094 1506397 1667067 1860081 2050159 2234086 2396985 2470601 2354961 2158709
5381 2158709 1920937 1666417 1461685 1284231 1147642 1053635 959018 886745 830545 770006
5371 770006 739241 696175 664838 661737 639937 638998 626402 629941 625255 628686 668016 692751 710519
5358 710519 747541 789945 834787 904988 966144 1006085 994408 957224 882058 784262 711210 621804
5346 621804 561194 525127 472081 434175 405740 360370 339642 332196 312187 312786 322033 308838
5334 308838 285818 276005 281903 266483 229654 217785 226842 230072 233812 195092 181625 202582 214298
5321 214298 220762 211626 218126 226405 216697 218651 204275 180326 179116 162041 171406 182212 181357 166667
5307 166667 165187 170258 142970 178569 191346 176485 180721 189207 163478 180533 154713 150528 170796
5294 170796 148290 162930 173220 180241 173734 165579 152985 160978 178455 167130 164838 177082 157581
5281 157581 171145 168475 149675 160751 166352 167036 164945 181608 206050 212666 210728 208230 214321
5268 214321 201376 192053 209281 203679 195390 183282 175694 167706 172607 185404 172975 180917 192940
5255 192940 197851 185299 204886 164966 173830 192114 202500 221556 203550 230045 227605 201861
5243 201861 211373 213511 200865 222816 214397 207711 224943 240895 263734 274925 279764 264433 259405
5230 259405 288785 267510 258107 252063 267902 315633 292046 308279 312046 302047 290409 292705 320777
5217 320777 328421 339111 342032 359664 370700 369162 388404 400536 379046 399709 410806 408283
5205 408283 422971 440368 450308 469082 471958 482350 506260 527673 538561 569914 590016 616376
5193 616376 639991 658832 716353 788080 847787 897538 984960 1061734 1154791 1260518 1338462
5182 1338462 1464198 1666576 1876235 2081848 2333902 2592315 2803015 2944037 2946298 2765055
5172 2765055 2492862 2192064 1894931 1645131 1426008 1261887 1113124 969348 876075 812967
5162 812967 749931 681744 609720 603798 590894 542816 511275 474071 420577 415941 439036 400034
5150 400034 363584 380792 381432 373406 351989 342483 320775 302258 308808 302015 276726 265156 272450
5137 272450 289620 265729 257067 258036 252416 260586 236893 243698 254943 224440 206615 192478 187052
5124 187052 184966 181642 194386 199819 209062 184822 193451 179146 184219 191102 190311 192792 178507 183198
5110 183198 199920 212269 197627 196230 185642 159650 154920 172914 176050 164989 162480 158096 159933
5097 159933 163102 159582 172073 192520 193533 182284 163448 145518 173134 179308 157715 153316 150618
5084 150618 141275 135306 146641 178674 179812 187861 210365 207535 196857 187082 170502 173222 194000
5071 194000 206121 209747 231376 263885 269689 289110 270720 244408 246289 244867 237353 220170 214762
5058 214762 215956 203511 203365 202546 209238 201349 207323 220929 248177 248655 256125 258909 263442 257273
5044 257273 260957 270241 258601 257650 267029 249421 241334 223176 225625 241995 227338 233588 241968
5031 241968 245247 226801 211878 189783 182014 219516 223856 210295 212798 222125 219177 218605 225761
5018 225761 240955 218777 197519 179743 195140 207046 172693 182137 191616 192283 230369 244480
5006 244480 230487 210137 202425 216444 185225 200683 195695 182400 174222 179845 195135 189122 169332
4993 169332 143858 148604 153327 144713 167663 144807 164627 166360 147437 177362 175363 142101 163919
4980 163919 174026 178857 186032 183114 171671 170807 168312 166942 159968 166111 158829 141340 150812 167165
4966 167165 169587 178569 157500 148954 155938 174301 189366 190740 169847 176354 187663 178486 172088
4953 172088 164485 182401 189230 188022 184271 177310 159148 156176 136344 173424 180478 175377 170661
4940 170661 141455 169115 185388 156680 159073 167201 167068 155362 165242 159923 154424 152074 134318
4927 134318 142847 127328 120676 136865 134149 138247 154388 174286 161604 154985 156817 178891 186029
4914 186029 166589 164326 167245 168146 163309 176922 173683 158855 176069 193811 166472 161088 164418
4901 164418 159857 192939 182278 172224 163220 171145 177544 156430 164305 167485 162392 192763 188191
4888 188191 150295 160351 160587 158614 170464 173535 172365 169642 185407 177320 169669 159652 162008
4875 162008 156240 150200 158715 159790 168698 166169 168186 162687 186654 200229 197949 191960 178843 193995
4861 193995 208361 206947 192573 178233 186337 202642 182639 200126 206835 220260 231160 226794
4849 226794 219313 212912 205930 218875 227752 233535 227764 232694 235677 236927 237816 232320 240084 237792
4835 237792 216579 206535 233737 239807 254190 245788 225872 222017 227416 233899 236891 259047 248125
4822 248125 260890 296431 277541 266613 265822 258416 257967 282151 303459 303895 303611 293721 286440 308484
4808 308484 301873 316638 334373 352903 368437 354670 342800 361202 375357 365604 357848 377706
4796 377706 417093 424802 442344 470164 467933 478639 467747 482944 499637 519324 541574 566173
4784 566173 608373 629853 625122 675477 687825 703621 726928 756219 744088 742013 753532 742735
4772 742735 741556 745094 751020 741216 761844 746878 741875 753182 734540 722034 716897 725780 746223
4759 746223 772056 787251 782488 803772 835024 838070 844117 864473 877581 883696 905978 935204
4747 935204 984996 1069420 1092755 1108540 1144917 1180328 1235619 1264005 1293090 1322788 1303077 1318861
4735 1318861 1329643 1369698 1381510 1378859 1377069 1387717 1374364 1354975 1334308 1313284 1291968 1295074
4723 1295074 1281047 1270645 1272779 1268397 1286494 1302610 1306374 1333292 1379284 1391539 1437541 1524816
4711 1524816 1598515 1660088 1751383 1828583 1954962 2066608 2152641 2227170 2268190 2255254 2177625
4700 2177625 2096853 1999442 1923540 1853983 1788576 1702697 1648236 1614308 1571205 1532067 1485796
4689 1485796 1466506 1420400 1427438 1403447 1370015 1364177 1335117 1312415 1342377 1359760 1379959 1390950
4677 1390950 1390572 1420538 1428430 1435273 1412898 1403518 1383090 1357807 1323528 1301305 1276530 1260952
4665 1260952 1251775 1241792 1237324 1249922 1236384 1225985 1245112 1260334 1280089 1304414 1308348 1334735
4653 1334735 1385352 1401938 1444565 1446316 1451121 1472057 1480060 1465951 1481726 1491264 1507485 1549797
4641 1549797 1581635 1588992 1613270 1638727 1674526 1722012 1765037 1782757 1792327 1743759 1662834 1575257
4629 1575257 1445806 1332239 1218249 1132687 1054262 1007358 962915 949198 912976 881414 851580
4618 851580 852955 849095 806291 777808 768549 777016 770695 767403 761306 749695 748847 700978 685455
4605 685455 679751 669325 657668 645122 645794 650335 640237 622229 615443 634119 630549 617549 620537
4592 620537 608076 597860 591776 575781 586955 583648 553498 568615 571156 580486 567382 555644
4580 555644 551938 549837 539729 530361 523322 517987 517186 527416 537531 549801 556011 545495 540410
4567 540410 521638 525860 533935 523029 518842 532775 548104 523875 502467 499575 527303 541152
4555 541152 525578 516255 527991 537407 523943 508150 528132 527923 540527 520244 509583 518586 530692
4542 530692 538105 524442 519663 524068 526626 514979 531537 534576 532145 529962 541440 558956 564667
4529 564667 559876 552835 553459 554293 558070 548148 551470 537005 549901 561754 581759 589777 590129 577319
4515 577319 578397 568349 577473 603638 574699 564878 562442 575470 575879 591272 599291 604272 590189
4502 590189 584848 601722 599516 607838 602939 604774 616086 604441 609788 608855 638756 639543 637991 632654
4488 632654 639497 640951 652807 652446 642608 657132 659525 676396 675132 678147 676017 661367 677022
4475 677022 692544 665724 687905 712657 727820 752428 753485 772196 779738 778565 765029 757845
4463 757845 754374 752857 769239 812087 822068 826937 843479 861078 874954 869819 884191 910599 931725
4450 931725 939934 971787 994703 995115 999996 1031904 1017906 1022753 1013145 1015078 1014583 999622 1002341 985272
4436 985272 1008871 1013355 1024227 1040290 1047830 1046812 1064641 1106179 1111533 1115127 1149204 1189683 1180372
4423 1180372 1201202 1252745 1278098 1311568 1329976 1371172 1395889 1405812 1421868 1453976 1464327 1498218
4411 1498218 1474088 1471675 1482254 1477938 1493534 1528563 1574541 1589325 1598339 1630067 1654337 1685324
4399 1685324 1714510 1742088 1742551 1761607 1762117 1759807 1769067 1790934 1838385 1842683 1849437 1854880 1864805
4386 1864805 1887363 1911912 1906808 1966397 1991063 2055573 2081882 2114704 2153899 2184869 2184812 2161471
4374 2161471 2139139 2088059 2068786 2033171 2001866 1976977 1989885 1998252 2008656 1989608 1970623 2000699
4362 2000699 1957979 1924557 1887546 1861230 1825443 1786635 1745959 1677392 1634232 1611688 1548321
4351 1548321 1508897 1463168 1451944 1448593 1404095 1374730 1334076 1300390 1313515 1287227 1272410 1276271
4339 1276271 1267396 1246716 1242721 1246386 1225320 1267298 1253182 1222704 1218684 1227439 1242665 1234677 1251065
4326 1251065 1270552 1255717 1295129 1308698 1304404 1304590 1309047 1301888 1318219 1312954 1315346 1301018 1310107
4313 1310107 1311301 1320280 1322406 1312739 1303065 1307017 1354507 1349805 1367220 1371815 1359274 1411096 1422785
4300 1422785 1396483 1423736 1483691 1532647 1572414 1608914 1631601 1664574 1713356 1753453 1826424
4289 1826424 1867191 1918792 2006379 2054402 2100120 2155874 2228542 2286598 2311796 2279662 2231595
4278 2231595 2190803 2179383 2133237 2092170 2062777 2034628 2027840 2021088 1997391 1949254 1950593 1966057
4266 1966057 1953303 1965439 1963691 1965446 1961837 1953903 1937120 1933335 1939098 1952714 1976063 1975762 1988138
4253 1988138 1983107 1994882 1998521 2021538 2016998 2028858 2019498 2035995 2041688 2008352 2005099 1999732 2001605
4240 2001605 1997780 1976787 1936792 1931068 1899064 1881104 1866073 1865415 1865055 1876138 1887262 1869563 1848938
4227 1848938 1866056 1863541 1882147 1873279 1861818 1868617 1861369 1849050 1860799 1876615 1882492 1866586
4215 1866586 1876936 1889133 1912204 1944720 1961665 2018304 2082830 2142714 2165451 2186538 2210385
4204 2210385 2206131 2172293 2114067 2076802 2035489 1998069 1985412 1965712 1956085 1958858 1942786 1930218
4192 1930218 1942421 1942408 1947231 1955530 1983904 1992177 1998008 2021801 2021710 2030550 2047644 2074048 2119907 2121218
4178 2121218 2144885 2179447 2212333 2258371 2275436 2304609 2327019 2367796 2426224 2410865 2466217
4167 2466217 2525086 2572343 2650358 2691128 2740324 2784885 2801005 2796438 2770228 2793616 2792690 2822212
4155 2822212 2839633 2819917 2864579 2907954 2947023 3007355 3041390 3075818 3134888 3240930 3351500
4144 3351500 3451096 3553894 3674145 3753062 3810815 3847094 3859360 3859374 3853497 3865168 3881911 3888659
4132 3888659 3890219 3953756 3982220 3995895 4025586 4053515 4100671 4164251 4208039 4279028 4375109 4483399
4120 4483399 4604312 4717008 4823801 4911864 4975708 5022266 5045344 5082053 5145552 5234872 5344255
4109 5344255 5475508 5628986 5801827 5999643 6172166 6311410 6374175 6405367 6425831 6358157
4099 6358157 6240600 6098567 5978186 5847510 5743554 5716162 5694564 5699191 5723806 5730041 5805849
4088 5805849 5895765 5997306 6114612 6255598 6397049 6567002 6769086 6958638 7172395 7384944
4078 7384944 7586437 7751167 7896665 8031527 8114094 8197208 8282678 8380242 8507947 8638909
4068 8638909 8790143 8958756 9135004 9318929 9506154 9660959 9822717 9994793 10107333 10190220
4058 10190220 10249203 10340035 10445436 10577619 10703517 10862384 11039822 11232992 11440333 11678108
4048 11678108 11959306 12269843 12614657 13013397 13483138 14027262 14663427 15366626 16139242
4039 16139242 17011622 17960108 19031388 20287016 21717171 23431881 25402082 27633572
4031 27633572 30062157 32594875 35087552 36967564 37147355 35637253 33432425 31207142
4023 31207142 29165158 27384745 25851777 24593328 23618440 22896320 22428997 22137206 22016449
4014 22016449 22017479 22172841 22476640 22902015 23426749 24053655 24836375 25728357 26756447 27935405
4004 27935405 29320334 30955691 32815471 34891927 37230872 39938739 43108425 46945732
3996 46945732 51633470 57420004 64430488 72414480 80626361 87974135 91722301 88711879
3988 88711879 80354981 70460601 61349070 53926409 48099260 43522335 39906338 37098230
3980 37098230 34959071 33397398 32286279 31550171 31089225 30804525 30603023 30444848 30200824
3971 30200824 29833795 29355658 28817968 28159021 27474413 26888661 26401063 26065736 25866335
3962 25866335 25793777 25772188 25782711 25750898 25647524 25445870 25170250 24841055 24550110 24312187
3952 24312187 24150509 24063081 24045208 24014098 23979727 23847621 23555714 23117827 22595440 22028327
3942 22028327 21511403 21123291 20841674 20717690 20747932 20919744 21224651 21684609 22281891 23030815
3932 23030815 23893984 24820638 25707952 26462076 26974745 27143212 26929438 26332278 25463465
3923 25463465 24423593 23320884 22230486 21217089 20325726 19586574 19011008 18561859 18283167
3914 18283167 18118007 18069531 18108310 18257847 18462033 18678875 18883876 19049506 19051692 18847565
3904 18847565 18455706 17869269 17124479 16289796 15465541 14674851 13960810 13332156 12744860
3895 12744860 12299382 11948627 11639589 11386880 11175862 11026951 10910594 10821051 10800694 10812790
3885 10812790 10883433 10996614 11173093 11371558 11618540 11930385 12219638 12466133 12641501 12691644
3875 12691644 12548580 12308031 11972563 11672845 11338587 11082379 10911048 10754247 10627104
3866 10627104 10489927 10325902 10178129 10034920 9908948 9852040 9898258 9988810 10176512 10381571
3856 10381571 10557184 10635443 10579263 10464975 10260138 10095149 9980697 9921522 9902557 9917584
3846 9917584 9888654 9872322 9790079 9632230 9417966 9193680 9022010 8845963 8691889 8564417
3836 8564417 8504892 8470127 8472133 8486303 8485528 8525779 8559825 8607929 8700191 8835905 9021651 9253065
3824 9253065 9533502 9869605 10258478 10732019 11273221 11905540 12594084 13350117 14098281 14818165
3814 14818165 15428435 15863022 16044317 15915202 15545540 15021680 14437579 13830229 13259689
3805 13259689 12762897 12367532 12063265 11873944 11768624 11685351 11736523 11890356 12086375 12355100
3795 12355100 12698509 13151496 13662915 14266261 14929730 15586368 16107600 16441795 16468407 16199354
3785 16199354 15715869 15126447 14600152 14175367 13867248 13685246 13625375 13697838 13890495 14194349
3775 14194349 14586412 15038093 15500678 15954528 16351071 16611089 16779625 16821344 16784330 16755973
3765 16755973 16773897 16873975 17066892 17351807 17713505 18114511 18456669 18684557 18668087 18415461
3755 18415461 17957600 17379342 16798128 16277363 15822674 15484959 15212835 15045119 14958299 14904339
3745 14904339 14826745 14698534 14521697 14235831 13895736 13549954 13239321 12953534 12762905 12660903
3735 12660903 12635914 12679104 12834715 13036606 13272638 13559147 13931852 14301762 14657621 14998166
3725 14998166 15291790 15463731 15511640 15467174 15398898 15364474 15355770 15379707 15362184 15183824 14791328
3714 14791328 14165018 13377644 12503372 11693274 10978021 10372673 9897648 9507523 9234144
3705 9234144 9048800 8940049 8941712 9009916 9085556 9242800 9475313 9720146 9977654 10211331
3695 10211331 10386572 10467751 10452040 10358904 10182215 10037930 9933115 9874844 9864633 9880403
3685 9880403 9868415 9841446 9714198 9452996 9068906 8621008 8134406 7657893 7217067 6809410
3675 6809410 6493106 6225424 6000734 5826044 5667116 5597020 5572431 5560009 5605861 5659905
3665 5659905 5731503 5780539 5783324 5763209 5695790 5593169 5469914 5315831 5178443 5100893 5044603
3654 5044603 5030047 5069239 5166607 5289303 5356712 5391347 5335716 5141326 4841131 4512309 4186989
3643 4186989 3909504 3679938 3472323 3285073 3141227 3037443 2914434 2840338 2794298 2739683
3633 2739683 2693394 2651692 2619033 2612152 2585842 2592569 2613061 2638695 2691220 2729524 2773658 2854712
3621 2854712 2926159 3008855 3051907 3085110 3055301 2952855 2842822 2667948 2550394 2430885
3611 2430885 2282562 2164833 2056355 1970482 1882079 1806437 1754214 1684521 1654853 1595390 1556737
3600 1556737 1556175 1534561 1505465 1468580 1451981 1438267 1422860 1384882 1364370 1356652 1324471 1301115
3588 1301115 1302472 1284288 1266263 1272179 1267610 1248736 1223708 1224495 1239707 1256330 1260155 1271960 1256239
3575 1256239 1264066 1260458 1290157 1341444 1338159 1300049 1335117 1353611 1357403 1353750 1340688 1339878 1302719
3562 1302719 1274227 1264355 1255347 1220227 1201362 1197511 1195977 1214072 1207206 1180356 1193787 1195376 1176666
3549 1176666 1159145 1142902 1116654 1106725 1141658 1163233 1147961 1143561 1147099 1143202 1165976 1166520 1178193
3536 1178193 1195158 1190871 1183531 1187673 1178072 1174547 1179166 1192004 1196522 1230941 1216398 1196777 1225572
3523 1225572 1214948 1253768 1268884 1304939 1320313 1352142 1377850 1418538 1467604 1523683 1554781
3512 1554781 1623162 1725410 1821774 1949403 2098155 2256898 2424140 2629217 2811321 2984630
3502 2984630 3122787 3187921 3194694 3099723 2920253 2742468 2562472 2381333 2206282 2047299
3492 2047299 1955896 1874737 1803553 1729453 1669811 1634741 1610765 1615633 1580973 1546229 1533158 1528076
3480 1528076 1505732 1461526 1432073 1417115 1415347 1404277 1396457 1362724 1363315 1334907 1295066 1287924
3468 1287924 1277295 1275067 1297095 1284575 1255303 1261294 1225137 1205507 1195677 1193459 1198344 1234934
3456 1234934 1252259 1278027 1320460 1329043 1338873 1364808 1372735 1368006 1379046 1394579 1387123 1377803 1375795
3443 1375795 1383916 1407295 1380906 1363144 1374923 1394723 1446120 1514245 1588494 1644046 1690847 1722306
3431 1722306 1732295 1768569 1800788 1807696 1832132 1812578 1821682 1843689 1849263 1866363 1874289 1874038 1897200
3418 1897200 1911294 1925676 1939338 1977524 1992529 1984792 2001903 2034374 2060171 2079491 2111608 2134193
3406 2134193 2184226 2194552 2234626 2327036 2429855 2522633 2598766 2607636 2643121 2629680 2599392
3395 2599392 2599069 2620886 2650250 2707157 2778811 2840932 2922330 3008090 3089086 3167539 3259185 3311931
3383 3311931 3370642 3399449 3413139 3450705 3473704 3491072 3514632 3529885 3591157 3645663 3687157
3372 3687157 3739071 3816369 3920218 4010095 4113320 4216483 4328226 4425903 4523019 4605561 4686985
3361 4686985 4762915 4832928 4907828 4985056 5100514 5188880 5318444 5435066 5543815 5657929
3351 5657929 5804265 5948918 6135593 6322186 6494302 6680413 6857333 7054820 7221591 7388348
3341 7388348 7558919 7719352 7853887 8019254 8199540 8401450 8637310 8866041 9119389 9394073
3331 9394073 9721284 10082180 10457416 10845815 11264356 11732373 12251604 12837617 13494791 14228104
3321 14228104 14986423 15783859 16652437 17620346 18781714 20236909 21965235 23845750 25858380
3312 25858380 27584572 27838500 26517283 24773360 23306245 22352108 21871719 21755698 21857927
3303 21857927 22123460 22480504 22864555 23286108 23791022 24421675 25198195 26159598 27325750
3294 27325750 28751160 30395882 32303207 34543100 37119467 40134486 43704975 48011450
3286 48011450 53187538 59072356 65298998 71352752 75703193 75886526 71556103 64981551
3278 64981551 58403937 52928008 48747105 45665871 43454680 41820263 40594353 39724207
3270 39724207 39146938 38849508 38865007 39081462 39428048 39816578 40141944 40374640 40584034 40951571
3260 40951571 41513752 42307110 43291044 44424021 45659502 47043289 48523894 50029611 51480138
3251 51480138 52802848 53946994 54863900 55586838 56167054 56780069 57491428 58370128 59399512
3242 59399512 60658992 62137237 63802524 65759957 68022326 70634688 73542669 76799584
3234 76799584 80416344 84482959 89230801 94939635 101863983 110228316 120252440 131907672
3226 131907672 145383826 161062201 179376243 200905680 226836016 258494652 297006764
3219 297006764 342265261 391270597 438231490 471620789 471964199 434799128 377947181
3212 377947181 319627930 269378644 229395591 198165545 173432455 153591675 137435515
3205 137435515 124028504 112652481 102963120 94696544 87637527 81526400 76137811 71272679
3197 71272679 66830189 62686067 58773581 55150216 51860218 48895388 46198967 43759795
3189 43759795 41582090 39564779 37701200 35983320 34399408 32886509 31483424 30191300
3181 30191300 29061510 28064419 27240928 26514489 25857721 25267027 24686636 24093620 23565202
3172 23565202 23089982 22662996 22349631 22132543 22026555 21978712 22004141 21996179 21648614 20797945
3162 20797945 19729747 18631560 17624375 16747355 15991259 15364154 14820048 14349853 13923775
3153 13923775 13522564 13140780 12742069 12337520 11966800 11624179 11308808 10990222 10706662
3144 10706662 10473730 10268189 10096996 9938574 9791567 9671990 9611438 9572197 9557687 9561432
3134 9561432 9586800 9538247 9333117 8959424 8500319 8076616 7716633 7423579 7171071 6977249
3124 6977249 6789262 6604386 6402301 6183277 5997842 5833980 5657048 5508958 5368840 5229585
3114 5229585 5129418 5023258 4950660 4885632 4816695 4750098 4672719 4603791 4534874 4488033 4441574
3103 4441574 4390932 4385763 4370749 4350613 4339857 4317697 4263783 4200951 4132560 4083171 4046071 4019658
3091 4019658 3984395 3960001 3956107 3953173 3978250 4034597 4085947 4106174 4062882 4009970 3912681 3810053
3079 3810053 3711248 3602633 3531703 3447922 3372833 3298855 3237225 3174561 3095504 3032022 2996499
3068 2996499 2951308 2900219 2852037 2800501 2786886 2791081 2772140 2768724 2723647 2686925 2626003 2568517
3056 2568517 2509766 2467706 2438005 2383512 2341056 2285738 2206674 2160710 2123179 2079525 2059997
3045 2059997 2072055 2089343 2080426 2084187 2119493 2128914 2112537 2117974 2052905 1985089 1956244 1916509
3033 1916509 1871468 1817194 1778247 1806299 1831508 1879269 1924054 1921642 1919520 1880795 1868059 1848001
3021 1848001 1810078 1768211 1712283 1708232 1687633 1661416 1628742 1603106 1620331 1600340 1564118 1515239
3009 1515239 1479876 1451901 1443994 1436174 1417777 1416769 1417633 1424058 1408273 1432456 1451508 1493342 1529499
2996 1529499 1559413 1632406 1664002 1668235 1679585 1669302 1633168 1611195 1588052 1525659 1494045 1457595
2984 1457595 1421808 1429990 1426193 1396727 1391388 1405391 1443196 1449646 1450461 1432410 1428967 1416653 1428946
2971 1428946 1445031 1423636 1404436 1370793 1328195 1314029 1297460 1265416 1223008 1177700 1175309 1138886
2959 1138886 1103592 1093911 1100735 1074390 1070438 1070750 1045161 1058674 1087305 1102151 1091817 1095052 1095647
2946 1095647 1090674 1136804 1162526 1177770 1227599 1271722 1305822 1359994 1407328 1457221 1552680 1678010
2934 1678010 1807955 1936884 2113288 2287685 2428086 2617136 2746287 2791160 2740969 2639397
2924 2639397 2475361 2303729 2109170 1924854 1787743 1657648 1530770 1427922 1376722 1314968
2914 1314968 1239641 1175914 1134871 1101917 1042332 1000606 982906 965547 943878 927322 918205 877383
2902 877383 839929 842514 816079 807702 810677 810884 790802 759994 752803 734839 696296 700063 708127
2889 708127 703624 702213 705338 706738 692172 695973 661739 635176 639529 619548 603968 592681 590284
2876 590284 612832 633782 647496 650107 651861 643586 647721 633747 607720 600072 597100 562160 534792
2863 534792 537005 559045 561193 555213 539641 552517 563976 572564 538224 519433 545109 547531 542682
2850 542682 551921 538155 528905 548937 538954 533039 504149 498549 503565 485555 487587 500699 501668
2837 501668 500729 496452 504164 494591 465735 461286 450711 472153 459240 436298 419326 400971 414725
2824 414725 422338 401041 419725 408772 398588 410871 380694 374624 380996 365604 358023 366316 357686
2811 357686 353583 353116 352833 348719 331320 317109 333445 328514 335146 350149 318050 302745 271280
2798 271280 254564 279758 307389 301954 317558 323300 336643 323302 300717 288166 287883 292935 295164
2785 295164 322836 309878 273432 265368 288411 269843 271460 274494 266313 279241 275483 257450 272654
2772 272654 265498 259333 264051 274936 279714 303499 300934 294548 289970 275744 319867 341801 329715
2759 329715 321454 305068 313007 294859 294886 271139 281664 304482 310545 296805 288638 278841 273612
2746 273612 287301 282471 273153 259446 260247 256129 242522 219069 209579 202171 225988 231109 212193
2733 212193 176424 180412 208687 205475 204672 205140 223537 239227 229150 212139 222420 231583 244076
2720 244076 226974 195103 205812 210320 219337 231146 238529 219024 212512 220610 205149 214015 223353
2707 223353 230840 234377 196714 186565 189467 197769 206819 205377 178856 187165 213774 197289 193454
2694 193454 167612 156282 173550 156403 165641 176758 180259 139620 162001 165738 180506 192479
2682 192479 185291 184898 183698 177094 157086 174792 160684 173784 202563 199544 182971 188645 191993
2669 191993 209758 201576 190053 180103 176438 158425 176360 188546 164198 180052 172619 166153 180027
2656 180027 186228 190684 183058 191599 164225 144065 158290 171701 178647 166835 168459 151610 165582
2643 165582 177422 172161 183029 172088 163822 137118 132320 132401 128182 121792 132644 147674 118438
2630 118438 92816 103441 126940 123788 124543 138307 119216 120486 146860 157081 157009 153344 150201
2617 150201 148272 158387 146468 149879 167962 149493 145181 148238 143542 152442 157061 170814 169457
2604 169457 160296 180974 180000 161817 167877 156520 161357 135536 134540 171500 176413 166224 145251
2591 145251 120952 102332 127678 141628 163463 141846 107045 117649 106013 133895 139823 127470
2579 127470 140172 143336 120731 140597 141524 130313 119125 97681 120370 128806 123667 112541 105990
2566 105990 92986 98390 91935 98596 84252 79085 83437 80476 98578 119612 127856 119108 116924
2553 116924 112463 103852 113147 92392 72630 62612 74068 87448 98745 85281 76286 73002 73561
2540 73561 84104 84287 115734 124256 118223 116108 112429 104596 86254 102649 104820 124995 130801 133130
2526 133130 110326 111269 137606 129263 116480 91054 87218 73037 99801 122935 131010 118556 105633
2513 105633 109522 130743 123958 114379 99368 93817 91380 75848 53270 76800 89611 84178 82878
2500 82878 86592 87000 110895 82671 89721 114001 113152 102488 109782 107187 88632 97660 89042 73460
2486 73460 66479 71013 83675 74964 76310 95032 54713 59908 109214 109729 107540 110761 90318 75598
2472 75598 71301 66882 60718 68221 70597 82556 86152 75086 91109 86948 73054 77111 70464 49656
2458 49656 42063 58536 57130 72232 62255 67085 59468 74425 76036 81910 73413 65266 74474 58649
2444 58649 72227 66721 62633 80279 72935 52029 59182 59488 59817 55132 21581 43539 52613 50015
2430 50015 56393 38887 39678 47373 63460 57970 59064 53369 61958 58710 40315 33438 38402 44639
2416 44639 43811 49335 53249 52863 28378 50295 48614 42442 63256 65811 88209 80775 66783 76726
2402 76726 73322 71107 69067 58895 48397 70095 79121 67752 56284 64313 55346 35364 51678
2389 51678 43521 35598 54862 49279 78673 59648 60972 76132 58900 36872 40287 62154 32638
2376 32638 28185 10169 15735 39103 34614 37785 25695 15938 35048 45717 33360 39228 42104
2363 42104 41177 37185 40334 62369 79060 58691 47605 46978 48044 62254 47528 37481 23038
2350 23038 35519 51844 60936 59332 58484 55364 59345 63524 77266 87949 76219 77318 107106
2337 107106 100088 99650 88691 69932 63760 68284 68552 52809 55158 39679 34290 62668 73665
2324 73665 62894 52420 32383 38531 20875 26233 34414 44290 63353 59188 49131 31249 26158
2311 26158 7227 12707 28382 38414 10381 -16917 -16943 253 25397 17136 -23836 -14217 27304
2298 27304 29811 5425 5828 15914 14920 33036 27608 20372 51827 48830 39863 30283 41312 42707
2284 42707 44580 26798 40920 52099 31245 30852 58539 51136 40350 51108 31214 43773 62085
2271 62085 60484 35215 21179 10857 12300 3751 819 37648 45148 24671 31211 12433 45216
2258 45216 53539 38061 39673 62770 59846 42914 55864 52307 56054 46425 28554 40368 44966
2245 44966 33168 25322 47086 50588 35633 46774 46309 34511 13461 16845 19350 10756 13870
2232 13870 15226 10622 15921 21342 11503 11048 20638 22263 44667 3035 13992 26508 45385 34837
2218 34837 23253 19485 3518 -3531 -14823 24455 39438 37441 15254 21148 33717 34466 31003
2205 31003 33549 27723 57975 77981 82904 60566 52413 73162 57641 49564 68098 76879 67720
2192 67720 39013 61781 77879 90878 78669 89420 95623 91730 72111 85250 98111 78183
2180 78183 80159 77962 58757 60501 77940 64947 59078 72321 102680 94620 77767 80810 72883
2167 72883 88914 97090 111739 88030 83088 111735 140591 147479 136836 146868 133450 152637
2155 152637 152111 140429 142975 140239 150734 167637 131646 143690 140900 178341 197182 181403 179664
2142 179664 168438 189231 214365 234956 217752 207243 196290 210755 222065 234837 245505 257356
2130 257356 265448 265341 271813 279915 293744 309441 328420 328139 338252 372248 392805 385581 397328
2117 397328 412979 397549 406985 439850 454866 476516 501087 497282 544118 583699 615130 628455
2105 628455 634540 652564 664955 688846 675417 716980 747872 772870 794064 829581 877607 914630
2093 914630 983304 1032816 1117181 1180334 1264968 1348121 1445608 1522986 1603453 1720018 1838584
2082 1838584 2023601 2268803 2571445 2930342 3396745 4035292 4874421 5995715 7388040
2073 7388040 8921905 10334060 9898720 8078236 6209639 4773606 3862476 3179591 2722292
2064 2722292 2323065 2025854 1807572 1656995 1492728 1381731 1339563 1297935 1224169 1108190
2054 1108190 962284 856351 787929 738298 707990 665845 609915 543796 532491 498142 463919
2043 463919 455072 438220 439703 420444 399937 357074 346237 337850 332231 330960 336351 333948 319654
2030 319654 302367 289886 282068 258763 247540 234932 214845 208241 204487 189074 193537 198450 193038
2017 193038 204792 166109 151830 169652 179995 174015 184859 159040 145556 141372 136107 120883
2005 120883 114271 109892 130282 129587 97131 124692 110606 97581 137463 114158 94397 97075 100410
1992 100410 89599 92089 72893 66023 51540 62425 80981 73750 38019 33587 59857 73556
1980 73556 74879 61121 57442 39132 55745 59823 54949 42976 45389 32413 42942 45972 15377
1967 15377 39827 39065 65006 74495 42021 50911 51188 34114 65567 85133 84943 48434 27542
1954 27542 35727 42419 54690 49790 19815 42763 49402 31838 45956 35064 36926 23635 52103
1941 52103 37030 30933 32746 56684 43178 26157 41867 34702 22019 20128 14298 38953 41445
1928 41445 48407 50708 40102 32350 36711 44965 43061 35991 43667 51111 40245 46851 35148 36016
1914 36016 28544 25037 13198 15510 11984 23064 3180 -12621 -2143 9302 -2015 -8238 -1794
1901 -1794 26494 41450 44147 21250 36564 40108 17820 39090 22061 -5994 28407 47786
1889 47786 9797 13453 -5280 21672 21951 7997 4010 22253 -1531 -12466 -15427 -583 14321
1876 14321 13888 7083 16894 4906 4718 23060 21474 7774 -12221 -10324 -18789 -28483 -7978 24505
1862 24505 18028 -2442 -2468 8494 6684 9410 33629 15074 -3847 -1682 11369 -5597 -16490
1849 -16490 7684 6007 252 -10383 -16905 -15712 14458 22937 3318 2996 -3471 -14757 18441
1836 18441 3007 -15841 -3312 14750 34968 9852 1485 13544 -1990 -20922 -13129 7878
1824 7878 12150 24015 24080 17209 6304 11011 9117 1595 11723 26464 20594 19618 24806 27252 27464
1809 27464 14041 10458 17488 40844 53151 35933 52869 56532 53314 65264 60311 42949 26113
1796 26113 2478 21116 16705 17383 15922 -713 17739 31786 9479 -10649 6618 -3243 -1105
1783 -1105 3254 -7155 -17281 -24721 -13878 17778 28965 8220 -4201 -7612 -13495 1202 -13731
1770 -13731 -37358 -16310 11052 10624 20563 3922 -5886 -13886 -27390 3331 4567 6147 -14954
1757 -14954 -3403 -18100 -6648 -13089 -13427 -21294 -29990 -7386 -11611 -2920 17381 8801 -18171
1744 -18171 -784 9620 -3080 2544 9462 6537 16695 -14698 -17686 -21252 1686 -1663 -21343
1731 -21343 -10204 -9800 -14379 -23179 -14128 -13574 14758 -11 4803 17742 12772 13463 6927 -1757
1717 -1757 41 9056 -1288 -1371 -4507 -17207 -19125 -28700 -14585 -13883 -33061 -20355 -26072 -19244
1703 -19244 -12257 -13160 -11531 -2632 -15433 -26049 -34096 -31960 -32707 -29370 -18549 -504 16678 12912
1689 12912 -7950 -12967 -10415 8981 1311 -20331 -38389 -11962 7999 -3881 -4528 -14538 -29167
1676 -29167 -32757 -15506 106 23909 17827 1713 18131 6846 8141 -13224 -25184 -21079 -19348
1663 -19348 -7135 11263 -4398 2202 1810 -4251 769 2465 -15519 -17304 -18950 -36909 -12685
1650 -12685 -20322 11229 27478 23704 13242 -11018 -4443 19911 10783 10832 8962 -7969 2523
1637 2523 -8062 -17312 -8935 -1670 19015 -18358 -9809 -9395 -19132 -23685 -28078 -39916 -61485 -28879
1623 -28879 2244 6759 5078 -14150 -4300 8879 -7470 13856 20310 23055 8648 -11289 -5762
1610 -5762 -11532 -9368 1616 -17356 -29194 -33431 -24725 -2279 -32852 -18355 -22373 -21320 -24217
1597 -24217 -13022 -10412 -27063 -17447 -22630 225 -455 -2436 -24642 -24925 -31212 -30791 -14033 -14975
1583 -14975 -16909 -8128 -30860 -21314 290 24038 16164 -7723 -20217 -29741 5646 6570 3767
1570 3767 11809 13570 610 -19633 13582 6637 -40882 -36539 -11812 -3035 969 -13890 8171
1557 8171 -8657 556 1783 -631 20095 16556 14441 14309 -1984 -10413 -25381 -52859 -42536 -43269
1543 -43269 -25169 -1465 6577 -27291 -28752 -13484 5183 -3052 14851 986 -16434 -34662
1531 -34662 -10206 15236 6833 6284 4924 5979 18847 3367 2080 2076 14498 16514 14541 -3994
1517 -3994 -30983 -17370 95 -9187 9084 6544 -10733 -614 -8296 -12962 -27142 -3735 19937
1504 19937 9841 -2137 -19716 -26452 -16303 -38345 -28763 5515 4586 -10636 -24769 -24374 -35192
1491 -35192 -35395 -14284 -30904 -28155 -47799 -45650 -21375 -28451 -45131 -22787 -5601 -2140 -19594
1478 -19594 -12004 -8227 -25900 -41122 -12798 -2258 -16227 -19001 -22738 -5127 22392 6186 -18577
1465 -18577 -14468 -2282 -3337 -43278 -9603 15180 -1702 -14872 -29754 -2409 9370 -11852
1453 -11852 -901 -339 -9733 -8044 -32693 -25398 -3436 1234 -17211 -14028 -30202 -29467 -6058 -2186
1439 -2186 -23211 -40141 -27875 -1811 32755 22005 25625 1102 623 -23417 -38474 -3693 15648
1426 15648 -10661 -1940 -15378 -25260 4447 111 -9005 1534 -2250 3346 2876 -6231 3345 -17491
1412 -17491 -7461 -2444 789 -6326 -32291 -47825 -42407 -26064 -6092 4895 -25710 -15125 -19858
1399 -19858 -32183 -17642 3088 3692 -11136 7942 26864 16086 8550 -6391 -22001 -15725 -22641
1386 -22641 -30180 -31903 -14789 -26326 -12389 4997 -18700 -8779 5229 -10169 16028 -29252
1374 -29252 -13319 -3562 -11278 8605 -18134 -37156 -26342 -12217 3579 -3012 -17550 -18388 -5102
1361 -5102 12157 12149 1619 -10833 -13368 6054 10183 26765 19330 -8629 -22877 9875 -77 -20655
1347 -20655 11734 1353 -26829 -19382 8237 10259 -8277 -12952 -16798 -41901 -33114 -23478 -33348
1334 -33348 -33325 2762 2122 -1299 -16534 9018 2100 -3980 1129 20240 27546 3284 -8919 -11754
1320 -11754 -6657 -24406 -11846 -21614 -29803 6498 -3014 7774 -6228 -12240 11718 -16009 -16475
1307 -16475 -10831 -12435 -25292 -27112 -12472 -32392 -42483 -27557 -5321 -1340 -26669 -7156 -7769
1294 -7769 -10665 -6458 -37824 -44855 -28275 -13462 -23586 -6665 -32856 -31558 -16821 -4111 4166
1281 4166 -5350 6204 -155 -8339 -3517 6324 -11534 -2143 8969 5063 15618 -9431 -10318 -4409
1267 -4409 -4441 -6274 -15237 -32514 -19612 3050 5564 -24987 -9716 -1991 -28765 -33210 -21624 -38437
1253 -38437 -32676 -7709 -7193 -20177 -22815 -19212 3138 6430 -13193 -2702 7942 -4891 -16535
1240 -16535 14505 19058 -8849 -6842 6566 18239 5195 -17996 -13366 -10231 -3389 40 -4605
1227 -4605 7146 9221 -8024 4562 3688 -870 4118 10709 -10406 -28691 3151 13071 -315
1214 -315 -5246 -24779 -11122 -22156 -18654 -29595 -1630 16011 8800 -10503 -4862 4020 -6501
1201 -6501 1868 11639 -4930 -15196 -17106 1020 3480 11943 -5454 -17018 -20498 -19720 -16876 -12785
1187 -12785 6167 -5150 -29559 -7330 10272 -600 -8648 954 12530 -4692 -3128 -9975 5525
1174 5525 -6051 -24250 -6585 11103 6212 -5382 12748 5200 11514 2468 -15649 -14055 -8029
1161 -8029 -23274 -9328 16687 13333 -7345 6747 15142 -5073 -21172 -7603 7775 11556 1582
1148 1582 -20486 -5926 -8956 2928 8681 14352 5367 14529 15993 -8005 590 -8010 3813 12074
1134 12074 -3112 -16214 -19961 8407 -15879 -15042 -2644 -15820 -1335 17078 -5541 -1225 -30909
1121 -30909 -5811 -5685 -31747 -26672 -24855 -14316 -21301 -5127 -15461 -19448 5583 -1314 -22448
1108 -22448 -14243 -19789 -13223 5172 2646 -6382 -70 -8968 -36837 -26711 -11234 2135 -15505
1095 -15505 -18038 -16018 -7587 -20586 -15847 -15398 -14843 -2239 -6824 -19774 -8720 -2373 -2426 -19155
1081 -19155 -1824 -17345 -8395 11251 15204 22970 -1187 -7427 -9107 543 14806 29619 9739
1068 9739 -19897 -14445 -5885 -19788 -1482 11935 -1598 3696 15277 28063 20194 -1458 -5144
1055 -5144 -8429 -17300 -11514 29984 20869 -15830 -21387 -10780 7932 7103 2180 13714 8450 5292
1041 5292 -16168 -30209 -8308 24086 18661 5918 -3195 8421 1645 -2962 9560 3645 -6390
1028 -6390 3324 9964 -731 -26416 -2665 -16104 -31056 -18272 -4103 -23248 -30832 -4350 -7800
1015 -7800 5456 -4027 1387 -1176 -686 -1815 4932 30872 22666 -2203 7730 15888 -18184 -32416
1001 -32416 -18800 456 4594 4592 22041 7910 3684 30739 21939 14482 -4316 -1578 3771 -721
987 -721 -14182 -6236 7540 -8720 -9643 -11260 -32122 -42746 -29013 -12885 -15255 4063 -2930 -6391
973 -6391 8403 -496 6207 -28717 -45373 -23346 -16394 -18603 -11815 -29480 -25460 -23748 -21040 -14996
959 -14996 1376 2788 -25463 24985 26929 12155 12930 21252 -2536 -16924 7372 13458 -1358
946 -1358 -3874 3653 1001 -20696 -23696 1823 12387 13660 33524 25426 15605 -4756 -49964 -22284
932 -22284 1676 1509 -4661 -21993 -19931 -8346 -13761 3345 -10756 -19333 -13749 12098 21171 -10723
918 -10723 -981 1951 -16921 -12887 -14705 -24408 -18107 -5230 -4222 7696 21898 12781 -4129 -28838
904 -28838 -27514 6588 8799 8148 40663 69759 32754 22465 9295 -2021 -23137 -4301 22140
891 22140 -5547 -12315 -11382 5647 -13307 -18611 -12649 -17615 -17193 10072 29651 7556 17726 22546
877 22546 -10914 -23461 -28547 -33306 -13722 -4195 4905 4097 19229 3813 -19185 8004 14891
864 14891 5982 10242 3399 -3412 -1580 -9144 -3991 14215 -1810 -24159 -32959 -17090 -15625 -22269
850 -22269 -20114 2549 6437 12674 10829 4237 5481 -23591 -4875 -29348 -30789 -12024 9042
837 9042 25385 10379 -16075 -11964 6263 2350 3683 -22376 -28284 -16172 -14157 -34455 -42345
824 -42345 -32160 -42819 -28808 -12509 -2584 20957 -5394 -8134 16969 1412 -7479 13464 18520
811 18520 -2037 2911 -10754 -9887 -6573 -2097 -8035 -21300 -16694 -19815 12300 1527 8518 7057
797 7057 -18861 -25646 -13752 -1790 -3433 2965 -14035 -3304 -5265 -19781 -18166 -19995 -4943
784 -4943 9361 -1982 2027 -6939 -2839 -7157 -18422 -1026 -293 11896 9936 -6272 -6633 4264
770 4264 14272 4658 3364 -3425 11615 22308 -8592 -21380 -31133 -32846 -12913 -30180 -30755 -11671
756 -11671 -17325 -7175 15774 -21449 -16176 -9928 5234 14751 -9638 -22789 -16541 -3473 12216
743 12216 2193 -14463 3741 607 -30501 -30322 -1150 -3119 8071 18368 -1913 -23558 -30395
730 -30395 10410 21471 -14037 16180 30110 20189 -26527 -23457 -20853 6489 9555 4594 14466
717 14466 4728 10995 -17526 -2578 16706 25086 5763 -14890 -9085 -1831 -10435 -18562 -7544
704 -7544 -2817 -13323 -14334 -768 34737 25166 2169 -4365 22308 15885 1226 6196 -1581 15110
690 15110 24323 10377 12466 12536 34703 25534 415 -3333 -20328 1762 15184 9422 -3853 -4753
676 -4753 4601 13151 -225 -18617 -23491 -31292 -10984 -10405 -25255 -6817 2804 12967 3161 744
662 744 15004 3065 -7322 869 18833 46137 33535 22173 20351 13776 -251 26091 25520
649 25520 27500 14254 -363 12529 15710 17788 29637 8967 2354 3274 -16312 -731 38977
636 38977 19966 -1106 5047 14087 4172 16926 20429 157 33807 20808 23269 3116 16324
623 16324 20910 5840 4575 -3662 -2563 -11671 -12509 -3627 23762 11079 17836 5580 16913 -14084
609 -14084 -19104 -20526 -33449 -1111 -287 -8763 2230 17684 15599 -7347 -20927 -2079 -15257
596 -15257 3081 -1574 19983 19785 33477 7748 -8571 -5384 -5793 -927 -7192 -7381 10681 6144
582 6144 -2479 -2564 4427 -3782 6073 25402 -5038 8111 14334 20582 34069 20242 10376 10624 2579
567 2579 4259 5312 5055 694 -10718 2550 -18477 -53405 -30294 -8625 5545 5738 -3573 -4755
553 -4755 4648 14278 11198 8026 8816 36078 34165 7706 -17834 -18219 5709 8804 11780 5384 -28262
538 -28262 -23013 5149 1754 28548 33868 -4005 -19418 9369 3747 17651 23649 35051 44844
525 44844 34389 26512 19027 38770 29223 19937 -1898 -32286 -45890 -41109 -34964 -30472 683
512 683 -18377 -22879 -5280 -19807 689 33429 23839 6325 -5051 -10304 3282 35679 34793
499 34793 39803 24636 11804 9358 -4430 759 7941 18247 21905 29979 17707 2105 -273
486 -273 41846 28223 18840 36948 24344 9014 21143 18574 27193 17113 14785 25667 25761 8458
472 8458 1107 6050 16901 -7977 -7958 -11300 -19117 -34386 -19374 9271 20026 11784 -15714 -10041
458 -10041 -10501 -11279 -18416 -6251 -8949 -2002 -9807 10514 9194 4818 7472 16218 29197 18367
444 18367 16403 40825 27154 34540 24632 13144 6127 13580 7791 -13513 -23850 -2080 807
431 807 -12995 8658 4269 -14669 -9746 25528 9623 -5107 1566 8807 -6971 150 19594
418 19594 16425 11899 -7223 -55 24232 22365 13555 -5942 4208 13908 28025 23666 4979
405 4979 -2271 -23944 -26798 -2150 27454 39020 25740 24544 9402 -473 -6481 21230 25466
392 25466 15451 22082 -9993 -20620 -7602 14576 23640 34461 6726 -5594 -560 8780 -13168
379 -13168 -9899 6486 19539 19030 677 22818 24318 18592 -2459 3741 10209 12060 41815 37640
365 37640 27312 -5338 -6526 8879 -4002 -4943 4845 5565 -1978 10340 11462 3355 21467 29623
351 29623 22163 19824 25565 40972 34049 432 3402 10471 14374 7300 9167 18447 24864 27261
337 27261 13667 12345 16857 13040 29142 21799 8793 2013 10754 31165 20769 19310 2284
324 2284 5733 28329 46576 53876 26771 14440 10031 16338 3375 -4479 5673 28581 26940
311 26940 6856 5134 -3593 -14063 -3091 1992 7317 8773 6067 2562 9238 12005 -9119 12163
297 12163 2286 10780 10979 29494 28208 17882 14103 295 12116 26297 27632 38086 38494 34701
283 34701 1595 13286 16175 14720 -10991 -11500 -5280 -20534 -27926 -2643 9615 13151 12097 2575
269 2575 19314 -7587 -17296 15421 33214 23846 29308 10211 2606 21986 12335 -2623 -2019 -8456
255 -8456 12684 24843 38475 19891 14070 18415 19162 26403 -5443 489 26373 25360 9178 19007
241 19007 8830 16857 23128 21416 25602 14240 10239 13801 14369 28779 27133 -2096 -4905 11293
227 11293 27968 12112 -8137 12075 29768 22732 1180 -8144 14265 -2035 -22612 -16771 -16218
214 -16218 -25586 -11381 8146 13492 24552 22801 15434 21821 27952 11725 13839 24320 13220
201 13220 27056 16371 6189 -4497 -13595 3412 15531 -4338 14588 20006 21932 31940 22214
188 22214 28481 29879 30001 32371 46013 66084 41819 44430 38194 18971 9285 27133 27314 26496
174 26496 23578 41909 37036 41890 27500 917 4830 -2209 -7386 606 15324 21455 20153 15091
160 15091 5424 10868 17663 21377 30952 31047 34351 25767 19036 21416 8663 4316 3718 19070 51096
145 51096 46459 38111 40208 34271 35844 22447 25294 25644 22143 32023 22262 10665 2173 9149 1913
130 1913 -827 -23847 2206 3967 17052 9509 4691 16759 20073 7038 15658 -232 14243
117 14243 19879 3907 -4697 13204 18416 -9692 -6262 12309 14387 -8213 2364 12851 14742
104 14742 9036 10529 -2395 9383 16493 23776 6083 8349 27798 17598 15471 13688 34407
91 34407 33728 16376 20481 10593 3742 4029 11297 23438 17837 20043 24187 21802 13832 24780 17597
76 17597 9684 5701 11365 18031 14458 12612 23424 18585 20741 33253 22000 2576 2448 13868
62 13868 16182 49450 35283 16856 29601 20244 17187 12009 25815 30354 27935 22500 9218 24901
48 24901 32986 36208 24409 32457 31586 7878 749 -543 15958 13822 21198 15100 7941 4203 5793
33 5793 7337 11071 11700 22131 21928 26526 37038 35969 35927 26621 20191 23441 24856 30935 29705 40726
17 40726 30971 18959 15823 6375 -8839 -6880 15519 12144 1333 9395 23921 9786 32120
4 32120 32314 29413 10488 18476
0 18476
$$ Imaginary data points
##PAGE= N=2
##DATA TABLE= (X++(I..I)), XYDATA
16383 -715882 -698714 -676583 -662708 -661654 -653493 -663219 -660113 -648781 -632045 -622904 -600809 -585681
16371 -585681 -580319 -584195 -569498 -535291 -511620 -524591 -522136 -505194 -483835 -471635 -464554 -455817
16359 -455817 -436556 -438884 -425816 -422356 -423394 -404872 -397968 -369742 -359738 -353569 -338443 -337797 -342322
16346 -342322 -329478 -310628 -297999 -289545 -281034 -264767 -238189 -237237 -240617 -225447 -218969 -206789 -210139
16333 -210139 -189876 -184371 -179063 -161293 -150934 -136905 -119139 -113375 -110066 -101835 -90476 -95794 -88321
16320 -88321 -68419 -54589 -30659 -24036 -23409 -25922 -21068 -12935 -1460 1502 18874 32115 29355
16307 29355 38238 50222 61231 50432 69640 99135 101929 96823 93668 122522 117289 110635 123013
16294 123013 142731 166118 185930 177958 186473 203777 199631 202455 192465 219039 228269 248213 259847
16281 259847 256275 273831 263174 247885 274171 295713 316107 331591 323439 315220 333974 344311
16269 344311 351218 327116 339705 351728 360822 379448 388457 388749 385352 388165 400930 421836 430766
16256 430766 430166 438849 437027 440142 445091 457900 462573 480548 486778 477932 498501 493329 490631 490080
16242 490080 515240 517590 534029 542125 542861 549069 566946 567358 569115 564242 546875 561705 592716
16229 592716 593336 586152 598727 598653 611042 629529 640037 625875 624044 630253 643860 652470 657447
16216 657447 646650 665671 649462 646050 658766 667317 679365 679651 702371 695016 672138 666726 675636
16203 675636 692555 711736 706103 736365 728014 713730 733553 743592 722040 727093 725333 742412
16191 742412 760538 771654 760216 764327 750012 752293 782572 762933 757017 748816 737539 750919
16179 750919 762839 793126 805448 806873 803342 806026 803551 814549 798091 807245 815157 796262 808491
16166 808491 814659 815923 828825 818710 799079 818097 834728 829866 843468 829944 827114 812036
16154 812036 812098 818154 845381 852656 848871 877095 880773 878522 864378 873579 868696 867599 880881 874580
16140 874580 868061 890322 875345 857524 842794 852087 887224 906802 903872 919322 895034 873587
16128 873587 882914 868826 887479 901952 889691 901530 881809 922946 922858 906202 899225 906241 904028
16115 904028 905512 891074 903811 908059 889797 874627 888858 908017 910780 922916 895702 896525
16103 896525 903806 920300 908768 890386 890422 896940 906939 923831 938970 949689 944502 915558 928108
16090 928108 945490 942907 955794 942131 931694 923951 927373 952939 945743 940261 935897 947338 950970
16077 950970 922279 928956 935154 935101 926688 925155 939538 930860 944093 937403 918307 925177 922139 909904
16063 909904 904652 902195 919325 930277 939117 933333 943218 945540 950964 950118 948277 949134 943518 943136
16049 943136 912333 909219 911870 929290 921495 936056 956770 955472 938419 947924 945336 926210 929734
16036 929734 927191 935026 963967 986577 970647 953534 959425 960972 946238 960870 955101 965233
16024 965233 972182 954979 941785 935320 936174 934589 936435 944442 955589 959931 945152 939279 934425
16011 934425 947667 943585 931691 952807 961966 952704 939668 925921 925306 941674 932614 947552 961909
15998 961909 962852 936631 944315 947195 956941 953545 927394 934188 951166 941568 957519 949405 966669
15985 966669 976110 955749 937031 941764 960188 967689 962753 994219 972453 954538 954723 952637 960536
15972 960536 948981 944164 943382 949279 951355 941167 941762 964946 977118 954252 930059 952035 952953
15959 952953 955056 965496 997695 972808 974382 970906 957748 955542 973861 963442 950480 954314
15947 954314 937527 935117 935310 925478 932925 966629 990271 965776 976922 983592 988115 969349 944202
15934 944202 923043 908953 937108 933600 946432 947051 974810 987892 993198 1019707 1002391 964600
15922 964600 967719 970682 979508 977138 973895 983772 974899 964650 948807 957746 959148 971015 946987
15909 946987 963196 979619 982483 970009 964423 970171 982481 979796 945617 949464 955935 970427 946768
15896 946768 944422 946950 957838 948631 959548 962523 969823 965866 957192 963712 954658 956089 965187 965829
15882 965829 977713 961226 942316 957981 969016 964436 974802 975315 951702 951510 962033 989357
15870 989357 969091 951854 963496 975313 964680 956159 962797 968345 953773 963277 980299 989388
15858 989388 972765 950256 965249 946410 927453 950821 971708 985595 987999 992858 983839 968051
15846 968051 956175 965415 963413 966378 959235 970410 969113 981070 967654 967493 972908 968640 957881
15833 957881 959524 972647 963086 962163 968777 966010 953208 949809 969827 985120 960801 955734 979968
15820 979968 975607 982137 1004500 975089 964265 967848 980134 969828 948515 950380 969524 976344
15808 976344 967280 991672 995415 979474 994914 974300 955403 956869 971607 954945 975361 982946
15796 982946 966646 951226 972001 981354 1002088 988116 955780 935833 964498 969352 972349 985541
15784 985541 965002 957248 966664 961791 947523 972564 972956 961342 974744 991981 961992 950418
15772 950418 951713 966308 971798 961618 990693 976543 956666 966818 954594 966337 972213 968447
15760 968447 972532 984279 975615 969927 1003707 1001016 978332 980787 983206 968613 990712 995200 991033
15747 991033 1030350 1013618 995551 992004 983757 983259 960819 970040 989910 986971 978770 985444 989041
15734 989041 993657 1008837 1018100 1019635 1024657 1015077 1000115 1003557 994822 981335 963521 975272 984623
15721 984623 992408 971232 949033 967278 982202 980871 990565 997097 970591 969746 969488 982432 995401
15708 995401 988568 1007964 974229 991781 984908 993138 990790 991536 981014 965012 977362 961191 966588
15695 966588 976898 965753 961186 976724 959657 963839 986242 959814 967158 981878 978249 1002482
15683 1002482 981001 983827 1015569 999141 994322 999095 965578 963497 984423 996596 992233 983950
15671 983950 1003524 988019 981601 968893 981285 1000320 983606 995942 1019729 1002453 995519 977669
15659 977669 992703 1001311 989398 1004559 993254 996687 983747 970627 990809 998415 986808 1005213
15647 1005213 977358 980310 989505 969726 967186 997924 1011238 999677 979872 980366 978439 1007240
15635 1007240 989318 996687 986763 964761 963129 979108 993692 1004139 976685 973071 999363 1003339
15623 1003339 987941 988889 1012463 995483 973495 964362 979316 980194 990348 981680 1000231 994524 977223
15610 977223 984184 979315 983376 973883 978693 997159 967914 963605 975662 965303 995515 1017399 997006
15597 997006 996535 1017133 988750 983342 997484 994689 987733 979341 984020 987055 979301 970504 989139
15584 989139 1000941 1020691 1012070 1031721 1015097 1023590 1022097 1019492 1026866 1018143 988851 994502 991954
15571 991954 998737 1002330 979909 987038 1011314 1010833 996724 986050 980585 994423 1022540 1030422 1014048
15558 1014048 1021178 1010665 997688 1005803 1006418 1013344 1018002 1015497 1026692 1032681 1027009 1023919 1020662
15545 1020662 1008808 984542 1001469 982125 975649 989704 1003561 1003068 992290 989052 988934 1017683
15533 1017683 988295 1002574 1002076 970357 958916 958691 979896 986558 988170 1020961 991746 985137 995867
15520 995867 991154 1004714 1032118 1023820 1016747 999278 998128 996447 986908 992826 997311 1010374 1017206
15507 1017206 996930 987960 985000 1018235 1017720 1013656 1003739 992863 995092 975592 992847 971317 973836
15494 973836 1006002 1004396 1012871 983188 1018845 1004512 991449 1010789 995032 998242 985700 990301
15482 990301 978139 989396 1004592 1013162 1005207 999830 1004499 1003172 988207 984157 1011225 1011902 997293
15469 997293 1013423 988338 990376 1006083 985315 1016669 1017961 1004644 1007271 1002601 987389 997575
15457 997575 1022635 1013836 1020411 1024346 1051983 1028583 1035720 1014274 1024213 1007949 1017338 1031492 1030049
15444 1030049 1023604 1026372 1012332 995096 1010399 1016441 1043176 1011763 1015339 1002358 1035352 1030684
15432 1030684 1032691 1037076 1019803 988340 1013762 1021184 1004838 1026570 1027399 1033537 1016290 1004416
15420 1004416 1018990 999998 992184 988484 1007513 999941 981217 980916 991740 994593 986361 975400 993312
15407 993312 1018168 1018093 1012826 1001409 1004657 998325 1003283 983613 1011900 1024502 1026789 1019955 1018069
15394 1018069 1015342 1009446 981361 985588 984156 1017907 1038445 1028423 1004794 1016934 1028959 1051467
15382 1051467 1034444 1009521 1023515 1028403 1007756 1010421 998109 1013472 1029103 1039877 1051321 1020787
15370 1020787 1015303 1011438 1011531 999272 1006012 1008786 988718 1012037 1022061 1015706 1035004 1010513 994183
15357 994183 1022625 1061894 1051419 1023886 1017963 1016783 1019098 1011788 1025396 1039801 1011531 991972
15345 991972 996054 1000391 992393 998928 1010464 999071 998917 1016974 1041270 1026666 1024764 1030436 993257
15332 993257 990957 1020487 1038410 1015736 1020503 1031089 1027299 1009060 1027959 1031065 1014786 1004705
15320 1004705 1010574 1014811 1001404 993353 1014810 1022077 1022928 1007397 1017100 1019323 1023302 1021430 1051561
15307 1051561 1045308 1026134 1026193 1057650 1075389 1049580 1046416 1037340 1008668 1018582 1016394 1020158 1016954
15294 1016954 1046045 1057894 1038526 1022709 1025978 1035173 1044905 1057881 1037263 1020856 1035366 1050382
15282 1050382 1032561 1030079 1038648 1037928 1031886 1022331 1031300 1038154 1033973 1023851 1012751 1028040 1036640
15269 1036640 1026141 1039792 1045951 1034542 1033758 1031667 1053589 1049271 1033446 1025493 1015283 1030751
15257 1030751 1020704 1015204 1026343 1020401 1025427 1039498 1022964 1049784 1046376 1047793 1054213 1018843
15245 1018843 1031464 1033865 1037097 1039049 1038359 1027681 1035379 1025990 1015065 1015467 1040786 1028681 1044403
15232 1044403 1020400 1018059 1030008 1041343 1045072 1037908 1025706 1022090 1019022 1031585 1012340 999212
15220 999212 1014408 1036407 1038239 1045964 1010371 991974 1022344 1036263 1025524 1042427 1019269 1015324
15208 1015324 1034127 1043340 1036495 1066677 1070794 1037251 1019793 1034238 1041682 1034519 1002467 999598
15196 999598 1032497 1031590 1053839 1043818 1038681 1026925 1036175 1063267 1048782 1027973 1036314 1033821 1015700
15183 1015700 1012373 1020616 1025582 979551 1002406 1016548 1003578 1012367 1018029 1042153 1021211 1043637
15171 1043637 1046308 1034738 1022405 1014112 1036527 1033845 1036344 1036388 1021609 1036938 1035209 1032524 1013425
15158 1013425 1037470 1048454 1059844 1035801 1024636 1036834 1033922 1021321 1020733 1018452 1041845 1031025
15146 1031025 1029960 1061032 1043356 1035078 1029813 1013724 1041318 1024848 1042414 1041144 1027879 1046536
15134 1046536 1038274 1037768 1032710 1033682 1031079 1013004 1008156 1011317 1032146 1033185 1040530 1055170 1043849
15121 1043849 1022953 1040622 1043684 1041605 1033157 1053129 1059857 1051901 1039384 1063549 1070528 1064259 1056678
15108 1056678 1055476 1061383 1047119 1039722 1035554 1038301 1029257 1041379 1063257 1069449 1052719 1057662 1069207
15095 1069207 1059501 1034174 1019044 1044750 1045894 1050825 1070289 1067346 1079599 1047974 1055479 1060365
15083 1060365 1066992 1063833 1046909 1048298 1067685 1053863 1043412 1046046 1043989 1033205 1062004 1053518
15071 1053518 1028964 1016065 1019583 1051147 1033666 1024378 1042241 1031735 1046046 1057386 1059326 1042994
15059 1042994 1025410 1033170 1040657 1055249 1046114 1040204 1031855 1046262 1069387 1040479 1046300 1054469 1077674
15046 1077674 1088792 1079223 1066633 1058809 1064013 1066505 1065107 1056102 1050445 1067796 1056413 1040030 1063420
15033 1063420 1049343 1033216 1031673 1061884 1081341 1069272 1047183 1048460 1042162 1031632 1053458 1068231
15021 1068231 1072275 1058062 1079231 1076225 1051982 1066310 1056791 1053852 1073930 1070936 1079286 1058790
15009 1058790 1063008 1081049 1074289 1072303 1053329 1023337 1054932 1047076 1036865 1041514 1026812 1058941
14997 1058941 1081511 1103334 1097580 1080288 1043184 1043184 1075945 1056075 1045999 1069075 1048939 1042827
14985 1042827 1067628 1089710 1082021 1072743 1079255 1096038 1091256 1091174 1065819 1071069 1073272 1065640 1082779
14972 1082779 1066088 1047864 1048919 1068890 1073868 1051131 1060598 1078777 1072463 1065744 1057755 1080855
14960 1080855 1071764 1064398 1051749 1048937 1061535 1063858 1049751 1059544 1063870 1062001 1079690 1079921 1060812
14947 1060812 1057549 1056041 1039850 1042774 1028073 1025848 1039599 1027608 1016602 1030358 1041978 1049897
14935 1049897 1075486 1087474 1089923 1076485 1051021 1063946 1072211 1074246 1093773 1092812 1084743 1063318
14923 1063318 1076949 1071279 1071566 1071035 1068111 1079297 1080526 1083029 1066653 1082781 1058560 1069487 1071663
14910 1071663 1080448 1071638 1076574 1082009 1083495 1094255 1099840 1101779 1086669 1080921 1091839 1098548 1060845
14897 1060845 1065796 1089685 1103273 1100347 1096801 1084331 1082590 1111310 1103571 1078952 1051697 1053686
14885 1053686 1052423 1046346 1054727 1046619 1065204 1083776 1082482 1067886 1083929 1093284 1085708 1086769 1081366
14872 1081366 1086853 1066830 1076211 1080157 1085867 1109894 1099088 1070629 1078329 1077761 1076960 1088651 1105212
14859 1105212 1101298 1081235 1091495 1086824 1054125 1095477 1096680 1090769 1084708 1086793 1096129 1075932 1084130
14846 1084130 1089265 1075455 1102512 1094856 1081174 1096477 1093012 1078300 1093618 1085910 1060804 1075527
14834 1075527 1080710 1058236 1065766 1075668 1063480 1088830 1082560 1096230 1078153 1082613 1086868 1080371 1095098
14821 1095098 1115163 1100160 1097446 1091237 1070968 1083641 1103865 1079709 1075747 1070541 1079117 1074503
14809 1074503 1079227 1092155 1082504 1072046 1080040 1067370 1086546 1081823 1084491 1079440 1067147 1060056 1062252
14796 1062252 1062679 1060008 1071743 1078619 1075252 1101243 1114350 1096430 1086930 1087603 1081105 1073490 1083674
14783 1083674 1093845 1119716 1102698 1082254 1082621 1090248 1088039 1080640 1072534 1073840 1099975 1103704 1081827
14770 1081827 1085292 1091225 1112067 1096931 1091774 1113137 1093341 1072447 1090973 1089156 1110329 1120223
14758 1120223 1090952 1079987 1082138 1063438 1078523 1107637 1105331 1117054 1108074 1085851 1085250 1083079
14746 1083079 1090656 1075688 1078606 1078192 1072735 1099156 1093554 1078218 1063065 1076168 1085532 1091532 1087172
14733 1087172 1065227 1062300 1069708 1083360 1099765 1109190 1093252 1070111 1085960 1102953 1092186 1094573
14721 1094573 1092801 1098226 1091473 1077438 1080207 1074023 1096931 1093103 1082713 1109955 1116662 1134402 1100217
14708 1100217 1102197 1080400 1066698 1088022 1069725 1091997 1092095 1095041 1081431 1080748 1101274 1121882 1133616
14695 1133616 1107939 1089715 1104669 1114226 1099907 1105332 1100440 1090014 1108989 1096023 1099455 1096007
14683 1096007 1084690 1113816 1110093 1118091 1119726 1123687 1106443 1086765 1081259 1104674 1110520 1116398 1106944
14670 1106944 1074831 1099706 1082010 1088701 1119102 1112916 1085342 1086094 1117881 1135829 1119385 1103139
14658 1103139 1101160 1103708 1130433 1144602 1100966 1080677 1090921 1079026 1073183 1069623 1103033 1122492
14646 1122492 1099276 1099583 1123180 1121387 1114101 1101585 1117149 1114373 1124463 1117318 1102803 1133845
14634 1133845 1115172 1084869 1087498 1097295 1099699 1106660 1132871 1132758 1116200 1105228 1105161 1096254 1099366
14621 1099366 1102573 1084864 1089701 1099520 1077626 1095349 1087085 1113088 1120544 1134161 1153332 1126478
14609 1126478 1122919 1125881 1103469 1101564 1111302 1098158 1106146 1129958 1132348 1120781 1104625 1095273 1120990
14596 1120990 1109946 1129563 1105340 1100382 1120505 1111263 1133692 1130005 1128244 1114028 1090300 1119154
14584 1119154 1119584 1112590 1123660 1101881 1084946 1101747 1109861 1124568 1132823 1130089 1119870 1106544
14572 1106544 1110019 1115852 1120567 1134882 1132068 1142367 1119845 1134017 1122114 1126430 1108117 1102775
14560 1102775 1111615 1128438 1113478 1103126 1096486 1087724 1093041 1100951 1115977 1132068 1116605 1104290
14548 1104290 1117465 1128257 1121400 1125019 1119577 1084537 1085890 1088526 1115336 1120054 1119666 1115603 1109569
14535 1109569 1103259 1081191 1103989 1085960 1086891 1113349 1135580 1132821 1131712 1118283 1106710 1115600
14523 1115600 1104704 1087319 1101779 1121666 1114472 1128634 1115039 1114332 1110414 1113663 1128219 1117529
14511 1117529 1088565 1102294 1091197 1115796 1135636 1144179 1117144 1092693 1094024 1111152 1118337 1130705
14499 1130705 1139349 1159586 1155624 1124533 1122292 1112522 1108258 1141546 1151234 1166075 1153254 1131387
14487 1131387 1121173 1131600 1149997 1126188 1123749 1122637 1128593 1138817 1120094 1109214 1099983 1111275
14475 1111275 1121629 1114452 1104702 1108089 1104512 1107263 1116139 1115043 1127147 1115442 1091935 1120366 1136796
14462 1136796 1134269 1153487 1154969 1128246 1135317 1147033 1140639 1137191 1114800 1114314 1097565 1117173 1126102
14449 1126102 1121452 1094389 1109878 1118790 1115836 1110376 1123175 1139825 1106516 1120524 1131706 1130249
14437 1130249 1133118 1135497 1128831 1140917 1143199 1120619 1116510 1127291 1126948 1123716 1140838 1163230 1171992
14424 1171992 1168759 1154393 1186339 1174042 1166913 1168258 1169202 1146381 1142997 1134661 1126971 1119106 1129243
14411 1129243 1125401 1110503 1118761 1126517 1121084 1122609 1122065 1134524 1139463 1132271 1134770 1139010 1140240 1150825
14397 1150825 1155277 1141966 1157396 1144474 1176754 1171971 1175084 1175397 1168018 1177785 1185692 1166650 1139881
14384 1139881 1146257 1140663 1160689 1147532 1123918 1157975 1166182 1156011 1142176 1125715 1140101 1168433
14372 1168433 1148677 1151670 1145571 1147146 1150994 1179615 1141017 1115265 1140811 1148748 1143591 1125967
14360 1125967 1149452 1164937 1175553 1174035 1151110 1152692 1161046 1176845 1173162 1165687 1158281 1149625 1144028
14347 1144028 1146321 1157989 1173955 1149265 1123612 1126059 1140255 1153688 1168513 1169608 1159949 1135936
14335 1135936 1118448 1137999 1148998 1159032 1154077 1153114 1153287 1131301 1131280 1160162 1194465 1165037 1138800
14322 1138800 1130186 1133280 1125424 1141989 1158628 1175711 1165280 1142402 1154816 1152697 1146775 1166719
14310 1166719 1177517 1163629 1163853 1131008 1151515 1156471 1143130 1137165 1140460 1148422 1149917 1151899 1154316
14297 1154316 1152828 1151301 1166896 1143236 1158664 1164397 1138881 1154152 1160706 1178451 1163759 1156347
14285 1156347 1156828 1153644 1146044 1149045 1145344 1131547 1131023 1142118 1138260 1155633 1141660 1125519 1132376
14272 1132376 1137751 1141610 1156011 1161664 1164143 1153426 1126915 1134816 1143706 1144532 1134739 1153062 1148922
14259 1148922 1155856 1146001 1138800 1143524 1161531 1162703 1151867 1158996 1162117 1152707 1146360 1137630 1124265
14246 1124265 1140253 1118850 1140883 1161767 1168355 1164578 1154152 1136976 1148974 1132446 1137181 1135115
14234 1135115 1162011 1160310 1156536 1163696 1171358 1149650 1160504 1163241 1139521 1135356 1141420 1141380 1140178
14221 1140178 1149351 1164347 1168599 1152711 1148822 1136398 1149978 1159859 1175347 1162418 1148285 1135568
14209 1135568 1131901 1145849 1160431 1164168 1156842 1173156 1189520 1164291 1133502 1133874 1145637 1158095
14197 1158095 1185262 1167167 1161104 1139918 1144341 1158989 1156541 1141839 1145878 1133022 1131942 1162783
14185 1162783 1156333 1158311 1180872 1191370 1190044 1167460 1147674 1157005 1145420 1158205 1159824 1148379
14173 1148379 1136814 1126520 1149621 1143470 1154445 1153322 1157805 1138446 1153511 1163648 1162602 1165438
14161 1165438 1159692 1170481 1162007 1158171 1151653 1123855 1128890 1158824 1154163 1136107 1172173 1181444 1172818
14148 1172818 1172863 1152554 1180652 1172175 1142431 1157117 1166927 1183074 1191182 1173026 1162675 1181362
14136 1181362 1185511 1161622 1139137 1131715 1149213 1169616 1171691 1181178 1166528 1177068 1193295 1183810
14124 1183810 1169041 1158291 1169353 1171669 1169273 1172609 1187395 1168862 1148768 1162947 1171686 1168994
14112 1168994 1149065 1157787 1170607 1136196 1149897 1167589 1174319 1177368 1180238 1168428 1188138 1194161
14100 1194161 1183869 1183768 1203231 1193006 1188934 1200886 1193805 1187649 1164739 1181709 1194086 1201672
14088 1201672 1211616 1192034 1175923 1178770 1173991 1204069 1218680 1191503 1202187 1197499 1151349 1166199
14076 1166199 1173125 1197966 1191848 1200456 1195664 1187027 1194335 1197247 1193636 1191568 1194113 1200109 1202369 1180614
14062 1180614 1165581 1152849 1165015 1173969 1163139 1162642 1181951 1166073 1180345 1208357 1209023 1174916
14050 1174916 1174060 1190186 1198996 1180080 1159727 1168725 1180879 1198685 1200906 1176482 1164899 1172605
14038 1172605 1184818 1194212 1211753 1192604 1197976 1208238 1212577 1201325 1191411 1194649 1194118 1181230 1186537
14025 1186537 1203474 1190820 1196353 1207834 1222966 1218004 1199911 1208635 1204049 1204623 1193970 1209557
14013 1209557 1197618 1202694 1201261 1179617 1190844 1204675 1214318 1209777 1204628 1192427 1197294 1180322
14001 1180322 1188620 1186489 1193918 1185262 1217279 1204963 1181679 1178085 1206639 1217096 1215283 1208057 1206922
13988 1206922 1193352 1176070 1200312 1193044 1201946 1191189 1185288 1186116 1218507 1200154 1199274 1187624 1202272
13975 1202272 1211189 1195455 1192950 1199424 1204831 1224372 1229133 1207165 1193178 1189434 1185413 1185544 1199563
13962 1199563 1189084 1182906 1202653 1191532 1183583 1193523 1181233 1186712 1178053 1174032 1194085 1203487 1186934
13949 1186934 1186935 1181626 1208510 1204027 1176371 1182264 1191332 1189312 1190209 1199501 1188244 1207587 1194344 1178247
13935 1178247 1173853 1174299 1189821 1208027 1223982 1213291 1205050 1204412 1202477 1205268 1200125 1211352 1209436
13922 1209436 1218427 1219878 1202075 1209934 1220189 1232884 1221141 1218669 1205033 1189363 1192055 1180479
13910 1180479 1199188 1213318 1223803 1212064 1196225 1218301 1231289 1219521 1214029 1207182 1225440 1234871
13898 1234871 1242571 1245795 1220464 1228252 1217867 1226852 1225617 1240388 1223750 1223545 1210853 1215113 1218759
13885 1218759 1221288 1200301 1201810 1213351 1226893 1217334 1224134 1210840 1239564 1211148 1180286 1214059
13873 1214059 1205639 1202121 1197238 1184034 1208362 1224992 1221305 1230221 1215863 1234041 1238993 1224242
13861 1224242 1204688 1216606 1211871 1226021 1232914 1254424 1245329 1225645 1238604 1226963 1232607 1213461
13849 1213461 1227242 1198651 1208083 1228924 1223555 1229189 1224063 1207174 1217226 1239967 1228612 1243677
13837 1243677 1237366 1238565 1250497 1247919 1223524 1203643 1213702 1210306 1219648 1217567 1194259 1219570
13825 1219570 1217672 1198587 1207679 1209390 1212277 1208393 1220880 1224413 1212555 1227560 1222581 1221781 1216155
13812 1216155 1235098 1236595 1220979 1209690 1215950 1202904 1203842 1193631 1220658 1224646 1223904 1227972 1228186
13799 1228186 1234127 1229859 1196511 1225947 1220019 1224287 1227693 1233467 1221215 1225379 1210635 1190037 1188722
13786 1188722 1204880 1232483 1219505 1214634 1213708 1228750 1239199 1211319 1199971 1179694 1193750 1216335
13774 1216335 1213941 1231481 1250654 1250106 1232811 1228043 1235752 1225848 1213417 1216469 1199782 1213051 1226219
13761 1226219 1205881 1208178 1222002 1203602 1205415 1215181 1211964 1205851 1240754 1245761 1240474 1220706 1221545
13748 1221545 1225588 1217625 1209122 1221345 1235043 1240135 1211016 1225598 1234142 1249818 1243610 1233857 1239149
13735 1239149 1253328 1248593 1239706 1224957 1225911 1236252 1226794 1253112 1267016 1262365 1252041 1248235 1259852
13722 1259852 1264081 1246320 1252254 1237665 1243886 1237328 1229683 1236237 1235631 1213807 1215212 1263046 1265738
13709 1265738 1263982 1252190 1254363 1254884 1226588 1226637 1270611 1262916 1216305 1212492 1223420 1234796 1238822
13696 1238822 1220109 1225479 1240787 1244408 1242629 1244976 1260515 1244149 1241542 1249061 1248451 1237595 1246801
13683 1246801 1234226 1214964 1242930 1262901 1254388 1272689 1241894 1229948 1229083 1221180 1229626 1213249
13671 1213249 1242074 1242316 1241323 1228694 1261954 1242880 1242448 1202853 1206647 1226957 1226675 1233622 1257174
$$ [...]
##END NTUPLES=NMR SPECTRUM
##END=
