##TITLE=1H_EC-3255(II)
 CDCl3, 8 sc, 
 26.07.2021
##JCAMPDX= 6.0         $$ Bruker NMR JCAMP-DX V2.0
##DATA TYPE= NMR SPECTRUM
##DATA CLASS= NTUPLES
##ORIGIN= UXNMR, Bruker Analytische Messtechnik GmbH
##OWNER= root
$$ XWIN-NMR		Version 3.5
$$ Mon Jul 26 08:48:59 2021 Russian Standard Time (UT+4h)  she@DPX200
##.OBSERVE FREQUENCY= 200.131506
##.OBSERVE NUCLEUS= ^1H
##.ACQUISITION MODE= SIMULTANEOUS
##.ACQUISITION SCHEME= undefined
##.AVERAGES= 8
##.DIGITISER RES= 18
##SPECTROMETER/DATA SYSTEM= spect
##.PULSE SEQUENCE= zg30
##.SOLVENT NAME= CDCl3
##.SHIFT REFERENCE= (INTERNAL, CDCl3, 0, 17.4995)
##AUDIT TRAIL= $$ (NUMBER, WHEN, WHO, WHERE, WHAT)
$$ ##TITLE= Audit trail, XWIN-NMR		Version 3.5
$$ ##JCAMPDX= 5.01
$$ ##ORIGIN= Bruker BioSpin GmbH
$$ ##OWNER= she
$$ F:/spectra/data/she/nmr/H-F/1/pdata/1/auditp.txt
$$ ##AUDIT TRAIL=  $$ (NUMBER, WHEN, WHO, WHERE, WHAT)
(   1,<2021-07-26 08:47:18.85 +0400>,<she>,<DPX200>,
      <created by zg, POWCHK disabled, PULCHK disabled
       configuration hash MD5:
       00 E9 B6 7A A2 85 ED C7 34 08 36 98 17 FE 4E 26
       data hash MD5: 16K
       11 E8 DA D1 1F AF 92 49 E1 8F 7C E8 07 35 66 A7>)
(   2,<2021-07-26 08:47:21.85 +0400>,<she>,<DPX200>,
      <Start of raw data processing
       efp BC_mod = 2 LB = 0.24 FT_mod = 6 PKNL = 1 PHC0 = -12274.31 PHC1 = 10.80099 SI = 16K 
       data hash MD5: 16K
       CE AC A5 42 57 30 32 96 A2 1D 52 1D EB 77 F5 C6>)
(   3,<2021-07-26 08:47:44.09 +0400>,<she>,<DPX200>,
      <pk PHC0 = -2.266219 PHC1 = 3.2 
       data hash MD5: 16K
       0D 7D 6A 3E 79 9A F7 0B C7 85 4E BF F0 8C 83 E8>)
(   4,<2021-07-26 08:47:47.90 +0400>,<she>,<DPX200>,
      <abs ABSG = 5 
       data hash MD5: 16K
       74 25 68 91 53 19 58 7C 67 16 FC EA EE EA C7 76>)
$$ ##END=
$$ 
$$ hash MD5
$$ E7 21 49 45 A7 4A 1B D4 98 2D 5F 7F 42 AC 91 64
##$RELAX= 
##$RELAX= 
##$RELAX= 
##$RELAX= 
##$RELAX= 
##$RELAX= 
$$ Bruker specific parameters
$$ --------------------------
##$DU= <F:/spectra>
##$EXPNO= 1
##$NAME= <H-F>
##$PROCNO= 1
##$TYPE= <nmr>
##$USER= <she>
##$AMP= (0..31)
100 100 100 100 100 100 100 100 100 100 100 100 100 100 100 100 100 100 
100 100 100 100 100 100 100 100 100 100 100 100 100 100 
##$AQSEQ= 0
##$AQ_mod= 1
##$AUNM= <au_zg>
##$AUTOPOS= <>
##$BF1= 200.13
##$BF2= 200.13
##$BF3= 200.13
##$BF4= 200.13
##$BF5= 200.13
##$BF6= 200.13
##$BF7= 200.13
##$BF8= 200.13
##$BYTORDA= 1
##$CFDGTYP= 0
##$CFRGTYP= 5
##$CHEMSTR= <none>
##$CNST= (0..31)
1 1 145 1 1 1 1 1 1 1 1 1 1 1 1 1 1 1 1 1 1 1 1 1 1 1 1 1 1 1 1 1 
##$CPDPRG= <>
##$CPDPRG1= <>
##$CPDPRG2= <>
##$CPDPRG3= <>
##$CPDPRG4= <mlev>
##$CPDPRG5= <mlev>
##$CPDPRG6= <mlev>
##$CPDPRG7= <mlev>
##$CPDPRG8= <mlev>
##$CPDPRGB= <>
##$CPDPRGT= <>
##$D= (0..31)
0 1.2 0 0 0 0 0 0 0 0.06 0 0.03 0 0 0 0 0.0002 0 0 0 0 0 0 0 0 0 0 0 0 
0 0 0 
##$DATE= 1627274838
##$DBL= (0..7)
120 120 120 120 120 120 120 120 
##$DBP= (0..7)
150 150 150 150 150 150 150 150 
##$DBP07= 0
##$DBPNAM0= <>
##$DBPNAM1= <>
##$DBPNAM2= <>
##$DBPNAM3= <>
##$DBPNAM4= <>
$$ [...]
##$SUBNAM3= <"">
##$SUBNAM4= <"">
##$SUBNAM5= <"">
##$SUBNAM6= <"">
##$SUBNAM7= <"">
##$SUBNAM8= <"">
##$SUBNAM9= <"">
##$SW= 20.0188882624521
##$SWIBOX= (0..15)
0 0 2 0 0 0 0 0 0 0 0 0 0 0 0 0 
##$SW_h= 4006.41025641026
##$TD= 16384
##$TD0= 1
##$TE= 0
##$TE2= 300
##$TE3= 300
##$TEG= 300
##$TL= (0..7)
0 120 120 120 120 120 120 120 
##$TP= (0..7)
150 150 150 150 150 150 150 150 
##$TP07= 0
##$TPNAME0= <>
##$TPNAME1= <>
##$TPNAME2= <>
##$TPNAME3= <>
##$TPNAME4= <>
##$TPNAME5= <>
##$TPNAME6= <>
##$TPNAME7= <>
##$TPOAL= (0..7)
0.5 0.5 0.5 0.5 0.5 0.5 0.5 0.5 
##$TPOFFS= (0..7)
0 0 0 0 0 0 0 0 
##$TUNHIN= 0
##$TUNHOUT= 0
##$TUNXOUT= 0
##$USERA1= <user>
##$USERA2= <user>
##$USERA3= <user>
##$USERA4= <user>
##$USERA5= <user>
##$V9= 5
##$VALIST= <valist>
##$VCLIST= <CCCCCCCCCCCCCCC>
##$VD= 0
##$VDLIST= <DDDDDDDDDDDDDDD>
##$VPLIST= <PPPPPPPPPPPPPPP>
##$VTLIST= <TTTTTTTTTTTTTTT>
##$WBST= 1024
##$WBSW= 4
##$XGAIN= (0..3)
0 0 0 0 
##$XL= 0
##$YL= 0
##$YMAX_a= 158041
##$YMIN_a= -233527
##$ZGOPTNS= <>
##$ZL1= 120
##$ZL2= 120
##$ZL3= 120
##$ZL4= 120
##$ABSF1= 17.49833
##$ABSF2= -2.520708
##$ABSG= 5
##$ABSL= 3
##$ALPHA= 0
##$AQORDER= 0
##$ASSFAC= 0
##$ASSFACI= 0
##$ASSFACX= 0
##$ASSWID= 0
##$AUNMP= <proc_1d>
##$AZFE= 0.1
##$AZFW= 0.1
##$BCFW= 0
##$BC_mod= 2
##$BYTORDP= 0
##$COROFFS= 0
##$CY= -3
##$DATMOD= 1
##$DC= 0
##$DFILT= <>
##$DTYPP= 0
##$F1P= 0
##$F2P= 0
##$FCOR= 1
##$FTSIZE= 16384
##$FT_mod= 6
##$GAMMA= 0
##$GB= 0
##$INTBC= 1
##$INTSCL= 1.334414e-10
##$ISEN= 128
##$LB= 0.24
##$LEV0= 0
##$LPBIN= 0
##$MAXI= 10000
##$MC2= 0
##$MEAN= 0
##$ME_mod= 0
##$MI= 1.114404
##$NCOEF= 0
##$NC_proc= -5
##$NLEV= 6
##$NOISF1= 3.799351
##$NOISF2= 2.8
##$NSP= 0
##$NTH_PI= 0
##$NZP= 0
##$OFFSET= 17.49955
##$PC= 1
##$PHC0= -12276.58
##$PHC1= 14.00099
##$PH_mod= 1
##$PKNL= yes
##$PPARMOD= 0
##$PSCAL= 0
##$PSIGN= 0
##$REVERSE= no
##$SF= 200.13000701874
##$SI= 16384
##$SIGF1= 3
##$SIGF2= 2
##$SINO= 5.538805
##$SIOLD= 16384
##$SREGLST= <1H.CDCl3>
##$SSB= 0
##$STSI= 16384
##$STSR= 0
##$SW_p= 4006.41025641026
##$SYMM= 0
##$S_DEV= 0
##$TDeff= 16384
##$TDoff= 0
##$TI= <>
##$TILT= no
##$TM1= 0
##$TM2= 0
##$TOPLEV= 0
##$USERP1= <user>
##$USERP2= <user>
##$USERP3= <user>
##$USERP4= <user>
##$USERP5= <user>
##$WDW= 1
##$XDIM= 16384
##$YMAX_p= 279601002
##$YMIN_p= -184826
$$ End of Bruker specific parameters
$$ ---------------------------------
##NTUPLES= NMR SPECTRUM
##VAR_NAME=  FREQUENCY,     SPECTRUM/REAL,   SPECTRUM/IMAG
##SYMBOL=    X,             R,               I
##VAR_TYPE=  INDEPENDENT,   DEPENDENT,       DEPENDENT
##VAR_FORM=  AFFN,          ASDF,            ASDF
##VAR_DIM=   16384,         16384,           16384
##UNITS=     HZ,            ARBITRARY UNITS, ARBITRARY UNITS
##FACTOR=    0.24454680195387, 1,            1
##FIRST=     3502.18503745187, 0,            0
##LAST=      -504.225218958394, 0,           0
##MIN=       -504.225218958394, -184826,     0
##MAX=       3502.18503745187, 279601002,    0
$$ Real data points
##PAGE= N=1
##DATA TABLE= (X++(R..R)), XYDATA
$$ [...]
$$ plain form
11452 -12969 -35914 -4379 -29489 -76450 -109757 -112005 -107636 -93970 -43374 10981 27808 -42612
11440 -42612 -12029 -31428 -49812 1741 24614 28917 -33281 -28319 -5814 -37665 697 18714
11428 18714 -5768 -5384 18968 18704 -11694 4149 39202 23020 5303 -13933 -9784 -10226 -39106
11415 -39106 -46677 -25021 -7802 -67436 -67785 -23095 -76618 -75837 -45565 -8973 -13975 -14092 -6868
11402 -6868 -58931 -62988 1548 51220 36674 50509 -2010 3836 1715 20663 27528 -8101 -47900
11389 -47900 -27828 9766 40788 -7544 -24841 171 -18987 -2103 -17224 -9239 -62507 -12759
11377 -12759 -29323 -35748 -49606 -51841 -31125 -18523 -27426 14516 2104 30265 -17512 -51081
11365 -51081 -96079 -21692 7384 -29674 7100 1423 14210 13183 4922 -32552 -22856 -58931
$$ packed form
11452a2969k2945L1535k5110m6961l3307k248M369J3666N0596N4355J6827p0420
11440d2612L0583j9399j8384N1553K2873M303o2198M962K2505l1851L8362J8017
11428A8714k4482L84K4352k64l0398J5843L5053j6182j7717j9236M149m42k8880
11415c9106p571K1656J7219n9634l49M4690n3523P81L0272L6592n002j17P224
11402f868n2063m057O4536M9672j4546J3835n2519N846k121J8948O865l5629l9799
11389d7900K0072L7594L1022m8332j7297K5012j9158J6884j5121P985n3268M9748
11377a2759j6564o425j3858k235K0716J2602q903M1942j2412K8161m7777l3569
11365e1081m4998P4387K9076l7058L6774n677J2787j027q261l7474R696l6075
$$ plain form
11353 -58931 -57319 -90315 -105857 -66131 -2712 2042 -32678 -58356 -33400 -39812 -36303 -17500
11341 -17500 -43260 62302 7043 20383 -42727 -39874 13764 59616 28279 -47118 -61906 -70342
11329 -70342 -19040 -54084 -54768 -3608 9927 -20242 -64500 -30226 -23099 -47395 -29614 16904
11317 16904 10311 40564 50888 63941 54714 -45518 -16280 -9741 3325 -7491 -34109 -9544
11305 -9544 45662 -6252 -61847 -6731 16426 -16653 -5373 17220 -10325 -15812 -6167 -17684
11293 -17684 -24815 -87235 -95481 -31590 17537 -21519 -27563 7335 -32402 -8643 -72251 -51210
11281 -51210 9765 2198 -188 -13545 -34649 -9159 -15186 -69707 -51875 -14152 -22907 -51608
11269 -51608 -53498 -41906 -25594 -18557 -18537 44401 30055 12010 -42755 -106790 -35146 -72812 -35804
$$ packed form
11353e8931J612l2996j5542L9726O3419M754l4720k5678K4956o412L509J8803
11341a7500k5760J05562n5259J3340o3110K853N3638M5852l1337p5397j4788q436
11329g0342N1302l5044o84N1160J3535l0169m4258L4274P127k4296J7781M6518
11317A6904o593L0253J0324J3053r227j00232K9238O539J3066j0816k6618K4565
11305i544N5206n1914n5595N5116K3157l3079J1280K2593k7545n487R645j1517
11293a7684p131o2420q246O3891M9127l9056o044L4898l9737K3759o3608K1041
11281e1210O0975p567k386j3357k1104K5490o027n4521J7832L7723q755k8701
11269e1608j890J1592J6312P037K0O2938j4346j8045n4765o4035P1644l7666L7008
$$ plain form
11256 -35804 18958 -6006 -25647 14786 3081 11645 -37525 -56778 -14803 -17348 -17389 162 -42365
11243 -42365 -14677 -23163 -90962 -19287 39033 -31774 -11229 -56119 13074 3112 -32254 -95775
11231 -95775 -41241 -5413 -28225 -12511 -33646 -18600 -45013 -48381 -88424 -63139 -13038 30278
11219 30278 11869 -17465 28172 -1539 -11577 -70479 -55097 -70414 -400 -2747 10647 -13255
11207 -13255 -16645 -35721 -19008 11867 -44059 -10468 -6510 4669 -89207 -57737 6688 61639
11195 61639 74438 47600 -5396 -15981 -88411 -45824 -30157 -40680 -49767 -7993 -2862 -57773
11183 -57773 -76188 -59938 -85323 -34149 -37804 10862 61806 17698 -22240 -28103 -41680 8912
11171 8912 9102 -61669 -6806 12749 -35615 -29466 12712 11506 1001 -15540 -18272 29236 11906
$$ packed form
11256c5804N4762k4964j9641M0433j1705Q564m9170j9253M1975k545m1J7551m2527
11243d2365K7688q486o7799P1675N8320p0807K0545m4890O9193r962l5366o3521
11231i5775N4534L5828k2812J5714k1135J5046k6413l368m0043K5285N0101M3316
11219C0278j8409k9334M5637k9711j0038n8902J5382j5317P0014k347J3394k3902
11207a3255l390j9076J6713L0875n5926L3591L958J1179r3876L1470O4425N4951
11195F1639J2799k6838n2996j0585p2430M2587J5667j0523r087M1774N131n4911
11183e7773j8415J6250k5385N1174l655M8666N0944m4108l9938n863j3577N0592
11171H912J90p0771N4863J9555m8364O149M2178j206j0505j6541k732M7508j7330
$$ plain form
11158 11906 6782 -46275 -47169 23331 -9808 21181 24875 -14284 -20551 6613 -22474 -10400 -37297
11145 -37297 -44946 8845 22491 5756 29436 -17909 4793 -12665 11 255 -41055 55599
11133 55599 -9079 -62218 -15453 -9251 37572 -11647 -113846 -58509 -71322 -34636 -43722 -64574
11121 -64574 -44467 -37997 -24571 14135 -38446 -29091 -110680 -49115 -11953 23613 70701 57203
11109 57203 -11730 -27468 7096 66917 74322 81746 63535 40960 19292 -16066 -35359 -40226
11097 -40226 -54829 -79532 -109925 -63770 -2159 -58175 -11041 -19086 -56021 3904 15549 -19729
11085 -19729 1842 -48615 -31704 -92566 -70152 -71255 -85355 -34398 -29523 -11971 7428 13831
11073 13831 -5302 -27579 -20373 -38820 -31980 -15279 -16031 -17607 -18923 -60650 -7639 374 -44762
$$ packed form
11158A1906n124n3057q94P0500l3139L0989L694l9159o267K7164k9087J2074k6897
11145c7297p649N3791J3646j6735K3680m7345K2702j7458J2676K44m1310R6654
11133E5599o4678n3139M6765O202M6823m9219j02199N5337j2813L6686r086k0852
11121f4574K0107O470J3426L8706n2581R355q1589O1565L7162L5566M7088j3498
11109E7203o8933j5738L4564N9821P405P424j8211k2575k1668l5358j9293m867
11097d0226j4603k4703l0393M6155O1611n6016M7134q045l6935N9925J1645l5278
11085a9729K1571n0457J6911o0862K2414j103j4100N0957M875J7552J9399O403
11073A3831j9133k2277P206j8447O840J6701p52j576j316m1727N3011Q013m5136
$$ plain form
11060 -44762 -34454 13182 -2157 -32381 11492 44790 15620 17756 -14286 -59808 -49812 -12288
11048 -12288 908 5716 -25269 47720 23601 -38099 -35232 -27882 -42999 -9966 54142 43254
11036 43254 -3389 -63397 -56535 -12533 -51481 -60178 -6183 -8143 -34504 -27379 10155 13158 -4477
11023 -4477 53510 51509 29649 38230 41009 20866 -9844 -65593 -45532 -37041 -50970 -61573 -1833
11010 -1833 -24970 -76945 18695 19592 -67691 -62191 -20109 -32723 -31380 -48292 -17288 36490 -10012
10997 -10012 -15928 16805 8062 18854 16077 29937 27821 39234 41104 48208 -8200 -26134 8996
10984 8996 -12320 -64705 -33463 -18169 -12612 -53087 -59421 -36222 -57749 -51158 -61520 -143
10972 -143 -24606 -93371 -62636 -29233 -3234 8858 30554 30276 26012 -26819 -63490 -39289 -25645
$$ packed form
11060d4762J0308M7636j5339l0224M3873L3298k9170K136l2042m5522R996L7524
11048a2288J3196M808l0985P2989k4119o1700K867P350j5117L3033O4108j0888
11036D3254m6643o0008O862M4002l8948q697N3995j960k6361P125L7534L003j7635
11023d477N7987k001k1860Q581K779k0143l0710n5749K0061Q491j3929j0603N9740
11010a833k3137n1975R5640Q97q7283N500M2082j2614J343j6912L1004N3778m6502
10997a0012n916L2733q743J0792k777J3860k116J1413J870P104n6408j7934L5130
10984H996k1316n2385L1242J5294N557m0475o334K3199k1527O591j0362O1377
10972a43k4463o8765L0735L3403K5999J2092K1696k78m264n2831l6671K4201J3644
$$ plain form
10959 -25645 -34628 6293 -16620 -22542 -24755 -22488 -47427 -46761 -38293 -13540 -14177 -2536 -16856
10946 -16856 -34059 -47967 -33935 51819 33022 -27914 -27919 -57440 -105623 -86285 -54389 -36868
10934 -36868 -68919 -30691 -31317 -7709 -34721 34545 53501 -7819 -30847 -273 72219 37250
10922 37250 18465 17536 -25604 -22512 20546 11072 50031 2190 -48696 -9570 15084 -56622
10910 -56622 17699 -7870 -24944 6622 -56458 2342 -4977 17423 13713 2241 37504 9284
10898 9284 24843 27088 17665 -75125 -57010 -73179 -23661 14945 -18521 -33632 -51029 -56466
10886 -56466 -41706 -20612 -11156 -4857 -379 -15787 -38235 -47905 -48302 -11484 -50429 -71101 -30646
10873 -30646 14566 17432 31601 23246 -10783 4300 32817 46027 45744 33980 28546 2282 955
$$ packed form
10959b5645q983M0921k2913n922k213K267k4939O66Q468K4753o37J1641j4320
10946a6856j7203j3908J4032Q5754j8797o0936nk9521m8183J9338L1896J7521
10934c6868l2051L8228o26K3608k7012O9266J8956o1320k3028L0574P2492l4969
10922C7250j8785r29m3140L092M3058r474L8959m7841n0886L9126K4654p1706
10910e6622P4321k5569j7074L1566o3080N8800p319K2400l710j1472L5263k8220
10898I284J5559K245r423r2790J8115j6169M9518L8606l3466j5111j7397n437
10886e6466J4760K1094R456O299M478j5408k2448r670l97L6818l8945k0672M0455
10873c0646M5212K866J4169q355l4029J5083K8517J3210k83j1764n434k6264j327
$$ plain form
10860 955 31138 51814 35432 30665 -376 -51040 -23980 5280 11385 19084 -12383 -42801 -74475
10847 -74475 -34841 -33791 -46752 -84540 -84261 -21946 47888 20902 -2188 -29108 -75199 -33586
10835 -33586 40301 26707 -142 43257 72352 42459 4752 -48072 -65071 -46897 -25199 -77416
10823 -77416 -40570 -73022 -110026 -56198 -40037 1120 -19881 -42544 -41570 -45516 -19036 -15195
10811 -15195 -1550 -30992 -9017 32883 35137 -24124 -21405 -46965 -23798 -21841 6848 3054
10799 3054 -55795 -9992 -10176 -24246 -40617 -73739 -20703 24049 -16135 -6241 -48624 -74980
10787 -74980 -84872 -40167 -83996 -74216 -32368 -36518 -49888 -31821 -44966 -65478 -27996 -37858
10775 -37858 8037 31233 -28240 -7074 -8816 7204 -7360 -4033 12935 -13597 -52968 -36707
$$ packed form
10860I55L0183K0676j6382m767l1041n0664K7060K9260O105P699l1467l0418l1674
10847g4475L9634J050j2961l7788K79O2315O9834k6986k3090k6920m6091M1613
10835c3586P3887j3594k6849M3399K9095k9893l7707n2824j6999J8174K1698n2217
10823g7416L6846l2452l7004N3828J6161M1157k1001k2663R74l946K6480L841
10811a5195J3645k9442K1975M1900K254n9261K719k5560K3167J957K8689l794
10799C054n8849M5803j84j4070j6371l3122N3036M4752m0184R894m2383k6356
10787g4980r892M4705m3829R780M1848m150j3370J8067j3145k0512L7482r862
10775c7858M5895K3196n9473K1166j742J6020j4564L327J6968k6532l9371J6261
$$ plain form
10763 -36707 -27483 -39663 -17230 -16344 -37272 -55605 -8042 29694 30423 -54247 -55282 -64987 -84329
10750 -84329 -49921 -37370 -53455 -72142 -27592 24165 -2487 -12480 -22353 16749 15427 -52226
10738 -52226 -27166 -34237 -27164 -67630 -36094 -49396 -8105 -18144 -7758 3220 -37959 -117482
10726 -117482 -64463 -47450 -43732 -37726 -54557 4862 -43708 -57438 -265 -10873 -74464 -31242
10714 -31242 6608 10700 12402 1874 -18378 1405 -4996 -37966 -25916 -21078 -33515 -26967 -14538
10701 -14538 38789 27216 872 32155 35119 55893 53784 8326 -62884 -90760 -33794 -43970
10689 -43970 -51718 -44926 -2367 -85976 -104755 -60219 -23660 -41728 -35583 -58147 -75981 -14260
10677 -14260 -102050 -78756 -15859 -10966 -37669 -20075 7428 5330 -24652 -8023 31289 -27997
$$ packed form
10763c6707R224j2180K2433Q86k0928j8333M7563L7736P29q4670j035r705j9342
10750h4329L4408J2551j6085j8687M4550N1757k6652r993r873L9102j322o7653
10738e2226K5060p071P073m0466L1536j3302M1291j0039J0386J0978m1179p9523
10726a17482N3019J7013L718O006j6831N9419m8570j3730N7173j0608o3591M3222
10714c1242L7850M092J702j0528k0252J9783o401l2970J2050M838j2437O548J2429
10701a4538N3327j1573k6344L1283K964K0774k109m5458p1210k7876N6966j0176
10689d3970p748O792M2559q3609j8779M4536L6559j8068O145k2564j7834O1721
10677a4260q7790K3294O2897M893k6703J7594K7503k098k9982J6629L9312n9286
$$ plain form
10665 -27997 -29280 28469 -16643 39820 -4902 -30949 -30076 -62609 -27179 -16212 -21003 -28249 -68282
10652 -68282 -60036 -36425 -42233 -7537 -26985 -64375 -42771 -18716 -19216 9939 -18061 -70762
10640 -70762 -65565 -59044 -14515 54877 -12831 29471 28695 -3518 -93317 -93845 -33983 7408 19891
10627 19891 47049 2157 4549 -24469 15706 39457 -56574 -32821 -57568 -31996 -7083 17741
10615 17741 -31921 -72845 -24677 -9386 -9675 -31714 67547 17100 9073 31328 -20373 -55344
10603 -55344 -36795 -47106 -25778 -30845 -45764 -43783 -68146 -86455 -15361 39622 -39366 -36950
10591 -36950 -24077 34705 12009 -60057 -104097 -40916 -75993 -50109 -40389 7773 10172 19472
10579 19472 3027 40128 -6722 -18563 17179 48434 13054 49932 28933 25566 89833 67947
$$ packed form
10665b7997j283N7749m5112N6463m4722k6047Q73l2533L5430J0967m791p246m0033
10652f8282Q246K3611n808L4696j9448l7390K1604K4055n00K9155k8000n2701
10640g0762N197O521M4529O9392o7708M2302p76l2213q9799n28N9862M1391J2483
10627A9891K7158m4892K392k9018M0175K3751r6031K3753k4747K5572K4913K4824
10615A7741m9662m0924M8168J5291k89k2039R9261n0447q027K2255n1701l4971
10603e5344J8549j0311K1328n067j4919J981k4363j8309P1094N4983p8988K416
10591c6950J2873N8782k2696p2066m4040O3181l5077K5884R720M8162K399R300
10579A9472j6445L7101m6850j1841L5742L1255l5380L6878k0999l367O4267k1886
$$ plain form
10567 67947 3882 4550 7290 -38835 4745 4498 44743 42168 -364 -1375 80196 37259 19092
10554 19092 -4833 -50144 -45182 -50379 -81198 -36834 79950 72213 66087 12674 1518 -16797
10542 -16797 -9261 58733 16374 45729 60117 32411 29262 -28901 -101466 -30986 21244 23282
10530 23282 416 14463 -588 -2046 -48123 -28072 -15588 -32934 -44555 31655 67031 18444
10518 18444 6136 46132 29105 -37487 7487 39675 84909 34382 -26589 -42156 -8526 18219
10506 18219 -58097 -89866 -71509 -10077 -21188 12259 12191 -15358 -10603 -70220 -62882 -65777 -3454
10493 -3454 -14663 3586 -29108 -13633 10005 22814 7774 37612 15911 -34246 36533 1938
10481 1938 -14363 12813 -4723 -18143 53255 74222 68445 46546 69336 46527 56835 -9507
$$ packed form
10567F7947o4065O68K740m6125M3580k47M0245k575m2532j011Q1571m2937j8167
10554A9092k3925m5311M962n197l0819M4364J16784p737o126n3413j1156j8315
10542a6797P536O7994m2359K9355J4388k7706l149n8163p2565P0480N2230K038
10530B3282k2866J4047j5051j458m6077K0051J2484j7346j1621P6210L5376m8587
10518A8444j2308L9996j7027o6592M4974L2188M5234n0527o0971j5567L3630K6745
10506A8219p6316l1769J8357O1432j1111L3447o8k7549M755n9617P338k895O2323
10493c454j1209J8249l2694J5475K3638J2809j5040K9838k1701n0157P0779l4595
10481A938j6301K7176j7536j3420P1398K0967n777k1899K2790k2809J0308o6342
$$ plain form
10469 -9507 -2161 -4531 34116 26033 45438 79997 39985 64602 60172 50886 27172 37456 -314
10456 -314 -9849 7042 24702 2666 43240 39823 43884 67816 73203 52343 3339 -7391 53615
10443 53615 41165 47461 32199 -1866 -15714 -19611 -7218 -26408 58909 31349 -28984 -54060
10431 -54060 -57205 -38449 -18869 36601 15561 -2117 63125 7435 -38115 8350 12285 -26502
10419 -26502 -33471 5178 7129 -7877 20322 69048 54926 33896 28006 12608 43040 28294
10407 28294 -14008 21511 -12001 -2711 -18553 -34809 19422 52852 -2635 -6343 14434 -32287
10395 -32287 16379 35282 32796 33321 57697 63386 28104 19277 1353 10452 -1389 -23550 -10960
10382 -10960 -15084 29986 59387 23632 56401 78980 20939 -32341 -37214 -1008 28568 -20613
$$ packed form
10469i507P346k370L8647q083J9405L4559m0012K4617m430r286k3714J0284l7770
10456c14r535J6891J7660k2036M0574l417M061K3932N387k0860m9004j0730O1006
10443E3615j2450O296j5262l4065j3848l897J2393j9190Q5317k7560o0333k5076
10431e4060l145J8756J9580N5470k1040j7678O5242n5690m5550M6465L935l8787
10419b6502o969L8649J951j5006K8199M8726j4122k1030n890j5398L0432j4746
10407B8294m2302L5519l3512R290j5842j6256N4231L3430n5487l708K0777m6721
10395c2287M8666J8903k486N25K4376N689l5282q827j7924R099j1841k2161J2590
10382a0960m124M5070K9401l5755L2769K2579n8041n3280m873L6206K9576m9181
$$ plain form
10370 -20613 -40939 4227 20015 29204 -27571 -60198 -972 21078 3096 11909 53182 15706
10358 15706 -20062 -27454 18105 -8499 3906 -10943 -2434 -36157 -39473 -1803 29744 -28232
10346 -28232 -11978 12248 20127 -6762 -17963 -7309 -90087 -39502 -16369 -36971 -75570 -26613
10334 -26613 -23223 -80104 -46499 21240 20488 22417 8245 19716 17196 41035 35127 35653 -16954
10321 -16954 -5730 31876 29688 8404 -33133 -14994 -45558 -34568 -25431 -89793 -62770 -68148
10309 -68148 -47797 -64341 -5714 26070 11711 -24590 -3176 -34796 -18672 -15201 -34611 -2185
10297 -2185 -6110 -5642 -38109 -12106 29301 75821 -4206 -3912 -33055 18512 11919 -7452 -53436
10284 -53436 -92966 -3691 13521 50414 72886 33388 28461 52195 -38208 -59325 -41360 -34019
$$ packed form
10370b0613k0326M5166J5788R189n6775l2627N9226K2050j7982Q813M1273l7476
10358A5706l5768p392M5559k6604J2405j4849Q509l3723l316L7670L1547n7976
10346b8232J6254K4226P879k6889j1201J0654q2778N0585K3133k0602l8599M8957
10334b6613L390n6881L3605O7739p52J929j4172J1471k520K3839n908N26n2607
10321a6954J1224L7606k188k1284m1537J8139l0564J0990R137o4362K7023n378
10309f8148K0351j6544N8627L1784j4359l6301K1414l1620J6124L471j9410L2426
10297b185l925M68l2467K6003M1407M6520q0027K94k9143N1567o593j9371m5984
10284e3436l9530Q9275J7212L6893K2472l9498m927K3734r0403k1117J7965P341
$$ plain form
10272 -34019 -22092 2160 -7417 48200 9782 26922 41579 44063 8921 -31655 -10354 -27648
10260 -27648 5025 36325 -4011 20411 -28749 -77447 -103214 -105221 -85614 -58149 -72536 -83588
10248 -83588 -47796 -33871 -41428 -10060 45857 -14469 48273 -1005 9393 -34813 -65190 -64554
10236 -64554 -57242 -9660 25180 -8616 -34299 -22178 18336 26564 51195 39220 6551 2599
10224 2599 -39513 -22171 -2666 43233 5010 -25110 -37972 -45019 20295 -52390 17924 32162
10212 32162 -9623 -2721 -3750 -13844 -36237 9418 50863 -19169 8573 -16082 -34824 6778
10200 6778 -11445 -2911 27613 54197 9607 4890 6438 -15164 -13823 13135 11795 -34155 -59952
10187 -59952 -34801 49981 38393 18419 -8030 -33860 -15182 4154 -53282 -54942 -13226 -17464
$$ packed form
10272c4019J1927K4252r577N5617l8418J7140J4657K484l5142m0576K1301j7294
10260b7648L2673L1300m0336K4422m9160m8698k5767k007J9607K7465j4387j1052
10248h3588L5792J3925p557L1368N5917o0326O2742m9278J0398m4206l0377O36
10236f4554P312M7582L4840l3796k5683J2121M0514Q228K4631j1975l2669l952
10224B599m2112J7342J9505M5899l8223l0120j2862p047O5314p2685P0314J4238
10212C2162m1785O902j029j0094k2393M5655M1445p0032K7742k4655j8742M1602
10200F778j8223Q534L0524K6584m4590m717J548k1602J341K6958j340m5950k5797
10187e9952K5151Q4782j1588j9974k6449k5830J8678J9336n7436j660M1716m238
$$ plain form
10175 -17464 35080 24497 -10332 32230 -3954 -61229 -104998 -115595 -70550 -79640 -83924 -70762
10163 -70762 -42394 -42230 -63105 -111985 -62517 -62296 -24939 -33903 -106272 -144261 -141337 -72639 -4968
10150 -4968 15123 55031 13701 55235 58833 -8507 -57553 -80152 -64782 -3553 5925 4952 -46513
10137 -46513 40396 29402 46387 22176 -33627 2284 34265 16041 -42420 17958 -2048 15118
10125 15118 32037 -24972 -34698 -43973 -25672 -58428 -61233 -56549 -30601 30637 31488 44545 24092
10112 24092 16491 -45183 -37348 -9743 56979 73911 50025 -14121 17598 17248 9293 -3102 -35357
10099 -35357 -12648 9164 4247 2692 46201 -19239 -52622 -7218 -38007 -60897 -84337 -30978
10087 -30978 -2187 32801 17222 13313 -29048 -29562 24148 56430 33368 29947 40872 11096
$$ packed form
10175a7464N2544j0583l4829M2562l6184n7275m3769j0597M5045r090m284J3162
10163g0762K8368J64k0875m8880M9468K21L7357q964p2369l7989K924O8698O7671
10150d968K0091L9908m1330M1534L598o7340m9046k2599J5370O1229R478r73n1465
10137d6513Q6909j0994J6985k4211n5803L5911L1981j8224n8461O0378k0006J7166
10125A5118J6919n7009r726r275J8301l2756k805M684K5948O1238Q51J3057k0453
10112B4092p601o1674P835K7605O6722J6932k3886o4146L1719l50p955j2395l2255
10099c5357K2709K1812m917j555M3509o5440l3383M5404l0789k2890k3440N3359
10087c0978K8791L4988j5579l909m2361n14N3710L2282k3062l421J0925k9776
$$ plain form
10075 11096 -58613 -37791 -19918 12702 -20897 -68534 -16270 -11986 29682 9000 -705 -15377
10063 -15377 -10295 -29349 -43781 19828 -13832 -61002 -29241 -66563 -56172 -35184 18280 -34243
10051 -34243 -20713 -23050 11941 -43583 3897 10576 -17581 35594 -3159 -28515 -26420 -2238
10039 -2238 -32588 -58331 -55657 -65571 -87251 -11502 42208 -8366 22378 78019 25090 43234
10027 43234 23977 29619 6755 -1127 6603 -14991 -10379 33915 27199 32711 75379 88219 -10381
10014 -10381 -24065 72462 27796 23849 36674 14669 -40969 -33149 2273 -35306 3172 67351
10002 67351 84501 42707 253 59567 24204 -16185 -118 2556 -73545 -37946 36556 8694
9990 8694 10789 11993 36467 -40162 -13091 -18825 -28373 -13851 -18218 23482 40283 -8846 -11210
$$ packed form
10075A1096o9709K0822J7873L2620l3599m7637N2264M284M1668k0682r705j4672
10063a5377N082j9054j4432O3609l3660m7170L1761l7322J0391K0988N3464n2523
10051c4243J3530k337L4991n5524M7480O679k8157N3175l8753k5356K095K4182
10039b238l0350k5743K674r914k1680P5749N3710n0574L0744N5641n2929J8144
10027D3234j9257N642k2864p882P730k1594M612M4294o716N512M2668J2840r8600
10014a0381j3684R6527m4666l947J2825k2005n5638P820L5422l7579L8478O4179
10002F7351J7150m1794m2454N9314l5363m0389J6067K674p6101L5599P4502k7862
9990H694K095J204K4474p6629K7071n734r548J4522m367M1700J6801m9129k364
$$ plain form
9977 -11210 -2414 -48629 -28982 9406 25870 -11119 -58214 -68502 -31003 -44114 -19653 -49881
9965 -49881 -66303 -55216 -66695 -40334 -8913 -44797 26972 -17225 -72725 -25344 11985 28532
9953 28532 42415 76595 47339 16714 -1169 2908 17478 49636 17238 66394 48359 5958
9941 5958 -15898 -9995 31655 36693 -31488 -54586 -57627 -52728 -41266 -42848 -12144 31152 -5855
9928 -5855 -4877 -21610 -26666 -20946 -20565 -23446 -18067 -10015 -35679 -22733 -53717 -38290 -27998 9635
9914 9635 13114 -26432 -5292 6338 143 21296 8581 -17311 27572 49106 -216 -18206
9902 -18206 -52649 -63223 -16270 -18291 46991 43643 18278 28804 -941 3541 2234 44984 83711
9889 83711 51346 -18206 -45343 -37350 -110767 -55167 4545 -55932 -66043 -50324 -67735 -91856
$$ packed form
9977a1210Q796m6215J9647L8388J6464l6989m7095j0288L7499j3111K4461l0228
9965d9881j6422J1087j1479K6361L1421l5884P1769m4197n5500M7381L7329J6547
9953B8532J3883L4180k9256l0625j7883M077J4570L2158l2398M9156j8035m2401
9941E958k1856N903M1650N038o8181k3098l041M899J1462j582L0704M3296l7007
9928e855R78j6733n056N720L81k881N379Q052k5664J2946l0984J5427J0292L7633
9914I635L479l9546K1140J1630o195K1153j2715k5892M4883K1534m9322j7990
9902a8206l4443j0574M6953k021O5282l348k5365J0526k9745M482j307M2750L8727
9889H3711l2365o9552k7137P993p3417N5600N9712o0477j0111J5719j7411k4121
$$ plain form
9877 -91856 -55723 -112668 -162837 -65587 -24633 -14952 -25939 -24060 -57075 -64593 -108416 -121492
9865 -121492 -46940 -3393 33628 -15987 36312 21006 -7745 -2513 13607 -35150 -22622 41388
9853 41388 -15768 -22495 -5793 4909 23274 1694 -58013 -88642 -25567 -10854 33282 37141
9841 37141 37920 46951 71516 5491 -257 25037 -7117 35300 -13471 -29281 -27485 -46327 -104011
9828 -104011 -74400 -132047 -95547 -48291 -39572 -33955 -30557 50776 39722 -38342 -74390 -3110
9816 -3110 -23265 -20879 -62454 -73966 -63266 12625 -12237 -38656 -7171 -26373 -28423 15089
9804 15089 -53999 -81199 -93963 -47577 -3223 39805 32584 16574 6500 -20559 19615 15595
9792 15595 -10235 25276 31075 -4486 -27342 -11008 35969 -18202 14484 -33261 -23493 -4862
$$ packed form
9877i1856L6133n6945n0169R7250M0954R681j0987J879l3015p518m3823j3076
9865a21492P4552M3547L7021m9615N2299j5306k8751N232J6120m8757J2528O4010
9853D1388n7156o727J6702J0702J8365k1580n9707l0629O3075J4713M4136L859
9841C7141P79R031K4565o6025n748K5294l2154M2417m8771j5810J796j8842n7684
9828a04011K9611n7647L6500M7256Q719N617L398Q1333j1054p8064l6048P1280
9816c110k0155K386m1575j1512J0700P5891k4862k6419L1485j9202k050M3512
9804A5089o9088k7200j2764M6386M4354M3028p221j6010j0074k7059M0174m020
9792A5595k5830L5511N799l5561k2856J6334M6977n4171L2686m7745R768J8631
$$ plain form
9780 -4862 20996 2002 30185 -6280 -14511 -26413 -18600 398 32259 101964 114049 54955
9768 54955 2302 37669 22212 -7619 -3981 23445 49615 -10791 -16289 -17542 -56492 -31694
9756 -31694 -13652 -5445 54849 27339 -28050 -5422 23964 5598 -62960 -42398 -23085 17373
9744 17373 -10250 4527 2346 -4550 29971 61019 116100 69381 51913 32068 1387 6194
9732 6194 26584 36839 62868 40726 139 18028 21814 -37433 -31879 -31477 -19135 -1506 -40559
9719 -40559 -6615 11071 -37114 -41773 -34931 30109 -11990 -23888 -44443 22254 76914 41495
9707 41495 -16301 -41086 -42693 -38827 15503 20356 -13708 7534 18250 15742 -16598 29407 32697
9694 32697 17794 26300 -47005 -65195 -130488 -51577 -14073 30608 -5802 -81542 -46780 -9679
$$ packed form
9780d862K5858j8994K8183l6465q231j1902P813J8998L1861O9705J2085n9094
9768E4955n2653L5367j5457k9831L638K7426K6170o0406n498j253l8950K4798
9756c1694J8042Q207O0294k7510n5389K2628K9386j8366o8558K0562J9313M0458
9744A7373k7623J4777k181o896L4521L1048N5081m6719j7468j9845l0681M807
9732F194K0390J0255K6029k2142m0587J7889L786n9247N554M02J2342J7629l9053
9719d0559L3944J7686m8185m659O842O5040m2099j1898k0555O6697N4660l5419
9707D1495n7796k4785j607L866N4330M853l4064K1242J0716k508l2340M6005L290
9694C2697j4903Q506p3305j8190o5293P8911L7504M4681l6410p5740L4762L7101
$$ plain form
9682 -9679 -11375 10527 12339 -32816 -20659 -21512 -30122 -10966 10298 32612 11295 -13611 -40381
9669 -40381 42972 58217 71691 16058 -17535 -3297 10672 -25705 -28946 -53531 -52545 -55459 -44809
9656 -44809 -11280 20268 37196 -4438 -20139 -45245 -70303 -27272 -65523 -7756 -67532 -66183
9644 -66183 26957 25169 43922 -4249 39541 33498 -10120 -6164 -34228 -37647 -6101 -2101 14512
9631 14512 50256 92074 98349 52250 -146 -17179 -60613 -24455 -28379 -17273 11598 19721
9619 19721 8447 89635 45920 -1919 27417 10336 26933 36372 22794 61289 87509 20895
9607 20895 2551 -2586 -28519 -39129 -30251 -50650 -61243 36896 54323 24344 3461 -5657
9595 -5657 32666 31809 -45307 -20797 -47281 -83412 -16523 12571 34757 10336 -24447 -41006
$$ packed form
9682i679j696K1902J812m5155J2157q53q610J9156K1264K2314k1317k4906k6770
9669d0381Q3353J5245J3474n5633l3593J4238J3969l6377l241k4585R86k914J0650
9656d4809L3529L1548J6928m1634j5701k5106k5058M3031l8251N7767n9776J349
9644f6183R3140j788J8753m8171M3790o043m3618L956k8064l419L1546M000J6613
9631A4512L5744M1818O275m6099n2396j7033m3434L6158l924J1106K8871Q123
9619A9721j1274Q1188m3715m7839K9336j7081J6597R439j3578L8495K6220o6614
9607B0895j8344n137k5933j0610Q878k0399j0593R8139J7427k9979k0883r118
9595e657L8323q57p7116K4510k6484l6131O6889K9094K2186k4421l4783j6559
$$ plain form
9583 -41006 -39956 -24131 12230 -8473 37924 50381 -30907 10068 58960 69636 -66388 -85162
9571 -85162 -36127 4868 -28408 -10462 35120 -18197 9340 33312 69633 54528 15786 21599
9559 21599 58166 -6756 -17686 16931 27349 -19663 15151 21287 -15608 55118 32765 18425
9547 18425 -28051 1353 10106 36922 30518 6728 12442 27561 59324 15333 -11339 16307
9535 16307 3036 14889 21421 2992 -4424 18955 9322 -13187 30222 28701 47324 -5808 -12317
9522 -12317 2051 -4403 16283 59005 31469 62287 31135 22286 23775 5617 -20544 -16989 -24777
9509 -24777 4328 -4006 12659 -3404 33489 42841 -10637 31888 42996 66878 81508 59393
9497 59393 27144 51003 52800 -7529 -15414 -4348 4482 6352 14404 37712 33642 27089 13759
$$ packed form
9583d1006J050J5825L6361k0703M6397J2457q1288M0975M8892J0676j36024j8774
9571h5162M9035M0995l3276J7946M5582n3317K7537K3972L6321j5105l8742N813
9559B1599L6567o4922j0930L4617J0418m7012L4814O136l6895P0726k2353j4340
9547A8425m6476K9404Q753K6816o404k3790N714J5119L1763m3991k6672K7646
9535A6307j3271J1853O532j8429p416K3379r633k2509M3409j521J8623n3132o509
9522a2317J4368o454K0686M2722k7536L0818l1152q849J489j8158k6161L555p788
9509b4777K9105q334J6665j6063L6893R352n3478M2525J1108K3882J4630k2115
9497E9393l2249K3859J797o0329p885J1066Q830J870Q052K3308m070o553j3330
$$ plain form
9484 13759 -7491 -48244 3089 21085 -10773 4240 65707 97540 67819 80679 -12068 -8975
9472 -8975 56702 30252 55457 -876 15674 30114 24851 75769 63152 -8453 63969 25240
9460 25240 -6711 49249 89019 68748 14989 -51005 46100 71721 7732 -32222 -21686 3610
9448 3610 45766 52547 4231 -51793 -35888 -35594 -53457 -3620 11683 72075 63264 3764 32123
9435 32123 26806 868 -17569 59325 24828 -16995 -19990 -5107 16857 -24935 836 -14659
9423 -14659 7390 -16610 -27846 -53804 21254 15668 40658 53619 30879 -7049 57489 10482
9411 10482 22357 43209 -202 -8762 -19213 20667 53653 58326 68326 -907 3427 33091
9399 33091 75788 55117 -14392 27585 39124 3455 -37904 9394 -14639 -53512 -25874 28365
$$ packed form
9484A3759k1250m0753N1333J7996l1858J5013O1467L1833k9721J2860r2747L093
9472h975O5677k6450K5205n6333J6550J4440n263N0918j2617p1605P2422l8729
9460B5240l1951N5960L9770k0271n3759o5994R7105K5621o3989l9954J0536K5296
9448C610M2156O781m8316n6024J5905K94j7863M9837J5303O0392q811n9500K8359
9435C2123n317k5938j8437P6894l4497m1823k995J4883K1964m1792K5771j5495
9423a4659K2049k4000j1236k5958P5058n586K4990J2961k2740l7928O4538m7007
9411A0482J1875K0852m3411q560j0451L9880L2986M673J0000o9233M334K9664
9399C3091M2697k0671o9509M1977J1539l5669m1359M7298k4033l8873K7638N4239
$$ plain form
9387 28365 61211 60460 75202 67647 56863 35223 -6397 -20475 2 30527 22005 29272 79455
9374 79455 85565 35908 47280 16415 666 -14637 -15564 9636 297 -25677 6534 140 -50939
9361 -50939 -5487 51317 18007 46047 70141 45895 1003 -57671 -56075 -4267 -13396 -40678
9349 -40678 -3147 56442 24881 -12828 1172 16069 -45339 -2226 -52513 -71711 8653 -2601
9337 -2601 16537 2548 -8344 -17688 13711 35288 59850 42328 -22095 -27824 -9905 -30335
9325 -30335 -50006 -40547 -9655 -36758 -53582 11649 -43771 -20042 36575 34558 -25551 -52304
9313 -52304 -19684 -1859 32869 17110 18409 -27522 -63048 -16829 58156 50426 10224 -21016
9301 -21016 -37282 2829 27046 4549 9217 54807 74272 6249 47065 -1844 -31301 -46855
$$ packed form
9387B8365L2846p51J4742p555j0784k1640m1620j4078K0477L0525q522P267N0183
9374G9455O110m9657J1372l0865j5749j5303r27K5200r339k5974L2211o394n1079
9361e0939M5452N6804l3310K8040K4094k4246m4892n8674J596N1808r129k7282
9349d0678L7531N9589l1561l7709J4000J4897o1408M3113n0287j9198Q0364j1254
9337b601J9138j3989j0892r344L1399K1577K4562j7522o4423n729J7919k0430
9325c0335j9671R459L0892k7103j6824O5231n5420K3729N6617k017o0109k6753
9313e2304L2620J7825L4728j5759J299m5931l5526M6219P4985p730m0202l1240
9301b1016j6266M0111K4217k2497M668M5590J9465o8023M0816m8909k9457j5554
$$ plain form
9289 -46855 -9030 -42234 -79897 -59284 -64147 -22534 8872 -16993 2220 20265 -8793 43110
9277 43110 -11634 25278 3458 4246 75579 45534 7990 -13805 -796 8689 -8005 15007
9265 15007 9279 -52473 -24250 -3728 15459 -6736 -3248 14384 -18803 -13629 -26001 -10523
9253 -10523 18761 -41110 -29176 91129 5103 -32228 61991 19328 -33844 -25817 -2322 -16402
9241 -16402 9374 9819 -7782 62176 -4074 -32102 -38259 -10402 44643 58087 -8234 1843
9229 1843 -1907 -41492 -4898 22726 23753 358 17194 6063 60247 66456 39439 8699 52426
9216 52426 16082 12219 74625 78475 56742 103974 79054 89272 53100 57099 7024 -49836
9204 -49836 -32285 -28789 11933 12259 -12981 4617 -9179 -45212 -31761 -8404 21301 21406 -51960
$$ packed form
9289d6855L7825l3204l7663K0613m863M1613L1406k5865J9213J8045k9058N1903
9277D3110n4744L6912k1820P88P1333l0045l7544k1795J3009R485j6694K3012
9265A5007n728o1752K8223K0522J9187k2195L488J7632l3187N174j2372J5478
9253a0523K9284n9871J1934J20305q6026l7331R4219m2663n3172Q027K3495j4080
9241a6402K5776M45j7601O9958o6250k8028o157K7857N5045J3444o6321J0077
9229A843l750l9585L6594K7624J027k3395J6836j1131N4184O209k7017l0740M3727
9216E2426l6344l863O2406L850k1733M7232k4920J0218l6172L999n0075n6860
9204d9836J7551L496M0722L26k5240J7598j3796l6033J3451K3357K9705J05p3366
$$ plain form
9191 -51960 -59172 24546 19239 78469 -14154 -61907 -87532 -14746 -3259 -3943 -45165 -2699 -16095
9178 -16095 -35135 -59015 -63746 -53860 13006 -24819 -49913 18859 -30736 -57614 -73846 -57439
9166 -57439 -30718 31552 -13668 15755 16923 8761 51815 38955 52541 -13023 44235 20879
9154 20879 30531 42361 41658 84294 47512 15971 -8096 42091 33712 69074 61753 24061 11289
9141 11289 30779 79494 107076 65766 34233 41448 34874 65103 20665 -16474 10775 39321
9129 39321 93439 21990 -9878 -15237 1811 39332 96115 54656 63055 77501 62886 59297
9117 59297 59728 25100 17220 74532 83221 120638 71958 53922 68060 39799 1970 4828 33921
9104 33921 18325 107199 52965 50153 87946 107062 70858 60549 17548 38709 31541 11495
$$ packed form
9191e1960p212Q3718n307N9230r2623m7753k5625P2786J1487o84m1222M2466j3396
9178a6095j9040k3880m731R886O6866l7825k5094O8772m9595k6878j6232J6407
9166e7439K6721O2270m5220K9423J168q162M3054j2860J3586o5564N7258k3356
9154B0879R652J1830p03M2636l6782l1541k4067N0187q379L5362p321l7692j2772
9141A1289J9490M8715K7582m1310l1533P215o574L0229m4438l7139K7249K8546
9129C9321N4118p1449l1868n359J7048L7521N6783m1459Q399J4446j4615l589
9117E9297M31l4628p880N7312Q689L7417m8680j8036J4138k8261l7829K858K9093
9104C3921j5596Q8874n4234k812L7793J9116l6204j0309m3001K1161p168k0046
$$ plain form
9092 11495 -6298 18158 6050 51344 80608 72471 54433 58860 92525 126706 95684 60277
9080 60277 89822 60087 53869 110706 111040 -24530 35076 26386 32900 86915 96661 95575 125333
9067 125333 83721 68728 100288 129106 127900 118397 153623 103207 118253 161119 112577 163035
9055 163035 133543 143531 57174 31517 31850 85824 94647 71912 157742 145639 101391 73517
9043 73517 90709 115369 139691 143351 149834 170637 177662 214864 210491 194074 172005 163493 184137
9030 184137 228114 242009 232969 218935 228279 305370 301738 308154 276826 319762 339001 323849
9018 323849 338002 337043 366961 417844 346001 374933 381864 346687 298890 251304 279602 247981
9006 247981 207900 197082 227643 240950 171627 94108 175636 189060 211904 252242 231628 207752
$$ packed form
9092A1495j7793K4456j2108M5294K9264q137j8038M427L3665L4181l1022l5407
9080F0277K9545k9735o218N6837L34j35570N9606q690O514N4015R746j086K9758
9067A25333m1612j4993L1560K8818j206r503L5226n0416J5046M2866m8542N0458
9055A63035k9492R988q6357k5657L33N3974Q823k2735Q5830j2103m4248k7874
9043G3517J7192K4660K4322L660O483K0803P025L7202m373j6417k2069q512K0644
9030A84137M3977J3895r040j4034R344P7091l632O416l1328M2936J9239j5152
9018C23849J4153r59K9918N0883p1843K8932O931l5177m7797m7586K8298l1621
9006B47981m0081j0818L0561J3307o9323p7519Q1528J3424K2844M0338k0614k3876
$$ plain form
8994 207752 208885 175172 129967 136078 172254 90584 64056 84889 121653 141162 108094 83487
8982 83487 139489 96288 93184 113396 180628 197634 148735 137717 90288 31770 48362 103624
8970 103624 101610 76181 124950 76493 63350 106131 54041 65252 91278 128014 118621 108629
8958 108629 68608 64290 64749 92953 64032 86600 77853 103130 186029 125165 144819 120334
8946 120334 147509 145497 110149 87708 83107 140837 134684 90336 104847 158260 172215 194584
8934 194584 137387 87961 56977 76852 91132 58284 88665 113013 84779 139117 101764 69605
8922 69605 108740 111604 97909 139676 65415 41469 35100 61507 56080 45206 77 33765
8910 33765 79336 124708 51759 101115 81425 54896 105031 75506 45944 41025 99773 107884
$$ packed form
8994B07752J133l3713m5205O111L6176q1670k6528K0833L6764J9509l3068k4607
8982H3487N6002m3201l104K0212O7232J7006m8899j1018m7429n8518J6592N5262
8970A03624k014k5429M8769m8457j3143M2781n2090J1211K6026L6736r393r992
8958A08629m0021m318M59K8204k8921K2568q747K5277Q2899o0864J9654k4485
8946A20334K7175k012l5348k2441m601N7730o153m4348J4511N3413J3955K2369
8934A94584n7197m9426l0984J9875J4280l2848L0381K4348k8234N4338l7353l2159
8922F9605L9135K864j3695M1767p4261k3946o369K6407n427j0874m5129L3688
8910C3765M5571M5372p2949M9356j9690k6529N0135k9525k9562m919N8748Q111
$$ plain form
8898 107884 144855 176991 119468 113813 152170 130126 113633 105945 85472 82938 121263 155880
8886 155880 133924 109599 90552 60543 84995 47792 118212 140245 149285 122765 76709 52885
8874 52885 150797 67202 26446 37974 30875 83092 105353 116508 174364 178118 73004 114564
8862 114564 59763 -7687 22895 41267 66760 73387 65254 112132 118561 72677 59154 78039
8850 78039 121181 63060 101062 150134 82006 65029 88478 58989 24910 39689 50197 33032
8838 33032 64352 99226 77911 80959 128657 153180 128352 78376 74216 123150 160763 100527
8826 100527 95553 123247 78743 113922 73937 20549 53394 77278 135572 145367 122306 85851
8814 85851 117688 85531 57779 87379 130257 163982 151725 124745 149497 110780 89428 73686
$$ packed form
8898A07884L6971L2136n7523n655L8357k2044j6493p688k0473k534L8325L4617
8886A55880k1956k4325j9047l0009K4452l7203P0420K2033R040k6520m6056k3824
8874E2885R7912q3595m0756J1528p099N2217K2261J1155N7856L754j05114M1560
8862A14564n4801o7450L0582J8372K5493O627q133M6878O429m5884j3523J8885
8850G8039M3142n8121L8002M9072o8128j6977K3449k9489l4079J4779J0508j7165
8838C3032L1320L4874k1315L048M7698K4523k4828m9976m160M8934L7613o0236
8826A00527m974K7694m4504L5179l9985n3388L2845K3884N8294R795k3061l6455
8814H5851L1837l2157k7752K9600M2878L3725j2257k6980K4752l8717k1352j5742
$$ plain form
8802 73686 55097 60133 50783 80797 41054 72096 74299 91325 74446 67686 1173 24217 100386
8789 100386 57122 26217 117540 123841 92151 101088 77325 96167 94578 107930 116529 121785 183444
8776 183444 121556 118336 148956 154738 181021 134854 155171 160667 172472 168475 150189 111287
8764 111287 83974 110226 74957 64010 55587 114554 164926 133542 146964 113615 145523 123775
8752 123775 62261 52094 27381 73964 121232 166238 180604 168841 117734 74917 99934 126354
8740 126354 174744 145841 150271 91440 33113 80784 92982 62433 75989 60352 114448 102199
8728 102199 118730 85048 30036 23975 85845 152698 141594 183785 145197 95897 131889 167455
8716 167455 143993 105995 102360 166144 151927 147687 235894 266845 220500 258695 220737 138065
$$ packed form
8802G3686j8589N036r350L0014l9743L1042K203J7026j6879o760o6513K3044P6169
8789A00386m3264l0905R1323O301l1690Q937k3763J8842j589J3352Q599N256O1659
8776A83444o1888l220L0620N782K6283m6167K0317N496J1805l997j8286l8902
8764A11287k7313K6252l5269j0947q423N8967N0372l1384J3422l3349L1908k1748
8752A23775o1514j0167k4713M6583M7268M5006J4366j1763n1107m2817K5017K6420
8740A26354M8390k8903M430n8831n8327M7671J2198l0549J3556j5637N4096j2249
8728A02199J6531l3682n5012o061O1870O6853j1104M2191l8588m9300L5992L5566
8716A67455k3462l7998l635O3784j4217m240Q8207L0951m6345L8195l7958q2672
$$ plain form
8704 138065 216066 201888 124922 177923 149774 153678 143055 141404 194287 199925 182521 179159
8692 179159 152140 116814 170116 215846 230825 205410 185558 170463 204456 181426 201783 213006
8680 213006 264205 216315 128482 180858 191148 196067 166750 155194 117294 82887 99772 158850
8668 158850 124119 100454 137573 175461 164579 176545 185862 196519 134601 178608 201624 207582
8656 207582 163826 118443 184304 213452 184442 170249 140816 132540 120271 142243 175724 99937
8644 99937 156421 145502 162724 176420 193609 181725 140325 94926 106989 195640 214353 207833
8632 207833 164270 144757 161165 176837 132532 139859 154850 130713 128852 91031 97230 163981
8620 163981 199449 189800 178984 193831 176711 214344 208988 132248 129912 158028 159178 163329 189136
$$ packed form
8704A38065P8001j4178p6966N3001k8149L904j0623j651N2883N638j7404l362
8692A79159k7019l5326N3302M5730J4979k5415j9852j5095L3993k3030K0357J1223
8680B13006N1199m7890q7833N2376J0290M919k9317j1556l7900l4407J6885N9078
8668A58850l4731k3665L7119L7888j0882J1966R317J0657o1918M4007K3016N958
8656B07582m3756m5383O5861K9148k9010j4193k9433q276j2269K1972L3481p5787
8644I9937N6484j0919J7222J3696J7189j1884m1400m5399J2063Q8651J8713o520
8632B07833m3563j9513J6408J5672m4305P327J4991k4137j861l7821O199O6751
8620A63981L5468r649j0816J4847j7120L7633n356p6740k336K8116J150M151K5807
$$ plain form
8607 189136 231103 197340 189250 167747 142391 126310 153190 171201 217414 201516 179840 233191
8595 233191 198197 181433 198536 168630 170171 198502 222980 201744 181953 204926 172132 168783
8583 168783 148361 155622 164192 168190 237558 240265 187025 229402 247898 226412 230556 199613 169718
8570 169718 167544 170372 204833 234716 208826 180101 119480 164913 124101 165212 195468 192975
8558 192975 235304 210241 180210 218176 284545 237951 242036 226824 286011 258062 236572 197939
8546 197939 276726 351321 445908 410835 330839 340927 337354 339784 347201 301387 305933 300803 325058
8533 325058 315843 284677 247788 299927 290726 277988 307439 294918 248304 247244 299553 222812
8521 222812 302997 293775 264619 283061 271031 263482 293523 309079 314983 271304 264173 265133 325618
$$ packed form
8607A89136M1967l3763q090k1503k5356j6081K6880J8011M6213j5898k1676N3351
8595B33191l4994j6764J7103k9906J541K8331K4478k1236j9791K2973l2794l349
8583A68783k0422P261Q570L998O9368K707n3240M2377J8496k1486M144l0943k9895
8570A69718k174K828L4461K9883k5890k8725o0621M5433m0812M1111L0256k493
8558A92975M2329k5063l0031L7966O6369m6594M085j5212N9187k7949k1490l8633
8546A97939P8787P4595R4587l5073p9996J0088l573K430P417m5814M546n130K4255
8533C25058r215l1166l6889N2139r201j2738K9451j2521m6614j060N2309p6741
8521B22812Q0185r222k9156J8442j2030p549L0041J5556N904m3679p131R60O0485
$$ plain form
8508 325618 392642 371706 338524 336698 371977 297344 282903 296967 256711 246897 265424 267585
8496 267585 279161 318475 406340 293891 312106 331790 324751 312767 306446 277253 241990 273669
8484 273669 330571 305646 308995 318953 301248 285488 252532 313039 322454 321830 320007 364798 372117
8471 372117 359782 343031 367187 411341 412992 414370 484010 486906 491593 538884 543386 469687 469131
8458 469131 477733 491549 518032 520157 539344 559992 545747 516849 568084 631121 642008 706442
8446 706442 730186 819014 884135 962522 1012108 1119182 1290011 1375246 1555938 1740087 1833092
8435 1833092 1853727 1701987 1502207 1286147 1157013 1056038 988782 897574 825853 732096
8425 732096 690238 665858 680361 705622 677211 621598 586942 568149 612172 648627 579042 521090
$$ packed form
8508C25618O7024k0936l3182j826L5279p4633j4441J4064m0256r814J8527K161
8496B67585J1576L9314Q7865j12449J8215J9684p039j1984o321k9193l5263L1679
8484B73669N6902k4925L349R958j7705j5760l2956O0507R415o24j823M4791P319
8471C72117j2335j6751K4156M4154J651J378O9640K896M687M7291M502p3699n56
8458D69131Q602J3816K6483K125J9187K0648j4245k8898N1235O3037J0887O4434
8446G06442K3744Q8828O5121P8387M9586J07074J70829Q5235J80692J84149R3005
8435A833092K0635j51740j99780k16060j29134j00975o7256r1208p1721r3757
8425G32096m1858k4380J4503K5261k8411n5613l4656j8793M4023L6455o9585n7952
$$ plain form
8413 521090 641215 623141 580546 638599 583508 579663 658469 643679 644693 651473 716682 721357
8401 721357 726891 737301 777236 806454 793198 787291 819954 900895 940095 995035 1001098 1017304
8389 1017304 998503 1009668 1083527 1085685 1070059 1081870 1065459 1008270 978719 960660 931376 949385
8377 949385 952320 991349 1020413 1069827 1076202 1053551 1027753 1009786 1044443 990261 999125 1123832
8365 1123832 1064495 1048248 1143097 1223966 1148656 1188173 1239733 1289603 1333962 1330837 1349804 1321158
8353 1321158 1285611 1225644 1195261 1162002 1113749 1113921 1115365 1103864 1090299 1093399 1072631 1052206
8341 1052206 980463 917238 919180 918593 929762 904737 923645 951019 904437 903435 884207 941173
8329 941173 881782 835540 792695 855062 868161 867618 893905 909380 877023 809449 839954 871283
$$ packed form
8413E21090J20125j8074m2595N8053n5091l845P8806j4790J014O780O5209M675
8401G21357N534J0410L9935K9218j3256n907L2663Q0941L9200N4940O063J6206
8389A017304j8801J1165P3859K158j5626J1811j6411n7189k9551j8059k9284J8009
8377I49385K935L9029K9064M9414O375k2651k5798j7967L4657n4182Q864J24707
8365A123832n9337j6247R4849Q0869p5310L9517N1560M9870M4359l125J8967k8646
8353A321158l5547n9967l0383l3259m8253J72J444j1501j3565L100k0768k0425
8341A052206p1743o3225J942n87J1169k5025J8908K7374m6582j002j9228N6966
8329I41173n9391m6242m2845O2367J3099n43K6287J5475l2357o7574L0505L1329
$$ plain form
8317 871283 881088 846280 864826 942283 960448 906692 832134 870069 846893 864899 818407 856157
8305 856157 923984 887504 871739 889557 863126 843932 868219 880384 866904 810999 785841 782987
8293 782987 811531 895404 898199 890214 904892 898074 901477 900211 888377 924009 936459 917722 923078
8280 923078 919391 868575 859001 882372 889919 896372 917805 948641 976506 991115 946948 971972
8268 971972 991032 965590 970396 937996 986166 1008898 1017828 1053654 1099865 1050666 1033772 1085710
8256 1085710 1090475 1077514 1006965 1012386 1023836 1029318 1032555 1061511 1013345 1010343 1021114 1020625 1091692
8243 1091692 1138992 1125374 1208682 1141503 1098850 1150356 1204089 1160502 1186068 1195736 1217670 1216001
8231 1216001 1217107 1241775 1305190 1326174 1403033 1346656 1404223 1352993 1411153 1439316 1449065 1492015
$$ packed form
8317H71283R805l4808J8546P7457J8165n3756p4558L7935k3176J8006m6492L7750
8305H56157O7827l6480j5765J7818k6431j9194K4287J2165j3480n5905k5158k854
8293G82987K8544Q3873K795p985J4678o818L403j266j1834L5632J2450j8737N356
8280I23078l687n0816r574K3371P547O453K1433L0836K7865J4609m4167K5024
8268I71972J9060k5442M806l2400M8170K2732Q930L5826M6211m9199j6894N1938
8256A085710M765j2961p0549N421J1450N482L237K8956m8166l002J0771m89P1067
8243A091692M7300j3618Q3308o7179m2653N1506N3733m3587K5566R668K1934j669
8231A216001J106K4668O3415K0984P6859n6377N7567n1230N8160K8163R749M2950
$$ plain form
8219 1492015 1520359 1463387 1482206 1422665 1446111 1455373 1404957 1403893 1427418 1386153 1394353 1401188
8207 1401188 1486047 1474221 1509190 1584734 1594238 1570552 1645987 1602563 1611814 1629011 1631421 1603986
8195 1603986 1679413 1711908 2026931 2410424 1694703 1766534 1755033 1828485 1860067 1883469 1950652
8184 1950652 1969142 2056778 2098358 2141420 2235416 2292423 2330057 2358211 2370929 2407810 2450265
8173 2450265 2585262 2615301 2618173 2691200 2679946 2711330 2717539 2732278 2710063 2677088 2739909 2702352
8161 2702352 2649297 2633750 2616224 2596495 2583493 2560338 2658719 2702614 2711717 2705203 2816190 2906560
8149 2906560 3011216 3095789 3175654 3325028 3411667 3426356 3503922 3595956 3617650 3587870 3549876
8138 3549876 3504816 3567771 3589381 3559012 3564862 3561101 3496155 3443024 3416679 3441181 3467512 3430892
$$ packed form
8219A492015K8344n6972J8819n9541K3446R262n0416j064K3525m1265Q200O835
8207A401188Q4859j1826L4969P5544R504k3686P5435m3424R251J7197K410k7435
8195A603986P5427L2495L15023L83493p15721P1831j1501P3452L1582K3402O7183
8184A950652J8490Q7636M1580M3062R3996N7007L7634K8154J2718L6881M2455
8173B450265J34997L0039K872P3027j1254L1384O209J4739k2215l2975O2821l7557
8161B702352n3055j5547j7526j9729j3002k3155R8381M3895R103o514J10987R0370
8149B906560J04656Q4573P9865J49374Q6639J4689P7566R2034K1694k9780l7994
8138C549876m5060O2955K1610l0369N850l761o4946n3131k6345K4502K6331l6620
$$ plain form
8126 3430892 3421642 3393429 3428645 3472312 3537311 3520783 3578924 3644672 3667267 3781453 3878216
8115 3878216 3941610 4010174 4046403 4050754 4070113 4184808 4299505 4385067 4539454 4649104 4773086
8104 4773086 4827137 4889924 4972595 5086327 5264162 5389518 5433808 5636293 5818910 5962529
8094 5962529 6157899 6303543 6471899 6588939 6798500 6932806 7082316 7202079 7344743 7429387
8084 7429387 7570701 7748616 7909790 7988563 8102668 8180766 8278208 8466032 8672115 8799541
8074 8799541 9016949 9178613 9386933 9612550 9816080 10041893 10254291 10514878 10775904 10879384
8064 10879384 11101849 11253533 11524937 11734069 11943987 12052168 12274037 12571831 12951156
8055 12951156 13272146 13667706 14107384 14506368 14933476 15389988 15829710 16473502 17059763
$$ packed form
8126C430892r250k8213L5216M3667O4999j6528N8141O5748K2595J14186R6763
8115C878216O3394O8564L6229M351J9359J14695J14697Q5562J54387J09650J23982
8104D773086N4051O2787Q2671J13732J77835J25356M4290K02485J82617J43619
8094E962529J95370J45644J68356J17040K09561J34306J49510J19763J42664Q4644
8084G429387J41314J77915J61174P8773J14105P8098R7442J87824K06083J27426
8074H799541K17408J61664K08320K25617K03530K25813K12398K60587K61026J03480
8064A0879384K22465J51684K71404K09132K09918J08181K21869K97794L79325
8055A2951156L20990L95560M39678L98984M27108M56512M39722O43792N86261
$$ plain form
8046 17059763 17815027 18544823 19429480 20326866 21319987 22312524 23350752 24381478 25505424
8037 25505424 26598353 27909987 29364176 30989386 32805639 34767524 36850500 39240192
8029 39240192 41898700 44673204 48168797 52611281 57418867 62472732 68256448 75095968
8021 75095968 82726894 90737195 99797618 109827308 121074784 134793492 153115145 174505246
8013 174505246 198435358 225246674 253789755 275077310 279601002 248053750 198581029
8006 198581029 158918032 130424201 110045851 95120488 83852134 73937680 65814900
7999 65814900 58810193 53211534 48395991 44618033 41414869 38819048 36483970 34469926
7991 34469926 32573902 31018984 29650759 28696078 27831149 27056697 26158999 25422569 24680182
$$ packed form
8046A7059763P55264P29796Q84657Q97386R93121R92537J038228J030726J123946
8037B5505424J092929J311634J454189J625210J816253J961885K082976K389692
8029C9240192K658508K774504L495593M442484M807586N053865N783716O839520
8021G5095968P630926Q010301R060423J0029690J1247476J3718708J8321653K1390101
8013A74505246K3930112K6811316K8543081K1287555M523692l1547252m9472721
8006A98581029l9662997k8493831k0378350j4925363j1268354r914454q122780
7999F5814900p004707n598659m815543l777958l203164k595821k335078k014044
7991C4469926j896024j554918j368225r54681q64929p74452q97698p36430p42387
$$ plain form
7982 24680182 24001536 23287841 22635658 21931125 21317247 20630584 20122388 19695284 19376429
7973 19376429 19004671 18597995 18189554 17696787 17031096 16487087 15998828 15692118 15336927
7964 15336927 15023054 14858765 14772814 14550212 14418589 14173346 13945700 13690232 13343375 13037179
7954 13037179 12761803 12439441 12155471 11908724 11661694 11385105 11181761 10960472 10742235
7945 10742235 10521598 10346249 10171929 9980727 9694565 9526093 9347846 9223833 9055489
7936 9055489 8944149 8777620 8647422 8442902 8301464 8107689 7965102 7733175 7569327 7433886
7926 7433886 7334362 7103343 6920295 6807688 6626248 6570691 6450451 6302690 6178878 6042641
7916 6042641 5954090 5842748 5674741 5626166 5504579 5481567 5401239 5363038 5259994 5136086
$$ packed form
7982B4680182o78646p13695o52183p04533o13878o86663n08196m27104l18855
7973A9376429l71758m06676m08441m92767o65691n44009m88259l06710l55191
7964A5336927l13873j64289q5951k22602j31623k45243k27646k55468l46857l06196
7954A3037179k75376l22362k83970k46747k47030k76589k03344k21289k18237
7945A0742235k20637j75349j74320j91202k86162j68472j78247j24013j68344
7936I055489j11340j66529j30198k04520j41438j93775j42587k31927j63848j35441
7926G433886r9524k31019j83048j12607j81440n5557j20240j47761j23812j36237
7916F042641q8551j11342j68007m8575j21587k3012q0328l8201j03044j23908
$$ plain form
7906 5136086 5058937 4983866 4878042 4806927 4768723 4646203 4516521 4491808 4477336 4351016 4245058
7895 4245058 4091058 4036916 3923058 3859091 3817803 3741564 3807317 3721032 3685297 3633800 3639993
7884 3639993 3644116 3559403 3438558 3411662 3326334 3227072 3152770 3164266 3112682 3009951 2961083
7873 2961083 2939583 2913058 2903080 2872599 2856722 2855014 2798235 2737228 2730731 2680263 2647697 2577102
7861 2577102 2516809 2428671 2320012 2264781 2262272 2201432 2168683 2131658 2168125 2171025 2164240 2106880
7849 2106880 2062409 2107283 2108491 2166494 2082421 2063113 2018169 1924064 1893445 1812208 1852280 1807356
7837 1807356 1834113 1854079 1863831 1852982 1794905 1731138 1767550 1753374 1768913 1747045 1728990 1705187
7825 1705187 1631531 1661854 1609514 1604368 1591089 1524271 1566842 1559921 1529739 1477259 1471621 1467468
$$ packed form
7906E136086p7149p5071j05824p1115l8204j22520j29682k4713j4472j26320j05958
7895D245058j54000n4142j13858o3967m1288p6239O5753q6285l5735n1497O193
7884C639993M123q4713j20845k6896q5328r9262p4302J1496n1584j02731m8868
7873B961083k1500k6525r978l0481j5877j708n6779o1007o497n0468l2566p0595
7861B577102o0293q8138j08659n5231k509o0840l2749l7025L6467K900o785n7360
7849B106880m4471M4874J208N8003q4073j9308m4944r4105l0619q1237M0072m4924
7837A807356K6757J9966R752j0849n8077o3767L6412j4176J5539k1868j8055k3803
7825A705187p3656L0323n2340n146j3279o6818M2571o921l0182n2480n638m153
$$ plain form
7813 1467468 1483460 1499734 1506715 1431190 1422555 1327116 1295660 1279857 1302304 1295995 1216328 1230200
7801 1230200 1250105 1267813 1233869 1225511 1269172 1288933 1212721 1227194 1203201 1207056 1206011 1242723
7789 1242723 1224885 1214640 1213314 1168334 1146849 1137528 1113551 1089326 1068536 1110188 1067871 1093408
7777 1093408 1123513 1158137 1128772 1054516 1104475 1062910 1066096 1090668 1048729 1017326 1085836 1013148
7765 1013148 938004 922245 936994 985880 993039 984219 938964 870667 866536 918589 913202 921929
7753 921929 925672 954228 909136 951349 1014537 983762 895753 870531 886417 917455 874966 847159
7741 847159 884426 866368 838237 854622 835399 776654 800258 826478 784229 798361 752228 756340
7729 756340 811496 766756 778820 850644 844204 847787 812223 799780 788606 811064 820393 855248
$$ packed form
7813A467468J5992J6274O981p5525q635r5439l1456j5803K2447o309p9667J3872
7801A230200J9905J7708l3944q358M3661J9761p6212J4473k3993L855j045L6712
7789A242723j7838j0245j326m4980k1485r321k3977k4225k0790M1652m2317K5537
7777A093408L0105L4624k9365p4256M9959m1565L186K4572m1939l1403O8510p2688
7765A013148p5144j5759J4749M8886P159q820m5255o8297m131N2053n387Q727
7753I21929L743K8556m5092M2213O3188l0775q8009k5222J5886L1038m2489k7807
7741H47159L7267j8058k8131J6385j9223n8745K3604K6220m2249J4132m6133M112
7729G56340N5156m4740J2064P1824o440L583l5564j2443j1174K2458R329L4855
$$ plain form
7717 855248 863267 801632 818468 803295 786419 798171 770003 792497 855652 803343 818177 796341
7705 796341 765860 790484 812013 867758 828663 828125 869365 844135 885814 858608 810530 829042
7693 829042 842632 855967 884512 889669 858581 875635 858891 843685 843890 908521 865216 884026
7681 884026 875759 832517 798555 852908 816880 792252 803942 775540 759441 755519 762234 783080
7669 783080 795793 827832 834353 830017 812032 841359 844019 785099 795296 855782 884017 834828
7657 834828 854396 956551 924491 956845 960605 896299 938227 938589 995444 948481 944401 972447
7645 972447 946513 881613 909683 904301 850965 841326 827337 817250 808048 760397 760376 737525 738399
7632 738399 734104 777976 792412 767996 762430 842160 811128 795963 872828 928710 890577 829334
$$ packed form
7717H55248Q019o1635J6836j5173j6876J1752k8168K2494O3155n2309J4834k1836
7705G96341l0481K4624K1529N5745l9095n38M1240k5230M1679k7206m8078J8512
7693H29042J3590J3335K8545N157l1088J7054j6744j5206K05O4631m3305J8810
7681H84026q267m3242l3962N4353l6028k4628J1690k8402j6099l922O715K0846
7669G83080J2713L2039O521m336j7985K9327K660n8920J0197O0486K8235m9189
7657H34828J9568J02155l2060L2354L760o4306M1928L62N6855m6963m080K8046
7645I72447k5934o4900K8070n382n3336r639j3989j0087r202m7651k1k2851Q74
7632G38399m295M3872J4436k4416n566P9730l1032j5165P6865N5882l8133o1243
$$ plain form
7620 829334 787993 767661 760764 710459 682674 716446 749622 789069 796795 789924 725434 713990
7608 713990 737930 821182 855201 809472 831177 887619 878966 865930 901555 923698 906959 949391
7596 949391 1089350 1129541 1120025 1073938 1048923 1106716 1115824 1128558 1228859 1320620 1415126 1532835
7584 1532835 1596195 1742185 1932521 2069330 2201722 2201118 2139829 1842282 1609978 1474753
7574 1474753 1354497 1279942 1177281 1152335 1079551 1027983 974280 933458 842763 829244 815698
7563 815698 751782 709375 717010 726550 722852 729163 736837 693646 659752 636984 614594 588693 555603
7550 555603 610245 693554 678788 681971 623178 611740 589557 591517 586007 550928 596461 530227
7538 530227 534939 535122 539515 556193 531526 546306 527429 542590 626780 510549 519812 539007
$$ packed form
7620H29334m1341k0332o897n0305k7785L3772L3176L9447P726o871o4490j1444
7608G13990K3940Q3252L4019m5729K1705N6442q653j3036L5625K2143j6739M2432
7596I49391J39959M0191r516m6087k5015N7793R108J2734J00301R1761R4506J17709
7584A532835O3360J45990J90336J36809J32392o04o1289k97547k32304j35225
7574A474753j20256p4555j02661k4946p2784n1568n3703m0822r0695j3519j3546
7563H15698o3916m2407P635R540l698O311P674m3191l3894k2768k2390k5901l3090
7550E55603N4642Q3309j4766L183n8793j1438k2183J960n510l5079M5533o6234
7538E30227M712J83M393J6678k4667J4780j8877J5161Q4190j16231R263J9195
$$ plain form
7526 539007 645843 677758 620457 613413 571739 607820 631094 612806 552595 544143 496866 528318
7514 528318 492430 515071 572740 534019 595524 557315 484936 547060 542370 488330 531667 537586
7502 537586 554631 513633 449945 450709 423058 367979 377564 382113 392096 356218 320226 343644 379873
7489 379873 366537 371650 380503 349444 374617 347395 274420 318176 379035 347345 298130 325900
7477 325900 308563 307200 326562 334871 318269 324806 288526 358493 362054 364302 312571 292633 343779
7464 343779 344570 318033 312998 343174 275391 340081 344847 346582 312249 305240 335430 316362 270802
7451 270802 296783 308847 277214 306246 250055 289197 291611 329347 303984 282471 314115 286065
7439 286065 334048 315920 294697 312404 278058 234924 235879 235550 292036 306247 290135 285492 272746
$$ packed form
7526E39007J06836L1915n7301p044m1674L6081K3274j8288o0211q452m7277L1452
7514E28318l5888K2641N7669l8721O1505l8209p2379O2124m690n4040M3337N919
7502E37586J7045m0998o3688P64k7651n5079R585M549R983l5878l5992K3418L6229
7489C79873j3336N113Q853l1059K5173k7222p2975M3756O0859l1690m9215K7770
7477C25900j7337j363J9362Q309j6602O537l6280O9967L561K248n1731j9938N1146
7464C43779P91k6537n035L0176o7783O4690M766J735l4333p009L0190j9068m5560
7451B70802K5981J2064l1633K9032n6191L9142K414L7736k5363k1513L1644k8050
7439B86065M7983j8128k1223J7707l4346m3134R55l29N6486J4211j6112m643j2746
$$ plain form
7426 272746 245507 214136 239197 223493 242392 262958 277931 300980 184801 179256 227127 184408
7414 184408 205204 237545 239909 242469 227155 257842 309272 262911 227973 266653 245729 180081
7402 180081 203918 190245 157141 208451 218117 240230 247966 237852 225771 202468 168867 181561
7390 181561 232261 220332 206307 228313 163544 173765 170057 204095 180526 207291 194939 182612
7378 182612 185403 116890 165707 212535 173568 166735 133338 158434 146111 172580 231208 267388
7366 267388 230682 209928 195565 212497 203967 180239 193104 175091 138451 144755 198307 196614
7354 196614 199681 171725 113444 189786 247269 155386 168106 182720 200012 207502 208406 189244
7342 189244 126961 146106 192271 182670 210112 191002 234417 201886 217560 249516 290489 239326
$$ packed form
7426B72746k7239l1371K5061j5704J8899K0566J4973K3049j16179n545M7871m2719
7414A84408K0796L2341K364K560j5314L0687N1430m6361l4938L8680k0924o5648
7402A80081K3837j3673l3104N1310R666K2113P736j0114j2081k3303l3601J2694
7390A81561N0700j1929j4025K2006o4769J0221l708L4038k3569K6765j2352j2327
7378A82612K791o8513M8817M6828l8967o833l3397K5096j2323K6469N8628L6180
7366B67388l6706k0754j4363J6932q530k3728J2865j8013l6640O304N3552j693
7354A96614L067k7956n8281P6342N7483r1883J2720J4614J7292P490R04j9162
7342A89244o2283J9145M6165r601K7442j9110M3415l2531J5674L1956M0973n1163
$$ plain form
7330 239326 169137 168087 212849 240025 245867 268449 292991 271438 226903 219516 265564 278599
7318 278599 265808 262107 203865 205545 212361 144528 95769 146288 194113 194044 175567 166831 167493
7305 167493 171555 183294 252304 228579 261508 246714 246075 254285 218351 243991 230320 195609
7293 195609 181574 202987 205446 175556 259644 270796 212798 251106 299642 296557 233482 236438
7281 236438 216319 171339 85344 95449 134867 134409 142961 123587 187825 202680 135735 141062
7269 141062 181851 150544 164004 233946 173152 192994 151469 56527 78244 119765 119336 108603
7257 108603 44543 22764 88297 103955 87175 94741 112401 124808 91270 76811 54971 19900
7245 19900 76218 73234 96321 86076 71971 86466 130894 112585 100465 153421 118267 149680
$$ packed form
7330B39326p0189j050M4762K7176N842K2582K4542k1553m4535p387M6048J3035
7318B78599j2791l701n8242J680O816o7833m8759N0519M7825o9j8477q736O62
7305A67493M062J1739O9010k3725L2929j4794o39Q210l5934K5640j3671l4711
7293A95609j4035K1413K459k9890Q4088J1152n7998L8308M8536l085o3075K956
7281B36438k0119m4980q5995J0105L9418m58Q552j9374O4238J4855o6945N327
7269A41062M0789l1307J3460O9942o0794J9842m1525r4942K1717M1521m29j0733
7257A08603o4060k1779O5533J5658j6780P566J7660J2407l3538j4459k1840l5071
7245A9900N6318k984K3087j0245j4105J4495M4428j8309j2120N2956l5154L1413
$$ plain form
7233 149680 144496 121849 89781 48738 107668 117645 71941 82863 180251 127760 78087 76152
7221 76152 60079 88344 102550 110783 148704 126285 130504 111588 53185 38600 55875 104364
7209 104364 78740 55112 38313 106363 57591 79289 45937 107579 141290 92471 58945 48102
7197 48102 96913 120291 59568 56399 88450 65885 41514 73264 108511 55053 106858 128093
7185 128093 30988 26114 90621 58701 110954 85947 39306 81314 110455 20643 4686 62008
7173 62008 64329 61632 85110 119681 89544 14398 -2779 -3146 48351 49176 47085 42996 68296
7160 68296 104517 90378 90477 79596 136784 91394 48005 100876 72512 71318 62169 78623 120443
7147 120443 125557 91611 35841 25245 61105 79391 63318 87345 76576 65865 50889 55179
$$ packed form
7233A49680n184k2647l2068m1043N8930R977m5704J0922R7388n2491m9673j935
7221G6152j6073K8265J4206Q233L7921k2419M219j8916n8403j4585J7275M8489
7209A04364k5624k3628j6799O8050m8772K1698l3352O1642L3711m8819l3526j0843
7197D8102M8811K3378o0723l169L2051k2565k4371L1750L5247n3458N1805K1235
7185A28093r7105m874O4507l1920N2253k5007m6641M2008K9141q9812j5957N7322
7173F2008K321k697K3478L4571l0137p5146j7177l67N1497Q25k091m089K5300
7160F8296L6221j4139R9j0881N7188m5390m3389N2871k8364j194r149J6454M1820
7147A20443N114l3946n5770j0596L5860J8286j6073K4027j0769j0711j4976M290
$$ plain form
7135 55179 50535 47388 40596 30093 50044 46358 62478 76573 124009 134087 79810 36684 63077
7122 63077 63067 56292 80614 71012 92453 107150 92551 81621 45673 66140 62411 75877 95110
7109 95110 71106 85686 91068 113336 130021 84042 60574 109039 134670 145962 112801 61823
7097 61823 61579 69102 48749 74777 76693 48712 47037 66750 87718 90244 95981 95490 112190 105131
7083 105131 93172 156035 209847 144604 77248 69345 142069 143183 79073 90321 112244 99515
7071 99515 89257 140742 162833 89386 112834 88176 48059 86999 116492 123210 77374 47058
7059 47058 82342 115621 113926 127655 107576 89814 121999 126468 119804 78359 114882 121692 39143
7046 39143 44518 78769 87679 126432 128539 104883 138127 129127 131440 91544 145466 103889 133396
$$ packed form
7135E5179m644l147o792j0503J9951l686J6120J4095M7436J0078n4277m3126K6393
7122F3077j0o775K4322r602K1441J4697j4599j0930l5948K0467l729J3466J9233
7109I5110k4004J4580N382K2268J6685m5979k3468M8465K5631J1292l3161n0978
7097F1823k44P523k0353K6028J916k7981j675J9713K0968K526N737m91J6700p059
7083A05131j1959O2863N3812o5243o7356p903P2724J114o4110J1248K1923j2729
7071I9515j0258N1485K2091p3447K3448k4658m0117L8940K9493O718m5836l0316
7059D7058L5284L3279j695J3729k0079j7762L2185M469o664m1445L6523O810q2549
7046C9143N375L4251Q910L8753K107k3656L3244r000K313l9896N3922m1577K9507
$$ plain form
7033 133396 152520 134782 145128 120025 145367 62460 123728 160435 123492 73651 172717 179030
7021 179030 188573 162886 153862 131615 93581 133649 181213 130045 54755 116971 100426 134349
7009 134349 96204 104045 137086 157874 117152 74124 101232 132518 124941 201764 217642 184244
6997 184244 174737 190032 165940 146078 165956 128161 99127 135517 98644 108521 88169 138941
6985 138941 175449 129466 142831 167320 164338 175925 186598 171511 202078 212295 178341 207205
6973 207205 177249 143105 91416 140370 214026 208473 207777 231589 209559 150508 220891 196725
6961 196725 158486 215701 173089 177301 218338 239292 189256 191273 164494 151578 206338 169483
6949 169483 202773 174565 262793 256943 272722 307829 300552 324849 272249 287041 293112 305170
$$ packed form
7033A33396J9124j7738J0346k5103K5342q2907O1268L6707l6943m9841R9066O313
7021A79030R543k5687r024k2247l8034M0068M7564n1168p5290O2216j6545L3923
7009A34349l8145P841L3041K0788m0722m3028K7108L1286p577P6823J5878l3398
6997A84244r507J5295k4092j9862J9878l7795k9034L6390l6873R877k0352N0772
6985A38941L6508m5983J3365K4489k982J1587J0673j5087L0567J0217l3954K8864
6973B07205k9956l4144n1689M8954P3656n553o96K3812k2030n9051P0383k4166
6961A96725l8239N7215m2612M212M1037K0954n0036K017k6779j2916N4760l6855
6949A69483L3290k8208Q8228n850J5779L5107p277K4297n2600J4792O071J2058
$$ plain form
6937 305170 241329 173372 257723 260268 244790 307564 262777 233329 228571 273312 271034 243570
6925 243570 291637 277469 248847 259658 309461 334955 294827 244105 344311 343724 372613 409501
6913 409501 423715 450208 438062 440167 491845 472336 527521 567940 571148 580200 645943 633597
6901 633597 637088 700040 673887 721066 745621 702228 719603 768641 732347 772519 836973 885521
6889 885521 933066 931583 978238 1027005 1065413 1089986 1087490 1043927 980610 947991 950326 909610
6877 909610 926430 937140 941834 931946 957178 1016250 1028009 1068717 1093398 1061064 992117 1016823
6865 1016823 1033281 1038214 1023921 999330 1045072 1057159 1038742 996743 1009769 947965 920904 957551
6853 957551 1007656 980446 1029758 1011678 1021106 1043976 988256 987521 1004548 1083025 1032364 1059021
$$ packed form
6937C05170o3841o7957Q4351K545j5478O2774m4787k9448m758M4741k278k7464
6925B43570M8067j4168k8622J0811M9803K5494m0128n0722J00206n87K8889L6888
6913D09501J4214K6493j2146K105N1678j9509N5185M0419L208R052O5743j2346
6901F33597L491O2952k6153M7179K4555m3393J7375M9038l6294M0172O4454M8548
6889H85521M7545j483M6655M8767L8408K4573k496m3563o3317l2619K335m0716
6877I09610J6820J0710M694r888K5232N9072J1759M0708K4681l2334o8947K4706
6865A016823J6458M933j4293k4591M5742J2087j8417m1999J3026o1804k7061L6647
6853I57551N0105k7210M9312j8080R428K2870n5720p35J7027P8477n0661K6657
$$ plain form
6841 1059021 1040417 1042158 994968 1024871 1000113 1072162 1136131 1109850 1134059 1201757 1196769 1191610
6829 1191610 1201402 1240696 1292948 1230317 1204021 1210906 1216125 1220966 1269775 1189863 1175089 1135587
6817 1135587 1099919 1093141 1047112 1121432 1146787 1165882 1166788 1156353 1141403 1144148 1118732 1087367
6805 1087367 1043294 1077094 1038409 1009256 1089580 1140668 1114899 1103384 1070178 1089166 1135324
6794 1135324 1105301 1109620 1081725 1052891 982809 986877 1076378 1044460 1034058 1039188 1030980 1029606
6782 1029606 992823 1033920 1028570 1102300 1117418 1022892 1008130 1084970 1116883 1147453 1107213 1051303
6770 1051303 1056461 1083536 1021645 962452 975608 988422 1023510 1041464 997797 1024735 969662 938927
6758 938927 935978 1049277 1022603 980572 1014467 1002144 1061672 1002136 1058131 1021953 972946 948215
$$ packed form
6841A059021j8604J741m7190K9903k4758P2049O3969k6281K4209O7698m988n159
6829A191610R792L9294N2252o2631k6296O885N219M841M8809p9912j4774l9502
6817A135587l5668o778m6029P4320K5355J9095R06j0435j4950K745k5416l1365
6805A087367m4073L3800l8685k9153Q0324N1088k5769j1515l3206J8988M6158
6794A135324l0023M319k7895k8834p0082M068Q9501l1918j0402N130q208j374
6782A029606l6783M1097n350P3730J5118r4526j4762P6840L1913L0570m0240n5910
6770A051303N158K7075o1891n9193J3156J2814L5088J7954m3667K6938n5073l0735
6758I38927k949J13299k6674m2031L3895j2323N9528n9536N5995l6178m9007k4731
$$ plain form
6746 948215 956239 963732 1011813 1010894 1009660 969212 922325 923183 968407 969844 894909 896510 923424
6733 923424 895359 919356 992782 929443 912708 945651 899461 928380 955431 897224 913824 930097
6721 930097 947413 906524 883720 958060 969975 979189 905016 894364 877954 938394 1064573 1079090
6709 1079090 1075186 1109113 1118132 1125757 1128785 1175124 1180962 1147394 1175620 1201903 1179726 1170711 1201212
6696 1201212 1200252 1119590 1102616 1080140 1050787 996591 970605 940738 957569 1002614 1055325 1116552
6684 1116552 1125165 1175776 1113342 1050515 1011247 1043167 1067546 1022838 995168 972052 915131 852904
6672 852904 884547 909035 809593 818646 892712 836854 867731 864457 833737 908060 858585 840581
6660 840581 843017 851125 798592 781602 809313 847840 788471 751300 747991 781770 847149 856561
$$ packed form
6746I48215Q024P493M8081r19j234m0448m6887Q58M5224J437p4935J601K6914
6733I23424k8065K3997P3426o3339j6735L2943m6190K8919K7051n8207J6600J6273
6721I30097J7316m0889k2804P4340J1915R214p4173j0652j6410O0440J26179J4517
6709A079090l904L3927R019P625L028M6339N838l3568K8226K6283k2177r015L0501
6696A201212r60q0662j6974k2476k9353n4196k5986k9867J6831M5045N2711O1227
6684A116552Q613N0611o2434o2827l9268L1920K4379m4708k7670k3116n6921o2227
6672H52904L1643K4488r9442R053P4066n5858L0877l274l0720P4323m9475j8004
6660H40581K436Q108n2533j6990K7711L8527n9369l7171l309L3779O5379R412
$$ plain form
6648 856561 851092 902543 940084 923543 928177 876981 865850 976991 974697 1002474 1017991 1060388
6636 1060388 1145183 1187514 1191101 1226946 1316238 1369535 1326909 1285605 1303973 1336592 1295174 1256777
6624 1256777 1219298 1204178 1155182 1124548 1043073 987923 977147 967260 935475 874185 842001 835819
6612 835819 839110 789662 804015 733131 758483 838013 809754 800681 740918 771953 717297 728565
6600 728565 702467 728546 757082 718320 670796 681083 698429 683181 672149 689835 708878 675873
6588 675873 660710 663017 701344 685415 701147 701677 684732 630051 601106 603121 591178 626071
6576 626071 649907 603522 608577 604827 653195 629970 587835 513356 615869 586616 608694 667477
6564 667477 653973 579820 551607 557766 555059 565027 622060 624367 602043 619991 648420 620276
$$ packed form
6648H56561n469N1451L7541j6541M634n1196j1131J11141k294K7777J5517M2397
6636A060388Q4795M2331L587L5845Q9292N3297m2626m1304J8368L2619m1418l8397
6624A256777l7479j5120m8996l0634q1475n5150j0776r887l1785o1290l2184o182
6612H35819L291m9448J4353p0884K5352P9530k8259r073n9763L1035n4656J1268
6600G28565k6098K6079K8536l8762m7524J0287J7346j5248j1032J7686J9043l3005
6588F75873j5163K307L8327j5929J5732N30j6945n4681k8945K015j1943L4893
6576F26071K3836m6385N055l750M8368k3225m2135p4479J02513k9253K2078N8783
6564F67477j3504p4153k8213O159k707R968N7033K307k2324J7948K8429k8144
$$ plain form
6552 620276 614704 604098 540258 450710 436850 459111 483600 474702 455143 373250 397842 381368
6540 381368 340770 383774 413474 316913 314795 341816 361146 319107 298279 282589 310526 327761
6528 327761 312339 291997 291204 346605 363588 296081 297877 296327 346257 344665 272175 300343 285279
6515 285279 302207 312212 293778 255302 257481 260994 301968 262525 269340 257189 274699 227997
6503 227997 256438 225128 224980 236906 251702 264711 251305 209897 228868 250232 241050 177442
6491 177442 141215 188603 254660 235614 224148 212556 251921 252826 246740 151752 167153 172325
6479 172325 189588 191536 141249 133082 193455 201466 204206 230293 173823 161036 177822 167759
6467 167759 141082 159969 229643 227164 178232 177295 178110 178198 193201 202919 183930 175648 125958 187032
$$ packed form
6552F20276n572j0606o3840q9548j3860K2261K4489q898j9559q1893K4592j6474
6540C81368m0598M3004K9700r6561k118K7021J9330m2039k0828j5690K7937J7235
6528C27761j5422k0342p93N5401J6983o7507J796j550M9930j592p2490K8168j5064
6515B85279J6928J0005j8434l8476K179L513M0974l9443O815j2151J7510m6702
6503B27997K8441l1310j48J1926J4796J3009j3406m1408J8971K1364r182o3608
6491A77442l6227M7388O6057j9046j1466j1592L9365R05o086r4988J5401N172
6479A72325J7263J948n0287q167O0373Q011K740K6087n6470j2787J6786j0063
6467A67759k6677J8887O9674k479m8932r37Q15Q8J5003R718j8989q282m9690O1074
$$ plain form
6453 187032 125783 126053 181434 148705 127520 108763 132368 120648 153050 155557 168459 196802
6441 196802 156859 168171 193256 161482 140300 128364 159741 159804 166062 149664 182494 184440 179988
6428 179988 199331 187079 117021 90988 112005 80873 86745 160326 142534 111650 101272 103976
6416 103976 158126 173842 151960 129787 146680 166815 171982 140045 149098 143011 210240 176774
6404 176774 209321 221362 246840 244767 219718 259270 274863 206788 191009 237867 270055 196544
6392 196544 147204 208530 216362 195818 185387 205472 182915 133434 122974 129260 160721 158756
6380 158756 119226 186901 181294 164290 182167 145478 105515 60532 112523 151835 152326 138990
6368 138990 172806 177387 183069 194239 162715 181673 133266 147216 134629 89773 91190 106412
$$ packed form
6453A87032o1249K70N5381l2729k1185j8757K3605j1720L2402K507J2902K8343
6441A96802l9943J1312K5085l1774k1182j1936L1377O3O258j6398L2830J946m452
6428A79988J9343j2252p0058k6033K1017l1132N872P3581j7792l0884j0378K704
6416A03976N4150J5716k1882k2173J6893K0135N167l1937R053o087O7229l3466
6404A76774L2547J2041K5478k073k5049L9552J5593o8075j5779M6858L2188p3511
6392A96544m9340O1326P832k0544j0431K0085k2557m9481j0460O286L1461j965
6380A58756l9530O7675n607j7004J7877l6689l9963m4983N1991L9312M91j3336
6368A38990L3816M581N682J1170l1524J8958m8407J3950j2587m4856J417J5222
$$ plain form
6356 106412 45897 38299 128044 129369 101299 122631 187136 141524 111405 162927 139035 131201
6344 131201 101728 140084 155474 175515 159853 152459 177497 142731 139898 174385 191455 112051
6332 112051 161288 159743 169898 174568 194042 173644 184051 155074 150771 206713 119356 57689
6320 57689 86296 128677 134239 115657 143884 150710 159064 127849 161677 204695 161738 166615 163690
6307 163690 172132 217214 223255 200315 188838 214552 203279 161891 207615 204416 176986 164067
6295 164067 156104 164411 150973 164025 183386 136914 131026 201008 185040 179502 190604 187773 185153
6282 185153 145336 123972 146312 179945 239365 202799 184729 200128 229799 273740 262084 243080
6270 243080 210871 247673 216350 217063 266180 229967 188569 182600 152833 115933 125573 111648
$$ packed form
6356A06412o0515p598Q9745J325k8070K1332O4505m5612l0119N1522k3892p834
6344A31201k9473L8356J5390K0041j5662p394K5038l4766k833L4487J7070p9404
6332A12051M9237j545J0155M670J9474k0398J0407k8977m303N5942q7357o1667
6320E7689K8607M2381N562j8582K8227O826Q354l1215L3828M3018m2957M877k925
6307A63690Q442M5082O041k2940j1477K5714j1273m1388M5724l199k7430j2919
6295A64067p963Q307j3438J3052J9361m6472n888O9982j5968n538J1102k831k620
6282A85153l9817k1364K2340L3633N9420l6566j8070J5399K9671M3941j1656j9004
6270B43080l2209L6802l1323P13M9117l6213m1398n969k9767l6900R640j3925
$$ plain form
6258 111648 158389 162072 121034 132663 133066 162786 148056 247673 235453 238682 226395 174191
6246 174191 184548 255491 190644 195214 213997 197910 234053 192702 213638 196235 194096 216914
6234 216914 222341 230954 194645 190886 184727 208754 219387 237922 288012 321718 312707 269857 261727
6221 261727 252060 298773 291091 259574 291319 263436 255926 213600 212168 249696 241757 229963 261902
6208 261902 238389 246573 317258 297366 263169 263040 314793 267670 266959 245804 233607 214931 270647
6195 270647 282178 190164 199344 188504 222778 256199 254047 214393 191790 120516 193626 247754
6183 247754 218960 221942 167011 188448 172979 129858 194160 161018 130725 175742 205335 192988
6171 192988 212737 146000 148905 160614 139150 166697 129063 178024 195779 206041 214528 230264
$$ packed form
6258A11648M6741L683m1038J1629M03K9720j4730R9617j2220L229j2287n2204
6246A74191J0357P0943o4847M570J8783j6087L6143m1351K0936j7403k139K2818
6234B16914N427Q613l6309l759o159K4027J0633J8535N0090L3706r011m2850q130
6221B61727r667M6713p682l1517L1745k7883p510m2326j432L7528p939j1794L1939
6208B61902k3513Q184P0685j9892l4197j29N1753m7123p11k1155j2197j8676N5716
6195B70647J1531r2014R180j0840L4274L3421k152l9654k2603p1274P3110N4128
6183B47754k8794K982n4931K1437j5469m3121O4302l3142l0293M5017K9593j2347
6171A92988J9749o6737K905J1709k1464K7547l7634M8961J7755J0262Q487J5736
$$ plain form
6159 230264 201718 189556 206722 213299 185423 200811 152192 188592 181072 193627 222489 135339
6147 135339 181432 247929 237388 183107 222204 181002 141904 201503 188116 144837 169682 233865
6135 233865 221870 270903 291444 288352 180675 181407 214602 213433 265320 293204 271941 254569
6123 254569 234374 251789 259839 314978 313073 306752 229040 239510 266828 215739 197831 218423
6111 218423 258804 224443 225025 208973 165064 207262 240936 244993 236997 256402 231439 222563 252197
6098 252197 228808 255758 250776 310624 301308 270883 246336 223681 201383 212419 236925 283604
6086 283604 261612 254612 236867 236440 249493 242972 242509 261839 270775 281670 289314 258572 270499
6073 270499 267056 273755 275405 269468 330369 319077 339688 363102 347158 358552 355923 337371 325466
$$ packed form
6159B30264k8546j2162J7166O577k7876J5388m8619L6400p520J2555K8862q7150
6147A35339M6093O6497j0541n4281L9097m1202l9098N9599j3387m3279K4845O4183
6135B33865j1995M9033K0541l092j07677P32L3195j169N1887K7884k1263j7372
6123B54569k0195J7415Q050N5139j905o321p7712J0470K7318n1089j7908K0592
6111B18423M0381l4361N82j6052m3909M2198L3674M057p996J9405k4963q876K9634
6098B52197k3389K6950m982N9848r316l0425k4547k2655k2298J1036K4506M6679
6086B83604k1992p000j7745m27J3053o521m63J9330Q936J0895P644l0742J1927
6073B70499l443O699J650n937O0901j1292K0611K3414j5944J1394k629j8552j1905
$$ plain form
6060 325466 322483 317432 324203 341569 356076 358775 335426 350265 295671 270479 294410 315227
6048 315227 322849 268174 265786 307286 311114 368623 370453 320356 368108 421480 422419 391294 369755
6035 369755 412571 466890 428686 437426 462481 428793 453758 520367 502740 494978 499683 544538
6023 544538 596023 561825 583756 601201 638707 630186 605919 616669 713344 779867 742372 779269
6011 779269 800812 804691 830923 891530 910399 913528 909701 975739 953982 943379 888005 824884
5999 824884 817458 766304 772401 723815 667253 607281 582277 622496 668097 647767 583023 611361
5987 611361 592707 595887 634682 646309 612793 618712 657745 612387 624433 651582 639014 620256
5975 620256 621182 694509 744814 669641 692310 707226 745931 732718 767169 755681 762939 781199
$$ packed form
6060C25466k983n051O771J7366J4507K699k3349J4839n4594k5192K3931K0817
6048C15227P622n4675k388M1500L828N7509J830n0097M7752N3372R39l1125k1539
6035C69755M2816N4319l8204Q740K5055l3688K4965O6609j7627p762M705M4855
6023E44538N1485l4198K1931J7445L7506q521k4267J0750R6675O6523l7495L6897
6011G79269K1543L879K6232O0607J8869L129l827O6038k1757j0603n5374o3121
5999H24884p426n1154O097m8586n6562n9972k5004M0219M5601k0330o4744K8338
5987F11361j8654L180L8795J1627l3516N919L9033m5358J2046K7149j2568j8758
5975F20256R26P3327N0305p5173K2669J4916L8705j3213L4451j1488P258J8260
$$ plain form
5963 781199 717281 673714 702051 744704 760271 783047 748237 805538 750199 745429 728263 721286
5951 721286 735809 737281 794123 830831 798360 723286 715124 740827 803052 797366 805775 793729
5939 793729 781490 817717 793609 792805 867155 869684 807777 836630 871126 849391 881229 906111
5927 906111 912845 911411 916372 960748 940089 1012359 990588 954325 985733 994262 997654 1045364 1065098
5914 1065098 1096179 1118751 1091942 1133666 1157420 1167246 1214631 1169280 1101493 1116131 1136318 1182024
5902 1182024 1238321 1266251 1310163 1337478 1334744 1344849 1421184 1484747 1547368 1639822 1662508 1748401
5890 1748401 1857504 1975797 2075347 2193823 2407291 2554322 2661930 2794150 2930996 3073369
5880 3073369 3219139 3436118 3451130 3457686 3451652 3378714 3287724 3089168 2872611 2643944 2454129
$$ packed form
5963G81199o3918m3567K8337M2653J5567K2776l4810N7301n5339m770j7166o977
5951G21286J4523J472N6842L6708l2471p5074q162K5703O2225n686Q409j2046
5939G93729j2239L6227k4108q04P4350K529o1907K8853L4496k1735L1838K4882
5927I06111O734j434M961M4376k0659P2270k1771l6263L1408Q529L392M7710J9734
5914A065098L1081K2572k6809M1724K3754R826M7385m5351o7787J4638K0187M5706
5902A182024N6297K7930M3912K7315k734J0105P6335O3563O2621R2454K2686Q5893
5890A748401J09103J18293R9550J18476K13468J47031J07608J32220J36846J42373
5880C073369J45770K16979J5012O556o034p2938r0990j98556k16557k28667j89815
$$ plain form
5869 2454129 2244641 2126558 2033062 1931049 1845268 1758766 1682567 1671084 1647609 1541388 1515531
5858 1515531 1450611 1454381 1402947 1388423 1396571 1402176 1389855 1332580 1297460 1285482 1247286 1236388
5846 1236388 1233733 1239231 1257678 1290829 1264711 1186723 1247472 1222684 1230617 1262515 1262165 1219982
5834 1219982 1171728 1206825 1162264 1163684 1182295 1107911 1129612 1070221 1058339 1083163 1093246 1158017
5822 1158017 1142072 1128755 1061894 1091102 1149849 1085006 1099691 1158445 1165755 1158249 1228450 1203800
5810 1203800 1184660 1130886 1157863 1223055 1223973 1223170 1252249 1243346 1265079 1285137 1336691 1346566 1369013
5797 1369013 1410789 1428858 1525638 1596369 1595551 1656892 1735590 1797525 1888140 1973777 2069659 2189915
5785 2189915 2271723 2394299 2537752 2696297 2885561 3133455 3357747 3624172 3914858 4149003
$$ packed form
5869B454129k09488j18083r3496j02013q5781q6502p6199j1483k3475j06221k5857
5858A515531o4920L770n1434j4524Q148N605j2321n7275l5120j1978l8196j0898
5846A236388k655N498J8447L3151k6118p7988O0749k4788P933L1898l50m2183
5834A219982m8254L5097m4561J420J8611p4384K1701n9391j1882K4824J0083O4771
5822A158017j5945j3317o6861K9208N8747o4843J4685N8754P310p506P0201k4650
5810A203800j9140n3774K6977O5192R18q03K9079q903K1733K0058N1554R875K2447
5797A369013M1776J8069R6780P0731q18O1341P8698O1935R0615Q5637R5882J20256
5785B189915Q1808J22576J43453J58545J89264K47894K24292K66425K90686K34145
$$ plain form
5775 4149003 4316536 4273080 4026837 3615684 3216924 2800962 2466941 2228875 2045538 1842390
5765 1842390 1674387 1544443 1447402 1357323 1345220 1271503 1198162 1138440 1057551 1001557 1017993
5754 1017993 966862 909689 938789 921086 919922 891876 849455 840835 797731 746528 784333 762695
5742 762695 749213 744257 719777 716036 677818 683024 700731 682372 626854 653541 644055 625991
5730 625991 577028 555550 590221 617189 529681 553015 511705 539252 553573 501513 482007 539665
5718 539665 557410 539976 536305 532986 504092 459605 536059 484250 493877 595669 515542 497096
5706 497096 501448 478029 451840 438163 442532 403690 352445 369036 399168 405410 494082 455405
5694 455405 451881 413992 485858 504470 447411 387186 360782 350395 385781 392955 365375 360223
$$ packed form
5775D149003J67533m3456k46243m11153l98760m15962l34021k38066j83337k03148
5765A842390j68003j29944r7041r0079j2103p3717p3341n9722q0889n5994J6436
5754A017993n1131n7173K9100j7703j164k8046m2421q620m3104n1203L7805k1638
5742G62695j3482m956k4480l741l8218N206J7707j8359n5518K6687r486j8064
5730F25991m8963k1478L4671K6968q7508K3334m1310K7547J4321n2060j9506N7658
5718E39665J7745j7434l671l319k8894m4487P6454n1809R627J01792q0127j8446
5706D97096M352k3419k6189j3677M369l8842n1245J6591L0132O242Q8672l8677
5694D55405l524l7889P1866J8612n7059o0225k6404j0387L5386P174k7580n152
$$ plain form
5682 360223 378541 448362 452665 419856 455490 454345 453304 393558 397153 438015 413072 367511
5670 367511 387859 382960 368485 345596 341809 355188 360996 351914 365119 350885 306584 303518 313886
5657 313886 390861 357740 333422 340092 356040 351488 302212 356786 320289 360246 388249 361183
5645 361183 385484 359864 369845 357925 382667 380454 397002 407848 388044 342422 331917 361760
5633 361760 418459 419039 396475 467886 431411 448917 411910 368222 365209 317677 360130 369386
5621 369386 435812 422283 447145 459803 382396 348071 365801 348160 342883 389153 413715 331973
5609 331973 316381 392706 410416 350064 383562 396668 375899 364188 374398 410812 375641 410369
5597 410369 407519 402935 376219 374925 341759 320021 375866 392425 379350 357902 386378 394644
$$ packed form
5682C60223J8318O9821M303l2809L5634j145j041n9746L595M0862k4943m5561
5670C67511K0348m899j4475k2889l787J3379N808r082J3205j4234m4301l066J0368
5657C13886P6975l3121k4318O670J5948m552m9276N4574l6497L9957K8003k7066
5645C61183K4301k5620R981j1920K4742k213J6548J0846j9804m5622j0505K9843
5633C61760N6699N80k2564P1411l6475J7506l7007m3688l013m7532M2453R256
5621C69386O6426j3529K4862J2658p7407l4325J7730j7641n277M6270K4562q1742
5609C31973j5592P6325J7710o0352L3498J3106k0769j1711J0210L6414l5171L4728
5597D10369k850m584k6716j294l3166k1738N5845J6559j3075k1448K8476Q266
$$ plain form
5585 394644 345065 361918 419681 512590 485617 410288 371034 384993 392078 414518 431208 410175
5573 410175 426530 486433 465158 454942 482172 490638 431745 430853 470199 452617 465388 467704
5561 467704 445572 463345 446035 452987 407024 376843 433038 428927 469031 459342 480802 483784
5549 483784 483787 462770 433311 441401 504969 439165 405622 446932 470276 487361 488946 477019 466387
5536 466387 471481 501177 505528 493453 451292 478977 504199 484636 456428 454558 512261 462297
5524 462297 502561 479705 460169 483596 448226 485789 493627 482378 496131 516829 490991 510389
5512 510389 510868 548920 520864 542894 529597 519492 603611 555599 542530 551309 524550 535734
5500 535734 565317 540918 539857 518374 545073 523797 458122 451885 489064 503507 540791 580172
$$ packed form
5585C94644m9579J6853N7763R2909k6973p5329l9254J3959P085K2440J6690k1033
5573D10175J6355N9903k1275j0216K7230Q466n8893q92L9346j7582J2771K316
5561D67704k2132J7773j7310O952m5963l0181N6195m111M0104r689K1460K982
5549D83784Lk1017k9459Q090O3568o5804l3543M1310K3344J7085J585j1927j0632
5536D66387N094K9696M351j2075m2161K7685K5222j9563k8208j870N7703m9964
5524D62297M0264k2856j9536K3427l5370L7563P838j1249J3753K0698k5838J9398
5512E10389M79L8052k8056K2030j3297j0105Q4119m8012j3069Q779k6759J1184
5500E35734K9583k4399j061k1483K6699k1276o5675o237L7179J4443L7284L9381
$$ plain form
5488 580172 592807 515529 484266 520073 577498 609193 502594 491764 487790 572754 544924 509974
5476 509974 571955 563782 516520 514648 490563 513471 537770 539140 525782 483384 513080 514733
5464 514733 562992 555216 547919 563906 574723 556114 524748 503157 481166 526886 575090 476112
5452 476112 495736 559475 543820 535853 522653 546989 559320 536316 602184 597157 570682 539755
5440 539755 572854 635937 616872 633475 605454 623566 600892 628418 636763 638770 605257 592742
5428 592742 578899 596938 561488 544027 589248 669969 685126 634650 669325 640618 617912 661707
5416 661707 639628 646399 680506 707901 707789 689240 679688 651048 687588 692919 701334 717692 829941
5403 829941 826885 792243 829655 810050 768445 802802 785074 744575 722935 779479 815133 796608
$$ packed form
5488E80172J2635p7278l1263L5807N7425L1695j06599j0830l974Q4964k7830l4950
5476E09974O1981q173m7262j872k4085K2908K4299J370j3358m2398K9696J653
5464E14733M8259p776p297J5987J0817j8609l1366k1591k1991M5720M8204r8978
5452D76112J9624O3739j5655p967j3200K4336J2331k3004O5868n027k6475l0927
5440E39755L3099O3083j9065J6603k8021J8112k2674K7526Q345K007l3513j2515
5428E92742j3843J8039l5450j7461M5221Q0721J5157n0476L4675k8707k2706M3795
5416F61707k2079O771L4107K7395j12j8549r552k8640L6540N331Q415J6358J12249
5403H29941l056l4642L7412j9605m1605L4357j7728m0499k1640N6544L5654j8525
$$ plain form
5391 796608 799126 801039 796647 786026 785518 797047 824298 824648 827507 849252 802309 816911 781283
5378 781283 785351 742807 786315 753283 729340 841494 880196 856092 800245 818832 817763 856615
5366 856615 874300 904090 915344 808306 786415 813843 789731 723040 797222 852801 840613
5355 840613 851971 847809 851548 800429 774219 759122 770839 805398 847674 838382 856546 822130
5343 822130 843411 864672 815621 864850 827556 789289 743739 781024 802636 821312 831098 857350
5331 857350 857593 830899 855739 802718 873231 850170 840080 866985 919873 889600 906589 879995
5319 879995 868739 898826 959473 920206 929692 948839 978716 1018395 1010506 989278 953129 925050
5307 925050 952831 1046956 1025809 983387 1039178 1050116 1033439 1054261 1102170 1128569 1105293 1134892
$$ packed form
5391G96608K518J913m392j0621n08J1529K7251L50K859K1745m6943J4602l5628
5378G81283M068m2544M3508l3032k3943J12154L8702k4104n5847J8587j069L8852
5366H56615J7685K9790J1254j07038k1891K7428k4112o6691P4182N5579j2188
5355H40613J1358m162L739n1119k6210j5097J1717L4559M2276r292J8164l4416
5343H22130K1281K1261m9051M9229l7294l8267m5550L7285K1612J8676R786K6252
5331H57350K43k6694K4840n3021P0513k3061j0090K6905N2888l0273J6989k6594
5319H79995j1256L0087O0647l9267R486J9147K9877L9679p889k1228l6149k8079
5307I25050K7781R4125k1147m2422N5791J0938j6677K0822M7909K6399k3276K9599
$$ plain form
5295 1134892 1128513 1137871 1080043 1031362 1037323 1062103 1104903 1150244 1165866 1177070 1146495 1191387
5283 1191387 1231717 1235364 1222738 1233697 1321086 1299258 1319734 1359962 1398215 1431343 1466967 1466743
5271 1466743 1463702 1406737 1398232 1370068 1407866 1444122 1416661 1434573 1512223 1470611 1431471 1515207
5259 1515207 1526075 1502566 1579646 1641877 1698641 1755557 1771256 1825861 1845495 1894160 1937502
5248 1937502 1994766 1966826 2036775 2076958 2083512 2047194 1925567 1841134 1746850 1715924 1687824
5237 1687824 1677902 1694042 1733955 1725455 1653229 1641828 1710041 1793449 1748923 1701432 1716517 1697915
5225 1697915 1722681 1752956 1748630 1752113 1812903 1798021 1814155 1848476 1819714 1865277 1832073 1879273
5213 1879273 1881996 1925818 1954957 1955096 2009804 2030017 2063589 2076765 2034194 2014820 2030036 2035879
$$ packed form
5295A134892o379R358n7828m8681N961K4780M2800M5341J5622J1204l0575M4892
5283A191387M0330L647j2626J0959Q7389k1828K0476M0228L8253L3128L5624k24
5271A466743l041n6965q505k8164L7798L6256k7461J7912P7650m1612l9140Q3736
5259A515207J0868k3509P7080O2231N6764N6916J5699N4605J9634M8665M3342
5248A937502N7264k7940O9949M0183O554l6318j21627q4433r4284l0926k8100
5237A687824r922J6140L9913q500p2226j1401O8213Q3408m4526m7491J5085j8602
5225A697915K4766L0275m326L483O0790j4882J6134L4321k8762M5563l3204M7200
5213A879273K723M3822K9139J39N4708K0213L3572J3176m2571j9374J5216N843
$$ plain form
5201 2035879 2097486 2158878 2170093 2209216 2241074 2215769 2277372 2350600 2358358 2426986 2462491 2528427
5189 2528427 2577826 2591578 2710132 2821365 2903455 3015390 3070129 3149680 3245224 3337935 3445233
5178 3445233 3546910 3679016 3846691 3952697 4130754 4221497 4314663 4414264 4527097 4639128
5168 4639128 4671065 4683817 4661874 4603269 4480418 4483439 4472193 4462385 4484861 4538647 4567398 4532112
5156 4532112 4595116 4642521 4732832 4819411 4859007 4860236 5000078 5110944 5104460 5168192 5240850
5145 5240850 5311258 5407202 5425386 5515376 5606219 5758014 5928761 6078499 6227730 6395627
5135 6395627 6558354 6786779 6968560 7115168 7372614 7697307 8067684 8402163 8733940 9127897
5125 9127897 9508930 9948800 10342128 10798014 11318248 11815292 12377047 13020949 13776799 14514844
$$ packed form
5201B035879O1607O1392J1215L9123L1858k5305O1603P3228P758O8628L5505O5936
5189B528427M9399J3752J18554J11233Q2090J11935N4739P9551R5544R2711J07298
5178C445233J01677J32106J67675J06006J78057R0743R3166R9601J12833J12031
5168D639128L1937J2752k1943n8605j22851L021j1246r808K2476N3786K8751l5286
5156D532112O3004M7405R0311Q6579L9596J229J39842J10866o484O3732P2658
5145E240850P0408R5944J8184Q9990R0843J51795J70747J49738J49231J67897
5135F395627J62727K28425J81781J46608K57446L24693L70377L34479L31777L93957
5125I127897L81033M39870L93328M55886N20234M97044N61755O43902P55850P38045
$$ plain form
5115 14514844 15329781 16275488 17244381 18369589 19671130 21399411 23240166 25220371 27528709
5106 27528709 30089996 33054073 36160974 39643426 43537463 47851590 53049008 59952112
5098 59952112 68006843 76977506 86849190 97286553 105226727 107566592 97289931 79406077
5090 79406077 64671696 54020632 46280624 40575810 36171258 32320464 29144642 26545192
5082 26545192 24410996 22621001 21229346 19986830 19024398 18102872 17205740 16315192 15540234
5073 15540234 14839347 14186652 13637785 13076758 12519259 12039233 11498958 10984131 10521743
5064 10521743 10134838 9737883 9366647 9032257 8730159 8488479 8307615 8072275 7923692
5055 7923692 7707054 7455355 7204649 6991173 6771417 6661187 6484334 6304263 6193573 6077668
$$ packed form
5115A4514844Q14937R45707R68893J125208J301541J728281J840755J980205K308338
5106B7528709K561287K964077L106901L482452L894037M314127N197418O903104
5098E9952112Q054731Q970663R871684J0437363P940174K339865j0276661j7883854
5090G9406077j4734381j0651064p740008n704814m404552l850794l175822k599450
5082B6545192k134196j789995j391655j242516r62432r21526q97132q90548p74958
5073A5540234p00887o52695n48867n61027n57499m80026n40275n14827m62388
5064A0521743l86905l96955l71236l34390l02098k41680j80864k35340j48583
5055G923692k16638k51699k50706k13476k19756j10230j76853j80071j10690j15905
$$ plain form
5045 6077668 5936469 5818677 5620050 5515292 5357387 5287059 5222203 5126116 5017175 4909504
5035 4909504 4782868 4642497 4628821 4603769 4530231 4480188 4509608 4432367 4352015 4314994 4272003
5024 4272003 4193040 4071131 3990407 3966215 3899279 3798615 3744357 3684188 3659076 3605177 3565399
5013 3565399 3487334 3438599 3450186 3395296 3334068 3249591 3132953 3112998 3090209 3038980 2992138
5002 2992138 3002555 3007788 2930093 2865172 2794393 2776221 2805706 2832862 2816356 2755630 2693592 2702527
4990 2702527 2694569 2649067 2617620 2574445 2581302 2542344 2516296 2463368 2470276 2455468 2464822 2465991
4978 2465991 2389496 2345912 2333017 2327916 2327125 2317624 2268699 2309055 2321446 2301539 2334686 2421110
4966 2421110 2381313 2347898 2350773 2377398 2378351 2416585 2401142 2412402 2456472 2467424 2432838 2451322
$$ packed form
5045F077668j41199j17792j98627j04758j57905p0328o4856r6087j08941j07671
5035D909504j26636j40371j3676k5052p3538n0043K9420p7241q0352l7021m2991
5024D272003p8963j21909q0724k4192o6936j00664n4258o0169k5112n3899l9778
5013C565399p8065m8735J1587n4890o1228q4477j16638j9955k2789n1229m6842
5002B992138J0417N233p7695o4921p0779j8172K9485K7156j6506o0726o2038Q935
4990B702527p958m5502l1447m3175O857l8958k6048n2928O908j4808R354J169
4978B465991p6495m3584j2895n101p91r501m8925M0356J2391j9907L3147Q6424
4966B421110l9797l3415K875K6625R53L8234j5443J1260M4070J0952l4586J8484
$$ plain form
4954 2451322 2473133 2501664 2517727 2506048 2512722 2481206 2485782 2493705 2517757 2464892 2478690 2446549
4942 2446549 2355105 2300664 2300851 2289800 2238457 2283744 2254106 2235640 2238649 2196691 2221911 2236990
4930 2236990 2247260 2246584 2252867 2239445 2160228 2222042 2217650 2125708 2127458 2102638 2082553 2094746
4918 2094746 2043445 2043240 1993593 2006207 1988977 1957580 1951991 1980238 1953819 1936370 1969466 1949630
4906 1949630 1971924 1988784 1959905 1907265 1835473 1850510 1848073 1829221 1800678 1804001 1816212 1835305
4894 1835305 1808703 1795458 1807562 1802857 1765361 1743306 1774053 1772418 1776411 1769154 1661505 1655183
4882 1655183 1675638 1684223 1687446 1698311 1748192 1723196 1739740 1727882 1808936 1793538 1788924 1818825
4870 1818825 1870303 1860928 1854961 1828333 1839851 1808915 1801244 1825279 1819817 1809378 1766317 1771207
$$ packed form
4954B451322K1811K8531J6063j1679O674l1516M576P923K4052n2865J3798l2141
4942B446549r1444n4441J87j1051n1343M5287k9638j8466L009m1958K5220J5079
4930B236990J0270o76O283j3422p9217O1814m392r1942J750k4820k0085J2193
4918B094746n1301k05m9647J2614j7230l1397n589K8247k6419j7449L3096j9836
4906A949630K2294J6860k8879n2640p1792J5037k437j8852k8543L323J2211J9093
4894A835305k6602j3245J2104m705l7496k2055L0747j635L993p257j07649o322
4882A655183K0455Q585L223J0865M9881k4996J6544j1858Q1054j5398m614K9901
4870A818825N1478r375n967k6628J1518l0936p671K4035n462j0439m3061M890
$$ plain form
4858 1771207 1791542 1767539 1758453 1781579 1804350 1766548 1798235 1829776 1812262 1830120 1892753 1906437
4846 1906437 1934502 1910518 1885735 1981038 2025112 2110421 2090518 1978035 1918515 1904168 1852837
4835 1852837 1769100 1812843 1876172 1818494 1795385 1780624 1754583 1751766 1782232 1802950 1838633 1859510
4823 1859510 1838179 1811285 1797672 1873561 1870527 1834852 1814268 1776331 1701884 1636207 1625778 1688727
4811 1688727 1645649 1634127 1652078 1602435 1550066 1525063 1485702 1449313 1490074 1539509 1542424 1595267
4799 1595267 1618712 1575621 1443629 1450708 1467583 1405752 1387642 1399061 1380719 1356831 1416760
4788 1416760 1384978 1347382 1276778 1250069 1249858 1259158 1289223 1304988 1267329 1241416 1141420 1152221
4776 1152221 1112686 1120789 1124699 1101772 1103378 1049300 1046925 1047609 1023099 988916 1008386 1045224 1021628
$$ packed form
4858A771207K0335k4003r086K3126K2771l7802L1687L1541j7514J7858O2633J3684
4846A906437K8065k3984k4783R5303M4074Q5309j9903j12483n9520j4347n1331
4835A852837q3737M3743O3329n7678k3109j4761k6041k817L0466K0718L5683K0877
4823A859510k1331k6894j3613P5889l034l5675k0584l7937p4447o5677j0429O2949
4811A688727m3078j1522J7951m9643n2369k5003l9361l6389M0761M9435K915N2843
4799A595267K3445m3091j31992P079J6875o1831j8110J1419j8342k3888N9929
4788A416760l1782l7596p0604k6709k11R300L0065J5765l7659k5913r9996J0801
4776A152221l9535Q103L910k2927J606n4078k375O84k4510l4183J9470L6838k3596
$$ plain form
4763 1021628 1022291 1024977 992723 950601 1011113 1007590 1023677 962056 963982 962943 947356 1005290 966497
4750 966497 953941 867220 882100 935058 863233 894785 878594 944790 958034 943892 863156 859444
4738 859444 964373 886152 865104 848183 842424 811087 772169 824662 858006 850891 846145 846694
4726 846694 908739 885731 894211 862699 852734 815563 772217 776990 761009 771246 772930 712095
4714 712095 813935 825555 766396 792641 794825 786532 817898 860000 819283 799663 784015 810862
4702 810862 852631 809255 751953 737409 720128 712335 790908 813606 819649 805950 741999 764594
4690 764594 810294 821246 847397 771831 748982 764064 802799 736772 754623 794072 846885 804489
4678 804489 769422 753670 753107 757889 718414 751397 742504 755906 774246 777176 802510 828395 767357
$$ packed form
4763A021628O63K686l2254m2122O0512l523J6087o1621J926j039j5587N7934l8793
4750I66497j2556q6721J4880N2958p1825L1552j6191O6196J3244j4142q0736l712
4738H59444J04929p8221k1048j6921n759l1337l8918N2493L3344p115m746N49
4726H46694O2045k3008Q480l1512r965l7171m3346M773j5981J0237J684o0835
4714G12095J01840J1620n9159K6245K184q293L1366M2102m0717j9620j5648K6847
4702H10862M1769m3376n7302j4544j7281p793P8573K2698O043j3699o3951K2595
4690G64594M5700J0952K6151p5566k2849J5082L8735o6027J7851L9449N2813m2396
4678H04489l5067j5752n63M782l9475L2983q893J3402J8340K930K5334K5885o1038
$$ plain form
4665 767357 792297 846706 835200 807505 851839 824561 784606 779011 799762 763033 833962 888546
4653 888546 898365 858437 849669 896972 869254 859829 863603 893918 859041 883420 844136 872705
4641 872705 838164 873328 968921 930963 986821 958555 940582 933345 920283 913741 946456 950744
$$ packed form
4665G67357K4940N4409j1506k7695M4334k7278l9955n595K0751l6729P0929N4584
4653H88546R819l9928q768M7303k7718r425L774L0315l4877K4379l9284K8569
4641H72705l4541L5164R5593l7958N5858k8266j7973p237j3062o542L2715M288
$$ [...]
##END NTUPLES=NMR SPECTRUM
##END=
