##TITLE=1H_EC-3254(5-4)
 CDCl3, 8 sc, 
 8.07.2021
##JCAMPDX= 6.0         $$ Bruker NMR JCAMP-DX V2.0
##DATA TYPE= NMR SPECTRUM
##DATA CLASS= NTUPLES
##ORIGIN= UXNMR, Bruker Analytische Messtechnik GmbH
##OWNER= root
$$ XWIN-NMR		Version 3.5
$$ Thu Jul  8 11:41:16 2021 Russian Standard Time (UT+4h)  she@DPX200
##.OBSERVE FREQUENCY= 200.131506
##.OBSERVE NUCLEUS= ^1H
##.ACQUISITION MODE= SIMULTANEOUS
##.ACQUISITION SCHEME= undefined
##.AVERAGES= 8
##.DIGITISER RES= 18
##SPECTROMETER/DATA SYSTEM= spect
##.PULSE SEQUENCE= zg30
##.SOLVENT NAME= CDCl3
##.SHIFT REFERENCE= (INTERNAL, CDCl3, 0, 17.5081)
##AUDIT TRAIL= $$ (NUMBER, WHEN, WHO, WHERE, WHAT)
$$ ##TITLE= Audit trail, XWIN-NMR		Version 3.5
$$ ##JCAMPDX= 5.01
$$ ##ORIGIN= Bruker BioSpin GmbH
$$ ##OWNER= she
$$ F:/spectra/data/she/nmr/H-F/1/pdata/1/auditp.txt
$$ ##AUDIT TRAIL=  $$ (NUMBER, WHEN, WHO, WHERE, WHAT)
(   1,<2021-07-08 11:39:29.93 +0400>,<she>,<DPX200>,
      <created by zg, POWCHK disabled, PULCHK disabled
       configuration hash MD5:
       00 E9 B6 7A A2 85 ED C7 34 08 36 98 17 FE 4E 26
       data hash MD5: 16K
       AD BF 13 30 4C 8E 81 B5 31 B0 E9 62 C8 4C 14 27>)
(   2,<2021-07-08 11:39:32.84 +0400>,<she>,<DPX200>,
      <Start of raw data processing
       efp BC_mod = 2 LB = 0.24 FT_mod = 6 PKNL = 1 PHC0 = -12432.01 PHC1 = 9.20101 SI = 16K 
       data hash MD5: 16K
       FF 7C DA B3 00 D0 FD F1 52 76 C2 C5 9A E0 A4 13>)
(   3,<2021-07-08 11:39:55.20 +0400>,<she>,<DPX200>,
      <pk PHC0 = -0.8073128 PHC1 = 1.8 
       data hash MD5: 16K
       CF 91 CB 5D A9 36 BB 79 3B 17 DA 04 8E 3E 7F 12>)
(   4,<2021-07-08 11:39:58.64 +0400>,<she>,<DPX200>,
      <abs ABSG = 5 
       data hash MD5: 16K
       48 BA 65 4D 1D AD CD 04 62 B7 30 E4 74 BC B8 1A>)
(   5,<2021-07-08 11:40:27.26 +0400>,<she>,<DPX200>,
      <pk PHC0 = 1.674818 PHC1 = -2.6 
       data hash MD5: 16K
       90 3B 12 0D E6 0E 3D 0F 9A 05 97 4C 55 5D 64 2D>)
(   6,<2021-07-08 11:40:30.98 +0400>,<she>,<DPX200>,
      <abs ABSG = 5 
       data hash MD5: 16K
       3A F7 54 43 55 5E B6 14 F8 F4 7B 09 E2 B2 D5 12>)
$$ ##END=
$$ 
$$ hash MD5
$$ 06 E5 BF 00 EB 03 42 2F F1 19 DB 86 F0 CC F2 22
##$RELAX= 
##$RELAX= 
##$RELAX= 
##$RELAX= 
##$RELAX= 
##$RELAX= 
$$ Bruker specific parameters
$$ --------------------------
##$DU= <F:/spectra>
##$EXPNO= 1
##$NAME= <H-F>
##$PROCNO= 1
##$TYPE= <nmr>
##$USER= <she>
##$AMP= (0..31)
100 100 100 100 100 100 100 100 100 100 100 100 100 100 100 100 100 100 
100 100 100 100 100 100 100 100 100 100 100 100 100 100 
##$AQSEQ= 0
##$AQ_mod= 1
##$AUNM= <au_zg>
##$AUTOPOS= <>
##$BF1= 200.13
##$BF2= 200.13
##$BF3= 200.13
##$BF4= 200.13
##$BF5= 200.13
##$BF6= 200.13
##$BF7= 200.13
##$BF8= 200.13
##$BYTORDA= 1
##$CFDGTYP= 0
##$CFRGTYP= 5
##$CHEMSTR= <none>
##$CNST= (0..31)
1 1 145 1 1 1 1 1 1 1 1 1 1 1 1 1 1 1 1 1 1 1 1 1 1 1 1 1 1 1 1 1 
##$CPDPRG= <>
##$CPDPRG1= <>
##$CPDPRG2= <>
##$CPDPRG3= <>
##$CPDPRG4= <mlev>
##$CPDPRG5= <mlev>
##$CPDPRG6= <mlev>
##$CPDPRG7= <mlev>
##$CPDPRG8= <mlev>
$$ [...]
##$SUBNAM3= <"">
##$SUBNAM4= <"">
##$SUBNAM5= <"">
##$SUBNAM6= <"">
##$SUBNAM7= <"">
##$SUBNAM8= <"">
##$SUBNAM9= <"">
##$SW= 20.0188882624521
##$SWIBOX= (0..15)
0 0 2 0 0 0 0 0 0 0 0 0 0 0 0 0 
##$SW_h= 4006.41025641026
##$TD= 16384
##$TD0= 1
##$TE= 0
##$TE2= 300
##$TE3= 300
##$TEG= 300
##$TL= (0..7)
0 120 120 120 120 120 120 120 
##$TP= (0..7)
150 150 150 150 150 150 150 150 
##$TP07= 0
##$TPNAME0= <>
##$TPNAME1= <>
##$TPNAME2= <>
##$TPNAME3= <>
##$TPNAME4= <>
##$TPNAME5= <>
##$TPNAME6= <>
##$TPNAME7= <>
##$TPOAL= (0..7)
0.5 0.5 0.5 0.5 0.5 0.5 0.5 0.5 
##$TPOFFS= (0..7)
0 0 0 0 0 0 0 0 
##$TUNHIN= 0
##$TUNHOUT= 0
##$TUNXOUT= 0
##$USERA1= <user>
##$USERA2= <user>
##$USERA3= <user>
##$USERA4= <user>
##$USERA5= <user>
##$V9= 5
##$VALIST= <valist>
##$VCLIST= <CCCCCCCCCCCCCCC>
##$VD= 0
##$VDLIST= <DDDDDDDDDDDDDDD>
##$VPLIST= <PPPPPPPPPPPPPPP>
##$VTLIST= <TTTTTTTTTTTTTTT>
##$WBST= 1024
##$WBSW= 4
##$XGAIN= (0..3)
0 0 0 0 
##$XL= 0
##$YL= 0
##$YMAX_a= 383040
##$YMIN_a= -277576
##$ZGOPTNS= <>
##$ZL1= 120
##$ZL2= 120
##$ZL3= 120
##$ZL4= 120
##$ABSF1= 17.502
##$ABSF2= -2.517038
##$ABSG= 5
##$ABSL= 3
##$ALPHA= 0
##$AQORDER= 0
##$ASSFAC= 0
##$ASSFACI= 0
##$ASSFACX= 0
##$ASSWID= 0
##$AUNMP= <proc_1d>
##$AZFE= 0.1
##$AZFW= 0.1
##$BCFW= 0
##$BC_mod= 2
##$BYTORDP= 0
##$COROFFS= 0
##$CY= -3
##$DATMOD= 1
##$DC= 0
##$DFILT= <>
##$DTYPP= 0
##$F1P= 0
##$F2P= 0
##$FCOR= 1
##$FTSIZE= 16384
##$FT_mod= 6
##$GAMMA= 0
##$GB= 0
##$INTBC= 1
##$INTSCL= 1.334414e-10
##$ISEN= 128
##$LB= 0.24
##$LEV0= 0
##$LPBIN= 0
##$MAXI= 10000
##$MC2= 0
##$MEAN= 0
##$ME_mod= 0
##$MI= 1.114404
##$NCOEF= 0
##$NC_proc= -7
##$NLEV= 6
##$NOISF1= 3.799351
##$NOISF2= 2.8
##$NSP= 0
##$NTH_PI= 0
##$NZP= 0
##$OFFSET= 17.50811
##$PC= 1
##$PHC0= -12431.15
##$PHC1= 8.401011
##$PH_mod= 1
##$PKNL= yes
##$PPARMOD= 0
##$PSCAL= 0
##$PSIGN= 0
##$REVERSE= no
##$SF= 200.130005308094
##$SI= 16384
##$SIGF1= 3
##$SIGF2= 2
##$SINO= 5.538805
##$SIOLD= 16384
##$SREGLST= <1H.CDCl3>
##$SSB= 0
##$STSI= 16384
##$STSR= 0
##$SW_p= 4006.41025641026
##$SYMM= 0
##$S_DEV= 0
##$TDeff= 16384
##$TDoff= 0
##$TI= <>
##$TILT= no
##$TM1= 0
##$TM2= 0
##$TOPLEV= 0
##$USERP1= <user>
##$USERP2= <user>
##$USERP3= <user>
##$USERP4= <user>
##$USERP5= <user>
##$WDW= 1
##$XDIM= 16384
##$YMAX_p= 447430731
##$YMIN_p= -1652659
$$ End of Bruker specific parameters
$$ ---------------------------------
##NTUPLES= NMR SPECTRUM
##VAR_NAME=  FREQUENCY,     SPECTRUM/REAL,   SPECTRUM/IMAG
##SYMBOL=    X,             R,               I
##VAR_TYPE=  INDEPENDENT,   DEPENDENT,       DEPENDENT
##VAR_FORM=  AFFN,          ASDF,            ASDF
##VAR_DIM=   16384,         16384,           16384
##UNITS=     HZ,            ARBITRARY UNITS, ARBITRARY UNITS
##FACTOR=    0.24454680195387, 1,            1
##FIRST=     3503.89815651807, 0,            0
##LAST=      -502.512099892192, 0,           0
##MIN=       -502.512099892192, -1652659,    0
##MAX=       3503.89815651807, 447430731,    0
$$ Real data points
##PAGE= N=1
##DATA TABLE= (X++(R..R)), XYDATA
$$ [...]
6133B47253O861n835N03l4653O6261K4743j4208j4346J11241l0454r3635J9436
6121B83167J279O5280r2028j1469o4991K9364N2556J02522p5116j19481J34137
6110C05220m1724K6500j3564l102J31108l3813M5014j5356r3174n5015q4030R0385
6098B58449J19381k2537p9613K3767j08224k5602R8062q977N974k5903M3274L9770
6086C17821k5753J8100j7088R1272k5676n9063n4429J02062j32042N0884R1863
6075C57951m5702K8018j06219R2050m515k6436K9047n2388M8076j23857J06486
6064C02511k108n0731R1056M6698j971J01413o2921J7900m5390Q0967K5149p871
6052D94702R8643l4894p275K4389q1722J7335J15478m0305m7097R8859J64937
$$ plain form
6133 247253 254114 248279 248782 214129 280390 305133 290925 276579 387820 357366 263731 283167
6121 283167 284446 349726 257698 246229 181238 210602 263158 365680 290564 171083 305220
6110 305220 263496 289996 276432 273330 404438 370625 415639 400283 307109 252094 168064 258449
6098 258449 377830 355293 275680 299447 191223 165621 263683 254706 260680 234777 278051 317821
6086 317821 292068 310168 293080 384352 358676 299613 245184 347246 215204 266088 357951
6075 357951 312249 340267 234048 326098 321583 295147 324194 271806 319882 196025 302511
6064 302511 300403 249672 340728 387426 385455 486868 423947 441847 396457 477424 502573 494702
6052 494702 593345 558451 551176 575565 493843 511178 626656 586351 539254 638113 803050
6041H03050L0535J8365P7482P4497P3538K4111Q0689L9620J22091J77392j9829
6030A501541J07124P1818j5347r2235l124M5660K20143J32694L901l4899K07748
6019B145024J05677J45357K04957k4718n8382j4074J45243j35349k95857j25199
6009B092679l6066j10378j02272k9836p0243K7212o2342J05320k1431l3717j05040
5998A653886k9349l9079j67064r4766j22911r6933r4103r3654k4119j06047O2705
5987H48566P8453j22629r0456j9814r4929J610N2753J23925n6238L217L1936l8570
5975G17824K2459N0023P2836q4719p8433K6847J10857q67J5555J90951J32852
5964A176185K3038K5494J55653m2797L5360Q2944J65181O6461K63200K45861O1418
$$ plain form
6041 803050 833585 851950 929432 1003929 1077467 1101578 1182267 1221887 1343978 1521370 1501541
6030 1501541 1608665 1680483 1665136 1572901 1569777 1615437 1835580 1968274 1972175 1937276 2145024
6019 2145024 2250701 2396058 2601015 2576297 2517915 2503841 2649084 2513735 2217878 2092679
6009 2092679 2056613 1946235 1843963 1814127 1743884 1771096 1708754 1814074 1792643 1758926 1653886
5998 1653886 1624537 1585458 1418394 1323628 1200717 1103784 1009681 916027 891908 785861 848566
5987 848566 927019 804390 713934 694120 599191 600801 653554 777479 721241 724458 756394 717824
5975 717824 740283 790306 863142 778423 699990 726837 837694 836827 852382 1043333 1176185
5964 1176185 1199223 1224717 1380370 1337573 1372933 1455877 1621058 1687519 1950719 2196580 2257998
5953B257998p392j78193k15489k37091j02754k56062j90944K4676r3888j37382
5943H63479k0274j28902j5948m8835j03526J7595l5465L2915q1143p2547N2096
5932D59445r2156n7179O2172l4532J9012J7877j0060J037N783J20955r1749J3466
5920D14071k2704l4458P5980K2961q8962L4280L7235L5938j08977j03960J82254
5909D43658N0853m2167m3676o9425k8156J44412k6752K4031n112n587M0080k6372
5897D55787o1026o6719J17344J3018R257l8336R7951p3010q9355n1623J9613M3816
5885C76717m1623k34554Q7443J35593J37338M2836J1213j32739M5097l1871O1781
5874D57231j4715N384O5677N7997l8676j11574O3285Q5529p3830k713J39504j12897
$$ plain form
5953 2257998 2250606 2072413 1856924 1619833 1517079 1261017 1070073 1094749 1000861 863479
5943 863479 843205 714303 698355 649520 545994 563589 528124 561039 479896 407349 459445
5932 459445 367289 310110 372282 337750 356762 374639 364579 365616 371399 492354 400605 414071
5920 414071 391367 356909 432889 455850 366888 401168 438403 474341 365364 261404 443658
5909 443658 494511 452344 408668 339243 311087 455499 428747 452778 447666 442079 482159 455787
5897 455787 394761 328042 445386 458404 467661 429325 527276 454266 364911 313288 332901 376717
5885 376717 335094 100540 187983 323576 460914 503750 514963 382224 427321 395450 457231
5874 457231 442516 447900 513577 571574 532898 421324 484609 570138 496308 493595 633099 520202
5862E20202M2604o399M2595n8614J6570J44006O8826j2073O314j2509m0261M6849
5850G58110K0735j28871J5558l2565n6316k0180r297j3513O8852j992p9793l9240
5838D81488j6965Q7074R7190p9609N6442r8182r6925M0681l5048L3562m0511q671
5826D20526j7074N7121k909j26880o2132J00799J05324l9172r3627P2416Q053
5815D22445l4763o1602J4137L5051m8164K1107R1000j1015P8708J8130k8554J05220
5803F01700n0933n6231o1866m3098J4114j0540R5525K5913k9958Q8561j9113k1886
5791E32188o21j35447K7801R6190k5734k4209q2553Q7110m2626J5423j05499J25969
5779D67992J79315r0672j96327p4933J14544M4961j5687p8541J9304Q2933K3486
$$ plain form
5862 520202 562806 556407 599002 540388 556958 700964 769790 757717 764031 751522 711261 758110
5850 758110 778845 649974 665532 632967 576651 556471 547174 533661 602513 600521 520728 481488
5838 481488 464523 551597 648787 569178 625620 527438 430513 471194 436146 469708 429197 420526
5826 420526 403452 460573 457664 330784 268652 369451 474775 435603 341976 414392 422445
5815 422445 387682 326080 340217 375268 327104 348211 439211 428196 506904 525034 496480 601700
5803 601700 550767 494536 432670 389572 403686 393146 488671 514584 484626 573187 554074 532188
5791 532188 531567 396120 423921 520111 494377 470168 387615 474725 432099 447522 342023 467992
5779 467992 647307 556635 360308 285375 399919 444880 429193 350652 369956 452889 476375
5768D76375q8213m7712N4931r4408o599M1826O6533k357O0016j2035K235O9662
5756E20254j41363j31593O3147R821J9347L7114L9544M5555K2914p9297P5114
5745D80557Q4020J102j11823p0845M4531K8727O2303j7475J1409r8319O3860N6075
5733E34122M2378O5121o2401j11209J6377L3418L5980R96m0992J2519m8360L1536
5721E09485l0727M6428J8362M7489q508r4987K6341O1506o6855J9242L3613J8067
5709E79456Q930n1813r797L980J03359r602k1328N3673r0744j8616q0213P2990
5697E40275J37947p9539o6292J29249Q1141r3688j07516O9022J33623j9207k254
5686G22761j43956J5313J86320Q5797l4475J2248m7327K31J5724J80119k11605
$$ plain form
5768 476375 388162 340450 395381 300973 294374 336200 402733 400376 460392 448357 450592 520254
5756 520254 378891 247298 310445 320266 339613 376727 416271 461826 484740 405443 480557
5745 480557 564577 565679 453856 383011 427542 456269 518572 501097 512506 414187 478047 534122
5733 534122 576500 641621 579220 468011 484388 517806 553786 554782 513790 526309 477949 509485
5721 509485 478758 525186 543548 591037 582529 487542 513883 575389 508534 527776 561389 579456
5709 579456 588386 536573 526776 530756 634115 624513 603185 656858 566114 547498 467285 540275
5697 540275 678222 598683 532391 661640 742781 649093 541577 610599 744222 725015 722761
5686 722761 578805 594118 780438 866235 831760 844008 796681 796912 812636 992755 781150
5675G81150K1938J3345Q4801k3749p7864R3622l041j5588q3605P6557J0672R5861
5663I74099J38780L433j16231k03p1121L0172J05955K3539O1129J63853P2424
5652A385829j49492M1784n926j4207q7906N4367M8386J5831j73673L3106K8016
5641A176115j17013J38124r7087o18P6927K1010k493K7116l8271j31712P2969
5630A125067r363N3386L7465K3228r8029O3718O8227L8769P6776J8000l8028J4902
5618A374118p2455P700J4430m5706Q5694J01326m1127J8216R3912r8981r031n8568
5606A369528M6665j0000j28261J8024R3820J24766L3443r7062m8457K8736J69743
5595A600945p0427M1975j43252K61475J76036N0660Q3938O9730Q3982n7064J1146
$$ plain form
5675 781150 803088 816433 901234 877485 799621 893243 890202 874614 791009 867566 878238 974099
5663 974099 1112879 1116312 1000081 999878 928757 958929 1064884 1088423 1149552 1313405 1385829
5652 1385829 1236337 1278121 1272195 1257988 1170082 1224449 1272835 1288666 1114993 1148099 1176115
5641 1176115 1059102 1197226 1100139 1099521 1176448 1197458 1194965 1222081 1183810 1052098 1125067
5630 1125067 1115704 1169090 1206555 1229783 1131754 1195472 1263699 1302468 1379244 1397244 1359216 1374118
5618 1374118 1301663 1309363 1323793 1278087 1363781 1465107 1423980 1442196 1536108 1437127 1428096 1369528
5606 1369528 1416193 1406193 1277932 1295956 1389776 1514542 1547985 1450923 1402466 1431202 1600945
5595 1600945 1530518 1572493 1429241 1690716 1866752 1917412 2001350 2071080 2155062 2097998 2109144
5584B109144J56149J03755J93890J59389M2892N9793J8279K47305Q7369j76315
5574C001650K2859M7488K8791J23065j8778k6850j62947k3090R6460l0155j3435
5563C045058n282Q539P5328J84206K12918J46019Q9565K54721R8363J47523K78837
5552D535795L17873J58600J31350o7666J95341J55787j83485K9938m1297q0372
5542E151864j61164k41073j88614k02951k65174j33382j2163Q9605r6259m4413
5532C896276r1885O3285J09855m3523J12185J97170l8922R4822J00295J20610
5522D520168K08177Q3008j68547m6148l4867j55432p6951j43920j81989j28532
5512C874967k04477k71371L9750j01997j19974j2641K9566m6945L4862j31063
$$ plain form
5584 2109144 2265293 2369048 2562938 2722327 2765219 2825012 2843291 3090596 3177965 3001650
5574 3001650 3024509 3071997 3100788 3223853 3205075 3178225 3015278 2992188 3088648 3058493 3045058
5563 3045058 3039776 3048315 3123643 3307849 3520767 3666786 3756351 4011072 4109435 4256958 4535795
5552 4535795 4853668 5012268 5143618 5075952 5271293 5427080 5243595 5273533 5232236 5151864
5542 5151864 4990700 4749627 4561013 4358062 4092888 3959506 3947343 4036948 3940689 3896276
5532 3896276 3804391 3867676 3977531 3934008 4046193 4243363 4204441 4299263 4399558 4520168
5522 4520168 4728345 4811353 4642806 4596658 4561791 4406359 4329408 4185488 4003499 3874967
5512 3874967 3670490 3399119 3438869 3336872 3216898 3204257 3233823 3186878 3221740 3090677
5502C090677k9817o917m0434L0838L3300J26931o1017J8634r157J055k8190l799
5490C122104o3861q7619Q7794P5534m2283l167J29640L0155M5621O1047Q9986
5479C444951k7539J35919L963L0988J81565P773n168O641P463R7297Q7984Q1409
5467D053246Q4072Q9358l3874N6896Q8120J93361J25878p912Q4021K31417Q3383
5456E047966L1278R4801j2284J42591M1872Q6793J99581K10059N5487P9718O4581
5445F042443J04871K26646J99216K24667J99328J07599K94108K71474K58776J11602
5435H040730L12696J88475L14719K59342K85572L28860K91820L03925L38995M54247
5425A1119381M37017M13449M31275N05056N25154O17652Q95772J042796J197508
$$ plain form
5502 3090677 3060860 3053943 3013509 3044347 3077647 3204578 3143561 3162195 3153038 3154093 3125903 3122104
5490 3122104 3058243 2970624 3058418 3133952 3091669 3088502 3218142 3248297 3293918 3354965 3444951
5479 3444951 3417412 3553331 3557294 3588282 3769847 3777620 3772452 3779093 3786556 3883853 3971837 4053246
5467 4053246 4137318 4226676 4192802 4249698 4337818 4531179 4657057 4649145 4733166 4964583 5047966
5456 5047966 5079244 5174045 5161761 5304352 5346224 5433017 5632598 5842657 5898144 5977862 6042443
5445 6042443 6147314 6373960 6573176 6797843 6997171 7104770 7398878 7670352 7929128 8040730
5435 8040730 8353426 8541901 8856620 9115962 9401534 9730394 10022214 10326139 10665134 11119381
5425 11119381 11556398 11969847 12401122 12906178 13431332 14048984 14944756 15987552 17185060
5416A7185060J161139J413958J622692J896346J976159K244447K506728K587376
5408C2593905L004575L146117K995856K701948J649418M6568j202656k233271
5400D2702460k514938k347008k318157j734969j319184r23959n85848k76133K76566
5391C0958830M58649Q01704J131856J601653J753499K354328K794921L009773
5383D4865213L553501M102222M400028M775256M913455M972091M637945L720422
5375G9940133J733265p59664l102227m934549n823969o030925n596326m939730
5367E0486008m278429l516023k809304k360316j795579j483223j035249o00056
5359C2607829l98711j91829K07728O11011P99648Q30276J192114J685492J846424
$$ plain form
5416 17185060 18346199 19760157 21382849 23279195 25255354 27499801 30006529 32593905
5408 32593905 35598480 38744597 41740453 44442401 46091819 46138387 44935731 42702460
5400 42702460 40187522 37840514 35522357 33787388 32468204 31544245 30958397 30682264 30958830
5391 30958830 31417479 32219183 33351039 34952692 36706191 39060519 41855440 44865213
5383 44865213 48418714 52520936 56920964 61696220 66609675 71581766 76219711 79940133
5375 79940133 81673398 80913734 77811507 72876958 67052989 61022064 55425738 50486008
5367 50486008 46207579 42691556 39882252 37521936 35726357 34243134 33207885 32607829
5359 32607829 32209118 32017289 32225017 32836028 33635676 34465952 35658066 37343558 39189982
5350C9189982K241161K301720K303215J669546N07174j025947k407389l389173
5342D1390289l747107l783554l481858k956044k501787k134031j652236j457781
5334A9675891j314282j125990j090565q91881q59739p16585n82951n62105o21478
5325A1910315o96050n19671m58435m83385k90094k30710k32818l88114k40739
5316H370299k35317k97686k65675k45578k56044k52978j08929k24118k44378j81668
5306F057928m2977j47890j75455j00110j45556j58019j25875j17753k10126j98066
5296D636101j6723q9083P835k2765k21536K1048K4989l2363j07203o1814m8637
5285D089849k840j01046J0061r6309R505J4273r0590j5970j43769n2249p8237
$$ plain form
5350 39189982 41431143 43732863 46036078 47705624 48212798 47186851 44779462 41390289
5342 41390289 37643182 33859628 30377770 27421726 24919939 22785908 21133672 19675891
5334 19675891 18361609 17235619 16145054 15253173 14393434 13676849 13093898 12531793 11910315
5325 11910315 11214265 10694594 10236159 9752774 9462680 9231970 8999152 8611038 8370299
5316 8370299 8134982 7837296 7571621 7326043 7069999 6817021 6708092 6483974 6239596 6057928
5306 6057928 6014951 5867061 5691606 5591496 5445940 5287921 5162046 5044293 4834167 4636101
5296 4636101 4619378 4530295 4538130 4515365 4293829 4314877 4339866 4307503 4200300 4138486 4089849
5285 4089849 4087009 3985963 3996024 3899715 3909220 3923493 3832903 3816933 3673164 3620915 3542678
5274C542678J8104m2228j49626K9874j22319r2068O6079l1911o8705o8460K4302
5263C105720j32447p8720J8557q4927K2114j58412j98513P008k14158M1040J87861
5252B515123j23016j09568p0793O173l0912m8434K5415k38K4392J6552n0578j0133
5240B143983L305N1227n6632J5655j30038o3345M0237K0254J4357J0023j13003
5229A936023j3479P591p2029J332n3462J09920m1710M9063o4258q693n6222N0821
5217A844897N0951n3160P4004R9675O8805m4886J9341K8075K3665r6004M1679
5206B057042M2623p077J42787l5254j2184q4316O4442J1229j48436k5573J83619
5195B188902k780j78058J6568L8876j3215K6410J02427m0484m605J36713J8069
$$ plain form
5274 3542678 3560782 3518554 3368928 3398802 3276483 3184415 3250494 3218583 3149878 3081418 3105720
5263 3105720 2973273 2894553 2913110 2828183 2850297 2691885 2493372 2500380 2286222 2327262 2515123
5252 2515123 2392107 2282539 2211746 2217919 2187007 2138573 2163988 2163750 2188142 2204694 2154116 2143983
5240 2143983 2147288 2198515 2141883 2157538 2027500 1964155 2004392 2024646 2039003 2049026 1936023
5229 1936023 1922544 1930135 1858106 1859438 1805976 1915896 1874186 1923249 1858991 1850298 1794076 1844897
5217 1844897 1895848 1842688 1916692 2016367 2085172 2040286 2059627 2087702 2111367 2015363 2057042
5206 2057042 2099665 2092588 2235375 2200121 2187937 2103621 2168063 2179292 2030856 2005283 2188902
5195 2188902 2186122 2008064 2024632 2063508 2050293 2076703 2179130 2138646 2134041 2270754 2288823
5184B288823J8674J33380N0277N2455J79744n5500N1142L39939O4434J61955K21505
5173C506828J26762M602P1599J23253q0286j34894j34172m1215q7879k15965q9962
5162C048671m5502J8572j42082k0948R413M0136J1318r4481Q0241l2697l9857
5151B832784J94274L224k4370m2064Q9555l1902Q745J33511N6973q1238r7681
5140C041811J2256R2067K1473m4692n3369M3366k3995j1508L5471P9513P5792
5129C268185N0326J57015J18925J46818L2043O9549J68669J81590J65674J62094
5119D520888J23816J2399J34202J15858R0279l9655j57102j91319j32521j24565
5109D352280k50628j9478n9094P061l8373j77880K0324J24605p2844k175O4234
$$ plain form
5184 2288823 2307497 2440877 2491154 2543609 2723353 2667853 2718995 3058934 3123368 3285323 3506828
5173 3506828 3633590 3638192 3709791 3833044 3752758 3617864 3483692 3442477 3354598 3138633 3048671
5162 3048671 3003169 3021741 2879659 2858711 2868124 2908260 2919578 2825097 2905338 2872641 2832784
5151 2832784 3027058 3030282 3005912 2963848 3053403 3021501 3030246 3163757 3220730 3139492 3041811
5140 3041811 3054067 3146134 3167607 3122915 3069546 3112912 3088917 3077409 3112880 3192393 3268185
5129 3268185 3318511 3475526 3594451 3741269 3773312 3842861 4011530 4193120 4358794 4520888
5119 4520888 4644704 4657103 4791305 4907163 4997442 4957787 4800685 4609366 4476845 4352280
5109 4352280 4101652 4082174 4023080 4030141 3991768 3813888 3834212 3958817 3885973 3883798 3948032
5098C948032R769l1906P3424J29642J49270J90421k032K8326o6702N385J49619
5087D583248O814J12080L6625P4660K5483K03859N7086K06103J60385J32654J77402
5076E776399J65354R1574K74258J58904K50011J46438L15476L17054J71103K60802
5066G927373J35948K6988J65626J73546J86837K30965J38912R3630M1304J39670
5056I260799j8452J25668K23443J13639O4145K53142K41318L24311K54156K52082
5046A1094251L36990N14589M32708M62773M74676N70311N89879P12664O39293
5037A5828134M78790N74136N63025P18851Q38268R90120J032254J256057J456695
5028B3736330J539050J698386K091359K458424K710699L198965L726062M231315
$$ plain form
5098 3948032 3957801 3925895 3999319 4128961 4278231 4468652 4466620 4494946 4428244 4433629 4583248
5087 4583248 4590062 4702142 4738767 4813427 4838910 5042769 5099855 5305958 5466343 5598997 5776399
5076 5776399 5941753 6033327 6307585 6466489 6716500 6862938 7178414 7495468 7666571 7927373
5066 7927373 8063321 8090309 8255935 8429481 8616318 8847283 8986195 9079825 9121129 9260799
5056 9260799 9242347 9368015 9591458 9705097 9769242 10022384 10263702 10588013 10842169 11094251
5046 11094251 11431241 11945830 12378538 12841311 13315987 13886298 14476177 15188841 15828134
5037 15828134 16306924 16881060 17444085 18162936 19001204 19991324 21023578 22279635 23736330
5028 23736330 25275380 26973766 29065125 31523549 34234248 37433213 41159275 45390590
5020D5390590M721636N422746O016587O788712P624815Q138304Q469206Q532598
5012A01105194Q372224P908352P263263N830482L794200R39522k334666n224159
5004A27654412o944121p576744q142060q230882q072086p864934p570291o810288
4996F6443006o206401n411698m671561m142168l566554l075303k502494k190695
4988C4676132k047964j829633j542721j396802j291658j266109j123828j079947
4980B3097470j144748j063622q82128p91948q21229o04300n72742m86739o28300
4971A6101714l72366l30172k69324l83597k92186n65129n90691m40523n42062
4962A2315664l85590o03837m75046l78137m36325l05256k76754l62423k96512
$$ plain form
5020 45390590 50112226 55534972 61551559 68340271 75965086 84103390 92572596 101105194
5012 101105194 109477418 117385770 124649033 130479515 134273715 135213237 132878571 127654412
5004 127654412 120710291 113133547 104991487 96760605 88688519 80823585 73253294 66443006
4996 66443006 60236605 54824907 50153346 46011178 42444624 39369321 36866827 34676132
4988 34676132 32628168 30798535 29255814 27859012 26567354 25301245 24177417 23097470
4980 23097470 21952722 20889100 20006972 19215024 18393795 17789495 17216753 16730014 16101714
4971 16101714 15729348 15399176 15129852 14746255 14454069 13888940 13298249 12857726 12315664
4962 12315664 11930074 11326237 10851191 10473054 10036729 9731473 9454719 9092296 8795784
4953H795784l04196k87809j07379j66900k06616r0178r8286j97661k30713j15806
4943F990240r8959r7079q8703k20375k50272p1927p3206q0629j35897n9530k29615
4932E584048r6570l3366o9849q6406p717k46858j79055P0224j30334j38142j48436
4921D517539j50761j17536j20526j48468n8157M4580j19962j74667l9942r4230
4911C537870Q6331l1194p2140m8618q9261J2182j19986m6421j11435n3641p1262
4900B992425n4389J57773J8342N9158O763p7260r3089k6250j69816j1390K4695
4889B826962j31162J296p0591M5758M738r8771n1030j8701K4689n3302m8752j15134
4877B316000j477L491p8702q9907N2615R6634r8152j16709r3816J46094j38699
$$ plain form
4953 8795784 8491588 8203779 8096400 7929500 7722884 7632706 7534420 7336759 7106046 6990240
4943 6990240 6891281 6794202 6705499 6485124 6234852 6162925 6089719 6009090 5873193 5813663 5584048
4932 5584048 5487478 5454112 5384263 5297857 5290140 5043282 4864227 4934451 4804117 4665975 4517539
4921 4517539 4366778 4249242 4128716 3980248 3922091 3966671 3846709 3672042 3632100 3537870
4911 3537870 3624201 3593007 3520867 3472249 3382988 3395170 3275184 3228763 3117328 3063687 2992425
4900 2992425 2938036 3095809 3114151 3173309 3180072 3102812 3009723 2983473 2813657 2802267 2826962
4889 2826962 2695800 2697096 2626505 2672263 2677001 2578230 2527200 2508499 2533188 2479886 2431134 2316000
4877 2316000 2314523 2318014 2239312 2149405 2202020 2298654 2200502 2083793 1989977 2136071 1997372
4866A997372O2688P1248n8765K358L7683n4003N6010j33436Q6430p0967p2528
4855A924090J08514l0490P7848m5954j748J9713O1059n7272K400Q9888m8254n4591
4843B045203J01550m5457M7780n911r890M5228L9022r5k5815j0249m2675j7924
4831B120767O4175j5690k9662l55j6082M5525O6745R6614O3640L4780L9877P3846
4819B544180N9188J7937J25101Q7865J02844K10444K59442J06244L40808L79857
4809D233910M97956P37009M54747k73888n89209l13112m66658m73617j86365k6177
4799C594596J1138j775k8021P7982P5412K3530J28015J69295J00395o1249n8360
4788D030958j26437p6192j02642k03283j38387j87884p5916j27814j61517j33445
$$ plain form
4866 1997372 2060060 2131308 2072543 2074901 2112584 2058581 2114591 1981155 2067585 1996618 1924090
4855 1924090 2032604 2002114 2079962 2034008 2032260 2051973 2113032 2055760 2058160 2148048 2099794 2045203
4843 2045203 2146753 2101296 2149076 2143165 2133275 2178503 2217525 2217430 2191615 2181366 2138691 2120767
4831 2120767 2184942 2169252 2139590 2139235 2123153 2168678 2235423 2332037 2395677 2430457 2470334 2544180
4819 2544180 2603368 2621305 2746406 2834271 2937115 3147559 3407001 3513245 3854053 4233910
4809 4233910 4731866 5468875 5923622 5649734 5060525 4747413 4280755 3807138 3620773 3594596
4799 3594596 3605734 3603959 3575938 3653920 3729332 3752862 3880877 4050172 4150567 4089318 4030958
4788 4030958 3904521 3828329 3725687 3522404 3384017 3196133 3120217 2992403 2830886 2697441
4778B697441O68l2850q4963p7561k0296n5288K1856j78419M0596K671r7436K2519
4766B238938K7750j08161N8945J05243j15427N620n5897k4430k1119N9483J01439
4755B272384J0015j55577K2387P9792n4239K256K31218R3710J03909M3672m4256
4744B605271J36172J94566p2469J27661J32878N4720J06096J52155J37004N201
4734C579255J39098L148m9157n110p2812j69119j96680k29520j11624k12268k05089
4723B470122j279j29409L6364j32932p7558N6274j49418K5753j01785j04517K9179
4712A920794R6119o3424j2991k3021m5052K2804l6665o6945p7196P3352N7383
4701A845158N1826o1177r2274O7830j8685O8777K6423j177L2311j0408L168o7440
$$ plain form
4778 2697441 2698109 2665259 2580296 2502735 2482439 2427151 2449007 2270588 2311184 2313855 2216419 2238938
4766 2238938 2266688 2158527 2217472 2322715 2207288 2212908 2157011 2132581 2111462 2170945 2272384
4755 2272384 2282399 2126822 2149209 2229001 2174762 2177018 2408236 2501946 2605855 2649527 2605271
4744 2605271 2741443 2936009 2863540 2991201 3124079 3178799 3284895 3437050 3574054 3579255
4734 3579255 3718353 3721501 3672344 3667234 3594422 3425303 3228623 2999103 2887479 2675211 2470122
4723 2470122 2468843 2339434 2375798 2242866 2165308 2221582 2072164 2097917 1996132 1891615 1920794
4712 1920794 2016913 1953489 1940498 1917477 1872425 1895229 1858564 1791619 1714423 1787775 1845158
4701 1845158 1896984 1835807 1743533 1811363 1792678 1861455 1887878 1886701 1919012 1908604 1911772 1844332
4689A844332P4835j538L2053k3245J03428P8544P9993m3459m4174Q518J54840
4678B264127J1350q1678J06684M9494j01480M9262j15023l2381Q3229l0645m1385
4667B161554m1867Q7283K7685K2437K3756n6796K0720n405Q557M7368K4709J10276
4655B430277o0631o2056j2790J12283O084r822j10435m1533l1876O6369m07M6810
4643B332273J78222J18919l6889j09242n2246N6150l05P265N4760k6622k6116
4632B496169j4835m2582j27181J1283m3913R3065j5370O1018L9283m7341n2381
4621B357215p0446J6795r5591N5273J85352J7982N919j6582o7623L3980o7843
4610B354431k0159l0836Q74K0113R8296m3433n3757p485J28110j678l2895N221
$$ plain form
4689 1844332 1919167 1917629 1949682 1926437 2029865 2108409 2188402 2144943 2100769 2109287 2264127
4678 2264127 2275477 2193799 2300483 2349977 2248497 2297759 2182736 2150355 2233584 2202939 2161554
4667 2161554 2119687 2206970 2234655 2257092 2280848 2224052 2244772 2239367 2247924 2295292 2320001 2430277
4655 2430277 2369646 2307590 2294800 2407083 2413167 2403345 2292910 2251377 2219501 2285870 2285463 2332273
4643 2332273 2510495 2629414 2592525 2483283 2431037 2487187 2486882 2494147 2548907 2522285 2496169
4632 2496169 2481334 2438752 2311571 2322854 2278941 2372006 2356636 2417654 2456937 2409596 2357215
4621 2357215 2286769 2303564 2207973 2263246 2448598 2466580 2472499 2455917 2388294 2422274 2354431
4610 2354431 2334272 2303436 2304310 2324423 2422719 2379286 2325529 2318044 2446154 2444476 2411581 2416802
4598B416802k5994Q6766R8520Q1960r6095q8807n4077J4321N3642l0804P4081
4587B530315k1839L3793N9327L2548q7479M8593J6264m0300K6895N7289O3925
4576B719331J03386j4907L5678j7924M2066j2177n9461l0940O1774P5258l1874
4565B870210R9118Q8338j46375k6032L3406J18550K1759j13765N7925N3413r1271
4554B965276m221J47436m8763P3927P6013K5294l67Q7696J26846L7909J11972
4543C599018J10278K1575j46508J7076J99095P5223M4182J0927J2942K592Q2890
4532D029290J02964J32369Q4384J39644J8920K06198J18764R1829J00974L8067
4522E063403k8314J61045l2410k3429p676P0309k1492L1847J41958L9841J73016
$$ plain form
4598 2416802 2390808 2477574 2576094 2658054 2561959 2473152 2419075 2433396 2487038 2456234 2530315
4587 2530315 2508476 2542269 2601596 2634144 2546665 2595258 2611522 2571222 2598117 2655406 2719331
4576 2719331 2822717 2807810 2843488 2825564 2867630 2855453 2795992 2765052 2826826 2902084 2870210
4565 2870210 2969328 3057666 2911291 2885259 2918665 3037215 3058974 2945209 3003134 3056547 2965276
4554 2965276 2961055 3108491 3059728 3133655 3209668 3234962 3234595 3322291 3449137 3487046 3599018
4543 3599018 3709296 3730871 3584363 3601439 3800534 3875757 3919939 3930866 3943808 3946400 4029290
4532 4029290 4132254 4264623 4349007 4488651 4507571 4713769 4832533 4924362 5025336 5063403
4522 5063403 5035089 5196134 5163724 5140295 5132619 5202928 5181436 5213283 5355241 5395082 5568098
4511E568098O3375R5563R7372k355j7384r3786n8877q9279L8622R2739l9933p1324
4499E582831O5315J03635J03860m4399R6104J65719L1758J75030J70629J12277
4489F562759J4019J26185J29059J04166K2208k751K57173K25514K16663N4726
4479G709721J78822K91427K27038J18790J68462L6513N7604O7340J88492K0600
4469I064809J39163J92444K29172J17217K47889K71019L17585L51955J62164K43548
4459A1336965R5849K04541K12853O9612J22099J71553J31873K20381J68860K41772
4449A2976358L00590M14265L28833L82586L20869M75698N53549N65520N27191
4440A6845459N81640M98721P33723O70015N32934P42984P32689O05240O64122
$$ plain form
4511 5568098 5631473 5727036 5824408 5822053 5804669 5710883 5652006 5562727 5601349 5694088 5654155 5582831
4499 5582831 5648146 5751781 5855641 5811242 5907346 6073065 6104823 6279853 6450482 6562759
4489 6562759 6576778 6702963 6832022 6936188 6958396 6955645 7212818 7438332 7654995 7709721
4479 7709721 7888543 8179970 8407008 8525798 8694260 8730773 8788377 8855717 9044209 9064809
4469 9064809 9203972 9396416 9625588 9742805 9990694 10261713 10579298 10931253 11093417 11336965
4459 11336965 11432814 11637355 11850208 11919820 12041919 12213472 12345345 12565726 12734586 12976358
4449 12976358 13276948 13691213 14020046 14402632 14723501 15199199 15752748 16318268 16845459
4440 16845459 17427099 17925820 18659543 19329558 19862492 20605476 21338165 21943405 22607527
4431B2607527N91946O98592N74162P07861P57541P66437O68390Q27451Q17680
4422B9017587Q32950Q35203P18481Q29879Q42066P59428J100047R99211J088818
4413C7023670J244202J550518J570343J754190K067392K289401K502046K815609
4405E2817371L065089L346722L643102L687497L842974L848481M101587M196241
4397H2549064M526265M758896M628191M474572M549205M603740M813678N228407
4389A20132018N925657O320610O646291O812263O854671O570583O007842N093149
4381A70363084M115731K953828J520110k22039k631570n047881p229117q860626
4373A54961520r437445r098789p991901o264235m470102k885635j821125j546082
$$ plain form
4431 22607527 23199473 23898065 24472227 25180088 25937629 26704066 27372456 28199907 29017587
4422 29017587 29850537 30685740 31404221 32234100 33076166 33835594 34935641 35934852 37023670
4413 37023670 38267872 39818390 41388733 43142923 45210315 47499716 50001762 52817371
4405 52817371 55882460 59229182 62872284 66559781 70402755 74251236 78352823 82549064
4397 82549064 87075329 91834225 96462416 100936988 105486193 110089933 114903611 120132018
4389 120132018 126057675 132378285 139024576 145836839 152691510 159262093 165269935 170363084
4381 170363084 174478815 177432643 178952753 178730714 176099144 171051263 163822146 154961520
4373 154961520 145524075 136425286 128433385 122169150 117699048 114813413 112992288 111446206
4365A11446206k627841m192398o098576p253574p607907p166633o312152n392864
4357F4794261m567760l871294l032470k621367k117433j913481j643662j417037
4349D3609757j199551j082968r08512q70536o74662q73928j017645j130174j161790
4340C4689991r23483j061901j100599q93497q58676q22965p56120p33720o24893
4331B6914137m51125n46572n11614n34317m88878m13844m46048m59694m81024
4322B2581021l63919k32438l05853k58287j34165l12189m10036k12837k39969
4313B0111328l98545l45770l83384n44704n24980n12603l34870k73410l29488
4304A6463574l80660l43122k64897l29768l41870j93510j31435j69128j76297
$$ plain form
4365 111446206 108818365 104625967 98527391 91273817 83665910 76499277 70187125 64794261
4357 64794261 60226501 56355207 53322737 50701370 48583937 46670456 45026794 43609757
4349 43609757 42410206 41327238 40418726 39548190 38873528 37999600 36981955 35851781 34689991
4340 34689991 33766508 32704607 31604008 30710511 29851835 29028870 28272750 27539030 26914137
4331 26914137 26463012 25916440 25404826 24870509 24381631 23967787 23521739 23062045 22581021
4322 22581021 22217102 21984664 21678811 21420524 21286359 20974170 20564134 20351297 20111328
4313 20111328 19712783 19367013 18983629 18438925 17913945 17401342 17066472 16793062 16463574
4304 16463574 16082914 15739792 15474895 15145127 14803257 14609747 14478312 14309184 14132887
4295A4132887j08743j16006J728k4169p0803J02129j3704j7212J21442Q0348J41968
4284A4229865K7523J04913R7029k475P4322J93293L03894K46285L52012L96461
4274A6023122M58009N75578M35840M63414O70818O30593P20362P70838R25524
4265B1674098J078750R87001N62881j69640o61339q83755j039502j013274n78915
4256A9956305l87764l20413k23996l7513J01239N4020K14733L00915M18606M71322
4246B0547454N44013O94118P97924P59589R56565J139980J395531J631185J699299
4237C0165658J966124K009458J679027Q90666j82596q84419j493768j791730j722099
4228C0636321j427270j219763p70970n59770m80046j85798j14645r8190J68227
$$ plain form
4295 14132887 14024144 13908138 13909866 13885697 13814894 13917023 13903319 13886107 14007549 14087897 14229865
4284 14229865 14257388 14362301 14459330 14456855 14531177 14724470 15028364 15274649 15626661 16023122
4274 16023122 16481131 17056709 17492549 17955963 18626781 19257374 19977736 20748574 21674098
4265 21674098 22752848 23739849 24302730 24133090 23471751 22587996 21548494 20535220 19956305
4256 19956305 19568541 19248128 19024132 18986619 19087858 19141878 19356611 19657526 20076132 20547454
4246 20547454 21091467 21785585 22583509 23343098 24299663 25439643 26835174 28466359 30165658
4237 30165658 32131782 34141240 35820267 36710933 36528337 35643918 34150150 32358420 30636321
4228 30636321 29209051 27989288 27218318 26658548 26178502 25992704 25878059 25779869 25948096
4219B5948096K39229K78547M15606L82135P04029Q34516Q84364J020030J159883
4210C1866435J525278J610749J969096K071435K167051K144133J620085J066874
4202D6041136Q45421P18834P67093J173724J828850K092360K463309K797707K330505
4193F1058939J675959M81587p11645j507676k042250k252260k006808j604364
4185E3091482j191805p05226k82808P0950L98459P64710R68349J461774J974493
4176E6550378K381413K755132L021583L491730L828018M323337M844938N576690
4168H6773219O200553O632921O657583N837707L603119N46976k197399m193799
4160A09860880n110564m706937l911530k652823j240311k0651J291951K456245
$$ plain form
4219 25948096 26187325 26465872 26881478 27263613 27967642 28802158 29686522 30706552 31866435
4210 31866435 33391713 35002462 36971558 39042993 41210044 43354177 44974262 46041136
4202 46041136 46886557 47605391 48372484 49546208 51375058 53467418 55930727 58728434 61058939
4193 61058939 62734898 63216485 62504840 60997164 58954914 56702654 54695846 53091482
4185 53091482 51899677 51194451 50911643 50982593 51381052 52145762 53114111 54575885 56550378
4176 56550378 58931791 61686923 64708506 68200236 72028254 76351591 81196529 86773219
4168 86773219 92973772 99606693 106264276 112101983 115705102 116252078 114054679 109860880
4160 109860880 104750316 100043379 96131849 93479026 92238715 92218064 93510015 95966260
4152I5966260L778400N080387O335942P591789Q959725J0248023J1769659J3537056
4144A63267241J5456337J7932721K0882100K4171002K6887405K7283498K0404344
4137C16284648L283626j5424130k6052605l0312479l0745566k7426019k2714430
4130A66893045j7760074j3912412j0860645q475648o771246n600883m666987l939952
4122I4905198m139261m905771n294293n576487n210145m823510m245571l603676
4114E7106484l074367k496294k163952k043596j916400j771419j760392j613503
4106D0266561j606911j517925j479386j367612j262029j169659j103613q42899
4098B9916527q09260q43122p08691o06985p65009o93538o45882o80077p20840
$$ plain form
4152 95966260 99744660 104825047 111160989 118752778 127712503 137960526 149730185 163267241
4144 163267241 178723578 196656299 217538399 241709401 268596806 295880304 316284648
4137 316284648 319568274 304144144 278091539 247779060 217033494 189607475 166893045
4130 166893045 149132971 135220559 124359914 115884266 109113020 103512137 98845150 94905198
4122 94905198 90765937 85860166 80565873 74989386 69779241 64955731 60710160 57106484
4114 57106484 54032117 51535823 49371871 47328275 45411875 43640456 41880064 40266561
4106 40266561 38659650 37141725 35662339 34294727 33032698 31863039 30759426 29916527
4098 29916527 29107267 28264145 27555454 26948469 26183460 25489922 24844040 24163963 23443123
4089B3443123n74182n34490n58948n46969l36986l05683k09231l43261l81255
4080A9652118l90288m49239k41464m50191m06754l60589l35707j55402j05996
4071A6756488j26791k10777j86784j40925j79024k13339j43792k26662k16610
4062A5111784j86003q7155j67270j68509k32602j17993m1453j47445j6828o1120
4052A3885406P2630k57130k09473j25786j57548k99972j45323j03797j42230r4022
4042A2422755j49990o8297q3940p879j34463j41120j56327p8620n1318N6240p6895
4031A1530146n5248P4144l3621r9571M4989K2884n3839j41121J09964P0618o6798
4020A1402547n166r9735r6950P1703n501p9269J57211m3583K1304J02944j1198
$$ plain form
4089 23443123 22868941 22334451 21775503 21228534 20891548 20585865 20376634 20033373 19652118
4080 19652118 19261830 18812591 18571127 18120936 17714182 17353593 17017886 16862484 16756488
4071 16756488 16629697 16418920 16232136 16091211 15912187 15698848 15555056 15328394 15111784
4062 15111784 14925781 14838626 14671356 14502847 14270245 14152252 14110799 13963354 13946526 13885406
4052 13885406 13958036 13700906 13491433 13365647 13208099 12908127 12762804 12659007 12516777 12422755
4042 12422755 12272765 12204468 12120528 12112649 11978186 11837066 11680739 11602119 11550801 11607041 11530146
4031 11530146 11474898 11549042 11515421 11415850 11460839 11483723 11429884 11288763 11398727 11469345 11402547
4020 11402547 11397381 11297646 11200696 11272399 11266898 11187629 11344840 11301257 11322561 11425505 11414307
4009A1414307M9859k88J07662J09540J71926K89021L59099K22071L20166K44493
3999A3287856L83454M32453L74098O30475O72683Q50613Q98238J026305J023572
3990A9579747J103860O38864Q7670n44432p18083r31078q59513n99071k88260
3981A7469704j88402j51227L46452K11337L06532N14182M98889N98756P13067
3972B0319290R17506J094449J353126J679798J639732J122716P44076Q39688R89731
3963C0700112J213615J411929J185198L21734q07212j517316j971873j910918
3955B8625269j754088j598370j297828j128107r72568r07421p57274n20599n12436
3946A9176578j88429j86528m6386M6762K59100L06833N35809N96227O90458Q71390
$$ plain form
4009 11414307 11464166 11463878 11571540 11681080 11853006 12142027 12501126 12723197 13043363 13287856
3999 13287856 13671310 14103763 14477861 15108336 15781019 16631632 17529870 18556175 19579747
3990 19579747 20683607 21322471 21410141 20865709 20147626 19216548 18357035 17757964 17469704
3981 17469704 17281302 17130075 17476527 17687864 17994396 18508578 19007467 19606223 20319290
3972 20319290 21236796 22331245 23684371 25364169 27003901 28126617 28870693 29710381 30700112
3963 30700112 31913727 33325656 34510854 34832588 34025376 32508060 30536187 28625269
3955 28625269 26871181 25272811 23974983 22846876 21874308 20966887 20209613 19689014 19176578
3946 19176578 18988149 18801621 18755235 18801997 19061097 19367930 19903739 20499966 21190424 22061814
3936B2061814Q07227J137362J189437J236955J115725N16032l15498r33910j366284
3927B5448860j344493j096565j025161p76448m79617l66804m62718l42977k09612
3918A9344465j91189j73655J5731m5958J08117J53014K20857L21267L22020K50359
3908B0325028M08783M66170O87466Q47292Q31679R29871P02938N26319L44520
3899B6070066N14658N72708P70811Q24463J159472J293927J502541J549099J744219
3890C6001964K035519K295043K752463L121111L806961M368342M924571N357728
3882F4663702N741636O297579O905614Q245077R719877J1964459J4811877J7387726
3874A45737547J8877797J3678908l293056j6956625k0137060j9893765j7780629
$$ plain form
3936 22061814 22869041 24006403 25195840 26432795 27548520 28064552 27749054 26815144 25448860
3927 25448860 24104367 23007802 21982641 21206193 20726576 20359772 19897054 19554077 19344465
3918 19344465 19153276 18979621 18995352 18949394 19057511 19210525 19431382 19752649 20074669 20325028
3908 20325028 20733811 21199981 21887447 22734739 23566418 24496289 25199227 25725546 26070066
3899 26070066 26584724 27157432 27928243 28752706 29912178 31206105 32708646 34257745 36001964
3890 36001964 38037483 40332526 43084989 46206100 50013061 54381403 59305974 64663702
3882 64663702 70405338 76702917 83608531 91853608 101573485 113537944 128349821 145737547
3874 145737547 164615344 178294252 175001196 158044571 137907511 118013746 100233117
3867A00233117j3675637j0095230p868433n872745m603461m082852l560324l225299
3859D7249136k916154k561986k463302k099925j981548j649454j380649j033616
3851C1162502r87957p74155n69939m31100k06784o3770R2005K48098J37054l00398
3841B8305556p31456j192750j311581j297549j312419j072258n82847o91752m76655
3832A9636289m74787m17394k77919l44086l21530m17300j52128j09510k20590
3823A6901045j59562j7764j42998q4141O224j08919N6351l464r2263O6851K5918
3812A6447278J40839J75494J68093j5801J04986J27547J25326J81813J61200P0593
3802A7687368J35301J87482M20194L12001K79123K76940K98080M01824K80236
$$ plain form
3867 100233117 86557480 76462250 68593817 62721072 58117611 54034759 50474435 47249136
3859 47249136 44332982 41770996 39307694 37207769 35226221 33576767 32196118 31162502
3851 31162502 30174545 29400390 28830451 28399351 28192567 28128797 28220802 28468900 28605954 28305556
3841 28305556 27574100 26381350 25069769 23772220 22459801 21387543 20804696 20112944 19636289
3832 19636289 19161502 18744108 18466189 18122103 17800573 17383273 17231145 17121635 16901045
3823 16901045 16741483 16723719 16580721 16496580 16502804 16393885 16450236 16446772 16354509 16421360 16447278
3812 16447278 16588117 16763611 16931704 16915903 17020889 17148436 17273762 17455575 17616775 17687368
3802 17687368 17822669 18010151 18430345 18742346 19021469 19298409 19596489 19998313 20278549
3793B0278549M00794L57596L76301M92678N31849N45899M11611O16202N94897
3784B4606376O86620O86498O97710R08282R17254Q85207J000998J009050J065326
3775C2463321J212241J270484J291615J344552J289846J591348J661447J552008
3767D3676862J758860K014319K053821K175193K281016K252900K460449K587875
3759F1261295K560273K636726K670595K901379K984767K861233L090624L239533
3751H4206425L380441L424504L320975L593751L651598L517056L472807L471885
3743A12039442L476361L472537L578655L489014L574525L403959L149690K996009
3735A39180192K987954K762037K348041K280667K004914J576797J430656J166456
$$ plain form
3793 20278549 20679343 21036939 21413240 21905918 22437767 22983666 23395277 24011479 24606376
3784 24606376 25292996 25979494 26677204 27585486 28502740 29387947 30388945 31397995 32463321
3775 32463321 33675562 34946046 36237661 37582213 38872059 40463407 42124854 43676862
3767 43676862 45435722 47450041 49503862 51679055 53960071 56212971 58673420 61261295
3759 61261295 63821568 66458294 69128889 72030268 75015035 77876268 80966892 84206425
3751 84206425 87586866 91011370 94332345 97926096 101577694 105094750 108567557 112039442
3743 112039442 115515803 118988340 122566995 126056009 129630534 133034493 136184183 139180192
3735 139180192 142168146 144930183 147278224 149558891 151563805 153140602 154571258 155737714
3727A55737714R95312P79890N74650M41563j08470n69770r99869j260811j552186
3718A54038023k059394k189200k336016k388239k659257k764595k954975l088094
3710A33598253l421875l406362l762313l872012m102473m023002m132461m130096
3702A02747659l916006l858178l697612l711013l681701l591180l452880l434081
3694G3405008l331537l270095l149576k922357k733387k722344k502966k206223
3686E0566523k233122k152631j860950j862691j530693j640320j471514j476313
3678C6338289j202460j264849j199146r76694j015230q27668q34587o97720o35438
3669B7684497n87446o79551m75543o29681p04087l08121m20330l01004l80367
$$ plain form
3727 155737714 156733026 157512916 158087566 158529129 158420659 157850889 156851020 155590209 154038023
3718 154038023 151978629 149789429 147453413 145065174 142405917 139641322 136686347 133598253
3710 133598253 130176378 126770016 123007703 119135691 115033218 111010216 106877755 102747659
3702 102747659 98831653 94973475 91275863 87564850 83883149 80291969 76839089 73405008
3694 73405008 70073471 66803376 63653800 60731443 57998056 55275712 52772746 50566523
3686 50566523 48333401 46180770 44319820 42457129 40926436 39286116 37814602 36338289
3678 36338289 35135829 33870980 32671834 31695140 30679910 29852242 29017655 28319935 27684497
3669 27684497 27097051 26417500 25941957 25312276 24608189 24300068 23879738 23578734 23198367
3660B3198367l09749l40307l87578k02627k02365j67589j94585j36278j94188
3651B1063101j93772j60322k09291k43929j08656j25595j48892N1533p519j18724
3641A9797934q120j28856P8770j8059o1358Q8955O9088P927P3832j25377J97136
3630A9971872K32467q978P5351R0847K99378J45492J55025L30266L88992M95535
3620B2176247N39060L03533P00960Q11065P42593P53169P84235P82953R09780
3611B8503595Q98489O90679M41362J22626j62885k27632m68070k25021j64355
3602B9408788p7063J72091K71410L00117L98930L74928O30172R43534R15261J107722
3592C4445890J333454J369418J507763J843905K021830K225336K309477K666316
$$ plain form
3660 23198367 22888618 22548311 22160733 21958106 21755741 21588152 21393567 21257289 21063101
3651 21063101 20869329 20709007 20499716 20255787 20147131 20021536 19872644 19924177 19916658 19797934
3641 19797934 19789814 19660958 19739728 19721669 19660311 19749266 19818354 19826281 19900113 19774736 19971872
3630 19971872 20204339 20195361 20270712 20361559 20660937 20806429 20961454 21291720 21680712 22176247
3620 22176247 22715307 23018840 23719800 24530865 25273458 26026627 26810862 27593815 28503595
3611 28503595 29402084 30092763 30534125 30656751 30493866 30266234 29798164 29573143 29408788
3602 29408788 29331725 29503816 29775226 30075343 30474273 30849201 31479373 32422907 33338168 34445890
3592 34445890 35779344 37148762 38656525 40500430 42522260 44747596 47057073 49723389
3584D9723389K781300K605631K117297J358063K18210q92812j770436k118177
3576E4022465k187716k303363k016457j600704j221144q05095o40759j87210j16618
3567D2943399L17850N00803Q07025J007338J426834J693167J959502K221662K402856
3558E5280436K697993K872955L152678L266288L216903K238579Q80626o64362
3550G2942096k103823l242153l479563l691582l549684l121934k635655k114989
3542D9002713j782774j463177j121621p00852o31902l55709M4816K81419L94027
3533D3666940L90165P46529R66895J249978J423676J568369J677221J708489J492320
3524E4890582R10033J21639q18450j797270k509260k617566k606711k470056k120620
$$ plain form
3584 49723389 52504689 55110320 57227617 58585680 58803890 57911078 56140642 54022465
3576 54022465 51834749 49531386 47514929 45914225 44693081 43887986 43247227 43060017 42943399
3567 42943399 43261249 43762052 44569077 45576415 47003249 48696416 50655918 52877580 55280436
3558 55280436 57978429 60851384 64004062 67270350 70487253 72725832 73606458 72942096
3550 72942096 70838273 67596120 64116557 60424975 56875291 53753357 51117702 49002713
3542 49002713 47219939 45756762 44635141 43934289 43302387 42946678 42991494 43272913 43666940
3533 43666940 44057105 44803634 45770529 47020507 48444183 50012552 51689773 53398262 54890582
3524 54890582 55800615 55922254 55103804 53306534 50797274 48179708 45572997 43102941 40982321
3515D0982321j934272j620711j125381r83142q62549o73080o29259m34363l69817
3506C2349747k67203j21085p2910N8883J02530K59197L04053L60744M67897M69707
3496C3911560N62907J81569P8891j3789l11969m80656n30680l77192m19676k53823
3486C2347142p6241r5815k309K94303K93642N0915K63217M41974M93518N82733
3476C4593079O25682O93517O86546Q98189R88794R88437R40800J033592J263912
3467D2712548J375653J294023J199552J191730J126659J230159J175437J247913
3459E2553674J493425J505980J830644J915190K035715K211072K256553K319665
3451F8121918K320986K389295K531569K508722K400584K534867K545036K696192
$$ plain form
3515 40982321 39048049 37427338 36301957 35318815 34456266 33783186 33153927 32719564 32349747
3506 32349747 32082544 31961459 31888549 31947432 32049962 32309159 32613212 32973956 33441853 33911560
3496 33911560 34474467 34656036 34734927 34721138 34409169 33928513 33397833 33020641 32600965 32347142
3486 32347142 32270901 32175086 32172777 32467080 32760722 32811637 33074854 33516828 34010346 34593079
3476 34593079 35218761 35912278 36598824 37497013 38485807 39474244 40415044 41448636 42712548
3467 42712548 44088201 45382224 46581776 47773506 48900165 50130324 51305761 52553674
3459 52553674 54047099 55553079 57383723 59298913 61334628 63545700 65802253 68121918
3451 68121918 70442904 72832199 75363768 77872490 80273074 82807941 85352977 88049169
3443H8049169K760936K912146L156416L362506L325526L257819L096332K861640
3435A12782490K217948J907564J820451J873701K212546K684394L448928L744622
3427A32692644M552979N237929N854008O273959O504441O419770O257579N784305
3419A79577614M848005M122340L241665K794633L092947L347057L968911M512049
3411B09505221M976701N452685N782405N615068M927098M229177L070323J969400
3403B45528078J255510J173895J324046J647783K032107K580328L051867L393190
3395B61986804L795638L955987M015330M147758M265665M348246M161720L903305
3387B94580453L547543K932317K592383K044423J700920J430108J298868J094721
$$ plain form
3443 88049169 90810105 93722251 96878667 100241173 103566699 106824518 109920850 112782490
3435 112782490 115000438 116908002 118728453 120602154 122814700 125499094 128948022 132692644
3427 132692644 137245623 142483552 148337560 154611519 161115960 167535730 173793309 179577614
3419 179577614 184425619 188547959 191789624 194584257 197677204 201024261 204993172 209505221
3411 209505221 214481922 219934607 225717012 231332080 236259178 240488355 243558678 245528078
3403 245528078 246783588 247957483 249281529 250929312 252961419 255541747 258593614 261986804
3395 261986804 265782442 269738429 273753759 277901517 282167182 286515428 290677148 294580453
3387 294580453 298127996 301060313 303652696 305697119 307398039 308828147 310127015 311221736
3379C11221736P06820P54735L66138n8287m83662q71258j088778j231456j383409
3370C07932579j302115j476809j387648j258189j293611j220026j102411r37487
3362B97954283q75511p61835p91256q44282q85750p85411n86614k80934J18O18279
3352B92761087J409632K697966L761737N009063O455330P856320R171484J0621444
3344C39744063J2080247J3178830J4222807J4582616J4341855J3174959J1044320
3337D32369697Q213213N036834J810987j030537l144472m178786m738495m678412
3329D29660029m639264m623361n141811o436940q330952j1127678j3994377j6940492
3321C58425154j9575400k1249834k1917131k1363671k0135288j8303752j6089803
$$ plain form
3379 311221736 311928556 312683291 313049429 312991142 312507480 311636222 310547444 309315988 307932579
3370 307932579 306630464 305153655 303766007 302507818 301214207 299994181 298891770 297954283
3362 297954283 297078772 296316937 295525681 294681399 293795649 293010238 292423624 292142690 292142808 292761087
3352 292761087 294170719 296868685 300630422 305639485 312094815 319951135 329122619 339744063
3344 339744063 351824310 365003140 379225947 393808563 408150418 421325377 432369697
3337 432369697 440582910 445619744 447430731 446400194 443255722 439076936 434338441 429660029
3329 429660029 425020765 420397404 415255593 408818653 400487701 389360023 375365646 358425154
3321 358425154 338849754 317599920 295682789 274319118 254183830 235880078 219790275
3314B19790275j4065327j2231176j0866560r537255q573274p959253p438009o932220
3306A42187201o383891o230746n842002n335830m994918m557706m347212l981416
3298A00513480l853511l541941l408377l320977l321418l298191l099985l116454
3290G3552626k997259k833173k838208k588088k481513k278148j983990j995497
3282E3556750j887762j789850j694220j673909j398902j290875j381870j317099
3274D1122263j288689j119482j081912j021138r64791r17727p53546q85853q28905
3265C2260220q05636p69481o44695o84662o29525n63420o96959o56362n39844
3256B6269636m57565n13421n68389n49054n55435n78347l69273m04575m20726
$$ plain form
3314 219790275 205724948 193493772 182627212 173089957 164516683 156557430 149119421 142187201
3306 142187201 135803310 129572564 123730562 118394732 113399814 108842108 104494896 100513480
3298 100513480 96659969 93118028 89709651 86388674 83067256 79769065 76669080 73552626
3290 73552626 70555367 67722194 64883986 62295898 59814385 57536237 55552247 53556750
3282 53556750 51668988 49879138 48184918 46511009 45112107 43821232 42439362 41122263
3274 41122263 39833574 38714092 37632180 36611042 35646251 34728524 33974978 33089125 32260220
3265 32260220 31454584 30685103 30040408 29355746 28726221 28162801 27465842 26809480 26269636
3256 26269636 25812071 25298650 24730261 24181207 23625772 23047425 22678152 22273577 21852851
3247B1852851n04433m30509l93069k62030l10377m31060k26537l90664m02976
3238A8501196m10602k99150k80657k96017l50990l55701k28117k09504k43501
3229A5826957k96176k54079j95343k38618k51261k98472k49853k03262j85694
3220A3654199l21830j17288j63108k80631k42828j72651m8533k29205j61690k17579
3210A1698856k48922j41616j33995j59587j92280k34532j41748j31210r5615j02069
3200A0117282k45669j97959o4903j01600l6340j81750k35112r869m7696j44814
3190H851570k02493o0311o7789J8277m5969j68545j65519j18055M6899K4072m2546
3179H069591n842j56321l0111p1683j26517o2702M0424J37048r4230p8149k8860
$$ plain form
3247 21852851 21348418 20917909 20524840 20262810 19952433 19521373 19294836 18904172 18501196
3238 18501196 18090594 17791444 17510787 17214770 16863780 16508079 16279962 16070458 15826957
3229 15826957 15530781 15276702 15081359 14842741 14591480 14293008 14043155 13839893 13654199
3220 13654199 13332369 13215081 13051973 12771342 12528514 12355863 12307330 12078125 11916435 11698856
3210 11698856 11449934 11308318 11174323 11014736 10822456 10587924 10446176 10314966 10219351 10117282
3200 10117282 9871613 9673654 9608751 9507151 9470811 9289061 9053949 9044080 8996384 8851570
3190 8851570 8649077 8588766 8520977 8539254 8493285 8324740 8159221 8041166 8088065 8112137 8069591
3179 8069591 8063749 7907428 7877317 7805634 7679117 7616415 7656839 7793887 7699657 7621508 7592648
3168G592648n2899p3916L3004k1952r7262l4087l7251k8395Q8583n1785j15619
3157G201069k694O3863J4477l6235M8792J47922j46832j18666J3544j30566O7828
3146G122502j28908l3936j7151r2757j37538r0230j4030o6433O4584p5770j4901
3135F515432j43835j11356R4322O0155k4775R9523R8853m6268J2435J4493j27196
3124F441783M223l1719J05121J67478K9254k0157j3375K421q4661j5949N7134
3113F641553N5431j17677q9491L3070j30292k0006n5890P1334J11548q4475M2733
3102F457838p0264J5066L8710j0087q4862Q9910o9425N068N6742J1170K9562q552
3090F460876O5042J36071N5488O9394J08243P4031R7774O6721K4785J91233J31018
$$ plain form
3168 7592648 7539749 7465833 7498837 7476885 7379623 7345536 7308285 7279890 7368473 7316688 7201069
3157 7201069 7198375 7262238 7276715 7240480 7289272 7437194 7290362 7171696 7185240 7054674 7122502
3146 7122502 6993594 6959658 6942507 6849750 6712212 6621982 6607952 6541519 6606103 6530333 6515432
3135 6515432 6371597 6260241 6354563 6414718 6389943 6489466 6588319 6542051 6554486 6568979 6441783
3124 6441783 6446006 6414287 6519408 6686886 6716140 6695983 6682608 6685029 6600368 6584419 6641553
3113 6641553 6696984 6579307 6489816 6522886 6392594 6372588 6316698 6388032 6499580 6415105 6457838
3102 6457838 6387574 6402640 6441350 6431263 6346401 6436311 6366886 6371954 6428696 6439866 6469428 6460876
3090 6460876 6525918 6661989 6717477 6786871 6895114 6969145 7066919 7133640 7158425 7349658 7480676
3079G480676j75360j34954Q7105j05622k4197j8175j39149Q0205L5094n1794q0619
3068F953210j73907m2524P4808j49752j35461l7588o5488j66517j88586m4566
3058F023629n1269j24696J07360l652M865m7105J22308J14832r872j41052k00210
3047E795138k67892j27413k09266j25005J8119p898j46095j15727P0390k76086
3037D608265o5848R2457m7970n6518N8578k3194O0757P1068M3383N9426J04884
3026D905288k073J91829L38140K98955L57738J49906j8841m33973l76972k26148
3016E183849j83797j66085j65644o9609R5973j61687P8088J6992k06044k2677
3006D399359J05828J4518O7267J81909J50242J20210J51177J59824J75912K50682
$$ plain form
3079 7480676 7305316 7170362 7257467 7151845 7127648 7109473 6970324 7050529 7085623 7033829 6953210
3068 6953210 6779303 6736779 6811587 6661835 6526374 6488786 6423298 6256781 6068195 6023629
3058 6023629 5972360 5847664 5955024 5951372 5956237 5909132 6031440 6146272 6136400 5995348 5795138
3047 5795138 5527246 5399833 5190567 5065562 5083681 5075783 4929688 4813961 4884351 4608265
3037 4608265 4542417 4634874 4586904 4530386 4588964 4565770 4626527 4697595 4740978 4800404 4905288
3026 4905288 4903215 5095044 5433184 5732139 6089877 6239783 6220942 5786969 5409997 5183849
3016 5183849 5000052 4833967 4668323 4598714 4694687 4533000 4611088 4628080 4422036 4399359
3006 4399359 4505187 4519705 4586972 4768881 4919123 5039333 5190510 5350334 5526246 5776928
2996E776928L01713M89098L77638O40670M19029K99973K2057n25839q27489p01972
2986F271806m57767l73517l03486q9358j17899k13215l1111N4655r8995J2785
2976D653898m5777J07891J14117J31527N9497K08787K88585J70056L45510M46311
2966F480402M57345K22220l10582l36593n17765n24336l54889l69189m45692k19580
2956D081341j31214k09500j12119j75687Q3154j14757J27070m8188k00674K197
2946C301623N7k4513l7067p0941l2757j07860J7407j29104j42269J59223N500
2935B939299m1507k1852M6225K1559j34856m2712p244M2737j02260N4764J29307
2924B883460O2358p9891J3779O9110K0427O8527j8420n6564j51075q8246n387
$$ plain form
2996 5776928 6078641 6567739 6945377 7586047 8005076 8305049 8327106 7801267 6973778 6271806
2986 6271806 5814039 5440522 5137036 5047678 4929779 4716564 4685453 4740108 4641113 4653898
2976 4653898 4608121 4716012 4830129 4961656 5021153 5229940 5518525 5688581 6034091 6480402
2966 6480402 6937747 7159967 6849385 6512792 5995027 5470691 5115802 4746613 4300921 4081341
2956 4081341 3950127 3740627 3628508 3452821 3535975 3421218 3548288 3500100 3299426 3301623
2946 3301623 3301680 3277167 3240100 3169159 3136402 3028542 3045949 2916845 2774576 2933799 2939299
2935 2939299 2897792 2875940 2922165 2943724 2808868 2766156 2758912 2801649 2699389 2754153 2883460
2924 2883460 2945818 2865927 2879706 2948816 2969243 3037770 3019350 2962786 2811711 2723465 2718078
2913B718078Q4656j298M0210j09379j02378L4581O0430N4152o7835r9659K7521
2902B639079r951J26317J9600K5006J09884J07128Q5459j07502J2377J31817Q1984
2891C221198r5809l6116r7937l7012j30720N5212k0266k6008o4063n9433j5246
2880B693800j5812k2456q7348n7546K6571k9030m484j7154l0493q7077o745j4017
2868B348209J28559O4004j05890Q7217q0966J50058n5724q598K1208J9055k7343
2857B539789m0746p6986j80977N1857Q7870m3325q5236r0071Q3999J9614M3113
2846B308901P2051L2615m5742j03921J10682m4644M4075J49947L5862J8986R3089
2835B671901j33378M079k4262j11412j7705N4089r7897p6742q96j2643l3098j17217
$$ plain form
2913 2718078 2802734 2801436 2841646 2732267 2629889 2664470 2724900 2779052 2711217 2611558 2639079
2902 2639079 2629128 2755445 2775045 2800051 2909935 3017063 3102522 2995020 3007397 3139214 3221198
2891 3221198 3125389 3089273 2991336 2954324 2823604 2878816 2858550 2832542 2768479 2709046 2693800
2880 2693800 2677988 2655532 2568184 2510638 2537209 2508179 2503695 2486541 2456048 2368971 2362226 2348209
2868 2348209 2476768 2540772 2434882 2522099 2441133 2591191 2535467 2526869 2548077 2567132 2539789
2857 2539789 2499043 2422057 2241080 2292937 2380807 2337482 2252246 2162175 2246174 2265788 2308901
2846 2308901 2380952 2413567 2367825 2263904 2374586 2329942 2374017 2523964 2559826 2578812 2671901
2835 2671901 2538523 2542602 2518340 2406928 2389223 2443312 2345415 2268673 2267777 2255134 2222036 2104819
2823B104819P5840o7003J3543L8454p225j0482M9741o3985m9283M8223O9146J13348
2811B315136J20507M0618J05371M0303l0541k2211L9993k452r5602O4341K3217
2800B598680R7825J11247r0470O1622r0582j55089K6506N5412k30453o7840m7298
2789B269560J5073r6384N9628l3124R7027J040o1877k615N5543m4020k8642N6397
2777B287606n9971P4194N5922O4447l7313P4315l8066K8451j37038o5873p4526
2766B172148k6645q6523O1636n7021l6394k21260l5713m7302J4508M6084m8060
2755A735458k6581j2856R7425j10585j3753j4844Q8577p9418L1490n4257p2717
2744A567939m4939p9264J26330L4083j33866L1559J45478l8455j38386J5121J500
$$ plain form
2823 2104819 2180659 2113656 2127199 2165653 2158428 2147946 2197687 2133702 2084419 2132642 2201788 2315136
2811 2315136 2435643 2476261 2581632 2621935 2591394 2569183 2609176 2606724 2511122 2575463 2598680
2800 2598680 2696505 2807752 2717282 2778904 2688322 2533233 2559739 2615151 2384698 2316858 2269560
2789 2269560 2284633 2188249 2247877 2214753 2311780 2312820 2250943 2248328 2303871 2259851 2231209 2287606
2777 2287606 2227635 2301829 2357751 2422198 2384885 2459200 2421134 2449585 2312547 2246674 2172148
2766 2172148 2145503 2058980 2120616 2063595 2027201 1805941 1770228 1722926 1737434 1783518 1735458
2755 1735458 1708877 1696021 1793446 1682861 1669108 1654264 1742841 1663423 1694913 1640656 1567939
2744 1567939 1523000 1443736 1570066 1604149 1470283 1501842 1647320 1608865 1470479 1485600 1487100
2733A487100n052k2493o624P2016n550l1445j52735p4285R3962j9980l2533N0208
2721A352589Q733n4532j2732m543m9578Q845o304r441j15004Q1866O6090j4883
2709A251106k6437J05629k8410o2676q5041L1291k8819n1815k0306j4525l1104
2698A038893O3979q611l7223q8222K0479R3716M6830r5978j06079P3920j3726
2687I87978o2844o9177o3108K04214K9270q8911m769l3258q7055L1980J24862
2676I69182M4253J7637j37615k4974l5306M5238n158L8238M6314P1385m5185n5297
2664I28712j17440l0282N7493J3883k8267J6294M5592O3613q4972M2983n0086
2653H57523j42563N8967M4760j034Q690n2910j2470L1779M2659l8220l1004O8429
$$ plain form
2733 1487100 1482048 1459555 1452931 1524947 1519397 1487952 1335217 1260932 1354894 1334914 1302381 1352589
2721 1352589 1361322 1306790 1294058 1289515 1239937 1248782 1242478 1233037 1118033 1199899 1265989 1251106
2709 1251106 1224669 1330298 1301888 1239212 1154171 1185462 1156643 1104828 1084522 1069997 1038893
2698 1038893 1102872 1094261 1057038 968816 989295 1083011 1129841 1033863 927784 1001704 987978
2687 987978 925134 855957 792849 997063 1026333 937422 932653 899395 812340 844320 969182
2676 969182 1013435 1031072 893457 868483 833177 878415 873257 911495 957809 1029194 984009 928712
2664 928712 811272 780990 838483 852366 824099 840393 885985 949598 864626 907609 857523
2653 857523 714960 773927 818687 817653 826343 773433 760963 792742 835401 797181 766177 834606
2641H34606k1610M4209p6552n1842L5659M4111M0007j33835q6132M9526M4140
2630G22287k5172K4925K5074r3240j6773J04587l555j25107l8301K07364p4175
2619G07914N7658m2025j6052l154J07201n723m6370Q3115m1170r3799q8068n9932
2607E59595Q0378N0897k6720M7079n0997n2930K5886J50087k1409j32977m2876
2596E86013L8899m4612k726J00073N3064j32937O633O2043o3591Q4536o4270R4566
2584G17691Q9827j02774n4787l1484N9094l2604J4023O7187Q0269j50706p5444
2573E80292J3555J0706l7984J34462R2194j93137K8924J06835l5410o6032m9708
2562E84697k2990j44742O2901K4150R5858L8185j0156K0687r6859j08920N0552
$$ plain form
2641 834606 812996 857205 780653 728811 764470 808581 848588 714753 628621 678147 722287
2630 722287 697115 722040 747114 653874 637101 741688 738133 613026 574725 782089 707914
2619 707914 765572 723547 707495 704341 811542 805819 759449 842564 801394 707595 619527 559595
2607 559595 639973 690870 664150 711229 660232 607302 633188 783275 761866 628889 586013
2596 586013 624912 580300 577574 677647 730711 597774 604407 666450 602859 687395 623125 717691
2584 717691 807518 704744 649957 618473 677567 644963 658986 726173 806442 655736 580292
2573 580292 593847 604553 566569 701031 793225 600088 629012 735847 700437 634405 584697
2562 584697 561707 416965 479866 504016 599874 638059 627903 648590 551731 442811 493363
2551D93363J1627r1499O2449Q5543N3111j10287N0665N9721J392j37111N8951
2540E37925M3889r2507J6320k1022J01187j72831q101J19366j2252M3765K2983
2529E78722n797M2123l2603n7691k6685J9810K90N0013m6468R1287N5144r1376
2517E76769k085n902o8648O3877r2162j38295O7194Q3378j9252o7137M657J27295
2505E29689J8558r3049o815p6567M5648n1351K132m1673L8592J28995N2121j70641
2493C75639k9913q2462J05248P9286j08420J46858p5663n0961k2599R20N5849
2482C93782m6169K011J2669J17697M7024j24132k1628q6790K7725K2611M8800
2471C93600l4826j6487Q0610N1382j33050n6184L013N2216O6102M106o682j00266
$$ plain form
2551 493363 504990 413491 475940 561483 614594 504307 554972 614693 616085 478974 537925
2540 537925 581814 489307 505627 484605 585792 412961 404860 524226 511974 555739 578722
2529 578722 572925 615048 582445 524754 498069 517879 518169 568182 521714 613001 668145 576769
2517 576769 574684 568782 500134 564011 471849 333554 400748 484126 464874 397737 402394 529689
2505 529689 548247 455198 448383 371816 417464 366113 368245 326572 365164 494159 546280 375639
2493 375639 345726 263264 368512 447798 339378 486236 410573 359612 337013 337933 393782
2482 393782 347613 349624 362293 479990 527014 402882 381254 294464 322189 344800 393600
2471 393600 358774 342287 422897 474279 341229 285045 288058 340274 406376 410482 403800 303534
2459C03534P6123N6447o9847j65375K0714P6198O1605j8754k8584o7017J48305
2448C93349m4246m3604J6575j34791O4343N1273K8285k6319j2472L5254o6186
2437B61461O5919J27401p9226P9993P721j00458p0145R026n3431q4838J63190
2426C26613L5283n9510q330J40373N996j30581O7778K6388l1123m960r0272Q4167
2414C61822m0861o936M9522p8204L169P2824j36686K99P0355m3324k3204m4923
2402A83853M182P3825J03771l7559j3833J0724r454o7585Q7994j21021p3401J99295
2390C40791p8454j21573m7455P9007L3320m403M5767L0770l2261K8201J9578q4754
2378B08534j626J1022N0453p995j3752p6198M2156L9663N2349k7720m1621l4071
$$ plain form
2459 303534 379657 436104 366257 200882 221596 297794 359399 340645 312061 245044 393349
2448 393349 349103 305499 322074 187283 251626 302899 331184 304865 292393 327647 261461
2437 261461 327380 454781 375555 455548 463269 362811 292666 301692 248261 163423 326613
2426 326613 361896 302386 294056 434429 440425 309844 377622 404010 372887 367927 277655 361822
2414 361822 320961 314025 363547 285343 288512 361336 224650 224949 295304 251980 228776 183853
2402 183853 188035 261860 365631 328072 314239 324963 315509 247924 335918 214897 141496 340791
2390 340791 262337 140764 93309 172316 205636 201233 247000 277770 245509 273710 293288 208534
2378 208534 206908 217930 268383 260388 246636 170438 212594 252257 304606 276886 235265 201194
2366B01194J08825r0647l1482J3670J6549J17382K724q8138N9308L2439j09407
2355B32417J01551o1886n7239j0809P8689L4069Q9987r1058j34558P5282O1307
2344C17752j21613L2829K2923n0996p262J4364K570P280P543J05356J8295j11413
2332B37628l4539N8554J699n6600Q2649k0633j95422P9883J09756k3242j03768
2321A35965M2748M6729j44799J39232n2582O0770K1196J11381n3719K8682K9799
2310C65402L6071j68608j19561J0912R1232R5110n2816o930L5302M5928k7518
2299C04524k662j57713K5699J07062J15916M917K7119r5156K672O166n9372J6257
2287B95429M7655k6841m2236p9601P388J30329o6968J113p1024m4694Q8516j6957
$$ plain form
2366 201194 310019 219372 187890 201560 218109 335491 338215 250077 309385 341824 232417
2355 232417 333968 272082 214843 204034 282723 316792 406779 315721 181163 256445 317752
2344 317752 196139 228968 251891 200895 193633 207997 210567 217847 225390 330746 349041 237628
2332 237628 203089 261643 263342 206742 289391 268758 73336 153219 262975 239733 135965
2321 135965 178713 225442 80643 219875 167293 228063 249259 360640 306921 335603 365402
2310 365402 401473 232865 113304 124216 215448 310558 257742 250812 286114 332042 304524
2299 304524 301862 144149 169848 276910 392826 397743 424862 329706 332378 338544 279172 295429
2287 295429 343084 316243 274007 194406 201794 332123 265155 266268 195244 150550 239066 222109
2275B22109j12224k0161q504O2744M3731M1197J9944p4290j59634O2567J16935
2264A94414J267n2570l7607P9337k0493J898J2130J5140q9562o0212K9843J55496
2252B29081l3240j01857n6935N3368J60774o0768m8379J22398r8278J55782j31053
2241A90893K0016q6346L3986r205n1276o0325q5348K04996k6019O0972o5822M1249
2229A67771P5637k4237n8746j24741J18579Q7551p6539R9408j03275j24927J2632
2218D9113O6806R818J6217o8269N4457J2662n3370m7000R6457J4776j03772P4365
2206A22260J22159o4664k0245J19085L5410m2669M4330j51703P1204K7019j01753
2195A60433r903J17174j09425N1493R772k8177K8724K0629m6404M7749P1041l2879
$$ plain form
2275 222109 109885 89724 81220 143964 187695 228892 248836 174546 14912 77479 194414
2264 194414 195681 143111 105504 184841 164348 166246 178376 193516 103954 43742 73585 229081
2252 229081 195841 93984 37049 90417 251191 190423 142044 264442 166164 321946 190893
2241 190893 210909 124563 158549 149344 98068 37743 -47605 157391 131372 192344 126522 167771
2229 167771 243408 219171 160425 35684 154263 241814 165275 264683 161408 36481 49113
2218 49113 115919 125737 141954 73685 128142 140804 87434 40434 136891 151667 47895 122260
2206 122260 244419 179755 159510 278595 314005 271336 315666 163963 235167 262186 160433
2195 160433 150530 267704 158279 209772 219544 191367 220091 240720 194316 242065 313106 280227
2183B80227J7833j31853q8870J36055J16841j21733l1198n486j9191l7722M6486
2172A61389q3908Q4638R4567q2309j0443L6780o2705Q4066q298j1628q878l0055
2160A63216J69923N0436j6147j5509j13414P8793m3387M8282l4433m5311p6895
2149A65554K9377Q8887l234K3161j111l9756n474M6963O409P147L7223J74093
2137E29239j05698M0777k3820l3795M9644p1288R0108n5070r4453K3661N6673
2126D05978Q2313n027M7557R3948M8517J04371q1752P5518j15048O5235J4275
2115G35885R797L2748J0005n3341L2600P6496J31766J22564j35931l2348R1932
2104A022173R2651j1224M5931J22913k4759O1785k0755m1967J32747R7983j40315
$$ plain form
2183 280227 298060 166207 77337 213392 330233 208500 177302 171816 152625 114903 161389
2172 161389 77481 162119 256686 174377 163934 200714 138009 222075 213777 202149 193271 163216
2160 163216 333139 383575 367428 351919 238505 317298 273911 322193 287760 242449 165554
2149 165554 194931 283818 280584 303745 302634 262878 257404 304367 310776 317923 355146 529239
2137 529239 423541 464318 440498 406703 456347 385059 475167 420097 325644 349305 405978
2126 405978 488291 483264 530821 624769 673286 777657 695905 771423 656375 721610 735885
2115 735885 745682 778430 788435 735094 767694 844190 975956 1098520 962589 930241 1022173
2104 1022173 1114824 1103600 1149531 1272444 1247685 1309470 1288715 1246748 1379495 1477478 1337163
2093A337163m2983L7834j1115J38758O4870Q3675J07438K2610L6268J39796O2410
2082A976724J10693P4865Q9655J39669K41805J34083N7192K24281K63918K42025
2072C554910L24831K08433M73187N69516O48139O72107O71884P49241Q65640J000930
2062I738818J233049J452443J659161K103977K428481L257585L985828N464130
2054C1323472L905706l339336n440649m213260m363290l863384k616971j816054
2046I576234j151268p95340m82734m49388l23146j94019m05166n22609n25587
2037D726977l36813l43984l27240l20650k19770j87307j90427k73712j46706l7629
2027B342739j005j54240j48431l6385l1857j50033j58032l2203M1794o4455q5778
$$ plain form
2093 1337163 1294180 1332014 1320899 1459657 1524527 1608202 1715640 1738250 1774518 1914314 1976724
2082 1976724 2087417 2162282 2251937 2391606 2633411 2767494 2824686 3048967 3312885 3554910
2072 3554910 3879741 4088174 4561361 5130877 5779016 6451123 7123007 7872248 8737888 9738818
2062 9738818 10971867 12424310 14083471 16187448 18615929 21873514 25859342 31323472
2054 31323472 35229178 31889842 26449193 22235933 17872643 14009259 11392288 9576234
2046 9576234 8424966 7629626 7146892 6697504 6374358 6180339 5775173 5252564 4726977
2037 4726977 4390164 4046180 3718940 3398290 3178520 2991213 2800786 2527074 2380368 2342739
2027 2342739 2341734 2187494 2039063 2002678 1970821 1820788 1662756 1630553 1672347 1607892 1522114
2016A522114o6279j29784j77055J553k4248o3946P4744l3196j39818o1891j18879
2005G83315J22037P5395j29078j23313J23533L1962j31018R448j35038K8251K3822
1994F79316l0239K8469j52471J0608M5148L2228m5436n9157j19103k5428J62117
1983E26052J2565k17164o6866m2140K08533m6490j33944K8792J39574L4498j02507
1972C40903j22621M6300O7773j63745l4649R4456J7512n8019M9990n2313j22388
1961F3199J02217m2508p2549j34539Q1803J77443j9048K0503N4083p755j2986
1950B09863J587r4565o0081P603L8401N7728Q495o7021J2266m6148R8055J5815
1938A81998m9118n422L7638r6775J887n9524J6268j05143K1355J11348n9791j15510
$$ plain form
2016 1522114 1455835 1326051 1148996 1150549 1126301 1062355 1137099 1103903 964085 902194 783315
2005 783315 905352 980747 851669 728356 851889 883851 752833 762281 627243 655494 679316
1994 679316 649077 677546 525075 535683 580831 613059 567623 508466 389363 363935 526052
1983 526052 538617 321453 254587 212447 420980 374490 240546 269338 408912 443410 340903
1972 340903 218282 264582 332355 168610 133961 228417 245929 187910 237900 185587 63199
1961 63199 165416 122908 50359 -84180 -2377 175066 156018 176521 230604 222849 209863
1950 209863 211450 116885 56804 64407 102808 160536 169031 102010 114276 68128 166183 181998
1938 181998 132880 127458 165096 68321 70208 10684 26952 -78191 -56836 54512 -5279 -120789
1926a20789L1386r621J10319M0516l2562M523j4133O3025j9935L8404L0990L0543
1914A52666j45820p1430k6305J51211O4690o3959R542l5535j02827k6486L9242
1903e5011P2196L1295N1314L9336r360k02815l471K0643l4807J03863r0313R047
1891f8083N5736M7909o715o7423j2307j34225L9679J7544K008J13433R7902n1421
1879C4037J543J2407O0758q0448q1638K9362j2278k4267n9083P8818o2566Q3930
1867a9425m2185Q0457j20198M1694k3780K6433n3453L5315k5701l208J3764j6861
1855a07148J6948k5383L6818n2025r540J07181K5233r0992R1686j45761O6779
1844h6204M6365K2077M7675K3847k6536m5180M2193l5646m318j17524J3528j39181
$$ plain form
1926 -120789 -89403 -99024 11295 51811 19249 23772 9639 72664 52729 91133 122123 152666
1914 152666 6846 -64584 -90889 60322 125012 61053 70595 35060 -67767 -94253 -55011
1903 -55011 17185 48480 99794 139130 129770 -73045 -76516 -55873 -90680 13183 -77130 -68083
1891 -68083 -12347 35562 28847 -38576 -50883 -185108 -145429 -127885 -125877 -12444 85458 34037
1879 34037 35580 47987 108745 28297 -53341 -23979 -36257 -60524 -119607 -40789 -103355 -19425
1867 -19425 -61610 18847 -101351 -59657 -83437 -57004 -110457 -75142 -100843 -104051 -90287 -107148
1855 -107148 -90200 -115583 -78765 -130790 -140330 -33149 -7916 -98908 -7222 -152983 -86204
1844 -86204 -39839 -17762 29913 53760 27224 -17956 24237 -11409 -15727 -133251 -119723 -258904
1832b58904L0675K01469Q4792K3963j57078r0330J00317k6455k1566J07216j13333
1821a19234M3570l5405n4039M628K0716k4970J42795k5260j6848j6610J08781
1810B8124O3929Q1401r2340j14785p4393n1739Q0381P14L0915M3637o5117k005
1798g1278q27J6045M4391p7581k1114j10874Q399Q2167Q319J1146m6803k0952
1786a78962L5138L4027q9813Q6376m11J1529N3368J2234N9939j10008O5912p9573
1774a00244j14730l4771L8344n8826N9285L113J19313P641K4421P3573k84807
1763b67688l9804J73746l5906Q7200J9643k3462l1904k0570O345j057J27091O1243
1751E4877j10011j88346J5302R7093k7457R0729M7116p5770l7836Q3932J1493
$$ plain form
1832 -258904 -228229 -26760 58032 81995 -75083 -165413 -65096 -91551 -113117 -5901 -119234
1821 -119234 -75664 -111069 -165108 -160480 -139764 -164734 -21939 -47199 -64047 -80657 28124
1810 28124 92053 173454 81114 -33671 -108064 -159803 -79422 -78708 -47793 -4156 -69273 -71278
1798 -71278 -72105 -56060 -11669 -89250 -110364 -221238 -212839 -130672 -122353 -111207 -158010 -178962
1786 -178962 -143824 -109797 -199610 -113234 -113645 -102116 -48748 -36514 23425 -86583 -20671 -100244
1774 -100244 -214974 -249745 -211401 -270227 -210942 -207829 -88516 -80875 -56454 17119 -267688
1763 -267688 -307492 -133746 -169652 -82452 -62809 -86271 -118175 -138745 -132400 -133457 -6366 54877
1751 54877 -55134 -243480 -228178 -131085 -158542 -67813 -20697 -96467 -134303 -50371 -38878
1740c8878m1229O8J1211k0340J21710n6088j07153J858J7772N98K7273m184J4553
1727g2829O1633j55046J4280l0571k2046O2480P6022p0848J17072q8552O7454
1716d0951Q0198k13107M6090j4648j4318n4522O1291l5147K0563Q8599Q133J4790
1704e3029l7070O2157K409q9128o496Q4872L6380r0150r3615K1451P2096j5957
1692a06080R15j3532j9349L363j43444K3614J11315J45079l7922K9025n1653k8404
1680h7073k332m9399j58756J03258O3580K0862N2732k13915K4997J87005j17964
1669a77005P2459k6868p5657Q4281m4164N6753k1732l8378k307J699k1562N3529
1657a38952Q5351q0379J852p7881J33253j944j81930N207N1485J71873j69285
$$ plain form
1740 -38878 -80107 -80039 -68828 -89168 32542 -23546 -130699 -128841 -111069 -110471 -83198 -87382 -72829
1727 -72829 -11196 -166242 -151962 -182533 -204579 -142099 -66077 -136925 -19853 -108405 -40951
1716 -40951 39247 -173860 -127770 -142418 -156736 -211258 -149967 -185114 -164551 -75952 -67819 -53029
1704 -53029 -90099 -27942 -25533 -114661 -121157 -36285 95 -90055 -183670 -162219 -90123 -106080
1692 -106080 -105165 -118697 -138046 -134683 -278127 -254513 -143198 1881 -36041 -7016 -58669 -87073
1680 -87073 -89405 -138804 -297560 -194302 -130722 -109860 -57128 -271043 -246046 -59041 -177005
1669 -177005 -104546 -131414 -207071 -122790 -166954 -110201 -131933 -170311 -172618 -170919 -192481 -138952
1657 -138952 -53601 -133980 -132128 -210009 -76756 -78700 -260630 -255423 -203938 -32065 -201350
1646b01350m2686J08358j5898q4873O8651O6260K7970L8993J6050j31271j9070
1635a68866J17579M1537n0013K5349k3637p0384K1790L5557p4299J20302j4110
1624c9195j36222M8632K076M8768N6560L2770n4694r4532J09352n9089r2766J08083
1612g0257k4885j07206l07j17176J61987M698j79252Q3629O3881J773j0862N2389
1600a41588K5151k0740j18732J25304O5869j29740N3096Q9939J2661q4241O6097
1589e6924k9014p7634j3261N8048R9228o5428q5082O0565o0861j6405M0763R1123
1577e4882l2668q3126K47357Q0417k41691L0670L2949p9576J082m1233l7350q3637
1565b61688J05201j2387j3045J5920N892n34m7958O9036K9679k6156j146O987
$$ plain form
1646 -201350 -244036 -135678 -151576 -236449 -167798 -101538 -73568 -34575 -18525 -149796 -168866
1635 -168866 -51287 -9750 -59763 -34414 -58051 -128435 -106645 -71088 -145387 -25085 -39195
1624 -39195 -175417 -126785 -124709 -75941 -19381 13389 -41305 -135837 -26485 -85574 -178340 -70257
1612 -70257 -95142 -202348 -202655 -319831 -157844 -153146 -332398 -248769 -184888 -183115 -193977 -141588
1600 -141588 -116437 -137177 -255909 -130605 -64736 -194476 -141380 -51441 -38780 -123021 -56924
1589 -56924 -85938 -163572 -176833 -118785 -19557 -84985 -170067 -109502 -170363 -186768 -146005 -54882
1577 -54882 -87550 -170676 76681 157098 -84593 -53923 -20974 -100550 -99468 -140701 -178051 -261688
1565 -261688 -156487 -168874 -181919 -165999 -160107 -160641 -208599 -139563 -109884 -136040 -137186 -130199
1553a30199O3761p1913O8257q378m5952J09935K462j16074p7152n7250Q5215M0108
1541a37180L864P5598J9435M2045j34319r952O3694l7697J32264j8619O866j17442
1529a11443N4284J3782j41531k4758K1300p608K1090O4074N96J24702j58911j08725
1517b53148R9580K03508q273j34556n2980L008m2685j0686j4735L4936n548J13198
1505f8381J31306r2890N8480l2775q4596m1954n953k9493R1113M939j4949p927
1493i3080j07588k02169J96435J68400k9229n3944J0536p4882j9592M2503R5839
1482f6771n1541Q00L0719m7271J03137r8342L7174m9975L064M3239N6082n0697
1470i0382j3267q3357N8560M3730o9005Q2917l0315j18137N5664R0232J7836l9553
$$ plain form
1553 -130199 -66438 -138351 -70094 -78472 -124424 -14489 -12027 -128101 -205253 -262503 -177288 -137180
1541 -137180 -133316 -57718 -38283 3762 -130557 -140509 -76815 -114512 17752 -867 5999 -111443
1529 -111443 -57159 -43377 -184908 -209666 -188366 -195974 -174884 -110810 -110214 14488 -144423 -253148
1517 -253148 -153568 49940 41667 -92889 -145869 -142861 -185546 -196232 -210967 -176031 -181579 -68381
1505 -68381 62925 -29965 28515 -4260 -88856 -130810 -136763 -166256 -75143 -70204 -85153 -93080
1493 -93080 -200668 -402837 -206402 -38002 -67231 -121175 -110639 -185521 -205113 -162610 -66771
1482 -66771 -118312 -117512 -86793 -134064 -30927 -129269 -92095 -142070 -139006 -95767 -39685 -90382
1470 -90382 -103649 -187006 -128446 -84716 -153721 -70804 -101119 -219256 -163592 -73360 -55524 -95077
1458i5077n3484n1913J07140j74087N6089P6487O0577J5746M4740Q467j9378K9725
1446E032r3232Q1908M0641j01206o5967J5720k6937l403l9291n019p8061J59963
1434a09852r71q5738P1115N6768m9956q272J75497l6384k7063J118j85188Q4503
1422a14423Q2631j15028n4513N2470k2426L1445m254K2546O5371L974l3460n225
1410i0892o7514P3554r6434L8283k1065N9163K03746r0682j44508n7761q0358
1399b74468J13068q7821Q6936P8180j22949L3063P3960P0230j06652k9444m8075
1388b13972j0753J892J5122P5309J7569m3894J34906o9090j9475j1514R9121J34382
1376A09603L8557j58977q8447o6436j2370O4645l6405K0574N3644o4917M9247
$$ plain form
1458 -95077 -148561 -200474 -93334 -267421 -211332 -134845 -74268 -58522 -13782 -5315 -24693 5032
1446 5032 -88200 -6292 34349 -66857 -132824 -117104 -144041 -147444 -186735 -191754 -269815 -109852
1434 -109852 -110823 -196561 -125446 -68678 -118634 -126906 48591 12207 -14856 -13738 -198926 -114423
1422 -114423 -31792 -146820 -201333 -148863 -171289 -139844 -144098 -121552 -56181 -52207 -85667 -90892
1410 -90892 -158406 -84852 -181286 -143003 -164068 -104905 98841 8159 -136349 -194110 -274468
1399 -274468 -161400 -249221 -162285 -84105 -207054 -173991 -100031 -29801 -136453 -165897 -213972
1388 -213972 -224725 -222833 -207711 -132402 -114833 -158727 -23821 -92911 -112386 -123900 -24779 109603
1376 109603 148160 -10817 -99264 -165700 -178070 -113425 -149830 -129256 -75612 -140529 -91282
1365i1282o4169J540N245P0869O1569k2703n6263J1192j09814R2329P7639r3582
1353a17430k557o770l804m0721P9472j30534k7724O9740J24472n2512K9646K4954
1341e3768K3266q6217r6962l481l1307P5586J16627o7957k0441J27034m7796n4504
1329a19920l7704J8217J10494M0580p8817j53453j3300J04337M6183R604L1089
1318d2690o2325k3948M7396j02653o5032Q3540O2131L2624M2181o8561J7996j33321
1306b12662J31903P0966m6249l5152j4908K4744O0990J5931m6016r4980o9034
1295b14467J55406p56O6122J2240k9957L6213p8051k2663j8553n8826P6792p416
1283h3916q748n4147R6317j01120k8753K43456p1146j04325j4281k9467K6634
$$ plain form
1365 -91282 -155451 -153911 -148666 -77797 -16228 -38931 -95194 -84002 -193816 -101487 -23848 -117430
1353 -117430 -119987 -126757 -130561 -171282 -91810 -222344 -250068 -180328 -55856 -108368 -78722 -53768
1341 -53768 -30502 -116719 -213681 -217162 -248469 -172883 -56256 -124213 -144654 -17620 -65416 -119920
1329 -119920 -157624 -139407 -28913 11667 -67150 -220603 -233903 -129566 -83383 -73779 -42690
1318 -42690 -105015 -128963 -81567 -184220 -249252 -165712 -103581 -70957 -28776 -97337 -79341 -212662
1306 -212662 -80759 -9793 -56042 -91194 -106102 -81358 -20368 -4437 -50453 -145433 -214467
1295 -214467 -59061 -59817 6305 18545 -11412 24801 -53250 -75913 -94466 -153292 -76500 -83916
1283 -83916 -92664 -146811 -50494 -151614 -180367 63089 -8057 -112382 -126663 -156130 -129496
1272a29496R861k003L5699j54988j2956J22271R9588j6416M0319k4444l5269p7211
1260a45045M8421K4900j74817O3612Q2936k7685j3077l078Q2820m106m0288J61689
1248E6282l9782r7414j4213O1058k2771n820l4501k5222l7231R3703n2407L0972
1236h7346j7677r9826j3594J29795M0310J1553n9334K1K4524L403p1143L7227
1224a02087K1868j35785J4412Q4630P1720r0694M5498m9763M8631L3896j02050
1213a59724N6172L0221O8849p0801l2427J9346k971P0558K9412l1773R1274j01047
1201c2911q5763k4102l0975M8175O9073q6420J8025K9418m3672L0946m7764P7892
1189g8078n6135Q3200O5793k2409r1400r7870r9960P4241J05367j475j5231L2493
$$ plain form
1272 -129496 -119635 -121638 -85939 -240927 -253883 -131612 -32024 -48440 -8121 -32565 -67834 -145045
1260 -145045 -96624 -71724 -246541 -182929 -99993 -127678 -140755 -143833 -61013 -65119 -105407 56282
1248 56282 16500 -80914 -95127 -34069 -56840 -62660 -97161 -122383 -159614 -65911 -118318 -87346
1236 -87346 -105023 -204849 -218443 -88648 -48338 -36785 -96119 -96098 -71574 -68171 -139314 -102087
1224 -102087 -80219 -216004 -201592 -116962 -45242 -135936 -90438 -140201 -91570 -57674 -159724
1213 -159724 -103552 -73331 -4482 -75283 -107710 -88364 -91335 -20777 8635 -23138 68136 -32911
1201 -32911 -118674 -142776 -173751 -125576 -56503 -142923 -124898 -95480 -139152 -108206 -155970 -78078
1189 -78078 -134213 -51013 14780 -7629 -99029 -196899 -296859 -222618 -117251 -118726 -133957 -101464
1177a01464N3112J9176j33755J35603Q3243r2579r8272M4207R4217j4425j41462
1166a52399O6940J04900p1476k9237j3925j5254L9672q4247K0159M5371j46050
1155b35546P5424P5899O4524j2855p5358O0286K0335j24512L3061m625O5336P220
1143e0811j10332l764k912R106o0967N4256o786P4717j4009J4033J2968O2347
1131b2154l1629k7358L9468O6457j13041m8097Q9230M6625o3668J0997n0579K2996
1119h0753m6460O241J10827j58063M1763q687Q6176M4228l3671j9518J7699j25569
1107a65787L7693O0918j6673K8323N3401m1377p2158J5501n389K9760k0768m6160
1095a42716P1550P8388o6134j4522J01768p7316j8277Q8433q8832Q6952O5326
$$ plain form
1177 -101464 -48352 -29176 -162931 -27328 55915 -36664 -134936 -90729 3488 -10937 -152399
1166 -152399 -85459 19441 -52035 -81272 -95197 -110451 -70779 -155026 -134867 -89496 -235546
1155 -235546 -160122 -84223 -19699 -32554 -107912 -47626 -27291 -151803 -118742 -123367 -58031 -50811
1143 -50811 -161143 -164907 -167819 -158713 -219680 -165424 -172210 -97493 -111502 -97469 -84501 -22154
1131 -22154 -53783 -81141 -41673 24784 -88257 -136354 -47124 -499 -64167 -53170 -103749 -80753
1119 -80753 -127213 -120972 -10145 -168208 -126445 -135132 -48956 -4728 -38399 -57917 -40218 -165787
1107 -165787 -128094 -67176 -83849 -55526 -2125 -43502 -115660 -100159 -105548 -75788 -96556 -142716
1095 -142716 -71166 7222 -58912 -73434 28334 -48982 -67259 21174 -67658 19294 84620
1084H4620o4368q9405j6954J35853p2841l8712m3313J1117j0883L8008N881j72080
1072b33077N2441J91675q9194o4952Q2385L7370j9834n2031R2511J15348l5518
1061G7124n3345l6303m2084l9096K4139l1370p4203o0314J9373J60957Q7382j02596
1049g0336O4610n0797O0086O0346j73053j665K0223J1672j31081K1671J34579
1038e3745l740j4889m2037L3956k1032l5315k3770N7626J1277N9761k0204n894
1026e8006K7951m0131J21807n3027n3784j32746O7080P4864j45908O7263R7435
1015b7202L478j16401R0193k5219J0521O2200l5069p3087p2667j603J1176R9230
1003g4450Q6729N407l4786K8683q9113R311O2934n2454j00080j6199J08441N0246
$$ plain form
1084 84620 20252 -69153 -86107 49746 -23095 -61807 -105120 -94003 -104886 -66878 -60997 -233077
1072 -233077 -180636 11039 -78155 -143107 -60722 -23352 -43186 -95217 -2706 112642 77124
1061 77124 23779 -12524 -54608 -93704 -69565 -100935 -175138 -235452 -216079 -55122 32260 -70336
1049 -70336 -5726 -56523 3563 63909 -109144 -110809 -90586 -78914 -209995 -188324 -53745
1038 -53745 -57485 -72374 -114411 -80455 -101487 -136802 -160572 -102946 -91669 -31908 -52112 -58006
1026 -58006 -30055 -70186 51621 -1406 -55190 -187936 -120856 -45992 -191900 -124637 -27202
1015 -27202 -23724 -140125 -49932 -75151 -64630 -2430 -37499 -110586 -183253 -184856 -173680 -74450
1003 -74450 12279 17686 -17100 11583 -77530 -68219 -5285 -57739 -157819 -174018 -65577 -15331
991a5331r8616P8472m8063k4749O2553K4223j8241n8958P6345O3201n3564M047
979h681l9018O0841N6930L619R6516j10124n4738j12250l8228k5871O183R0030
967g4791o9130R1031J37127L4564p6966O1137k5453j3903m7195m2812J1296j39163
955a54258Q5946M1624N1484J9416q4168m1827j5487R7812k7169m593k8672l7487
943i7379R4157M0424n1825J51377K558j98492L9867r2189N5498P138K562q5857
931a32161j1315J41787q3573l4662J00945k8004J3941N8337l836O4148j30070
920d4463K316M5642m7414k2372k8008j69412L770R6439k8565k065O8639m7607
908a73100j0465N9368j2700Q7544M0536j44539J27557L8341n4797O6048Q822n7641
$$ plain form
991 -15331 -113947 -35475 -83538 -108287 -45734 -21511 -39752 -98710 -22365 40836 -12728 -8681
979 -8681 -47699 13142 70072 73691 170207 60083 5345 -106905 -145133 -171004 -164821 -74791
967 -74791 -143921 -52890 84237 118801 41835 102972 77519 63616 16421 -26391 -15095 -154258
955 -154258 -68312 -26688 24796 44212 -39956 -81783 -97270 542 -26627 -31220 -59892 -97379
943 -97379 -3222 37202 -14623 136754 139312 -59180 -19313 -111502 -56004 -48866 -46304 -132161
931 -132161 -143476 -1689 -85262 -119924 -18979 -46983 -33042 25295 21459 85607 -44463
920 -44463 -42147 3495 -43919 -66291 -94299 -263711 -259941 -163502 -192067 -194132 -125493 -173100
908 -173100 -183565 -124197 -136897 -49353 -8817 -153356 -25799 12542 -42255 23793 32615 -25026
896b5026o5901m0201J23405m2455N0713N0942m7620P4492q7312n531J1184J8658
884A5348j63088l4324J11146J9926M718R4799j03560Q5429J7378o9442J02237
873H0567p1569M8469j4411J9017r017p7350L9025q0671N5417o7244j06307O1642
861a22432M1388p999n509N0296n3638K4637P0623l0519L2219r4312J7281n113
849h3078j191j7876j7958J23193l5610k7119J7991m0071l0493q125J6868K0859
837h2610k5222q3040k4742R9958J0081Q2216o9756J75583l0518j56836J28222
826B3336L7700q3616O2967m0039o6515P6853j7760k352r5498j17642O7096J28703
814b6767J18391Q281n7595K0830l9111l8380K0100j29069Q9898n1635j4223O0023
$$ plain form
896 -25026 -90927 -131128 -7723 -50178 535 51477 3857 78349 -8963 -14494 -3310 15348
884 15348 -147740 -182064 -70918 -50992 -46274 48525 -55035 30394 47772 -21670 80567
873 80567 8998 57467 43056 62073 53056 -24294 14731 -65940 -10523 -77767 -184074 -122432
861 -122432 -81044 -89043 -94552 -44256 -97894 -73257 -2634 -33153 -934 -95246 -77965 -83078
849 -83078 -84269 -102145 -120103 3090 -32520 -59639 -41648 -81719 -112212 -120337 -103469 -82610
837 -82610 -107832 -190872 -215614 -115656 -105575 -23359 -93115 82468 51950 -104886 23336
826 23336 61036 -22580 40387 348 -66167 10686 -7074 -9426 -104924 -222566 -155470 -26767
814 -26767 91624 99905 42310 63140 24029 -14351 5749 -123320 -33422 -85057 -99280 -39257
802c9257k5084O8842K7191l5982n0824P4878r4568K9892r0622L6642J06892Q0735
790H8735q5054M5673n4763Q6632l0615p9957p8718P0415J2588N5332m5380j5706
778c0818o4190n8719J8230Q484N7204l1995l3123J5093O5109M669k2006q2974
766a55036P8732k8078m9417l564M1549R5186r519R5626m8234p2850k2410j5493
754i3508J0715r4468Q5683l1526R6545j45653J16513j02038j42520J40039J6070
743a44148M3456L841J732p5521K4755J07287O4924j5260m5268P3348j0401J03372
731A32117q0912M3067p544o1575k782j10040O4284k7178n768Q4787J5764k5610
719A8610m0588k6782p6877o6630O8365k195R4719J8809m5956N0782J6193P4317
$$ plain form
802 -39257 -64341 4501 31692 -4290 -55114 19764 -74804 -44912 -135534 -98892 8000 88735
790 88735 3681 49354 -5409 81223 50608 -29349 -108067 -37652 -25064 30268 -15112 -30818
778 -30818 -95008 -153727 -135497 -127013 -69809 -101804 -134927 -119834 -54725 -50056 -72062 -155036
766 -155036 -76304 -104382 -153799 -157363 -115814 -20628 -30147 65479 17245 -55605 -78015 -93508
754 -93508 -82793 -177261 -91578 -123104 -26559 -172212 -55699 -157737 -300257 -160218 -144148
743 -144148 -100692 -96851 -95119 -170640 -145885 -38598 26326 11066 -34202 39146 28745 132117
731 132117 51205 94272 86728 25153 22371 -87669 -23385 -50563 -56331 28456 44220 18610
719 18610 -21978 -48760 -125637 -192267 -123902 -126097 -31378 -12569 -58525 -7743 8450 82767
707H2767j94052p7316K24702P3930o2610L3793k4544j17219k0617R4452M6209
696E9495j24320M1549m7867K5476L661k5449N8428J4689o3336l7626J33146m2395
684d549K0316k9395l0683p5069q899Q5768p2754Q5005J19868l2696L9121p4150
672B1883p1551J3333J4945o1460n0116N3126L6022O0106n0364K5725L6864o5299
660c6786Q87K6646j401J027r9339q1425J33J50901J4829j17490O2165L6225Q1954
647C8326P262j02987L8805K429J06910n3278m8771n6308k4619K3266m4749P3363
635d0351j3847J3833R848K352M6056k6165o6365O2430p6657O1632l0863l1019
623h9116Q5112k3669k3822R4719l0279n174n8183O1732m8214k5218N9881M1496
$$ plain form
707 82767 -111285 -188601 36101 110031 47421 81214 56670 -60549 -81166 13286 59495
696 59495 -64825 -23276 -71143 -45667 -42006 -67455 -9027 5662 -57674 -95300 37846 -4549
684 -4549 15767 -13628 -44311 -119380 -128279 -42511 -115265 -30260 89608 56912 96033 21883
672 21883 -49668 -36335 -21390 -82850 -132966 -79840 -43818 16288 -34076 -8351 28513 -36786
660 -36786 -35899 -9253 -10654 -9627 -108966 -190391 -190258 -39357 -24528 -142018 -79853 -43628 38326
647 38326 45588 -57399 -18594 -16165 90745 37467 -11304 -67612 -92231 -68965 -113714 -40351
635 -40351 -54198 -40365 -30517 -28165 17891 -8274 -74639 -12209 -88866 -27234 -58097 -89116
623 -89116 -4004 -27673 -51495 43224 12945 7771 -50412 11320 -36894 -62112 -2231 39265
611C9265M522l9411q4727R4123l069o4408J05166K9444r697j06690J9055l2240
599d8667J7989r5381J04294R9661r0788J4100J0118l3556J01324q9947Q2767l7880
587C4034j28525n4966J13204P3123O6261j30643K7348Q2492L3955j2735q5539
576A8009K7091L0801j38651O9514K5217J24028j60149j0421J31875j33075n0378
565f6139Q7880Q9259j49727N7144N3887N9576N7758j16567Q6157n5936j5322K0878
553A08848M57J4926k33456j10N1912K1957K6163j05819m2276R3326O4334M6601
541D6863J8884M3133j69331P542p171P2350L9650l4015p3249J07979M6124q2266
529A6493j5943r998j9291O7599J2513n2681Q1926n6742o0501k4742R5736P3456
$$ plain form
611 39265 43787 4376 -80351 13772 10703 -53705 51461 80905 71208 -35482 -16427 -48667
599 -48667 -30678 -126059 -21765 77896 -12892 1208 11326 -22230 79094 -10853 71914 34034
587 34034 -94491 -149457 -36253 36870 103131 -27512 -164 82328 116283 103548 18009
576 18009 45100 75901 -62750 6764 31981 156009 -4140 -14561 117314 -15761 -66139
565 -66139 21741 111000 -38727 18417 72304 131880 189638 73071 159228 103292 87970 108848
553 108848 109305 124231 -109225 -109335 -57423 -35466 -9303 -115122 -157398 -64072 262 46863
541 46863 65747 108880 -60451 -52909 -60080 12270 51920 17905 -55344 52635 98759 16493
529 16493 550 -9448 -28739 38860 51373 -1308 80618 23876 -36625 -61367 34369 107825
517A07825q2048j395Q6998k4287j5016N5261o3626Q6559Q379M0003q7483l2740
505G8430n164p0675J3192n3023Q3540K1200j23607Q4369j7547n8717J21702o6255
493G445L0271L8460j52084K0886Q437K0553m2889K5412L8975J07798Q5570K2192
481B11026j02305l3018j00233J62753j23473j7437j0779l00J21038n671n1470
470E0131p643m0134N883J08540q2105R9140j28177l5347J11474P5731m0036q0032
458C7425O7047k9693k1260p3084p0414K2827J2204K6259k2426Q3520l3563O2973
446F1815j2574l368k3637k3610n7985R8380M7515j00847j2161L8704R136m5807
434b4439L5906R7758p2023J7132M9370q6887j07454L3003l9625J63813J09425
$$ plain form
517 107825 25777 24382 111380 87093 72077 127338 63712 150271 158650 198653 111170 78430
505 78430 73266 2591 15783 -37240 46300 67500 -56107 28262 10715 -48002 73700 7445
493 7445 37716 76176 -75908 -55022 -46585 -26032 -68921 -43509 -4534 103264 188834 211026
481 211026 108721 75703 -24530 138223 14750 -2687 -13466 -13766 107272 101601 50131
470 50131 42488 2354 8237 116777 34672 133812 5635 -29712 81762 157493 117457 37425
458 37425 104472 74779 53519 -19565 -89979 -67152 -54948 -28689 -51115 32405 -1158 61815
446 61815 49241 45873 22236 -1374 -59359 39021 86536 -14311 -26472 12232 21368 -24439
434 -24439 11467 109225 37202 54334 103704 16817 -90637 -57634 -97259 66554 175979
423A75979r2040j15205O4778j0343J33335K1115j61416o0867L4924P6457m05M465
411G0777m2903P8998k2039o2980M5251O4230L1437p9716j5944n3722q1813N9960
399h464q9837J5412R2970K4803r7434N9169J3362J15101l7137q2831J1119o9908
387e3675L7585Q2741j03758K3230J00172M5207k832m8626l3842j49550P0603J06101
375G3356M2980j5504n0797n831O0739m2255J22939m7573l6928j6672p6883j29315
363a21744O4418J0108k4404P6316O1858j2857q8760M2962J70089p1462j84967
352g8443J32187p5508j0453J56842N4702M7136j37597K6513N5975p3004J8695
341A17045k7725l0919j7499o9522K2304J5518M3772K0679r7962O2634P7581K9185
$$ plain form
423 175979 83939 -31266 33512 23169 156504 177619 16203 -44664 -9740 66717 66312 70777
411 70777 27874 106872 84833 21853 67104 131334 162771 83055 67111 13389 -68424 -8464
399 -8464 -98301 -82889 10081 34884 -62550 -3381 9981 125082 87945 5114 16233 -53675
387 -53675 -16090 66651 -37107 -13877 86295 131502 128670 80044 46202 -103348 -32745 73356
375 73356 116336 100832 50035 44204 104943 62688 185627 138054 101126 84454 7571 -121744
363 -121744 -57326 -47218 -71622 4694 66552 53695 -35065 7897 177986 106524 -78443
352 -78443 53744 -21764 -32217 124625 179327 226463 88866 115379 171354 98350 117045
341 117045 89320 58401 40902 -28620 -6316 9202 52974 73653 -24309 38325 115906 145091
329A45091j5887n978L2742J8542o1123o6636j4710k7400k4144k8760k1677J2747
317e7193n903k4296L6100k991J57810l7962j10062J80164q1705K4739p3786M8461
305E3376k8238j3161J02612K7784j05778o272j3393K6621Q2928N5735O1004r8895
293A44323l5047l7537l8657R4217p4061o1838J1450P7106J0193j4981j04521J379
281b7974k8241K8516j0056O7146K8300p6445J30399O0183R1209o0984j30675j6924
269E4454Q8032q2861q5211J40026l9359P7783k5833q7063L3232L0227r47k1747
257H0733N4917p303j21307J32094j17612o5440J62345m6371R5786q7224j16728
246c6110J25540l2570j83997J14122L9426j0062m2565P0351R0798k5875P355L7415
$$ plain form
329 145091 129204 123226 155968 174510 113387 46751 32041 4641 -19503 -48263 -69940 -57193
317 -57193 -63096 -87392 -51292 -54283 103527 65565 -44497 135667 53962 78701 4915 53376
305 53376 25138 11977 114589 142373 36595 30323 16930 43551 126479 182214 243218 144323
293 144323 109276 71739 33082 127299 53238 -8600 2850 79956 90149 75168 -29353 -27974
281 -27974 -56215 -27699 -37755 29391 57691 -18754 111645 171828 263037 202053 71378 54454
269 54454 142486 59625 -25586 114440 75081 152864 127031 39968 73200 103427 102480 80733
257 80733 135650 128347 7040 139134 21522 -43918 118427 72056 167842 80618 -36110
246 -36110 89430 56860 -127137 -13015 26411 16349 -26216 44135 134933 109058 116413 153828
234A53828J7616j8267j03215M3512K0990j78229J43033R297j1078J0656J9169
223A07312J82526j25241n7040k426O9612q2390q7644J14330O5344j17519K3781
212I0645j09490O1757P444j7025L6114Q4779J8387q1581n3101J9247m1103P4696
200I0769j42329O4112o4166R4077J4804J20524m6779j07844P7863m8513K3794
189G6312r2068J41954J8096j3459R748p5899R7701o15k7531L9007o2223l5224
177G5799p3643J25360l8119l7751K6524M8234k1915q0579j08638J26029p549M4482
165G8234N5132j4787j35785J16675N5109P3094j3675J02917o9772q0496q6517
154H0129l9510J18134n450l0732K209l1120m1650P9066m845o5725Q4135J02800
$$ plain form
234 153828 171444 153177 49962 93474 114464 -63765 79268 88565 77487 88143 107312
223 107312 289838 164597 107557 105131 174743 92353 4709 119039 184383 66864 90645
212 90645 -18845 42912 50356 33331 69445 154224 172611 91030 37929 57176 16073 90769
200 90769 -51560 12552 -51614 42463 57267 177791 131012 23168 101031 52518 76312
189 76312 -15756 126198 144294 130835 140583 64684 162385 161770 134239 173246 111023 75799
177 75799 2156 127516 89397 51646 78170 126404 104489 23910 -84728 41301 33752 78234
165 78234 133366 118579 -17206 99469 154578 227672 213997 316914 247142 166646 80129
154 80129 40619 158753 153303 122571 124780 93660 52010 131076 126231 60506 144641 247441
142B47441j46096n0464N9290L3180O0098l1346j0531n79o7231K3281L3417m8994
130A01466m1540J17286K2231l849j2116k2736o2194m2217J29431p968q658o716
118A62420p8006L7052K3966m8655j00773J03371N3748J0979j1677R2519n475j32314
106A07155J7392M4508R0634m0605l6471j55521l1522J55368J8653m647l2153K4737
$$ plain form
142 247441 101345 50881 110171 143351 203449 172103 161572 160993 93762 117043 150460 101466
130 101466 59926 177212 199443 195594 183478 160742 98548 56331 185762 177794 169136 162420
118 162420 84414 121466 145432 96777 -3996 99375 153123 164102 152425 244944 239469 107155
106 107155 124547 169055 259689 219084 182613 27092 -4430 150938 169591 164944 132791 157528
$$ [...]
##END NTUPLES=NMR SPECTRUM
##END=
