##TITLE=1H_EC-3254(5-3)
 CDCl3, 8 sc, 
 8.07.2021
##JCAMPDX= 6.0         $$ Bruker NMR JCAMP-DX V2.0
##DATA TYPE= NMR SPECTRUM
##DATA CLASS= NTUPLES
##ORIGIN= UXNMR, Bruker Analytische Messtechnik GmbH
##OWNER= root
$$ XWIN-NMR		Version 3.5
$$ Thu Jul  8 11:33:56 2021 Russian Standard Time (UT+4h)  she@DPX200
##.OBSERVE FREQUENCY= 200.131506
##.OBSERVE NUCLEUS= ^1H
##.ACQUISITION MODE= SIMULTANEOUS
##.ACQUISITION SCHEME= undefined
##.AVERAGES= 8
##.DIGITISER RES= 18
##SPECTROMETER/DATA SYSTEM= spect
##.PULSE SEQUENCE= zg30
##.SOLVENT NAME= CDCl3
##.SHIFT REFERENCE= (INTERNAL, CDCl3, 0, 17.502)
##AUDIT TRAIL= $$ (NUMBER, WHEN, WHO, WHERE, WHAT)
$$ ##TITLE= Audit trail, XWIN-NMR		Version 3.5
$$ ##JCAMPDX= 5.01
$$ ##ORIGIN= Bruker BioSpin GmbH
$$ ##OWNER= she
$$ F:/spectra/data/she/nmr/H-F/1/pdata/1/auditp.txt
$$ ##AUDIT TRAIL=  $$ (NUMBER, WHEN, WHO, WHERE, WHAT)
(   1,<2021-07-08 11:32:37.96 +0400>,<she>,<DPX200>,
      <created by zg, POWCHK disabled, PULCHK disabled
       configuration hash MD5:
       00 E9 B6 7A A2 85 ED C7 34 08 36 98 17 FE 4E 26
       data hash MD5: 16K
       3D 9A 58 D4 04 EF 73 96 6B 8D A7 BF 28 2C A7 0D>)
(   2,<2021-07-08 11:32:40.06 +0400>,<she>,<DPX200>,
      <Start of raw data processing
       efp BC_mod = 2 LB = 0.24 FT_mod = 6 PKNL = 1 PHC0 = -12431.43 PHC1 = 11.20101 SI = 16K 
       data hash MD5: 16K
       CB 00 2C 40 DD 15 4E 29 18 B2 E5 35 53 AA 62 FA>)
(   3,<2021-07-08 11:33:05.57 +0400>,<she>,<DPX200>,
      <pk PHC0 = -0.5814009 PHC1 = -2 
       data hash MD5: 16K
       31 C2 A6 5A 99 21 7A 01 71 18 D1 B5 6F 0C C7 B9>)
(   4,<2021-07-08 11:33:08.87 +0400>,<she>,<DPX200>,
      <abs ABSG = 5 
       data hash MD5: 16K
       07 1B 28 5D B2 B7 CE 72 2F DB 4F 29 87 C5 E5 E4>)
$$ ##END=
$$ 
$$ hash MD5
$$ AA 93 78 09 46 B9 9E BC 2B B7 68 4C 2B D9 BB CD
##$RELAX= 
##$RELAX= 
##$RELAX= 
##$RELAX= 
##$RELAX= 
##$RELAX= 
$$ Bruker specific parameters
$$ --------------------------
##$DU= <F:/spectra>
##$EXPNO= 1
##$NAME= <H-F>
##$PROCNO= 1
##$TYPE= <nmr>
##$USER= <she>
##$AMP= (0..31)
100 100 100 100 100 100 100 100 100 100 100 100 100 100 100 100 100 100 
100 100 100 100 100 100 100 100 100 100 100 100 100 100 
##$AQSEQ= 0
##$AQ_mod= 1
##$AUNM= <au_zg>
##$AUTOPOS= <>
##$BF1= 200.13
##$BF2= 200.13
##$BF3= 200.13
##$BF4= 200.13
##$BF5= 200.13
##$BF6= 200.13
##$BF7= 200.13
##$BF8= 200.13
##$BYTORDA= 1
##$CFDGTYP= 0
##$CFRGTYP= 5
##$CHEMSTR= <none>
##$CNST= (0..31)
1 1 145 1 1 1 1 1 1 1 1 1 1 1 1 1 1 1 1 1 1 1 1 1 1 1 1 1 1 1 1 1 
##$CPDPRG= <>
##$CPDPRG1= <>
##$CPDPRG2= <>
##$CPDPRG3= <>
##$CPDPRG4= <mlev>
##$CPDPRG5= <mlev>
##$CPDPRG6= <mlev>
##$CPDPRG7= <mlev>
##$CPDPRG8= <mlev>
##$CPDPRGB= <>
##$CPDPRGT= <>
##$D= (0..31)
0 1.2 0 0 0 0 0 0 0 0.06 0 0.03 0 0 0 0 0.0002 0 0 0 0 0 0 0 0 0 0 0 0 
0 0 0 
##$DATE= 1625729557
##$DBL= (0..7)
120 120 120 120 120 120 120 120 
##$DBP= (0..7)
150 150 150 150 150 150 150 150 
##$DBP07= 0
##$DBPNAM0= <>
##$DBPNAM1= <>
##$DBPNAM2= <>
##$DBPNAM3= <>
##$DBPNAM4= <>
$$ [...]
##$SUBNAM3= <"">
##$SUBNAM4= <"">
##$SUBNAM5= <"">
##$SUBNAM6= <"">
##$SUBNAM7= <"">
##$SUBNAM8= <"">
##$SUBNAM9= <"">
##$SW= 20.0188882624521
##$SWIBOX= (0..15)
0 0 2 0 0 0 0 0 0 0 0 0 0 0 0 0 
##$SW_h= 4006.41025641026
##$TD= 16384
##$TD0= 1
##$TE= 0
##$TE2= 300
##$TE3= 300
##$TEG= 300
##$TL= (0..7)
0 120 120 120 120 120 120 120 
##$TP= (0..7)
150 150 150 150 150 150 150 150 
##$TP07= 0
##$TPNAME0= <>
##$TPNAME1= <>
##$TPNAME2= <>
##$TPNAME3= <>
##$TPNAME4= <>
##$TPNAME5= <>
##$TPNAME6= <>
##$TPNAME7= <>
##$TPOAL= (0..7)
0.5 0.5 0.5 0.5 0.5 0.5 0.5 0.5 
##$TPOFFS= (0..7)
0 0 0 0 0 0 0 0 
##$TUNHIN= 0
##$TUNHOUT= 0
##$TUNXOUT= 0
##$USERA1= <user>
##$USERA2= <user>
##$USERA3= <user>
##$USERA4= <user>
##$USERA5= <user>
##$V9= 5
##$VALIST= <valist>
##$VCLIST= <CCCCCCCCCCCCCCC>
##$VD= 0
##$VDLIST= <DDDDDDDDDDDDDDD>
##$VPLIST= <PPPPPPPPPPPPPPP>
##$VTLIST= <TTTTTTTTTTTTTTT>
##$WBST= 1024
##$WBSW= 4
##$XGAIN= (0..3)
0 0 0 0 
##$XL= 0
##$YL= 0
##$YMAX_a= 288695
##$YMIN_a= -205541
##$ZGOPTNS= <>
##$ZL1= 120
##$ZL2= 120
##$ZL3= 120
##$ZL4= 120
##$ABSF1= 17.49955
##$ABSF2= -2.519489
##$ABSG= 5
##$ABSL= 3
##$ALPHA= 0
##$AQORDER= 0
##$ASSFAC= 0
##$ASSFACI= 0
##$ASSFACX= 0
##$ASSWID= 0
##$AUNMP= <proc_1d>
##$AZFE= 0.1
##$AZFW= 0.1
##$BCFW= 0
##$BC_mod= 2
##$BYTORDP= 0
##$COROFFS= 0
##$CY= -3
##$DATMOD= 1
##$DC= 0
##$DFILT= <>
##$DTYPP= 0
##$F1P= 0
##$F2P= 0
##$FCOR= 1
##$FTSIZE= 16384
##$FT_mod= 6
##$GAMMA= 0
##$GB= 0
##$INTBC= 1
##$INTSCL= 1.334414e-10
##$ISEN= 128
##$LB= 0.24
##$LEV0= 0
##$LPBIN= 0
##$MAXI= 10000
##$MC2= 0
##$MEAN= 0
##$ME_mod= 0
##$MI= 1.114404
##$NCOEF= 0
##$NC_proc= -7
##$NLEV= 6
##$NOISF1= 3.799351
##$NOISF2= 2.8
##$NSP= 0
##$NTH_PI= 0
##$NZP= 0
##$OFFSET= 17.502
##$PC= 1
##$PHC0= -12432.01
##$PHC1= 9.20101
##$PH_mod= 1
##$PKNL= yes
##$PPARMOD= 0
##$PSCAL= 0
##$PSIGN= 0
##$REVERSE= no
##$SF= 200.130006529809
##$SI= 16384
##$SIGF1= 3
##$SIGF2= 2
##$SINO= 5.538805
##$SIOLD= 16384
##$SREGLST= <1H.CDCl3>
##$SSB= 0
##$STSI= 16384
##$STSR= 0
##$SW_p= 4006.41025641026
##$SYMM= 0
##$S_DEV= 0
##$TDeff= 16384
##$TDoff= 0
##$TI= <>
##$TILT= no
##$TM1= 0
##$TM2= 0
##$TOPLEV= 0
##$USERP1= <user>
##$USERP2= <user>
##$USERP3= <user>
##$USERP4= <user>
##$USERP5= <user>
##$WDW= 1
##$XDIM= 16384
##$YMAX_p= 402449791
##$YMIN_p= -340334
$$ End of Bruker specific parameters
$$ ---------------------------------
##NTUPLES= NMR SPECTRUM
##VAR_NAME=  FREQUENCY,     SPECTRUM/REAL,   SPECTRUM/IMAG
##SYMBOL=    X,             R,               I
##VAR_TYPE=  INDEPENDENT,   DEPENDENT,       DEPENDENT
##VAR_FORM=  AFFN,          ASDF,            ASDF
##VAR_DIM=   16384,         16384,           16384
##UNITS=     HZ,            ARBITRARY UNITS, ARBITRARY UNITS
##FACTOR=    0.24454680195387, 1,            1
##FIRST=     3502.67553613302, 0,            0
##LAST=      -503.73472027724, 0,            0
##MIN=       -503.73472027724, -340334,      0
##MAX=       3502.67553613302, 402449791,    0
$$ Real data points
##PAGE= N=1
##DATA TABLE= (X++(R..R)), XYDATA
$$ [...]
6289a80586J07249P4514N843j7583m8161p0672J9418K7667J0668Q5736k0527j2803
$$ -180586 -73337 1177 7020 -10563 -58724 -129396 -109978 -82311 -71643 14093 -6434 -19237
6277a9237m5025J5013j7169J8549N5260J7343q9708J4254Q5044J9888O726o6917
$$ -19237 -64262 -49249 -66418 -47869 7391 24734 -64974 -50720 34324 54212 60938 -5979
6265e979L7644L4253p865L4366m3378j11616J5708P7849k1813j27402N6011J80681
$$ -5979 31665 65918 58053 92419 49041 -62575 -46867 30982 9169 -118233 -62222 118459
6253A18459M335k7367p6992j2576j1283k4940R405K6923o1883k1237K2965O0098
$$ 118459 122794 95427 18435 5859 -5424 -30364 -20959 5964 -55919 -77156 -54191 5907
6241E907q389j03638K9521L1180L0002P0676n1960l9320n3864k8729R2639J07515
$$ 5907 -2482 -106120 -76599 -45419 -15417 55259 3299 -36021 -89885 -118614 -25975 81540
6229H1540o9488o7495Q5174o1980l5475P41J1458J2532P325K4499o5348P6957
$$ 81540 12052 -55443 29731 -32249 -67724 -66983 -55525 -42993 -35668 -11169 -76517 440
6217D40K573O6339j203o3366N583L0425m2814j1552O9640K5361n6362k4090j1683
$$ 440 3013 69352 68149 4783 10366 40791 -2023 -13575 56065 81426 25064 974 -10709
6204a0709o1588N6681M4589j98m5455O4865L6859R3753j42066j7837K1836l3237
$$ -10709 -72297 -15616 28973 28775 -16680 48185 85044 178797 36731 18894 40730 7493
6192G493Q5765l2859O3539j9687q5747j4516K2498J8123k1832n2968J09603k4768
$$ 7493 93258 60399 123938 104251 18504 3988 26486 44609 22777 -30191 79412 54644
6180E4644M4702j2889l8911j377j19356Q2908R409K3084m520J2399p2249n4444
$$ 54644 99346 86457 47546 46169 -73187 9721 19130 42214 37694 50093 -22156 -76600
6168g6600J3046M5549j0897L3134j0159l7200m297P8009l5226P0286l4005l7413
$$ -76600 -63554 -18005 -28902 4232 -5927 -43127 -47424 30585 -4641 65645 31640 -5773
6156e773K7073k7141K7981L1315j5633k0151n9233N978R336P9401O8150p0569
$$ -5773 21300 -5841 22140 53455 37822 17671 -41562 -35584 -26248 53153 121303 50734
6144E0734L00k198n6660m0205M604M5541Q8155n1821M3894n8548K9480K4490Q282
$$ 50734 51034 48836 -7824 -48029 -43425 2116 90271 38450 82344 23796 53276 77766 86048
6131H6048L3428m7147r0151Q8328k5821j4473M298J9245p6322n3368J12170j2527
$$ 86048 119476 72329 -17822 70506 44685 30212 34510 53755 -22567 -75935 36235 23708
6119B3708l3170K8246R349l4235l1428L4685Q6573j7843N7912j574k6488M886
$$ 23708 -9462 18784 28133 -6102 -37530 -2845 83728 65885 123797 122223 95735 100621
6107A00621k2439m6293p626M1672r16m2575j8904N3132P8628r4160M968J1224
$$ 100621 78182 31889 24263 65935 65019 22444 3540 56672 135300 41140 46108 57332
6095E7332l3603K5350J2238L7139p0713M5259n5230K8234k0454P40k9622N6197
$$ 57332 23729 49079 61317 98456 27743 73002 17772 46006 25552 26292 -3330 52867
6083E2867L6129O4931j6246o6568j4168L3540o8465p9272N0609M1434L4786M5142
$$ 52867 88996 153927 137681 71113 56945 90485 22020 -57252 -6643 34791 69577 114719
6071A14719L1354n3352n6291K7094N6509J4642k441n3265j0971j5733N4989K3944
$$ 114719 146073 92721 36430 63524 120033 134675 132234 78969 67998 52265 107254 131198
6059A31198M0113k7680q161Q076J16351o2153j5205M7908L2166K1180m4155l8512
$$ 131198 171311 143631 135470 143546 259897 197744 182539 230447 262613 283793 239638 201126
6047B01126l9619N6417Q9015J3783O4940k1817M1907L9202k993P9458J20864M3611
$$ 201126 161507 217924 306939 320722 385662 363845 405752 444954 441961 521419 642283 685894
6035F85894K4947J31851Q4178J4533J20390N2252L7664J08582J43612P4807l600
$$ 685894 710841 842692 926870 941403 1061793 1114045 1151709 1260291 1403903 1478710 1475110
6024A475110L1308j3577k7701N8899j406Q6426J39803J56620J73717J02244M4141
$$ 1475110 1506418 1492841 1465140 1524039 1522633 1609059 1748862 1905482 2079199 2181443 2225584
6013B225584M0726L7863j5283o8782j15857j08781j44715p2485n9072j01474n7233
$$ 2225584 2266310 2304173 2288890 2220108 2104251 1995470 1850755 1778270 1719198 1617724 1560491
6002A560491j5121m8584N1529J749r9889j23193j3951q1236j09157j8661p9367
$$ 1560491 1545370 1496786 1548315 1550064 1450175 1326982 1313031 1231795 1122638 1103977 1024610
5991A024610j32775m5605p9766j02616r6075l5585o0553M050l0941m7232J0220
$$ 1024610 891835 846230 766464 663848 567773 532188 471635 475685 444744 397512 407732
5980D07732k4701l0443M0757l8851j22746r518l659K9753p211p716K1056Q5918
$$ 407732 383031 352588 393345 354494 231748 222230 218571 248324 241113 233397 254453 340371
5968C40371j29856l7271Q3869n4274l3634O9512j2518j6165k8020k5483J270K7895
$$ 340371 210515 173244 257113 202839 169205 238717 226199 210034 182014 156531 157801 185696
5956A85696J0371k0646N1561r5906j4873K4944k1598k6354r727m1635M5536n53
$$ 185696 196067 175421 226982 131076 116203 141147 119549 93195 83468 41833 87369 86816
5944H6816L7329L2363J187o283j951j7117j7509r5269M6241K9780K6713J9544
$$ 86816 124145 156508 157695 151412 149461 132344 114835 19566 65807 95587 122300 141844
5932A41844j11054L1421l2661P7213K2641m967Q0378n8786K0074K6799j6949l0603
$$ 141844 30790 62211 29550 106763 129404 124437 204815 146029 166103 192902 175953 145350
5920A45350M1623n6763n7656J4447n375J0285k7869m3062j9605l62M8089K1214
$$ 145350 186973 130210 72554 87001 81626 91911 64042 20980 1375 1013 49102 70316
5908G0316K3168K850K5409K3368r0671K8229L3039L3556r57L2016k0641j0554
$$ 70316 93484 96334 121743 145111 54440 82669 115708 149264 148307 180323 159682 149128
5896A49128J5407RM0661q8581k5946Q169P6893K7823n9792m623n0703k6802k2939
$$ 149128 164535 164544 205205 116624 90678 98847 175740 203563 143771 139148 88445 61643 38704
5883C8704J34729M1632j8193n7941K6567R890o3515K2263J5292O642k269k9398
$$ 38704 173433 215065 196872 138931 165498 175388 111873 134136 149428 156070 153801 124403
5871A24403l640J0766K8440k7799l6870p024l7082M5220Q3987o8171n482k4968
$$ 124403 120763 131529 159969 132170 95300 88276 51194 96414 180401 112230 106748 81780
5859H1780n9219m337M8924j28k3194q078k8609Q8340o3067o763L8495k8571K2248
$$ 81780 22561 18224 67148 67020 43826 35748 7139 95479 32412 25649 64144 35573 57821
5846E7821M5036J7967R019k1881l7917K1823m6025j4082O075K1234M101M5529
$$ 57821 102857 120824 129843 107962 70045 91868 45843 31761 37836 59070 63171 108700
5834A08700m2116m0615K4278J463Q2393J6582L772p7003k2276J2702J508R758
$$ 108700 66584 25969 50247 51710 134103 150685 154457 77454 55178 67880 69388 79146
5822G9146o130j8895m2283L8912P2221J5652l39Q950n1877l2170P4642L2578L7354
$$ 79146 73016 54121 11838 50750 122971 138623 138284 147234 95357 63187 137829 170407 207761
5809B07761m563l9387m5209k3223L1735J5135n0989O5423L6113n9577J2678k9131
$$ 207761 203198 163811 118602 95379 127114 142249 91260 156683 192796 133219 145897 116766
5797A16766J0088k3484R1797l7173o5180J6426L7135k5500J0044m1032N0224J14431
$$ 116766 126854 103370 195167 157994 92814 109240 146375 120875 130919 89887 140111 254542
5785B54542l331o5533p5849q813J7656M7627K5773K3143j31155k3774L8038N487
$$ 254542 251211 185678 109829 101016 118672 166299 192072 215215 84060 60286 98324 103811
5773A03811K3704M3812L3209n1329j2146l8110P658O3986j9262K1380n2103k0314
$$ 103811 127515 171327 204536 153207 141061 102951 110609 174595 155333 176713 124610 104296
5761A04296P5836l0748L0836J8258n3461q963p7745L7428M3955M360p6558m169
$$ 104296 180132 149384 180220 198478 145017 136054 58309 95737 139692 144052 67494 63325
5749F3325M7664K6660K8364j5774J4264P6787J4667o0804j707O9665J6756K2801
$$ 63325 110989 137649 166013 150239 164503 241290 255957 195153 193446 263111 279867 302668
5737C02668K0300K8613M0075L1929K8311q4741m8613J1085n4430l5703n0154J11737
$$ 302668 322968 351581 391656 423585 451896 367155 318542 329627 275197 239494 189340 301077
5725C01077k6205o3827K7760k47J5724m8329r208n9418r549P1881M9169J6413
$$ 301077 274872 211045 238805 238558 254282 205953 196745 137327 127778 199659 248828 265241
5713B65241p203m5333m387J3407L555l9065J780O7570k6818Q185j4105m145O1086
$$ 265241 258038 212705 208318 221725 225280 186215 187995 255565 228747 236932 222827 218682 279768
5700B79768O848L4395q976J5562L106K741j02035l649O6794o6704L6827R6298
$$ 279768 286616 321011 312035 327597 330703 333444 231409 227760 294554 227850 264677 360975
5688C60975P541k1748J2900L2463J1017j8996K9612J3342K5435m6700K5929J22591
$$ 360975 368516 346768 359668 392131 403148 384152 413764 427106 452541 405841 431770 554361
5676E54361J1768j16641l4856Q0502r264r6460L743O0467p7590L6640N1325n3339
$$ 554361 566129 449488 414632 495134 485870 389410 393153 453620 376030 412670 463995 410656
5664D10656L0186O1326K034m9855K8451J9528M3704N6668k3800j7338J06571J1081
$$ 410656 440842 502168 504202 454347 482798 502326 546030 602698 578898 561560 668131 679212
5652F79212j4784P1464J4096M0829n4731J0720J15879m9920m3980M5332n8242
$$ 679212 664428 735892 749988 790817 736086 746806 862685 812765 768785 814117 755875
5641G55875K2440Q1864O534o6159R842K5432p2623j35116m8921L0866P0801o5777
$$ 755875 778315 860179 866713 800554 810396 835828 763205 628089 579168 610034 680835 615058
5629F15058J7634M1484K6577M0864r6790K299O6849r992m416N4165M8130o5256
$$ 615058 632692 674176 700753 741617 644827 647126 713975 703983 699567 753732 801862 736606
5617G36606N4221N4980o4919n648M7188o2116o994n3M3178J3003p5407M0083M2600
$$ 736606 790827 845807 780888 775240 822428 760312 753318 753265 796443 809446 734039 774122 816722
5604H16722k5604J7671m2866n38j9940L0818L3814J4023M9062r8248j2599L2230
$$ 816722 791118 808789 765923 765385 745445 776263 810077 824100 873162 774914 762315 794545
5592G94545J8745O5895l7929q386J20877N5571n2103O7653O1921n0152q8271l1417
$$ 794545 813290 879185 841256 832870 953747 1009318 957215 1024868 1086789 1036637 948366 916949
5580I16949J30635m2407O0864M169o524K7212m5245J8025M0433n3524R7478J8384
$$ 916949 1047584 1005177 1066041 1070210 1063686 1090898 1045653 1063678 1104111 1050587 1148065 1166449
5568A166449K7859J2310K6538L1485k4004J14844L6427n634J53099J10372J16460
$$ 1166449 1194308 1206618 1233156 1264641 1240637 1355481 1391908 1386274 1539373 1649745 1766205
5557A766205J01534Q6510P4457N5243n5405K6127k3287n4440M4869J00923L8282
$$ 1766205 1867739 1954249 2028706 2083949 2028544 2054671 2031384 1976944 2021813 2122736 2161018
5546B161018o9927P1192Q0764J10360K4078N1714J619K7407K233L5539J26431
$$ 2161018 2091091 2162283 2243047 2353407 2377485 2429199 2430818 2458225 2460458 2495997 2622428
5535B622428N5350L715M7424J10145J87130Q8214J28402N8870K4376J0926J01079
$$ 2622428 2677778 2681493 2728917 2839062 3026192 3114406 3242808 3301678 3326054 3336980 3438059
5524C438059O8524K8801R2994P1630R49m1662K6996j03861p5026r992k6742j65768
$$ 3438059 3506583 3535384 3628378 3700008 3700957 3659295 3686291 3582430 3507404 3497412 3470670 3304902
5512C304902m5230m5589j09545n8943j16227N75j9278n5965K1964k0227N7264
$$ 3304902 3259672 3214083 3104538 3045595 2929368 2929943 2910665 2854700 2876664 2856437 2913701
5501B913701R2047O6138K9845q0168J03839J06861q9715N4188L567l368L834m9906
$$ 2913701 3005748 3071886 3101731 3021563 3125402 3232263 3142548 3196736 3200303 3196935 3200769 3150863
5489C150863j26173j7083k3532j21960n1674m9539k2842k2433J4982q2266q2960
$$ 3150863 3024690 3007607 2984075 2862115 2810441 2760902 2738060 2715627 2730609 2648343 2565383
5478B565383O7925L9070j1465n3634n336R6620J7809m6962M2339J21340n196O1061
$$ 2565383 2633308 2672378 2660913 2607279 2601943 2698563 2716372 2669410 2711749 2833089 2827893 2888954
5466B888954L0308k8752k751Q0863L9080J01789O4700j6042K9844M7704J08114
$$ 2888954 2919262 2890510 2887759 2968622 3007702 3109491 3174191 3158149 3187993 3235697 3343811
5455C343811L1414J09098N3311N4992K0042J22244O3620J1079O7926P9996O4236
$$ 3343811 3375225 3484323 3537634 3592626 3612668 3734912 3798532 3809611 3877537 3957533 4021769
5444D021769J11917K07231P1334J20019J24422N0356J14597J44255J20541J03084
$$ 4021769 4133686 4340917 4412251 4532270 4656692 4707048 4821645 4965900 5086441 5189525
5434E189525J89495J79570J23049J52477J97295K21845K46379K22651L09609K28710
$$ 5189525 5379020 5558590 5681639 5834116 6031411 6253256 6499635 6722286 7031895 7260605
5424G260605K56410L74421L10467L07500L70256L91057M60802O24619N72489O50930
$$ 7260605 7517015 7891436 8201903 8509403 8879659 9270716 9731518 10356137 10928626 11579556
5414A1579556P52395Q22600R56926J185076J231545J275700J429622J650455J928428
$$ 11579556 12331951 13154551 14111477 15296553 16528098 17803798 19233420 20883875 22812303
5405B2812303K071475K259227K590521K813926K800370K575567K034074J090768
$$ 22812303 24883778 27143005 29733526 32547452 35347822 37923389 39957463 41048231
5397D1048231L1463r81851j666163k092825k108387j811535j478426j092539p27925
$$ 41048231 41079694 40097843 38431680 36338855 34230468 32418933 30940507 29847968 29120043
5388B9120043l50783o5352K13543O12661Q48365J152142J372199J735019K217555
$$ 29120043 28769260 28703908 28917451 29530112 30378477 31530619 32902818 34637837 36855392
5379C6855392K606114K901419L391876L788101M147885M474065M562769M352698
$$ 36855392 39461506 42362925 45754801 49542902 53690787 58164852 62727621 67080319
5371F7080319L876930K656090J068351q07342k696527m118554m926435n142935
$$ 67080319 70957249 73613339 74681690 73874348 71177821 67059267 62132832 56989897
5363E6989897m862893m351382l796166l211422k674864k194735j802552j340109
$$ 56989897 52127004 47775622 43979456 40768034 38093170 35898435 34095883 32755774
5355C2755774r63331o52002l56580k9594J61127N17794O44732R94920J245049
$$ 32755774 31792443 31140441 30783861 30754267 30915394 31433188 32077920 33072840 34317889
5346C4317889J486617J738861J898751J973481J770762J084408O6812r94776k053774
$$ 34317889 35804506 37543367 39442118 41415599 43186361 44270769 44337581 43342805 41289031
5337D1289031k900721l199019l260805l081902k677893k288670j926629j664016
$$ 41289031 38388310 35189291 31928486 28846584 26168691 23880021 21953392 20289376
5329B0289376j479771j235299j145867j104439r43940p65088o47070p36314n66622
$$ 20289376 18809605 17574306 16428439 15324000 14380060 13614972 12967902 12231588 11664966
5320A1664966n01647m53481m71895m02952m51606l77127k15790l11673k54357
$$ 11664966 11163319 10709838 10237943 9834991 9383385 9006258 8790468 8478795 8224438
5311H224438k51382k52460k86622j95937k09651j77386j45722j42275j85421j76430
$$ 8224438 7973056 7720596 7433974 7238037 7028386 6851000 6705278 6563003 6377582 6201152
5301F201152j88067j38291j40368j68116j47096j33351k42669j12607l8246p8091
$$ 6201152 6013085 5874794 5734426 5566310 5419214 5285863 5043194 4930587 4892341 4814250
5291D814250r8993o3489j26232l7056N235q553j2861q7603m747o1743r3224j75265
$$ 4814250 4715257 4651768 4525536 4488480 4493715 4485162 4472301 4384698 4379951 4318208 4224984 4049719
5279D049719j00639p3863j47296j19330q5059n7252m9198j15807j71394j08520
$$ 4049719 3949080 3875217 3727921 3608591 3523532 3466280 3417082 3301275 3129881 3021361
5269C021361k5959m6198r2560p4338q0022l434q1530j5562k4553p8299m625r2143
$$ 3021361 2995402 2949204 2856644 2782306 2702284 2698850 2617320 2601758 2577205 2498906 2494281 2402138
5257B402138k8M0520m3391o9431p0801l2283k9544J1860J617L2672j30124j18338
$$ 2402138 2402110 2442630 2399239 2329808 2259007 2226724 2197180 2209040 2210657 2243329 2113205 1994867
5245A994867O0571q3959K4181j9752p3794k5249L1168l8902j7557j7975l0897
$$ 1994867 2055438 1971479 1995660 1975908 1902114 1876865 1908033 1869131 1851574 1833599 1802702
5234A802702Q222j7431l3002o0832n7175N3746l7106j0186K2801J1947k6785j3600
$$ 1802702 1810924 1793493 1760491 1699659 1642484 1696230 1659124 1648938 1671739 1683686 1656901 1643301
5222A643301L6360L2529l9380q5801j14589J8025N9608M2065q9989p3605K8992
$$ 1643301 1679661 1712190 1672810 1587009 1472420 1490445 1550053 1592118 1502129 1428524 1457516
5211A457516l4881n4363J8503l9996K3732M8151l2994j5530Q423m5438N974N9131
$$ 1457516 1422635 1368272 1386775 1346779 1370511 1418662 1385668 1370138 1378561 1333123 1339097 1398228
5199A398228R110q3139K0584K5751l8028l7296j6751J18688J5822P570L440J07339
$$ 1398228 1407338 1324199 1344783 1370534 1332506 1295210 1278459 1397147 1412969 1420539 1423979 1531318
5187A531318J1412l2480l9018Q254N3899k724n9682n0516K4933P2088K4459p1736
$$ 1531318 1542730 1510250 1471232 1479486 1533385 1530661 1470979 1420463 1445396 1517484 1541943 1470207
5175A470207J60900q337q4088N1521M2540J02264K7193K1718J5811M3056L5031
$$ 1470207 1631107 1622770 1538682 1590203 1632743 1735007 1762200 1783918 1799729 1842785 1877816
5164A877816O4002k0947J48150K5035J27611J05375J41065J79524J13136O7416
$$ 1877816 1941818 1920871 2069021 2094056 2221667 2327042 2468107 2647631 2760767 2828183
5154B828183O0543J04560n3853n0923q3797j05235j11288m2680r2130j09229m2087
$$ 2828183 2888726 2993286 2939433 2888510 2804713 2699478 2588190 2545510 2453380 2344151 2302064
5143B302064j28311j01874K3991k7346k1031n332j2900j8419p676N5119o6881
$$ 2302064 2173753 2071879 2095870 2068524 2047493 2042161 2029261 2010842 2003166 2058285 1991404
5132A991404N03J01146M600K4177K6380j1420K5181L7064K8323J6879O1570P5660
$$ 1991404 1991907 2093053 2097653 2121830 2148210 2136790 2161971 2199035 2227358 2244237 2305807 2381467
5120B381467N2807R6046J2668J778P8642Q0942O2420j880P7897O8343J00603P1293
$$ 2381467 2434274 2530320 2542988 2544766 2623408 2704350 2766770 2764890 2842787 2911130 3011733 3083026
5108C083026J00463J14632J08590J38472J81608K35041J78475K11700J75286K72279
$$ 3083026 3183489 3298121 3406711 3545183 3726791 3961832 4140307 4352007 4527293 4799572
5098D799572J43549J31922J11089L3460m4883o4433j16909k7291j28562j01272
$$ 4799572 4943121 5075043 5186132 5219592 5174709 5110276 4993367 4966076 4837514 4736242
5088D736242k4410o2104k0217N6440L9486K3544m3156L3547P1376M5706J51854
$$ 4736242 4711832 4649728 4629511 4685951 4725437 4748981 4705825 4739372 4810748 4856454 5008308
5077E008308J28797O5877m7025J02350K07688N7449J71838J48461K24280K56018
$$ 5008308 5137105 5202982 5155957 5258307 5465995 5523444 5695282 5843743 6068023 6324041
5067F324041J02301Q9228J12798K33390K33626J48254J55535K12659K31673K50613
$$ 6324041 6426342 6515570 6628368 6861758 7095384 7243638 7399173 7611832 7843505 8094118
5057H094118J51698J40449K53804K12969J04127K83233K36107L22233K85441K54673
$$ 8094118 8245816 8386265 8640069 8853038 8957165 9240398 9476505 9798738 10084179 10338852
5047A0338852K78175L74103K91377M01280M87816M43039O67767O77002P20567
$$ 10338852 10617027 10991130 11282507 11683787 12171603 12614642 13282409 13959411 14679978
5038A4679978P53495P84907Q51620R37142J170729J180471J438478J640189J755880
$$ 14679978 15433473 16218380 17070000 18007142 19177871 20358342 21796820 23437009 25192889
5029B5192889K066565K326714K660850K967212L519284L877254M389184N048461
$$ 25192889 27259454 29586168 32247018 35214230 38733514 42610768 46999952 52048413
5021E2048413N533324O271061O789123P200582P689675P872314P759992P399146
$$ 52048413 57581737 63852798 70641921 77842503 85532178 93404492 101164484 108563630
5013A08563630O635311N515398L647321J060690j532727l885426n529678o677430
$$ 108563630 115198941 120714339 124361660 125422350 123889623 120004197 114474519 107797089
5005A07797089p415200p572505p477822p292386p053142o394172n758002n131424
$$ 107797089 100381889 92809384 85331562 78039176 70986034 64591862 58833860 53702436
4997E3702436m314934l635362l187342k646933k130658j808987j608950j333964
$$ 53702436 49387502 45752140 42564798 39917865 37787207 35978220 34369270 33035306
4989C3035306j119051r19625o78039n51245m64459l96113l72803l49456m30859
$$ 33035306 31916255 30996630 30318591 29767346 29302887 28906774 28533971 28184515 27753656
4980B7753656q02155r06874j151055j226299j298292j201010j232120j183755
$$ 27753656 26951501 26044627 24893572 23667273 22368981 21167971 19935851 18752096
4972A8752096j010648j007975r06669q45158p44180o94671o48627n29189m09311
$$ 18752096 17741448 16733473 15826804 14981646 14237466 13542795 12894168 12364979 11955668
4963A1955668m99003m58266l52862l77115l54613l13253l31820k49025k29361
$$ 11955668 11456665 10998399 10645537 10268422 9913809 9600556 9268736 9019711 8790350
4954H790350j96299j82707j85114k42395k21550j69975j83303j15070r7406j77741
$$ 8790350 8594051 8411344 8226230 7983835 7762285 7592310 7409007 7293937 7196531 7018790
4944G018790j08669j44702j72465o3907j37756q6880j42574j27872j69967j00519
$$ 7018790 6910121 6765419 6592954 6529047 6391291 6304411 6161837 6033965 5863998 5763479
4934E763479j60325j39359p4474q0882j46248k1128q7503r2124l00m1126j2461
$$ 5763479 5603154 5463795 5389321 5308439 5162191 5141063 5053560 4961436 4961136 4920010 4907549
4923D907549o2153m5421j7467J7305j25976o6954J9140R4453j0099p2271Q6918
$$ 4907549 4845396 4799975 4782508 4799813 4673837 4606883 4626023 4720476 4710377 4638106 4725024
4912D725024k2884j44602j28265j26925j13825k01355l065o7750o5719n3119p2885
$$ 4725024 4702140 4557538 4429273 4302348 4188523 3987168 3984103 3916353 3850634 3797515 3724630
4901C724630r7243m1827p8357j27085n8090m5086J0507j6060j30841j39193j0437
$$ 3724630 3627387 3585560 3507203 3380118 3322028 3276942 3287449 3271389 3140548 3001355 2990918
4890B990918m3749M622p7659j02635q0259j14736q3223j05581o3304l282k3958
$$ 2990918 2947169 2951791 2874132 2771497 2691238 2576502 2493279 2387698 2324394 2321112 2297154
4879B297154l7155o5785o2975n3580j8330j9806p6612k4488n7261m3492n3280
$$ 2297154 2259999 2194214 2131239 2077659 2059329 2039523 1962911 1938423 1881162 1837670 1784390
4868A784390K9395J782k8793j4428n4855L4811m6526L548K591O944q2526o0249
$$ 1784390 1813785 1815567 1786774 1772346 1717491 1752302 1705776 1709324 1711915 1718859 1636333 1576084
4856A576084J0449J07188J6729r7400o4155N6445m4946M7613K5242k3240n5137
$$ 1576084 1586533 1693721 1710450 1613050 1548895 1605340 1560394 1608007 1633249 1610009 1554872
4845A554872L1722k6199p120j3802R432J1587q245o1065j3084k1143j1486m6197
$$ 1554872 1586594 1560395 1553275 1539473 1548905 1560492 1552247 1491182 1478098 1456955 1445469 1399272
4833A399272o8766J02075o0336K4033M1555N1631n0018N5434l0973o319K601O5581
$$ 1399272 1330506 1432581 1372245 1396278 1437833 1489464 1439446 1494880 1463907 1457588 1460189 1525770
4821A525770N3465l3736J737P3507K885K625m7944N6154O5688k2795l888J8448
$$ 1525770 1579235 1545499 1547236 1620743 1623628 1626253 1578309 1634463 1700151 1677356 1673468 1691916
4809A691916l6301j14620k8496P7880k4403L2850L2040K4893M4613Q7921J58439
$$ 1691916 1655615 1540995 1512499 1590379 1565976 1598826 1630866 1655759 1700372 1788293 1946732
4798A946732K2668J02748J54034Q2109J60473J92140Q3462J53719K95758K28767
$$ 1946732 1969400 2072148 2226182 2308291 2468764 2660904 2744366 2898085 3193843 3422610
4788C422610J81971K13579K54718J72887J0281k81271k29998l72361l46492k22161
$$ 3422610 3604581 3818160 4072878 4245765 4256046 3974775 3744777 3372416 3025924 2803763
4778B803763k22668k11681j75038j31530j53023j14433m5924n8303m9173j1268
$$ 2803763 2581095 2369414 2194376 2062846 1909823 1795390 1749466 1691163 1641990 1630722
4768A630722k9965l1776j02740J3304q337n0462r468m5864j4153M219K7151N528
$$ 1630722 1600757 1568981 1466241 1479545 1471208 1420746 1411278 1365414 1351261 1355480 1382631 1388159
4756A388159l4858O5133m0742o0157O9016k9877M2063J42084j16481J4691L9771
$$ 1388159 1353301 1418434 1377692 1317535 1386551 1356674 1398737 1540821 1424340 1439031 1478802
4745A478802K529K5227P3999J21181J45320J05306J32212J05356R7929J24314
$$ 1478802 1481331 1506558 1580557 1701738 1847058 1952364 2084576 2189932 2287861 2412175
4735B412175O4775P9800J20484R2333L3571k0003o1510j07582j06959j82888j14756
$$ 2412175 2476950 2556750 2677234 2769567 2803138 2783135 2721625 2614043 2507084 2324196 2209440
4724B209440j39830j35633j26126q5617p4164j23449m9406m1813m3635n0205o7802
$$ 2209440 2069610 1933977 1807851 1722234 1648070 1524621 1475215 1433402 1389767 1339562 1271760
4713A271760Q906j7950j6205n2614m4704Q8447n0553L147N5551l8870r18L9679
$$ 1271760 1280666 1262716 1246511 1193897 1149193 1237640 1187087 1190234 1245785 1206915 1205997 1245676
4701A245676k1993j09483k7340L606m8714k8610P1580O7681P9648j1238o3746
$$ 1245676 1223683 1114200 1086860 1090466 1041752 1013142 1084722 1152403 1232051 1220813 1157067
4690A157067n4542M617j4679l1746j7881Q737M139P5391J2165k8059k0759M2203
$$ 1157067 1102525 1107142 1092463 1060717 1042836 1051573 1055712 1131103 1143268 1115209 1094450 1136653
4678A136653L1730n0111r233N1397M7887m0438J7503O1685K3563L82K808L482
$$ 1136653 1168383 1118272 1109039 1160436 1208323 1167885 1185388 1247073 1270636 1271018 1273826 1277308
4666A277308N8638r71J1184L6106J3032N3016k2544K4219n2788J5797M0262l909
$$ 1277308 1335946 1334975 1346159 1382265 1395297 1448313 1425769 1449988 1397200 1412997 1453259 1449350
4654A449350p664M3921O2001J4163K0556j1232M9382q0682O3313m8835L2539L3320
$$ 1449350 1441686 1485607 1547608 1561771 1582327 1571095 1620477 1539795 1603108 1554273 1586812 1620132
4642A620132J4921j5456q0800j4566k974M0576m6575k2586P2551p7917P0395L9336
$$ 1620132 1635053 1619597 1538797 1524231 1521257 1561833 1515258 1492672 1565223 1487306 1557701 1597037
4630A597037j06235k1377k3198L1026R5176k0299n6011L3759N7262L1017m7720
$$ 1597037 1490802 1469425 1446227 1477253 1572429 1552130 1496119 1529878 1587140 1618157 1570437
4619A570437j4322L0301k6619r6267p7238Q8873N4799K2306k6585K2234k2760
$$ 1570437 1556115 1586416 1559797 1463530 1386292 1475165 1529964 1552270 1525685 1547919 1525159
4608A525159m264O818j61266j2867k9571M4565P7086l2079l669k4462J8606M7706
$$ 1525159 1520895 1527713 1366447 1353580 1324009 1368574 1445660 1413581 1409912 1385450 1404056 1451762
4596A451762K3532Q251M1757r1325n7997K1015M4538J608k8684o615m180K0977
$$ 1451762 1475294 1483545 1525302 1433977 1375980 1396995 1441533 1443141 1414457 1407842 1403662 1424639
4584A424639l8443m0417J8848L7686m731j0089M6716j8353r807n503K895J1974
$$ 1424639 1386196 1345779 1364627 1402313 1397582 1387493 1434209 1415856 1406049 1400546 1403441 1415415
4572A415415K7465M0087j0632L596O6426n7639N8696N7783m498J2751k3231K9861
$$ 1415415 1442880 1482967 1472335 1475931 1542357 1484718 1543414 1601197 1596699 1609450 1586219 1616080
4560A616080P7721P3303p016p0534L854R403N4149M4873j9961M6905j0164R913
$$ 1616080 1693801 1767104 1760088 1689554 1693408 1702811 1756960 1801833 1781872 1828777 1818613 1828526
4548A828526m674O8716L8784M517o231Q7674j15738P9643L2849l2721M9074N3258
$$ 1828526 1823852 1892568 1931352 1935869 1929638 2017312 1901574 1981217 2014066 1981345 2030419 2083677
4536B083677L9424M6336K3629l9188O5816P7751N8482l7613P3177J17633m37J45715
$$ 2083677 2123101 2169437 2193066 2153878 2219694 2297445 2355927 2318314 2391491 2509124 2508687 2654402
4524B654402P7703k4182p473M8815O4540j9735J38794M7322j0447P9537O9147
$$ 2654402 2732105 2707923 2700450 2749265 2813805 2794070 2932864 2980186 2969739 3049276 3118423
4513C118423K02915K0991J25804P7660J43781R2999N5400L4028R1976O8064K8926
$$ 3118423 3321338 3342329 3468133 3545793 3689574 3782573 3837973 3872001 3963977 4032041 4060967
4502D060967l6481q9684J04841M0800K9533K0250J62897J08142J39883N0906Q8274
$$ 4060967 4024486 3934802 4039643 4080443 4109976 4130226 4293123 4401265 4541148 4592054 4680328
4491D680328l560r9179R4538J22957p8146j2899P4436J9209l6066N8359J28668
$$ 4680328 4676768 4577589 4672127 4795084 4716938 4704039 4778475 4797684 4761618 4819977 4948645
4480D948645J28023Q2388P2770O5391J08676J60862J08474N9197J92666J85742
$$ 4948645 5076668 5159056 5231826 5297217 5405893 5566755 5675229 5734426 5927092 6112834
4470F112834J18817K31921J65245K18222K29677K00471L05531J75975K22015K02258
$$ 6112834 6231651 6463572 6628817 6847039 7076716 7277187 7582718 7758693 7980708 8182966
4460H182966K09661K24532K23637K36788R7789K12290J90222J33049J67880J99531
$$ 8182966 8392627 8617159 8840796 9077584 9175373 9387663 9577885 9710934 9878814 10078345
4450A0078345K42876L09822L20821L57218L48973L30654L94140L68726M52676
$$ 10078345 10321221 10631043 10951864 11309082 11658055 11988709 12382849 12751575 13204251
4441A3204251L93622M00522M68536M09172M01009M90238M28808N00155N72724
$$ 13204251 13597873 13998395 14466931 14876103 15277112 15767350 16196158 16696313 17269037
4432A7269037M31355N37430N05451N61163N81905O90431O27346O51661O08535
$$ 17269037 17700392 18237822 18743273 19304436 19886341 20576772 21204118 21855779 22464314
4423B2464314O57231P58232O69962P91673Q39209Q85281R96262J001531J011807
$$ 22464314 23121545 23879777 24549739 25341412 26180621 27065902 28062164 29063695 30075502
4414C0075502J178991J292215J448523J519131J529156J785524J985319K167207
$$ 30075502 31254493 32546708 33995231 35514362 37043518 38829042 40814361 42981568
4406D2981568K370198K698555L029042L385508L630952L913954M186894M281440
$$ 42981568 45351766 48050321 51079363 54464871 58095823 62009777 66196671 70478111
4398G0478111M568610M827786N100080N394955N490326N713506N738177N859983
$$ 70478111 75046721 79874507 84974587 90369542 95859868 101573374 107311551 113171534
4390A13171534O335218O594159P054367P539838P807129P812914P513504O762495
$$ 113171534 119506752 126100911 133155278 140695116 148502245 156315159 163828663 170591158
4382A70591158N704821M004616K037736l77454k964075n383829p450814q685330
$$ 170591158 176295979 180300595 182338331 181960877 178996802 173612973 166162159 157476829
4374A57476829q992241q514592p435741o001992m980829m436079m595759n392419
$$ 157476829 148484588 139969996 132534255 126532263 121551434 117115355 112519596 107127177
4366A07127177o346659p048684p337384p089122o441872n619441m867510m124707
$$ 107127177 100780518 93731834 86394450 79305328 72863456 67244015 62376505 58251798
4358E8251798l441768k931463k649799k374954j983601j706383j523867j244931
$$ 58251798 54810030 51878567 49228768 46853814 44870213 43163830 41639963 40395032
4350D0395032j108515j079321r98009j089911j062422j196828j151359j147953
$$ 40395032 39286517 38207196 37209187 36119276 35056854 33860026 32708667 31560714
4342C1560714j103348r88041r38270r58546q28365p88634o56789n88168o25551
$$ 31560714 30457366 29469325 28531055 27572509 26744144 25955510 25298721 24710553 24085002
4333B4085002n56119m65459m51415m98046m94536m81448o19918n66414m72537
$$ 24085002 23528883 23063424 22612009 22113963 21619427 21137979 20518061 19951647 19479110
4324A9479110l70061m22595m17396k84546k28672j24356j91863j21132o3798j20997
$$ 19479110 19109049 18686454 18269058 17984512 17755840 17631484 17439621 17318489 17254691 17133694
4314A7133694p7783j62227j00264l8225q5902K2040l7091J2876J52544J65737
$$ 17133694 17055911 16893684 16793420 16755195 16669293 16691333 16654242 16667118 16819662 16985399
4304A6985399K95146L29741M66084O18543O04844Q14916R43193J105707J171513
$$ 16985399 17280545 17610286 18076370 18694913 19299757 20114673 21057866 22163573 23335086
4295B3335086J335065J360284J354708J258909R73929O90812K63196m4571n87281
$$ 23335086 24670151 26030435 27385143 28644052 29617981 30308793 30571989 30527418 29940137
4286B9940137r52003j153191j368892j543721j542688j283808j414654j181093
$$ 29940137 28988134 27834943 26466051 24922330 23379642 22095834 20681180 19500087
4278A9500087j003452r49496p21436o72359o89778n82910n16112n05728l25686
$$ 19500087 18496635 17547139 16825703 16153344 15463566 14880656 14364544 13858816 13533130
4269A3533130k30844l23486j36654j92910k04557k06823j29240j63473j77630
$$ 13533130 13302286 12978800 12842146 12649236 12444679 12237856 12108616 11945143 11767513
4260A1767513j79290j08808r6167p8853m9700m3562r535J29224O5333N0075P7716
$$ 11767513 11588223 11479415 11383248 11304395 11254695 11211133 11201598 11330822 11396155 11446230 11523946
4249A1523946P4851O4961n888j6005Q1271Q3386k7844K2325J37264N1061L7488
$$ 11523946 11598797 11663758 11657870 11641865 11723136 11806522 11778678 11801003 11938267 11989328 12026816
4238A2026816L971M2529R4185N2942O9875J11949K21699K70754J84679K88400
$$ 12026816 12030787 12073316 12167501 12220443 12290318 12402267 12623966 12894720 13079399 13367799
4228A3367799L62965K28320K80668J83640K70846K09106K54127K83521M40045
$$ 13367799 13730764 13959084 14239752 14423392 14694238 14903344 15157471 15440992 15881037
4219A5881037L33903K91713L87818N49088N76040O52665Q07830P51932Q93274
$$ 15881037 16214940 16506653 16894471 17443559 18019599 18672264 19480094 20232026 21125300
4210B1125300R59496J172546J224434J337847J623584J692838J878797K090111
$$ 21125300 22084796 23257342 24481776 25819623 27443207 29136045 31014842 33104953
4202C3104953K346365K634652K899527L032792K950929K424613J516580M88433
$$ 33104953 35451318 38085970 40985497 44018289 46969218 49393831 50910411 51398844
4194E1398844m97384j186987j764066j789937j647091j304556q09501l55976j542
$$ 51398844 50901460 49714473 47950407 46160470 44513379 43208823 42399322 42043346 42041804
4185D2041804L33240O73362Q88835J220309J526837J880996K210374K465592K879726
$$ 42041804 42375044 43048406 43937241 45157550 46684387 48565383 50775757 53241349 56121075
4176E6121075L297451L673861M352601M868396N394619O053723O361871O081388
$$ 56121075 59418526 63092387 67444988 72313384 77708003 83761726 90123597 96204985
4168I6204985M851447K577919J2020k355932m036064m788987m481822l607241
$$ 96204985 101056432 103634351 103646371 101290439 97254375 92465388 87983566 84376325
4160H4376325k314378j088986R0876J133150K244795L111391M015404M976961
$$ 84376325 82061947 80972961 81063837 82196987 84441782 87553173 91568577 96545538
4152I6545538N952630P090369Q131734R438508J1106960J2940289J5292330J7924782
$$ 96545538 102498168 109588537 117720271 127158779 138265739 151206028 166498358 184423140
4144A84423140K0786624K3547139K4862050K2332252J3077668n48639j2874033
$$ 184423140 205209764 228756903 253618953 275951205 289028873 288480234 275606201
4137B75606201k2328089k7962791k8034224k4458597j9904216j5859642j2752038
$$ 275606201 253278112 225315321 197281097 172822500 152918284 137058642 124306604
4130A24306604j0229486q427648p059253n861407m937119m076082l112150k221228
$$ 124306604 114077118 105649470 98590217 92728810 87791691 83715609 80603459 78382231
4122G8382231j428889q14129l98293n97335j541609k517256l035296l311027l243025
$$ 78382231 76953342 76139213 75740920 75143585 73601976 71084720 68049424 64738397 61495372
4113F1495372k833173k632509k652377k635763k727964k892571k706051k493788
$$ 61495372 58662199 56029690 53377313 50741550 48013586 45121015 42414964 39921176
4105C9921176k256867k015417j667577j467303j372016j291351j171089r84011
$$ 39921176 37664309 35648892 33981315 32514012 31141996 29850645 28679556 27695545
4097B7695545j039969q92663q40697q07737q19922p08654o19244o71476o26628
$$ 27695545 26655576 25762913 24922216 24114479 23294557 22585903 21966659 21295183 20668555
4088B0668555n23386n72864n52515m41212m69808l46880l88616k64866l06756
$$ 20668555 20145169 19572305 19019790 18578578 18108770 17761890 17373274 17108408 16801652
4079A6801652l24429k45938l20905k86237k60898l44802k69048l76401l64250
$$ 16801652 16477223 16231285 15910380 15624143 15363245 15018443 14749395 14372994 14008744
4070A4008744l53466k96682l14166l39603k94391k28447k00806k02949k56858
$$ 14008744 13655278 13358596 13044430 12704827 12410436 12181989 11981183 11778234 11521376
4061A1521376k16111j26779o5286j53150j39301k13730q0570j46935j36700j52235
$$ 11521376 11305265 11178486 11113200 10960050 10820749 10607019 10526449 10379514 10242814 10090579
4051A0090579j67945l32394j37681j33388j90658r9760r9225j00680k06818j17912
$$ 10090579 9922634 9590240 9452559 9319171 9128513 9028753 8929528 8828848 8622030 8504118
4041H504118j89566k11487j27696k15848k17419j44399j41169r9908j57835j5283
$$ 8504118 8314552 8103065 7975369 7759521 7542102 7397703 7256534 7156626 6998791 6983508
4031F983508o9448j0630J0439P89P1377k2369j3230l5421k8485N6832j07008j24587
$$ 6983508 6914060 6903430 6913869 6914658 6986035 6963666 6950436 6915015 6886530 6943362 6836354 6711767
4019F711767l9472j75801r0917j29240j14822N8457l09j64225q2726L3309o1055
$$ 6711767 6672295 6496494 6405577 6276337 6161515 6219972 6219663 6055438 5972712 6006021 5944966
4008E944966L9590m7540L1324P5894k3220J0500j4221k7608l4069O5931N9746
$$ 5944966 5984556 5937016 5968340 6044234 6021014 6031514 6017293 5989685 5955616 6021547 6081293
3997F081293l9030P1624N2355M2087q0327p0524j16774j31697j36894m2066p0778
$$ 6081293 6042263 6113887 6166242 6208329 6128002 6057478 5940704 5809007 5672113 5630047 5559269
3986E559269j2030p6602k2016L5853m4523J24287J17993L8356K440P3733J18143
$$ 5559269 5547239 5470637 5448621 5484474 5439951 5564238 5682231 5720587 5723027 5796760 5914903
3975E914903J03993J65961P5385J03097l8272k19941k74276j86361j98869k03199
$$ 5914903 6018896 6184857 6260242 6363339 6325067 6105126 5830850 5644489 5445620 5242421
3965E242421k31474j26029j56960n7166N4855L214K4511J2672M9405Q6082r5115
$$ 5242421 5010947 4884918 4727958 4670792 4725647 4728861 4753372 4766044 4815449 4901531 4806416
3954D806416q2777m9725j19197q9092N5000J4573R045J4555j7198N4238k00j70220
$$ 4806416 4723639 4673914 4554717 4465625 4520625 4535198 4544243 4558798 4541600 4595838 4595638 4425418
3942D425418j06750j10271j52410j60973j15715k3833j23689K677M2015O7754
$$ 4425418 4318668 4208397 4055987 3895014 3779299 3755466 3631777 3634454 3676469 3744223
3932C744223M323r4135n0318P9409p922Q2977l5660L6840o0302o2918R0427L2398
$$ 3744223 3748546 3654411 3604093 3683502 3675580 3758557 3722897 3759737 3699435 3636517 3726944 3759342
3920C759342o3317l8522J0016O356N5307O5304M4689K1027r0399P1437J00689
$$ 3759342 3696025 3657503 3667519 3673875 3729182 3794486 3839175 3860202 3769803 3841240 3941929
3909C941929J09179N2795Q4384O1310p7901J9962M6379n256j5927K180O6923J21059
$$ 3941929 4051108 4103903 4188287 4249597 4171696 4191658 4238037 4232781 4216854 4219034 4285957 4407016
3897D407016J58742M2930J58679J07890J34865J65544K5218J0000J26454J18217
$$ 4407016 4565758 4608688 4767367 4875257 5010122 5175666 5200884 5210884 5337338 5455555
3887E455555J48685J80520J48820J62868J15386J26281O0061Q6104k3566o3039
$$ 5455555 5604240 5784760 5933580 6096448 6211834 6338115 6398176 6484280 6460714 6397675
3877F397675j10329j39533M9549K0230M5258J51476J53555J17094J1969N9970
$$ 6397675 6287346 6147813 6197362 6217592 6262850 6414326 6567881 6684975 6696944 6756914
3867F756914J6981J44681q0916r3930j04379j96202j47696q8787k06202j01226
$$ 6756914 6773895 6918576 6837660 6743730 6639351 6443149 6295453 6206666 6000464 5899238
3857E899238n1176j75541r4827m5015k7827q318l1204N5415R7121M7981Q0050
$$ 5899238 5848062 5672521 5577694 5532679 5504852 5496534 5465330 5520745 5617866 5665847 5745897
3846E745897K5144p6397J3712o1065k1601n2599k4106K1315P195L241j811Q067
$$ 5745897 5771041 5694644 5708356 5647291 5625690 5573091 5548985 5570300 5577495 5580736 5578925 5586992
3834E586992j3465L1515M9890Q0389J20984K0090J5564J55152M2949l2446P0483
$$ 5586992 5573527 5605042 5654932 5735321 5856305 5876395 5891959 6047111 6090060 6057614 6128097
3823F128097J20244J00224J61472P0913J05370J11096N4248K1091P4278R2315
$$ 6128097 6248341 6348565 6510037 6580950 6686320 6797416 6851664 6872755 6947033 7039348
3813G039348J66976M5950J06294O6836J00189R3148Q2860J43414J84779J37680
$$ 7039348 7206324 7252274 7358568 7425404 7525593 7618741 7701601 7845015 8029794 8167474
3803H167474J14322J46661J32812J82877K40444K14766R4456K88507K04706J73117
$$ 8167474 8281796 8428457 8561269 8744146 8984590 9199356 9293812 9582319 9787025 9960142
3793I960142K93576K74985J71366K79730L29515J87897K95962L04029K77759K58999
$$ 9960142 10253718 10528703 10700069 10979799 11309314 11497211 11793173 12097202 12374961 12633960
3783A2633960L67260L92319L65855L12244N05470N04488N53726N36741O81808
$$ 12633960 13001220 13393539 13759394 14071638 14577108 15081596 15635322 16172063 16853871
3774A6853871O48499O14456P49211P13110P82741R23474R93486J010421J209285
$$ 16853871 17502370 18116826 18866037 19579147 20361888 21285362 22278848 23289269 24498554
3765B4498554J199011J318634J390983J511242J608483J622956J755731J888749
$$ 24498554 25697565 27016199 28407182 29918424 31526907 33149863 34905594 36794343
3757C6794343K042225K222852K388938K441399K546463K676920K783608K819299
$$ 36794343 38836568 41059420 43448358 45889757 48436220 51113140 53896748 56716047
3749E6716047K940524L089801L109664L282581L302345L423724L472706L432860
$$ 56716047 59656571 62746372 65856036 69138617 72440962 75864686 79337392 82770252
3741H2770252L410137L498400L410302L258755L130550K962964K810891K662445
$$ 82770252 86180389 89678789 93089091 96347846 99478396 102441360 105252251 107914696
3733A07914696K469806K302233K183898J921880J780002J598531J258849J015790
$$ 107914696 110384502 112686735 114870633 116792513 118572515 120171046 121429895 122445685
3725A22445685P06999J43442j98852m10590p29979r64436j220130j432166j575334
$$ 122445685 123152684 123296126 123097274 122686684 121956705 120992269 119772139 118339973 116764639
3716A16764639j669397j895649k077135k240187k546888k738401k933083l122648
$$ 116764639 115095242 113199593 111122458 108882271 106335383 103596982 100663899 97541251
3708I7541251l252503l357554l291761l282281l226591l187899l123233l044340
$$ 97541251 94288748 90931194 87639433 84357152 81130561 77942662 74819429 71775089
3700G1775089l048870l015771k872850k929055k891269k752161k568831k554383
$$ 71775089 68726219 65710448 62837598 59908543 57017274 54265113 51696282 49141899
3692D9141899k406105k249155k064505j844225j728136j717081j598990j452111
$$ 49141899 46735794 44486639 42422134 40577909 38849773 37132692 35533702 34081591
3684C4081591j248997j255406j243672j093966j044405r83658j001899p86716
$$ 34081591 32832594 31577188 30333516 29239550 28195145 27211487 26209588 25422872
3676B5422872p79439o91644n32115o07875m93319m89774l92250l53878l23292
$$ 25422872 24643433 23951789 23419674 22811799 22318480 21828706 21436456 21082578 20759286
3667B0759286l89817l69168k85779l05651j76075j44689k05683k51829j63976
$$ 20759286 20369469 20000301 19714522 19408871 19232796 19088107 18882424 18630595 18466619
3658A8466619j54116k62415j44826j00615j09758q0553j58298j9415l3277j9258
$$ 18466619 18312503 18050088 17905262 17804647 17694889 17614336 17456038 17436623 17403346 17384088
3648A7384088j29308k871j6745L1891j488J942L7118J52022Q1528R3159J34982
$$ 17384088 17254780 17251909 17235164 17267055 17265567 17267509 17304627 17456649 17538177 17631336 17766318
3637A7766318K3624J14826K10295J37282K17631K38355K12382L16846L44860L96883
$$ 17766318 17789942 17904768 18115063 18252345 18469976 18708331 18920713 19237559 19582419 19979302
3627A9979302N16988L66358M89211O31463P08392P28755P84753P29492P26100
$$ 19979302 20496290 20862648 21351859 21983322 22691714 23420469 24205222 24934714 25660814
3618B5660814O82411M40788K61590O6664K528j41901j99797k05277j32883n973
$$ 25660814 26343225 26784013 27045603 27112267 27114795 26972894 26773097 26567820 26434937 26428964
3608B6428964J91679K63778M24401N94102O37492Q13536Q87377R89873J143157
$$ 26428964 26620643 26884421 27308822 27902924 28540416 29353952 30241329 31231202 32374359
3599C2374359J279040J461603J560813J880249J956429K180075K293173K444669
$$ 32374359 33653399 35115002 36675815 38556064 40512493 42692568 44985741 47430410
3591D7430410K333494J991655J382314O43030j35983r66652j526024j786284j867743
$$ 47430410 49763904 51755559 53137873 53780903 53644920 52678268 51152244 49365960 47498217
3582D7498217j746398j567555j219820q93604o39230m51661j33904J82762L39591
$$ 47498217 45751819 44184264 42964444 42070840 41431610 40979949 40846045 41028807 41368398
3573D1368398P30066Q13859J126244J409766J571837J865219K137398K395083
$$ 41368398 42098464 42912323 44038567 45448333 47020170 48885389 51022787 53417870
3565E3417870K669002K833000K876234K748479K230702J387238J02029j187655
$$ 53417870 56086872 58919872 61796106 64544585 66775287 68162525 68264554 67076899
3557F7076899k129032k760423l088718l103202k768568k497843k180733j873788
$$ 67076899 64947867 62187444 59098726 55995524 53226956 50729113 48548380 46674592
3549D6674592j562052j223564q92300o94740m07679k31982k4687J94205M14419
$$ 46674592 45112540 43888976 42996676 42301936 41894257 41662275 41637588 41831793 42246212
3540D2246212O38913P79827J009829J276557J308428J535409J521765J299836
$$ 42246212 42885125 43664952 44674781 45951338 47259766 48795175 50316940 51616776
3532E1616776J003828K64752l49571j040105j685770k116249k333297k135495
$$ 51616776 52620604 52885356 52535785 51495680 49809910 47693661 45360364 43224869
3524D3224869k023259j782780j529556j300040j108746r62013q12709o85146o23140
$$ 43224869 41201610 39418830 37889274 36589234 35480488 34518475 33705766 33020620 32397480
3515C2397480m96917l12505k58208j31830j93389j6209O3751O8250J94136K57985
$$ 32397480 31900563 31588058 31329850 31198020 31004631 30988422 31052173 31120423 31314559 31572544
3505C1572544K36450J86600J59647J13590k50413k95684l60486n33731n66207
$$ 31572544 31808994 31995594 32155241 32268831 32018418 31722734 31362248 30828517 30262310
3496C0262310n07992n00666m61091l02197k89260j59417j52755j64593r6411j13297
$$ 30262310 29754318 29253652 28792561 28490364 28201104 28041687 27888932 27724339 27627928 27514631
3486B7514631N6183L5367O9058K840J14416Q7388J30139K35275J74512J50733
$$ 27514631 27570814 27606181 27675239 27678079 27792495 27879883 28010022 28245297 28419809 28570542
3476B8570542K14331L25001K54619L16257L97079M51238M87555M79618N32010
$$ 28570542 28784873 29109874 29364493 29680750 30077829 30529067 31016622 31496240 32028250
3467C2028250N44309N99032P47919P54882Q03813R28890R14533J097652J117797
$$ 32028250 32572559 33171591 33919510 34674392 35478205 36407095 37321628 38419280 39537077
3458C9537077J226905J309314J291802J285731J357116J453210J359764J287944
$$ 39537077 40763982 42073296 43365098 44650829 46007945 47461155 48820919 50108863
3450E0108863J293992J217340J163360J221499J084380J066196J067090R95409
$$ 50108863 51402855 52620195 53783555 55005054 56089434 57155630 58222720 59218129
3442E9218129R69410Q29443O76701N62474L53651K21726O7640N2500j1827p5110
$$ 59218129 60187539 61016982 61693683 62256157 62609808 62831534 62899174 62951674 62939847 62864737
3432F2864737j9950Q1061l5185L2636J11534J47027J00047K27488L18312L48844
$$ 62864737 62844787 62925848 62890663 62923299 63034833 63181860 63281907 63509395 63827707 64176551
3422F4176551L77899O69527Q97261J160701J286659J473591J854838K169294K467788
$$ 64176551 64554450 65223977 66121238 67281939 68568598 70042189 71897027 74066321 76534109
3413G6534109K743929L115929L370945L754503M116123M428858M696648M859036
$$ 76534109 79278038 82393967 85764912 89519415 93635538 98064396 102761044 107620080
3405A07620080N061491N160089N157748N160641N063336M954068M973100N018146
$$ 107620080 112681571 117841660 122999408 128160049 133223385 138177453 143150553 148168699
3397A48168699M990545N062785N148762N002640M872708M611378M306965L971489
$$ 148168699 153159244 158222029 163370791 168373431 173246139 177857517 182164482 186135971
3389A86135971L553125L228233K782747K556278K317066K239271K348217K361115
$$ 186135971 189689096 192917329 195700076 198256354 200573420 202812691 205160908 207522023
3381B07522023K505489K443197K368379K448696K318769K090724J932184J741190
$$ 207522023 210027512 212470709 214839088 217287784 219606553 221697277 223629461 225370651
3373B25370651J604790J512418J462075J454358J578085J735213J958116K098957
$$ 225370651 226975441 228487859 229949934 231404292 232982377 234717590 236675706 238774663
3365B38774663K072090K280975K282647K411073K396332K513802K819144L025399
$$ 238774663 240846753 243127728 245410375 247821448 250217780 252731582 255550726 258576125
3357B58576125L585864M172643M951584O097347P237640Q741662J0405412J1894432
$$ 258576125 262161989 266334632 271286216 277383563 284621203 293362865 303768277 315662709
3349C15662709J3196281J4192933J4512644J3787453J2127937R672519O375849
$$ 315662709 328858990 343051923 357564567 371352020 383479957 393152476 399528325
3342C99528325K921466j53663k561350m152219m852573m855227m395106l909640
$$ 399528325 402449791 402296128 399734778 395582559 390729986 385874759 381479653 377570013
3334C77570013l951210m393553n785402p846373j0510586j3412766j6073618j8027712
$$ 377570013 373618803 369225250 363439848 355593475 345082889 331670123 315596505 297568793
3326B97568793j9373068j9645602j8888098j7709953j5911993j4177074j2316709
$$ 297568793 278195725 258550123 239662025 221952072 206040079 191863005 179546296
3319A79546296j0631415r329230q066085p018243o212786n638468n191707m783841
$$ 179546296 168914881 159585651 151519566 144501323 138288537 132650069 127458362 122674521
3311A22674521m430994m210965m137329l890019l801736l737844l530275l341432
$$ 122674521 118243527 114032562 109895233 106005214 102203478 98465634 94935359 91593927
3303I1593927l184539l038192k768135k718773k738871k543060k592897k574991
$$ 91593927 88409388 85371196 82603061 79884288 77145417 74602357 72009460 69434469
3295F9434469k479498k459451k563275k404991k184396k113422j938114j836644
$$ 69434469 66954971 64495520 61932245 59527254 57342858 55229436 53291322 51454678
3287E1454678j736261j613720j534065j382483j325126j302457j237668j210377
$$ 51454678 49718417 48104697 46570632 45188149 43863023 42560566 41322898 40112521
3279D0112521j128152j115583j058439j081193r02288q72984q61370p58449p71383
$$ 40112521 38984369 37868786 36810347 35729154 34826866 33953882 33092512 32334063 31562680
3270C1562680p61363p19787q33775p16653n78973o83299o91913o56798o11105
$$ 31562680 30801317 30081530 29247755 28531102 27952129 27268830 26576917 25920119 25309014
3261B5309014n77135o04844n98677n08894m77941n43606m74019n00923m84510
$$ 25309014 24731879 24127035 23528358 23019464 22541523 21997917 21523898 21022975 20538465
3252B0538465m35575n06323m03916l04953l61896l80745l48696l50264l80813
$$ 20538465 20102890 19596567 19192651 18887698 18525802 18145057 17796361 17446097 17065284
3243A7065284l00814k85580l30176l31687l17860l01820k98758k70035k90225
$$ 17065284 16764470 16478890 16148714 15817027 15499167 15197347 14898589 14628554 14338329
3234A4338329l08406k54656k72662j61248j93520k50013k50044j89319j23636
$$ 14338329 14029923 13775267 13502605 13341357 13147837 12897824 12647780 12458461 12334825
3225A2334825k31245k14644j94523j93172k14879j25214j59396j91129j36619
$$ 12334825 12103580 11888936 11694413 11501241 11286362 11161148 11001752 10810623 10674004
3216A0674004j67548q0922q9992j26979p4995j17014j61025j30458q8804j48989
$$ 10674004 10506456 10425534 10335542 10208563 10133568 10016554 9855529 9725071 9636267 9487278
3206I487278j14596j54204j42331j10663j77205j08121P915n6400q6383j44616
$$ 9487278 9372682 9218478 9076147 8965484 8788279 8680158 8688073 8631673 8545290 8400674
3196H400674j25071j05148m3492j55351j58472n6283o3175n3801o0861j58581
$$ 8400674 8275603 8170455 8126963 7971612 7813140 7756857 7693682 7639881 7579020 7420439
3186G420439k072q3699n8242r4938j88623M6044r9113j0643n3573j09673j33701
$$ 7420439 7418367 7334668 7276426 7181488 6992865 7038909 6939796 6929153 6875580 6765907 6632206
3175F632206j67777l0491L177k6439p3399q7619j02892r1236j01202q8130r8860
$$ 6632206 6464429 6433938 6437115 6410676 6337277 6249658 6146766 6055530 5954328 5866198 5767338
3164E767338J178j2708q0321r3853j00008j8067O569j32075j7807p779n0786o5503
$$ 5767338 5768516 5755808 5675487 5581634 5481626 5463559 5470128 5338053 5320246 5312467 5261681 5196178
3152E196178p1400O2091L295j334N4679p9919L6841l6854j49146R239m9334J9776
$$ 5196178 5124778 5186869 5190164 5188830 5243509 5163590 5200431 5163577 5014431 5023670 4974336 4994112
3140D994112J0234N956l7772n8787m2236L1996l5644q0551n2517l0787r4082J8255
$$ 4994112 5004346 5010302 4972530 4913743 4871507 4903503 4867859 4787308 4734791 4704004 4609922 4628177
3128D628177o1764J9069o6499j46897k1402j0717N5902j15832j9218m5826k143
$$ 4628177 4566413 4585482 4518983 4372086 4350684 4339967 4395869 4280037 4260819 4214993 4212850
3117D212850O5929K495r1866K5675k790q130r337J2071L0353n8010N6658P1148
$$ 4212850 4278779 4281274 4189408 4215083 4212293 4204163 4194826 4206897 4237250 4179240 4235898 4307046
3105D307046L6666m2152N2618R4423K0702P7920M6663P036N9519L8786O4463j3042
$$ 4307046 4343712 4301560 4354178 4448601 4469303 4547223 4593886 4600922 4660441 4699227 4763690 4750648
3093D750648J47347Q6998M7521R5384N1881P1051M5053j218O5211n741o4471r6735
$$ 4750648 4897995 4984993 5032514 5127898 5179779 5250830 5295883 5294665 5359876 5354135 5289664 5192929
3081E192929j01629n9710n7647M4204n9293j04058n9259j10412l9361k02618p1487
$$ 5192929 5091300 5031590 4973943 5018147 4958854 4854796 4795537 4685125 4645764 4443146 4371659
3070D371659r1876p8446K017k17968j26573o9336j66312j02924n3515j16664j11899
$$ 4371659 4279783 4201337 4203354 3985386 3858813 3789477 3623165 3520241 3466726 3350062 3238163
3059C238163l0905p1294p5815k2022j3723l7805q361j3805k4584l7588J9769P727
$$ 3238163 3207258 3135964 3060149 3038127 3024404 2986599 2978238 2964433 2939849 2902261 2922030 2929757
3047B929757M2305j4556n7833n2275K7509o0931L3877Q4052K4004k3169o485q9875
$$ 2929757 2972062 2957506 2899673 2847398 2874907 2813976 2847853 2931905 2955909 2932740 2926255 2836380
3035B836380p0473q2560j13051k0723p9745o2838j5910l7722l0203Q2413n5057
$$ 2836380 2765907 2683347 2570296 2549573 2469828 2406990 2391080 2353358 2323155 2405568 2350511
3024B350511M0135q9496J19874l2566l2574Q9437O8916O818O8880K2447M9791
$$ 2350511 2390646 2301150 2421024 2388458 2355884 2445321 2514237 2521055 2589935 2612382 2662173
3013B662173J33834J09185J9427L2594P1760k3916j17362J7052n683j81769J8330
$$ 2662173 2796007 2905192 2924619 2957213 3028973 3005057 2887695 2904747 2899064 2717295 2735625
3002B735625J29821o7900O6953J08681J00317P5356J77970J83548K92378L34815
$$ 2735625 2865446 2797546 2864499 2973180 3073497 3148853 3326823 3510371 3802749 4137564
2992D137564L95547L82703L60041J64957j07903l59437m20685m02773l33637k29560
$$ 4137564 4533111 4915814 5275855 5440812 5332909 4973472 4552787 4150014 3816377 3586817
2982C586817j07594l5722r5204l2890k4161r3528q5814n9140j4634R9578N9019
$$ 3586817 3479223 3443501 3348297 3315407 3291246 3197718 3111904 3052764 3038130 3137708 3196727
2971C196727Q7141J32152J81004J62667L60531L89764K97535J95148j15735l77774
$$ 3196727 3283868 3416020 3597024 3759691 4120222 4509986 4807521 5002669 4886934 4509160
2961D509160m81509m86828m07434k92837k57423j72792j44674j80146n1218p8674
$$ 4509160 4027651 3540823 3133389 2840552 2583129 2410337 2265663 2085517 2034299 1955625
2951A955625n6578p6007p7282k0097j3406p2974n3732p5904n8371P09L1116j26879
$$ 1955625 1899047 1823040 1745758 1725661 1712255 1639281 1585549 1509645 1451274 1451983 1483099 1356220
2939A356220r1237j8719P1766k3259L2200p9762j7079j8856M056m2505q0506M0209
$$ 1356220 1264983 1246264 1318030 1294771 1326971 1247209 1230130 1211274 1215330 1172825 1092319 1132528
2927A132528M2607j11585l1643m8708K8643L2343R251j1333r0824p565j9628q5162
$$ 1132528 1175135 1063550 1031907 983199 1011842 1044185 1053436 1042103 951279 943714 924086 838924
2915H38924j2451O6300M7812m2366o4282Q4977l027m4797k8538Q2351r7416O1551
$$ 838924 826473 892773 940585 898219 833937 918914 915887 871090 842552 924903 827487 889038
2903H89038L1461o5818n3330m7901M6863n554q090j1642j0358Q041L3607r187
$$ 889038 920499 854681 801351 753450 800313 794759 786669 775027 764669 772710 806317 797130
2891G97130r8856m6406k6295M5870K9906O851n851k9419M3895k6945L647k9628
$$ 797130 698274 651868 625573 671443 701349 708200 702349 672930 716825 689880 693527 663899
2879F63899k1761L7673N943j7269m8587J1618Q3092k2496k9901m1775N5554k4461
$$ 663899 642138 679811 685754 668485 619898 631516 714608 692112 662211 620436 675990 651529
2867F51529m265m0957l1261K897M8137L7754P7725q3675p2363M4552j5727O1585
$$ 651529 647264 606307 575046 577943 626080 663834 741559 657884 585521 630073 614346 675931
2855F75931m955n6310q6232M9293O839N044J180N6827j9110K3916L2152K9648
$$ 675931 670976 614666 528434 577727 584566 589610 590790 647617 628507 652423 684575 714223
2843G14223o3946j1950r944K7844J9253O097k0578k1429J1286J3919J04089j9545
$$ 714223 650277 638327 628383 656227 675480 681577 660999 639570 650856 664775 768864 749319
2831G49319N984Q7234l9613l0113R7599o241p557M4107M6085k291r8096k2371
$$ 749319 755303 842537 802924 772811 870410 864169 856612 900719 946804 944513 846417 824046
2819H24046o0029o2047p2512N0930L5150q2894m9353P8788N9118m996L6121m6981
$$ 824046 764017 701970 629458 680388 715538 632644 583291 662079 721197 716201 752322 705341
2807G05341Q5380L1231K6075L071P1894m4188O5950M6032Q8835M6484o4345P7479
$$ 705341 790721 821952 848027 851098 922992 878804 944754 990786 1079621 1126105 1061760 1139239
2795A139239N26Q003k0303n6972J5465l5166n3547N631m1221L1381j01494n0151
$$ 1139239 1139765 1147768 1127465 1070493 1085958 1050792 997245 1002876 961655 993036 891542 841391
2783H41391L051M66l3980k4217j1728J9385N735o7148k0040J32943J4469j0200
$$ 841391 844442 844908 810928 786711 774983 794368 800103 732955 712915 845858 860327 850127
2771H50127q7891K4144j1234m4316L1380m0228J24443M0049j36926J1763l562
$$ 850127 762236 786380 775146 730830 762210 721982 846425 886474 749548 761311 757749
2760G57749K9998j10856L2037K5273N5899k4968R303J8460j13565j7683M3132
$$ 757749 787747 676891 708928 734201 790100 765132 774435 792895 679330 661647 704779
2749G04779n0349M51l2858P638L3383p9268k0440N2066M9213o028K5586k5737
$$ 704779 654430 654881 622023 629661 663044 583776 563336 615402 664615 658587 684173 658436
2737F58436n478m6486R2190n7574j2039j654J2256O0048j1432J3731o9168r8008
$$ 658436 652958 606472 698662 641088 629049 627395 639651 699699 688267 701998 632830 534822
2725E34822M3466j03844N6589o9926k6249J6891M3263j0860k8738j1907L3725
$$ 534822 578288 474444 531033 461107 434858 451749 495012 484152 455414 443507 477232
2714D77232l1689l1179L3344J8313M5724j4698n1136J1238J3458J4910p4634q3834
$$ 477232 445543 414364 447708 466021 511745 497047 445911 457149 470607 485517 410883 327049
2702C27049L8325L197j31918L5330m7929j9190J13166r7660O5016l1918n9211
$$ 327049 365374 368571 236653 271983 224054 204864 318030 220370 285386 253468 194257
2691A94257J01998o1205J0353n235l0388k5787p8771J266M3858O2618N519L5198
$$ 194257 296255 235050 245403 240168 209780 183993 105222 106488 150346 212964 218483 253681
2679B53681q5396k5266N0093j5928n2394L8034n3562K3045J00360k3602q5203
$$ 253681 168285 143019 193112 177184 124790 162824 109262 132307 232667 209065 123862
2668A23862J7269K0257J6141K097m2342K3517L5917J0882J2655L026K0622n7434
$$ 123862 141131 161388 177529 179626 137284 160801 196718 207600 220255 223281 243903 186469
2656A86469o7269m5282M6131N3132o0271K0461K6961n3445M476L2463l5762l5542
$$ 186469 119200 73918 120049 173181 112910 133371 160332 106887 111363 143826 108064 72522
2644G2522q7101L1047J2594K4944L1818K1402J7742M914l1522m0381K2409k3941
$$ 72522 -14579 16468 29062 54006 85824 107226 124968 129882 98360 57979 80388 56447
2632E6447O8611L5303j1177m7418l0685K8400l4621J03359r755p8164k2900n968
$$ 56447 125058 160361 149184 101766 71081 99481 64860 168219 158464 80300 57400 51432
2620E1432L375J8638M1002j5181p6078L1154Q9061m2281N662J4611n0951J9632
$$ 51432 54807 73445 114447 99266 23188 54342 143403 101122 106784 121395 70444 90076
2608I0076K2224J2769N2566r736p5565n1974L3978N6602j9002q2745N8721L5054
$$ 90076 112300 125069 177635 167899 92334 40360 74338 130940 111938 29193 87914 122968
2596A22968q5024j350M1662j4662m4407q5559J33544M7521m4119N8209q4894R16
$$ 122968 37944 36594 78256 63594 19187 -66372 67172 114693 70574 128783 43889 44805
2584D4805k0677j4916M9885L3905M21M6171K446m343K969j00634k679P720P821
$$ 44805 24128 9212 59097 93002 93423 139594 142040 137697 140666 40032 37353 45073 52894
2571E2894k2487K0251Q5447q7906m4713q35p928O2814n0917J16065r0903o3531
$$ 52894 30407 50658 136105 48199 3486 2651 -5277 57537 6620 122685 31782 -31749
2559c1749O7442l532k7468M0563Q6353m7643k2121j4611k2053K0506k8193l8449
$$ -31749 35693 32161 4693 45256 131609 83966 61845 47234 25181 45687 17494 -20955
2547b0955J0061Q5524M0415m2863q180j1398k4760L3163J6002l1052n0738J1140
$$ -20955 -10894 74630 115045 72182 64002 52604 27844 61007 77009 45957 -4781 6359
2535F359P7285j04842p718N1453R078L0184j869N1329n1191o3682o190M1060M7278
$$ 6359 83644 -21198 -28916 22537 31615 61799 59930 111259 60068 -3614 -9804 31256 78534
2522G8534L9738k7345K0848p0035J1163q7672J2062k7747P840M5000n5991m008
$$ 78534 118272 90927 111775 41740 52903 -34769 -22707 -50454 -42614 2386 -53605 -57613
2510e7613K2018L3420O3059m6919n0592N2265J9393m888k8232N6811M1579P693
$$ -57613 -35595 -2175 60884 13965 -36627 15638 35031 30143 1911 58722 100301 107994
2498A07994j38679l4946K4517O0215K1729r0246Q3949K8395j2118K7925n0432
$$ 107994 -30685 -65631 -41114 19101 40830 -49416 34533 62928 50810 78735 28303
2487B8303P066K5475q8218l3230M2766q1396K7370k371N9975j5124K1768j0995
$$ 28303 35369 60844 -27374 -60604 -17838 -99234 -71864 -74235 -14260 -29384 -7616 -18611
2475a8611K2484K2879O779k6809L4137K4210o5079K9956M0794j5903K1520j19698
$$ -18611 3873 26752 33531 6722 40859 65069 -10 29946 70740 54837 76357 -43341
2463d3341Q0203M105J6589q159L0566o408m2573l0508n2186l7243L9254M5074
$$ -43341 36862 40967 57556 49397 79963 73555 30982 474 -51712 -88955 -49701 -4627
2451d627Q1163p3204J5521K5010l8972P266l0470R8869k8531R089n0597r2067
$$ -4627 76536 3332 18853 43863 4891 12157 -18313 80556 52025 61114 10517 -81550
2439h1550p9234J12480Q9114n5532Q247l6289N5245j266p3127q70j7315N2013
$$ -81550 -160784 -48304 40810 -14722 -6475 -42764 12481 11215 -61912 -62782 -80097 -28084
2427b8084M2646K0269J2145j05207q712P1003K6883J4957j5379j6867K6173o8548
$$ -28084 14562 34831 46976 -58231 -66943 4060 30943 45900 30521 13654 39827 -28721
2415b8721R890J25580o833p9288o7893J1691j7479l196l6372j6814O3189j2722
$$ -28721 -18831 106749 99916 20628 -47265 -35574 -53053 -56249 -92621 -109435 -46246 -58968
2403e8968q2379Q2857j2427Q0489J1943M0556j3444j3335N9084o0240q2682K040
$$ -58968 -141347 -58490 -70917 9572 21515 62071 48627 35292 94376 34136 -48546 -46506
2391d6506o578M1067M5643o1362j2791N0132k1124Q1957j9905q5601M6024R2597
$$ -46506 -53084 -12017 33626 -27736 -40527 9605 -11519 70438 50533 -35068 10956 103553
2379A03553j35330K7406j3913l2603Q64K5381K0018l2898k6676p49N384M1047
$$ 103553 -31777 -4371 -18284 -50887 -50023 -24642 -4624 -37522 -64198 -64947 -59563 -18516
2367a8516L5847p7889J719O9597k6460j9145J1581P3743n305l7424K5577k2398
$$ -18516 17331 -60558 -58839 10758 -15702 -34847 -23266 50477 45172 7748 33325 10927
2355A0927L0326k4770K2548J7878j9407p3797L6853m6331N162n1592Q8437L2749
$$ 10927 41253 16483 39031 56909 37502 -36295 558 -45773 -40611 -92203 -3766 28983
2343B8983p4224K7832l7672o3532N5047K447M863P9291K9854n270j06910k808
$$ 28983 -45241 -17409 -55081 -118613 -63566 -61119 -56256 23035 52889 47619 -59291 -62099
2331f2099J7436M9450O4804L492q1943K9796O262Q019j628j14385l8168J31353
$$ -62099 -44663 4787 69591 73083 -8860 20936 27198 35217 33589 -80796 -118964 12389
2319A2389j7478j0033R6914l3404j0756M8820n2857m5814O5839p8979P3160m0434
$$ 12389 -5089 -15122 81792 48388 37632 86452 33595 -12219 53620 -25359 47801 7367
2307G367L7573P7859L6982m4613j15K8481p4782K272J6401k33K2780m40j8720
$$ 7367 44940 122799 159781 115168 115053 143534 68752 71024 87425 87192 109972 109532 90812
2294I0812R82L3161k0882p1441M2980j4874q3978Q730k310r4M8890M661l5879
$$ 90812 91794 124955 104073 32632 75612 60738 -23240 -14510 -16820 -16914 31976 36637 758
2281G58l9097L6273J1970J12639q2132l5272o991k0486P2301J0096J4285j05775
$$ 758 -38339 -2066 9904 122543 40411 5139 -1852 -22338 49963 60059 74344 -31431
2269c1431J4775P846k3533N3541J7576j510P2574o3573m3191k6804j2985N8344
$$ -31431 -16656 -8810 -32343 21198 38774 37264 109838 46265 3074 -23730 -36715 21629
2257B1629J98n8798L8980m5434l456J2419l7615N3483N2103j9359r5329N2668
$$ 21629 21827 -36971 2009 -43425 -46881 -34462 -72077 -18594 33509 14150 -81179 -28511
2245b8511K1939K9539O0992k5235m8068k0125k761M250J0626Q331L6909Q526j3531
$$ -28511 -6572 22967 83959 58724 10656 -9469 -12230 -7980 2646 10977 47886 56412 42881
2232D2881l1292j3637k9668K9588n0434J1259M3509K0666J3l9540k8554q5392
$$ 42881 11589 -2048 -31716 -2128 -52562 -41303 2206 22872 22885 -16655 -45209 -130601
2220a30601J34108N5807N445k5294n7269O7123o5996n9141L4137o9771O9101M6567
$$ -130601 3507 59314 64759 39465 -17804 49319 -16677 -75818 -41681 -111452 -42351 4216
2208D216j165p1438R92L0793N0534M7837L8393o2913o3004r3353J8718J0754L1699
$$ 4216 3051 -68387 -67395 -36602 13932 61769 100162 37249 -25755 -119108 -100390 -89636 -57937
2195e7937Q2508M7119J1424M4951p6962o5086J07157q2160L1546J3233m4199l5405
$$ -57937 24571 71690 83114 128065 51103 -13983 93174 11014 42560 55793 11594 -23811
2183b3811N6877p256J1595k8405M7579L2631J5567M040o7210j61O4336p9347O46
$$ -23811 33066 25810 37405 9000 56579 89210 104777 108817 41607 41446 105782 26435 27081
2170B7081K4497P801l9296M9884K7406O6632q5189j4823O5223k0566L3977l9694
$$ 27081 51578 59379 20083 69967 97373 164005 78816 63993 129216 108650 142627 102933
2158A02933K4993l8129L2931o4160J0758M6140K8002M6748n4882P720L3251k7188
$$ 102933 127926 89797 122728 58568 69326 115466 143468 190216 135334 143054 176305 149117
2146A49117m3936r081L7138l9291Q5584P382l6909M7136O783L0322K2503m2389
$$ 149117 105181 96100 133238 93947 179531 186913 150004 197140 203923 234245 256748 214359
2134B14359j8240k0693k8808L9597k5714N3298O2343K5306l670j0092o0651N6425
$$ 214359 196119 175426 146618 186215 160501 213799 276142 301448 297778 287686 227035 283460
2122B83460P1011J6666K4252k6185m71P9048J736n7882J5220L9880Q0389l4047
$$ 283460 354471 371137 395389 369204 368733 447781 449517 391635 406855 446735 527124 493077
2110D93077j6274o970J8778Q5239L4933n1403K2455Q702O9849J14768m2350r555
$$ 493077 476803 469833 488611 573850 608783 557380 579835 588537 658386 773154 730804 721249
2098G21249K9076K9205P6276K4211P6035k4651N8511J7403J40120L4090J48J57486
$$ 721249 750325 779530 855806 880017 956052 931401 989912 1007315 1147435 1181525 1181673 1339159
2086A339159J74041P6953R4329P7118J45215J71636J77050R0648K60203K70723
$$ 1339159 1513200 1590153 1684482 1761600 1906815 2078451 2255501 2346149 2606352 2877075
2076B877075L69370N09500L40138L20257M14825M79711N78075O79090R49483J030464
$$ 2877075 3246445 3755945 4096083 4416340 4831165 5310876 5888951 6568041 7517524 8547988
2066H547988J387906J663937K004389K683697L314637J044878j385271j473139
$$ 8547988 9935894 11599831 13604220 16287917 19602554 20647432 19262161 17789022
2058A7789022l052876l286392k260827j491120j107886q34991o16739m66342k92867
$$ 17789022 14736146 11449754 9188927 7697807 6589921 5754930 5138191 4671849 4378982
2049D378982k17196k67689k80316l42214k36446k17364k22648j74088j61194j66667
$$ 4378982 4161786 3894097 3613781 3271567 3035121 2817757 2595109 2421021 2259827 2093160
2039B093160j85202k03423j04048l8455q203p5696j00296o7281q2051K2270m1199
$$ 2093160 1907958 1704535 1600487 1562032 1553829 1478133 1377837 1310556 1228505 1250775 1209576
2028A209576p1189q9611N931L2297j49250K6406j6049L5954m7914r8783n4961
$$ 1209576 1138387 1048776 1054707 1087004 937754 964160 948111 984065 936151 837368 782407
2017G82407j223j05250K4831L4546l8080m705Q624n9921j6528J0817r1342M8886
$$ 782407 781184 675934 700765 735311 697231 692526 701150 641229 624701 635518 544176 593062
2005E93062l0740j34395k6464j0413R9167P508r497m6844K071m3671m2065N4274
$$ 593062 562322 427927 401463 391050 490217 497725 488228 441384 443455 399784 357719 411993
1993D11993k9140k4313l5207J3667j0289L518L7170o6562K4482J1420o3447p0612
$$ 411993 382853 358540 323333 337000 326711 330229 367399 300837 325319 336739 273292 202680
1981B02680M1036K0988j4503K2377K4862n0955m6182j4315r83j5903j3299R8515
$$ 202680 243716 264704 250201 272578 297440 246485 200303 185988 185005 169102 155803 254318
1969B54318j05165M439r61j5596M3578L594j3617k7313m6134r646m5734J13063
$$ 254318 149153 153592 152631 137035 180613 184207 170590 143277 97143 87497 41763 154826
1957A54826r312n4257M4033l4899l8364l620P56k6037k4739Q1187M837J7767o1178
$$ 154826 145514 91257 135290 100391 62027 58407 59163 33126 8387 89574 94411 112178 51000
1944E1000R285n7871j8955N3510L4212j1300L8056m5257p0607K7039P2107m7210
$$ 51000 60285 2414 -16541 36969 71181 59881 97937 52680 -17927 9112 81219 34009
1932C4009q6799P9517M1127j26870O0762O6358m5674j1928M1819o9212L6948L7701
$$ 34009 -52790 26727 67854 -59016 1746 68104 22430 10502 52321 -16891 20057 57758
1920E7758k5791l914k1273l6911j0131j3080L4809L7715o6659K3306O9089k3786
$$ 57758 31967 28053 6780 -30131 -40262 -53342 -18533 19182 -47477 -24171 44918 21132
1908B1132o3666j2951L6980J2807k2873q765J2689m2754M3094J00265J8371j1488
$$ 21132 -42534 -55485 -18505 -5698 -28571 -37336 -24647 -67401 -24307 75958 94329 82841
1896H2841p1963o5114M7909O8059p1373l1288J0743P2091l7709n5894P1706K0903
$$ 82841 10878 -54236 -6327 61732 -9641 -40929 -30186 41905 4196 -51698 20008 40911
1884D0911q8360p662J1204K4600l4326M4229k1716K987J0944J1831m8742J156
$$ 40911 -47449 -55111 -43907 -19307 -53633 -9404 -31120 -28133 -17189 -5358 -54100 -52944
1872e2944R246J8465m1099J6926P7786j4011j0981N1997k1573k555O6596m6772
$$ -52944 -43698 -25233 -66332 -49406 28380 14369 3388 55385 33812 31257 97853 51081
1860E1081p8175m0855M7682l3526k3655j8592L3474J37366p1586o8414R8650L5803
$$ 51081 -27094 -67949 -20267 -53793 -77448 -96040 -62566 74800 3214 -65200 33450 69253
1848F9253m6399l1265N525L3657m0376J5956k0566K6928j06834n8019J24372n287
$$ 69253 22854 -8411 -2886 30771 -9605 6351 -14215 12713 -94121 -152140 -27768 -33055
1836c3055r8219L8975K7415l1870l316J3543J0783j928M8501J9010k0571O272
$$ -33055 -131274 -92299 -64884 -96754 -100070 -86527 -75744 -77672 -29171 -10161 -30732 -24460
1824b4460R314m353N3567J1232N9352m9541p699R647m3874k8473n708j8898N4655
$$ -24460 -15146 -19499 34068 45300 104652 55111 47412 57059 13185 -15288 -20996 -39894 14761
1811A4761m6312M137M9522l7456k6733n6044L6627N580M7308k0181J0730P0808
$$ 14761 -31551 -27414 22108 -15348 -42081 -98125 -61498 -55918 -8610 -28791 -18061 52747
1799E2747n1988K1633o4615j02122P0014m7929K9946k9152k0186L5052K467L6939
$$ 52747 759 22392 -42223 -144345 -74331 -122260 -92314 -121466 -141652 -106600 -104133 -67194
1787f7194o076P7557J6717j2202n1566K4081n5925j4829L4853o863J673n8123
$$ -67194 -73270 4287 21004 8802 -42764 -18683 -74608 -89437 -54584 -61447 -59774 -117897
1775a17897R0111k5757l4679k6426k8615O4290K5821j1992r371j1837Q2214K2938
$$ -117897 -27786 -53543 -88222 -114648 -143263 -78973 -53152 -65144 -74515 -86352 -4138 18800
1763A8800o5m3415p6444L8034l0490K4795j8263o7045k9326L1856k527j5939O0134
$$ 18800 18735 -24680 -101124 -63090 -93580 -68785 -87048 -154093 -183419 -151563 -154090 -170029 -109895
1750a09895N4315o4565k5983L9740K7899J0449O077j0642r082o0181L7959R5204
$$ -109895 -55580 -120145 -146128 -106388 -78489 -68040 -61963 -72605 -81687 -141868 -103909 -8705
1738h705R639j4058j9140j5844m6451p7757P4649L6540Q8242L8262j56155l5916
$$ -8705 934 -13124 -32264 -48108 -94559 -172316 -97667 -61127 27115 65377 -90778 -126694
1726a26694J11618M2186n1737m8805j9854k98K1421j8459J9165M4357N9719n2187
$$ -126694 -15076 27110 -24627 -73432 -93286 -93584 -72163 -90622 -71457 -27100 32619 -19568
1714a9568n4885L1204J1075L4163K6659q06l7972n7257q026n213L4054j8929o8608
$$ -19568 -74453 -43249 -32174 1989 28648 27842 -10130 -67387 -75413 -80626 -46572 -65501 -134109
1701a34109L5280R4074o9301J9467n8491q2369R9943K0613N8119r2749j3658J20374
$$ -134109 -98829 -4755 -74056 -54589 -113080 -195449 -95506 -74893 -16774 -109523 -123181 -2807
1689b807j7673l9692P3482p9458j2956n625o302K430N2031j8659P8005l4919m8809
$$ -2807 -20480 -60172 13310 -66148 -79104 -84729 -91031 -88601 -36570 -55229 22776 -12143 -60952
1676f0952K9684j9013N5103L5812k3160O11p161o0757r4893P4656L2714L175K4862
$$ -60952 -31268 -50281 4822 40634 17474 18085 10924 -49833 -144726 -70070 -37356 -34181 -9319
1663i319r0708m013O3073j8776p2299J9540O2600o91o254M0420K4801N0711j00629
$$ -9319 -100027 -104040 -40967 -59743 -132042 -112502 -49902 -50593 -56847 -16427 8374 59085 -41544
1650d1544o0964M1256l289k31J7403L4809j2554q8418J6764m6767K2589k6802
$$ -41544 -102508 -61252 -64541 -64772 -47369 -12560 -25114 -113532 -96768 -143535 -120946 -147748
1638a47748N3939M6909k8086M7055o1730N2283j0418k963M9244j9791o7302L6140
$$ -147748 -93809 -46900 -74986 -27931 -89661 -37378 -47796 -50759 -1515 -21306 -88608 -52468
1626e2468j8972m4080Q6906j5632l518l1282J0792k7731J186J2219Q6698q1391
$$ -52468 -71440 -115520 -28614 -44246 -47764 -79046 -68254 -95985 -94799 -82580 4118 -77273
1614g7273L2532L5780p8858L3666j9555J4104m6090q6397L1266O4310K1766N3345
$$ -77273 -44741 -8961 -87819 -54153 -73708 -59604 -105694 -192091 -160825 -96515 -74749 -21404
1602b1404l4495k2009j60J5396K686K8751K9428o0472o0293M4307k9002l6944
$$ -21404 -55899 -77908 -78068 -62672 -59986 -31235 -1807 -62279 -122572 -78265 -107267 -144211
1590a44211R7388O903j5833M104M148L9410r3770M9207M0533k742p2819k1676
$$ -144211 -46823 -39920 -55753 -51649 -47501 -8091 -101861 -52654 -12121 -14863 -87682 -109358
1578a09358N1268N4112j4499p2825r285N8812o683p2425L2764P1330j7985k5019
$$ -109358 -58090 -3978 -18477 -91302 -100587 -41775 -48458 -120883 -88119 -16789 -34774 -59793
1566e9793l7505l3M7974J0029J2497l2824n8499L1284J3171j9825J11462j23228
$$ -59793 -97298 -97331 -49357 -39328 -26831 -59655 -118154 -86870 -73699 -93524 17938 -105290
1554a05290O739K4560O8364k3637k8093j4989k7360L0982l5459l5634L9244p639
$$ -105290 -98551 -73991 -5627 -29264 -57357 -72346 -99706 -68724 -104183 -139817 -100573 -108212
1542a08212j8085M0810j4383L2995L0545k1258O7200k7099k9296R90l0851P8400
$$ -108212 -126297 -85487 -99870 -66875 -36330 -57588 9612 -17487 -46783 -45793 -76644 1756
1530A756o2476K0933l9206n5343n0686K3606P7455P9303r2678O576l1329K0591
$$ 1756 -60720 -39787 -78993 -134336 -185022 -161416 -83961 -4658 -97336 -90760 -122089 -101498
1518a01498j5780J7657P829O5112j6621j2453O595j08447N4006K3106N4454m8679
$$ -101498 -117278 -99621 -91792 -26680 -43301 -55754 -49159 -157606 -103600 -80494 -26040 -74719
1506g4719M0155K2457m5476P957M7984m4830m2164m360l2934K6171L7148l0484
$$ -74719 -34564 -12107 -57583 -49626 -1642 -46472 -88636 -92996 -125930 -99759 -62611 -93095
1494i3095M908j9012L481R335R492J067K0533n1929P5126j4629k1874k2963j3204
$$ -93095 -88187 -107199 -103718 -94383 -84891 -83824 -63291 -115220 -40094 -54723 -76597 -99560 -112764
1481a12764P2202M7331m9481k3027Q6060j23873K1447O5054M108j08936K6670
$$ -112764 -40562 6769 -42712 -65739 20321 -103552 -82105 -17051 -12943 -121879 -95209
1470i5209O6108p6088M7877k5986M0096Q7377m208j20896M203o9314l1829O1678
$$ -95209 -29101 -105189 -57312 -83298 -43202 44175 39967 -80929 -76726 -146040 -177869 -116191
1458a16191L8454Q551K8867m54p3075O5769J0433M8608l8952n6498L5576l78M1876
$$ -116191 -77737 -69186 -40319 -40773 -113848 -48079 -37646 10962 -27990 -84488 -48912 -49290 -7414
1445g414r0683J7597P7280M8286K609r3798p167L4951R081j5940M4537k7269n338
$$ -7414 -98097 -80500 -3220 45066 47675 -46123 -53290 -18339 -9258 -25198 19339 -7930 -13268
1432a3268l0925J0061m0638q9901N4030J1910L0764O1181p7494k2898K227M4698
$$ -13268 -44193 -34132 -74770 -164671 -110641 -98731 -67967 -6786 -84280 -107178 -104951 -60253
1420f0253k959j024p585k2954R5370l8144n1439k4572o5503J11482N7104J8355
$$ -60253 -63212 -64236 -71821 -94775 595 -37549 -88988 -113560 -179063 -67581 -10477 7878
1408G878J1047m9293L5214j222m2404P9939J3080n9628k7104M4423n7731l4997
$$ 7878 18925 -30368 4846 3624 -38780 41159 54239 -5389 -32493 11930 -45801 -80798
1396h0798O1350m373j5078Q59o1972N9717L5349l4786M1068n152K8684o0073l9453
$$ -80798 -19448 -23821 -38899 -38040 -100012 -40295 -4946 -39732 1336 -3816 24868 -35205 -74658
1383g4658N0519k415J5236k619K1917k0603L034O2075n4876p4993j4233N0348
$$ -74658 -24139 -26554 -11318 -13937 7980 -12623 -9589 52486 -2390 -77383 -91616 -41268
1371d1268M8298K1814J606m9598J1238m6744m0614N0365L759l4589j7242R9922
$$ -41268 7030 28844 30450 -19148 -7910 -54654 -95268 -44903 -41144 -75733 -92975 6947
1359F947j7492r629k5126J7717k844k9706j7357j7511o2833P100Q4188M1394o8749
$$ 6947 -10545 -20174 -45300 -27583 -30427 -60133 -77490 -95001 -157834 -150734 -66546 -25152 -93901
1346i3901K9107m7455o562l1987Q8145N2098l784n5976j2357O6169n278N6468
$$ -93901 -64794 -112249 -118811 -150798 -62653 -10555 -14339 -70315 -82672 -16503 -21781 34687
1334C4687n1378n2195J01785O2513k5412q9639l6122r245O2236o2764o4142M6906
$$ 34687 -16691 -68886 32899 95412 70000 -19639 -55761 -65006 -2770 -65534 -129676 -82770
1322h2770K0738k1444l3471J04771K6082o998j0887L3800m9908L9410p1266M570
$$ -82770 -62032 -83476 -116947 -12176 13906 6908 -3979 29821 -20087 19323 -51943 -47373
1310d7373K8257o3529l3529P285J8729O4236o9315N7624L2011p097j0460L709
$$ -47373 -19116 -82645 -116174 -108889 -90160 -25924 -95239 -37615 -5604 -12701 -23161 -19452
1298a9452K8572o0894m960J4680K4670j319M914L1161l5281L9822m76k7945k9635
$$ -19452 9120 -51774 -56734 -42054 -17384 -18703 -13789 17372 -17909 21913 21437 -6508 -36143
1285c6143l2108q199N354L5473k7143j3986O411j3010K5402l6981J3460M440k2141
$$ -36143 -68251 -76450 -71096 -35623 -62766 -76752 -70341 -83351 -57949 -94930 -81470 -77030 -99171
1272i9171K0854R2543k3268n1328k8304n5028M1017R6126L4982r22k4477K4043
$$ -99171 -78317 14226 -9042 -60370 -88674 -143702 -102685 -6559 28423 27501 3024 27067
1260B7067j6347k0692k9272j2209J0456q6137P8469k0385m3384O0422n5250j5725
$$ 27067 10720 -9972 -39244 -51453 -40997 -127134 -48665 -69050 -112434 -52012 -107262 -122987
1248a22987J4120j2936M6432j5713L678M3768M7475l5418k2576k4858L9763m0944
$$ -122987 -108867 -121803 -75371 -91084 -87406 -43638 3837 -31581 -54157 -79015 -39252 -80196
1236h0196l2053R3378q576p411K5335J5558m4299J971J660n8603R7139j9135O1152
$$ -80196 -112249 -18871 -27447 -34858 -9523 6035 -38264 -36293 -34633 -93236 3903 -15232 45920
1223D5920l1656o2324M2339N2406P056l0404n5819n766k7627L4440L2456m5445
$$ 45920 14264 -48060 -5721 46685 53741 23337 -32482 -38248 -65875 -31435 1021 -44424
1211d4424J4537L4035l4103j6738M697P5103K6538j9167j160M918j2180R507m3329
$$ -44424 -29887 4148 -29955 -46693 -41996 33107 59645 40478 39318 44236 32056 41563 -1766
1198a766k8401K4416L2688Q6764o8702o3804m0772k6730M4100M8150m1839n302
$$ -1766 -30167 -5751 26937 113701 44999 -18805 -59577 -86307 -42207 5943 -35896 -41198
1186d1198M2866j5687K2451L5251L7223o4777k4976L8361n4032k914m8358P5191
$$ -41198 1668 -14019 8432 43683 80906 16129 -8847 29514 -24518 -27432 -75790 -599
1174e99o8851J757K7335k266m003k1721R795N0021l3403j1250l7936j3417Q3268
$$ -599 -69450 -67693 -40358 -42624 -46627 -68348 -58553 -8532 -41935 -53185 -91121 -104538 -21270
1161b1270k768J561j4817k6047R9521J6214o1623j1659p427K6467J5396j6616
$$ -21270 -24038 -22477 -37294 -63341 36180 52394 -9229 -20888 -28315 -1848 13548 -3068
1149c068n2773l075M6081K6045p4504J3618J1380o3391O8209P4118l3202J4712
$$ -3068 -55841 -58916 -12835 13210 -61294 -47676 -36296 -99687 -31478 42640 9438 24150
1137B4150r1497N8579J5210K7392m9724M0134K0590k4902l0664j1260N651o9709
$$ 24150 -67347 -8768 6442 33834 -15890 24244 44834 19932 -10732 -21992 -16341 -86050
1125h6050N4203J834L2125m6360p397J4590k0454L5924J1002o3140k3578K7107
$$ -86050 -31847 -30013 2112 -44248 -51645 -37055 -57509 -21585 -10583 -73723 -97301 -70194
1113g0194P5189n709m5079j7717p20N654M404M021M3846J7197m1309o8073N2310
$$ -70194 4995 -714 -45793 -63510 -64230 -58576 -54172 -50151 -6305 10892 -30417 -98490 -46180
1100d6180N9415q5273M8159O9484m5621p2199j3556J42509j0995l8196m3604r577
$$ -46180 13235 -72038 -23879 45605 -16 -72215 -85771 56738 45743 7547 -36057 -45634
1088d5634n099P6541n2135m1526M2662k7160R567M5293k7954m5538K3745k1693
$$ -45634 -50733 25808 -26327 -67853 -25191 -52351 -42784 2509 -25445 -70983 -47238 -68931
1076f8931L633j7682P595n165O5295K802j431J5181k600l0144M3842m1832J9053
$$ -68931 -65298 -82980 -75385 -80550 -15255 -12453 -13884 1297 -1303 -31447 12395 -29437 -10384
1063a0384N5238m6963K6926N3562m7418p8662M3864L8156l8354M7445p941j5049
$$ -10384 44854 -2109 24817 78379 30961 -47701 -3837 34319 -4035 43410 35469 20420
1051B0420l2429k117P0043n6492j8209K7881l4866j8178M2215n1167p222k2992
$$ 20420 -12009 -14126 55917 -575 -18784 9097 -25769 -43947 -1732 -52899 -60121 -83113
1039h3113N1198q377J01051L7727o8198n3861N7218o0456o6469O1977P17K7827
$$ -83113 -31915 -40292 60759 98486 30288 -23573 33645 -26811 -93280 -31303 -30586 -2759
1027b759m9570K0003l2756k7440O0149R03N1278J4117p6140J9279j9236L1917
$$ -2759 -52329 -32326 -65082 -92522 -32373 -31470 19808 33925 -42215 -22936 -42172 -10255
1015a0255J4643q8223L8960M6196M0235j27226J899L2395l5579J6957P6976P8832
$$ -10255 4388 -83835 -44875 1321 41556 -85670 -83771 -51376 -86955 -69998 6978 85810
1003H5810q5687K7362p9542P356j7105K1920N4461m101O0997l7687l0029K2733
$$ 85810 123 27485 -52057 -44701 -61806 -39886 14575 10474 71471 33784 3755 26488
991B6488M037m8539j00590P8551j1694K0101P0256J0238l3319o7687N5876j0782
$$ 26488 30525 -18014 -118604 -40053 -51747 -31646 38610 48848 15529 -52158 3718 -7064
979g064l7719N0667j2189m2958K8744Q526o6295R4576m7365m252M8507m6620l80
$$ -7064 -44783 5884 -6305 -49263 -20519 -11993 -78288 16288 -31077 -35329 13178 -33442 -33822
966c3822P9539L447j0130k3979N5993j4561j16370M4543O7910m1946k2277l1057
$$ -33822 45717 49164 39034 15055 71048 56487 -59883 -15340 52570 10624 -11653 -42710
954d2710O1123L0022o262r249j546K8025j5652l4216j0537J7437p6928M1366N7755
$$ -42710 18413 48435 42173 32924 31378 59403 43751 9535 -1002 16435 -60493 -19127 38628
941C8628K1929j3762L2227k1517j7024j438k6157q933m1211M297l5154n924N229
$$ 38628 60557 46795 79022 57505 40481 39043 12886 3953 -37258 -32961 -68115 -74039 -68810
928f8810K8865n0589n0216J11498M7477k5355p933L7112p1749K877L9011l5148
$$ -68810 -39945 -90534 -140750 -29252 18225 -7130 -15063 22049 -49700 -46823 -7812 -42960
916d2960k5370J07967l1482n8159o9409R1284K274J2801j67M2721j30286j92K3895
$$ -42960 -68330 39637 8155 -50004 -119413 -28129 -25855 -13054 -13221 29500 -100786 -100978 -77083
903g7083L3787K5228j6421K7292r0150R9392M3372j09190n978O0111K271j1852
$$ -77083 -43296 -18068 -34489 -7197 -97347 2045 45417 -63773 -69751 -9640 -7369 -19221
891a9221J0704N9493k631k3558j883p7837p0093J26973L1659o3240J9886O00P0558
$$ -19221 -8517 50976 48345 24787 22904 -54933 -125026 1947 33606 -29634 -9748 -9148 61410
878F1410J2611n2668k6412m0419L1354l8900M8454N4365k3225k4103m765k9701
$$ 61410 74021 21353 -5059 -45478 -14124 -53024 -4570 49795 26570 2467 -2298 -31999
866c1999K6633M7526n0847l5258j517j9924M9986r895J4635k5606j4183k328L1448
$$ -31999 -5366 42160 -8687 -43945 -45462 -65386 -15400 -25295 -10660 -36266 -50449 -52777 -21329
853b1329o0599O1628R7351l9937j8031K0946m9524l6749n3264L7068k2681K2800
$$ -21329 -81928 -20300 77051 37114 19083 40029 -9495 -46244 -99508 -62440 -85121 -62321
841f2321M5380O2741n5375r0268j896R0278K120o004k6249m925M5035L817Q9159
$$ -62321 -16941 45800 -9575 -99843 -101739 -11461 -9341 -15345 -41594 -46519 -1484 2333 91492
828I1492r0233n086j523J1711k9459j9011J2740m7219m4565M9997j9273O5314
$$ 91492 1259 -3827 -5350 6361 -23098 -42109 -29369 -76588 -121153 -71156 -90429 -25115
816b5115l0742N5384O019j1583n6843N490Q5373J7194m4726P262j9469N8638J3685
$$ -25115 -55857 -473 5546 -6037 -62880 -57390 27983 45177 451 7713 -11756 46882 60567
803F0567q9384k2233J8888J483L9007L16O1917j7480k4844J5808j1608j1439l8426
$$ 60567 -28817 -51050 -32162 -30679 8328 8644 70561 53081 28237 44045 32437 20998 -17428
790a7428K7606j2144K5860k3394M6137m4392j13614J7155O6510J5135O5506o1070
$$ -17428 10178 -1966 23894 500 46637 2245 -111369 -94214 -27704 -12569 52937 -8133
778h133m4691p995N8946n175j7855m38M0275K9481r568O8247l0197J219o2668
$$ -8133 -52824 -60819 -1873 -7048 -24903 -25341 14934 44415 34847 103094 72897 74116 11448
765A1448m7293J16827n9706N2547n3507m0917J9497q3123L6381J04184l4135M347
$$ 11448 -35845 80982 21276 73823 20316 -20601 -1104 -84227 -47846 56338 22203 26550
753B6550Q277Q6418j48761j838M8707K9012o3380J5776M3873o0731O2603J3452
$$ 26550 34827 121245 -27516 -29354 19353 48365 -15015 761 44634 -16097 46506 59958
741E9958p1925q3114J14230J5245m2656R0268M1908q1930k2137J8682M0047r0047
$$ 59958 -11967 -95081 19149 34394 -8262 82006 123914 41984 19847 38529 78576 -11471
729a1471P6056n3931m2730j8743L5861Q310K8677l2454m2433M4376q264M3813
$$ -11471 64585 10654 -32076 -50819 -14958 -6648 22029 -10425 -52858 -8482 -16746 27067
717B7067o575J9600Q580k6716K9572p1494M6916J4069j8116O06k6364N8718J9788
$$ 27067 20492 40092 48672 21956 51528 -19966 26950 41019 22903 23509 -2855 55863 75651
704G5651R67r739o954n218j8773k3125n7334m8446K9894O4527l5219J932Q5257
$$ 75651 76618 66879 59925 54707 35934 12809 -44525 -92971 -63077 1450 -33769 -31837 53420
691E3420M9921k4577m0762M562K0213J3820r5992p8516L3647Q7569p660N6742
$$ 53420 103341 78764 38002 42564 62777 76597 -19395 -97911 -64264 23305 15645 72387
679G2387p320J422k0862l2732O2135l9641j1287J956K7238k7251o6666K2157Q9327
$$ 72387 65067 66489 45627 12895 75030 35389 24102 26058 53296 26045 -40621 -18464 70863
666G0863j04891P3573O3312k4834p3037n7704M7309P8410o6949L0984M2598l842
$$ 70863 -34028 39545 102857 78023 4986 -52718 -5409 73001 6052 37036 79634 75792
654G5792m2485m1541P5349o085M1075l0846p906K2238n0409K6990P8986j07978
$$ 75792 33307 -8234 67115 61030 102105 71259 63353 85591 35182 62172 141158 33180
642C3180o1043L566M985P6619K2091q8318m6075K4606M1409m1266M3599m7824
$$ 33180 -27863 -24297 -19312 57307 79398 -8920 -54995 -30389 11020 -30246 13353 -34471
630c4471M5612l4995k4298k4624J0961J13399k4205K8740p9698J8394J6663n076
$$ -34471 11141 -23854 -48152 -72776 -61815 51584 27379 56119 -23579 -5185 11478 6402
618F402O635o502K7844P8108j9769r7571m3382J01364J9850p6334O4650j5931
$$ 6402 13037 6535 34379 112487 92718 -4853 -48235 53129 72979 -3355 61295 45364
606D5364O1420o1202O071j24804K2198L9397k7173M3958K0368K8141m9368k4034
$$ 45364 106784 45582 51653 -73151 -50953 -11556 -38729 5229 25597 53738 4370 -19664
594a9664R780n8808O905O0651N4124n4252p1278K2198l054M8019N9702j4916M04
$$ -19664 -9884 -68692 -61787 -1136 52988 -1264 -72542 -50344 -53398 -5379 54323 39407 39811
581C9811J8675L180m8629o1631J10931O3787m3538n3940k7380J2040K2729m2618
$$ 39811 58486 61666 13037 -48594 62337 126124 82586 28646 1266 13306 36035 -6583
569f583O1426M5483L9638j6478o7027j08192j5675J7046K6308K1894M3776n7969
$$ -6583 54843 100326 139964 123486 56459 -51733 -67408 -50362 -24054 -2160 41616 -16353
557a6353j1359N4712l6345l2581K5106j4100J9001Q4017j2250j25501m6755J18346
$$ -16353 -27712 27000 -9345 -41926 -16820 -30920 -11919 72098 59848 -65653 -112408 5938
545E938K6583l7530R602O5119J1838J783J3796k5595o1451J3385R556N936q1235
$$ 5938 32521 -5009 4593 69712 81550 83333 97129 71534 10083 23468 33024 38960 -42275
532d2275M1705J08380K4394K936j24215K9904j7952m8234K658O1757J0795j0023
$$ -42275 -570 107810 132204 135140 10925 40829 22877 -25357 -22699 39058 49853 39830
520C9830J8613o2838K1799P5232J364R946j8626p1401k9796K8113N8425j1718
$$ 39830 58443 -4395 17404 92636 94000 103946 85320 13919 -15877 12236 70661 58943
508E8943l6025K9336J3712j8992l8786K3207j4048k7575l9811Q727Q7082j8187
$$ 58943 22918 52254 65966 46974 8188 31395 17347 -10228 -50039 -41312 45770 27583
496B7583J739K7157l5100j9326L6182m477L3659l7085j5513j1218M3275J539m6992
$$ 27583 29322 56479 21379 2053 38235 33758 67417 30332 14819 3601 46876 48415 1423
483A423r3167Q9585Q1768j9407n141k707K1515J6173n5786p1986J2180N8501Q0785
$$ 1423 -91744 -2159 79609 60202 55061 52354 73869 90042 34256 -37730 -25550 32951 113736
470A13736o5934M41O2767p662j5750k6162J1289m1847K6134R1518j11886L875
$$ 113736 47802 48243 111010 103348 87598 61436 72725 30878 57012 148530 36644 40519
458D0519N6361l8666P4069l4736q5621N8904k3036K1638J2480M4333n9385K0781
$$ 40519 96880 58214 132283 97547 11926 70830 47794 69432 81912 126245 66860 87641
446H7641j2880o4430L668J4138M2217O592j0439r162K5224k4330o2591J4340k9483
$$ 87641 74761 10331 13999 28137 70354 76946 66507 57345 82569 58239 -4352 9988 -19495
433a9495n256N7118L8043j1917m2370P0197n9832n3008M5984N2765J9698l485
$$ -19495 -24751 32367 70410 58493 16123 86320 26488 -26520 19464 72229 91927 88442
421H8442l0637n5973j6092O5360n9744J6768J0826K5481J14370l8585K9069n4221
$$ 88442 57805 1832 -14260 51100 -8644 8124 18950 44431 158801 120216 149285 95064
409I5064j9897J07284r1387p9771r585Q7196k2671j00635R6009O489j9824l5810
$$ 95064 75167 182451 91064 11293 1708 88904 66233 -34402 61607 68096 48272 12462
397A2462o3356N0651O1629K5463j247P467J5026j3952k7181n3859l6460O7712
$$ 12462 -50894 -243 61386 86849 85602 93069 108095 94143 66962 13103 -23357 44355
385D4355N6350q9732k3078L7915P5034n2242j281o878l6048m2695N3905L6492
$$ 44355 100705 10973 -12105 25810 100844 48602 47321 40443 4395 -38300 15605 52097
373E2097K7611m4958K7410M6103L37M1030m7190N4275l9972l2829n0628n9584
$$ 52097 79708 34750 62160 108263 108600 149630 102440 156715 116743 83914 33286 -26298
361b6298R2557J3453l9284J5990k517Q7292l9534N838l2473O8674p380L4561p5364
$$ -26298 66259 79712 40428 56418 53901 141193 101659 107497 75024 143698 136318 170879 95515
348I5515k9304Q439n430L1515o1885o563M3513o2O4756m6729o5826K7768o1410
$$ 95515 66211 74650 69220 100735 38850 32287 75800 75738 140494 93765 27939 55707 -5703
335e703M2319M469K7895P2659p1810N4667o050l7464l1171p682l2355J8805J3030
$$ -5703 36616 41085 68980 141639 69829 124496 118446 80982 49811 42129 9774 28579 41609
322D1609m1278l475M2237n287n8365K2701J2511Q9993L393L8696p7467P1935l2182
$$ 41609 331 -3144 39093 33806 -24559 -1858 10653 100646 104039 142735 65268 137203 105021
309A05021j08743R5122P8810q9616J4890k9257M4411q4066J4353M7356j547k900
$$ 105021 -3722 91400 170210 80594 95484 66227 110638 26572 40925 88281 86734 83834
297H3834l6206o6789J9850L1293k8988R6410n0074J9305P7440n9836k8503k3941
$$ 83834 47628 -19161 689 31982 2994 99404 49330 68635 146075 86239 57736 33795
285C3795j8516O1655m5070j1376R8425k1606l5145R263o1555J3635J18420l3999
$$ 33795 15279 76934 31864 20488 118913 97307 62162 71425 9870 23505 141925 107926
273A07926r4829M1902j4542m5026J23143j0178n9121n0146O5151J7454m680J3570
$$ 107926 13097 54999 40457 -4569 118574 108396 49275 -871 64280 81734 77054 90624
261I0624j6426J8209j6731J0334O2205K9501o7139o3301L670J8481j07056L7988
$$ 90624 74198 92407 75676 86010 148215 177716 110577 47276 50946 69427 -37629 359
249C59k4427n784M2132N7091N882N7779R353M3494n8906j55113O6027J2181m1029
$$ 359 -24068 -29852 12280 69371 75253 133032 142385 185879 126973 -28140 37887 50068 9039
236I039J23188o4989r471j4704j6436j2814K2615M8294n3416k3297L1109m5155
$$ 9039 132227 67238 57767 43063 26627 13813 36428 84722 31306 8009 39118 -6037
224f037l6969M3486M2826j5892M9698O5033p1889m1208R454k5221m0839O9478
$$ -6037 -43006 480 43306 27414 77112 142145 70256 29048 38502 13281 -27558 41920
212D1920L1630P291j7519J1587n2440k9839O807l2230M8814M2665l7280N0994
$$ 41920 73550 80841 63322 74909 22469 -7370 -563 -32793 16021 58686 21406 72400
200G2400K3523m5831r526P497m8874K5465L6319Q131l5653M8139M1242j0024K4877
$$ 72400 95923 50092 40566 48063 -811 24654 60973 69104 33451 81590 122832 112808 137685
187A37685p6370k5867J3035j2611K8813R176m136n2626l3300M4106R671J1416
$$ 137685 61315 35448 48483 35872 64685 73861 69725 17099 -16201 27905 37576 48992
175D8992J768K0832p845j05554k8962O0019N8840o443k2663K3750k5887M4747
$$ 48992 50760 71592 63747 -41807 -70769 -10750 48090 41647 18984 42734 16847 61594
163F1594N5530n2358q376K5088l9479k3106L3842P4846p653m6088L3238l5686
$$ 61594 117124 64766 56390 81478 41999 18893 52735 127581 119928 73840 107078 71392
151G1392k7037L3266m2983l7668K7953j2322M839l8355L8430J4528M465J7149
$$ 71392 44355 77621 34638 -3030 24923 12601 17440 -20915 17515 32043 36508 53657
139E3657m9046P926m3866M9745j8535N1558P116n7184O028j8567L0413o1359j4899
$$ 53657 4611 12537 -31329 18416 -119 51439 58555 1371 7399 -11168 19245 -42114 -57013
126e7013P4187k4643J8361o193j2824k7589L1574K8j7178L9520k0271j0780m7845
$$ -57013 17174 -7469 10892 4699 -8125 -35714 -4140 -4112 -21290 18230 -2041 -12821 -60666
113f0666R683l4245p882N1126J9418P928m7575K2539K7099J885k0853m5854j9659
$$ -60666 -50983 -85228 -93110 -41984 -22566 -14638 -62213 -39674 -12575 -10690 -31543 -77397 -97056
100i7056K5789P264J3221l2963K7824M1463m2685m650l382L7898j1931j8448q104
$$ -97056 -71267 -64003 -50782 -83745 -55921 -14458 -57143 -61793 -65175 -27277 -39208 -57656 -65760
87f5760p062P352j1944j7066O7080j9561l7374m4613N0153j051M268m0144N3679
$$ -65760 -72822 -65470 -77414 -94480 -27400 -46961 -84335 -128948 -78795 -79846 -75578 -115722 -62043
74f2043j886J5001j1463K4228J1677O511N1249o6127n5104L323N9778l0816k7053
$$ -62043 -63929 -48928 -60391 -36163 -24486 -17975 33274 -32853 -87957 -84634 -24856 -55672 -82725
61h2725P207K8771k2274m3418j0869j2089M754M1547L6129l2390l6833L996k1663
$$ -82725 -75518 -46747 -69021 -112439 -123308 -135397 -130643 -89096 -52967 -85357 -122190 -118194 -139857
48a39857M1900n7361K3651k639J3562k233o620l3490p730L2620n7230J3241N0576
$$ -139857 -97957 -155318 -131667 -134306 -120744 -122977 -129597 -163087 -170817 -138197 -195427 -182186 -131610
35a31610M9397k244q981k9244K6951l4025m6159N943k567M933J1552K3139J7927
$$ -131610 -82213 -84457 -93438 -122682 -95731 -129756 -175915 -169972 -172539 -167606 -156054 -132915 -114988
22a14988O898o3995K5729o2903J9317l599l538M9961j8281J9790o4464J4917N5212
$$ -114988 -108090 -172085 -146356 -209259 -189942 -193541 -197079 -147118 -165399 -145609 -210073 -195156 -139944
9a39944m5915J7182L2932J8935o8794l0477K4961m1575o31
$$ -139944 -185859 -168677 -135745 -116810 -185604 -216081 -191120 -232695 -233326
0b33326
$$ -233326
$$ Imaginary data points
##PAGE= N=2
##DATA TABLE= (X++(I..I)), XYDATA
16383b188220R0930J6516k0023K5271M8872J2374K8255K8264J7019O6893J6631
$$ -2188220 -2097290 -2080774 -2100797 -2075526 -2026654 -2014280 -1986025 -1957761 -1940742 -1873849 -1857218
16372a857218M8933L1451J7844m031M747P1153p777K0953K0396N3402J2540M7081
$$ -1857218 -1808285 -1776834 -1758990 -1763021 -1758274 -1687121 -1694898 -1673945 -1653549 -1600147 -1587607 -1540526
16360a540526j1346K2193O2977K0910M1638N5521o00K4827P9844l967K5252K3222
$$ -1540526 -1551872 -1529679 -1466702 -1445792 -1404154 -1348633 -1349233 -1324406 -1244562 -1248529 -1223277 -1200055
16348a200055r898M0039L7638O1101p59J04699O4633J9333l9979q068L100K94
$$ -1200055 -1209953 -1169914 -1132276 -1071175 -1071934 -967235 -902602 -883269 -923248 -931316 -928216 -927922
$$ [...]
##END NTUPLES=NMR SPECTRUM
##END=
