##TITLE=1H_EC-3254(5-23)
 CDCl3, 8 sc, 
 9.07.2021
##JCAMPDX= 6.0         $$ Bruker NMR JCAMP-DX V2.0
##DATA TYPE= NMR SPECTRUM
##DATA CLASS= NTUPLES
##ORIGIN= UXNMR, Bruker Analytische Messtechnik GmbH
##OWNER= root
$$ XWIN-NMR		Version 3.5
$$ Fri Jul  9 10:06:38 2021 Russian Standard Time (UT+4h)  she@DPX200
##.OBSERVE FREQUENCY= 200.131506
##.OBSERVE NUCLEUS= ^1H
##.ACQUISITION MODE= SIMULTANEOUS
##.ACQUISITION SCHEME= undefined
##.AVERAGES= 8
##.DIGITISER RES= 18
##SPECTROMETER/DATA SYSTEM= spect
##.PULSE SEQUENCE= zg30
##.SOLVENT NAME= CDCl3
##.SHIFT REFERENCE= (INTERNAL, CDCl3, 0, 17.502)
##AUDIT TRAIL= $$ (NUMBER, WHEN, WHO, WHERE, WHAT)
$$ ##TITLE= Audit trail, XWIN-NMR		Version 3.5
$$ ##JCAMPDX= 5.01
$$ ##ORIGIN= Bruker BioSpin GmbH
$$ ##OWNER= she
$$ F:/spectra/data/she/nmr/H-F/1/pdata/1/auditp.txt
$$ ##AUDIT TRAIL=  $$ (NUMBER, WHEN, WHO, WHERE, WHAT)
(   1,<2021-07-09 10:04:46.79 +0400>,<she>,<DPX200>,
      <created by zg, POWCHK disabled, PULCHK disabled
       configuration hash MD5:
       00 E9 B6 7A A2 85 ED C7 34 08 36 98 17 FE 4E 26
       data hash MD5: 16K
       B2 35 11 16 94 4C 25 FE DC 7F 2D D0 D2 A7 1C 4E>)
(   2,<2021-07-09 10:04:50.87 +0400>,<she>,<DPX200>,
      <Start of raw data processing
       efp BC_mod = 2 LB = 0.24 FT_mod = 6 PKNL = 1 PHC0 = -12275.43 PHC1 = 15.00101 SI = 16K 
       data hash MD5: 16K
       CA 4C 72 79 7E F5 EE A9 19 4F 51 73 31 85 B5 77>)
(   3,<2021-07-09 10:05:29.98 +0400>,<she>,<DPX200>,
      <pk PHC0 = 3.954544 PHC1 = -7.6 
       data hash MD5: 16K
       06 09 1B F5 82 34 5D 41 2F 9E 1D B5 89 7E 7D C6>)
(   4,<2021-07-09 10:05:33.56 +0400>,<she>,<DPX200>,
      <abs ABSG = 5 
       data hash MD5: 16K
       A8 D5 1C 46 05 A7 48 66 D1 97 A2 FD 4F CA 2B 88>)
$$ ##END=
$$ 
$$ hash MD5
$$ CF 2A BB FF 84 51 5F F1 B2 B9 E1 80 4B 03 E1 71
##$RELAX= 
##$RELAX= 
##$RELAX= 
##$RELAX= 
##$RELAX= 
##$RELAX= 
$$ Bruker specific parameters
$$ --------------------------
##$DU= <F:/spectra>
##$EXPNO= 1
##$NAME= <H-F>
##$PROCNO= 1
##$TYPE= <nmr>
##$USER= <she>
##$AMP= (0..31)
100 100 100 100 100 100 100 100 100 100 100 100 100 100 100 100 100 100 
100 100 100 100 100 100 100 100 100 100 100 100 100 100 
##$AQSEQ= 0
##$AQ_mod= 1
##$AUNM= <au_zg>
##$AUTOPOS= <>
##$BF1= 200.13
##$BF2= 200.13
##$BF3= 200.13
##$BF4= 200.13
##$BF5= 200.13
##$BF6= 200.13
##$BF7= 200.13
##$BF8= 200.13
##$BYTORDA= 1
##$CFDGTYP= 0
##$CFRGTYP= 5
##$CHEMSTR= <none>
##$CNST= (0..31)
1 1 145 1 1 1 1 1 1 1 1 1 1 1 1 1 1 1 1 1 1 1 1 1 1 1 1 1 1 1 1 1 
##$CPDPRG= <>
##$CPDPRG1= <>
##$CPDPRG2= <>
##$CPDPRG3= <>
##$CPDPRG4= <mlev>
##$CPDPRG5= <mlev>
##$CPDPRG6= <mlev>
##$CPDPRG7= <mlev>
##$CPDPRG8= <mlev>
##$CPDPRGB= <>
##$CPDPRGT= <>
##$D= (0..31)
0 1.2 0 0 0 0 0 0 0 0.06 0 0.03 0 0 0 0 0.0002 0 0 0 0 0 0 0 0 0 0 0 0 
0 0 0 
##$DATE= 1625810686
##$DBL= (0..7)
120 120 120 120 120 120 120 120 
##$DBP= (0..7)
150 150 150 150 150 150 150 150 
##$DBP07= 0
##$DBPNAM0= <>
##$DBPNAM1= <>
##$DBPNAM2= <>
##$DBPNAM3= <>
##$DBPNAM4= <>
$$ [...]
##$SUBNAM3= <"">
##$SUBNAM4= <"">
##$SUBNAM5= <"">
##$SUBNAM6= <"">
##$SUBNAM7= <"">
##$SUBNAM8= <"">
##$SUBNAM9= <"">
##$SW= 20.0188882624521
##$SWIBOX= (0..15)
0 0 2 0 0 0 0 0 0 0 0 0 0 0 0 0 
##$SW_h= 4006.41025641026
##$TD= 16384
##$TD0= 1
##$TE= 0
##$TE2= 300
##$TE3= 300
##$TEG= 300
##$TL= (0..7)
0 120 120 120 120 120 120 120 
##$TP= (0..7)
150 150 150 150 150 150 150 150 
##$TP07= 0
##$TPNAME0= <>
##$TPNAME1= <>
##$TPNAME2= <>
##$TPNAME3= <>
##$TPNAME4= <>
##$TPNAME5= <>
##$TPNAME6= <>
##$TPNAME7= <>
##$TPOAL= (0..7)
0.5 0.5 0.5 0.5 0.5 0.5 0.5 0.5 
##$TPOFFS= (0..7)
0 0 0 0 0 0 0 0 
##$TUNHIN= 0
##$TUNHOUT= 0
##$TUNXOUT= 0
##$USERA1= <user>
##$USERA2= <user>
##$USERA3= <user>
##$USERA4= <user>
##$USERA5= <user>
##$V9= 5
##$VALIST= <valist>
##$VCLIST= <CCCCCCCCCCCCCCC>
##$VD= 0
##$VDLIST= <DDDDDDDDDDDDDDD>
##$VPLIST= <PPPPPPPPPPPPPPP>
##$VTLIST= <TTTTTTTTTTTTTTT>
##$WBST= 1024
##$WBSW= 4
##$XGAIN= (0..3)
0 0 0 0 
##$XL= 0
##$YL= 0
##$YMAX_a= 610004
##$YMIN_a= -964522
##$ZGOPTNS= <>
##$ZL1= 120
##$ZL2= 120
##$ZL3= 120
##$ZL4= 120
##$ABSF1= 17.51299
##$ABSF2= -2.506048
##$ABSG= 5
##$ABSL= 3
##$ALPHA= 0
##$AQORDER= 0
##$ASSFAC= 0
##$ASSFACI= 0
##$ASSFACX= 0
##$ASSWID= 0
##$AUNMP= <proc_1d>
##$AZFE= 0.1
##$AZFW= 0.1
##$BCFW= 0
##$BC_mod= 2
##$BYTORDP= 0
##$COROFFS= 0
##$CY= -3
##$DATMOD= 1
##$DC= 0
##$DFILT= <>
##$DTYPP= 0
##$F1P= 0
##$F2P= 0
##$FCOR= 1
##$FTSIZE= 16384
##$FT_mod= 6
##$GAMMA= 0
##$GB= 0
##$INTBC= 1
##$INTSCL= 1.334414e-10
##$ISEN= 128
##$LB= 0.24
##$LEV0= 0
##$LPBIN= 0
##$MAXI= 10000
##$MC2= 0
##$MEAN= 0
##$ME_mod= 0
##$MI= 1.114404
##$NCOEF= 0
##$NC_proc= -5
##$NLEV= 6
##$NOISF1= 3.799351
##$NOISF2= 2.8
##$NSP= 0
##$NTH_PI= 0
##$NZP= 0
##$OFFSET= 17.502
##$PC= 1
##$PHC0= -12271.48
##$PHC1= 7.40101
##$PH_mod= 1
##$PKNL= yes
##$PPARMOD= 0
##$PSCAL= 0
##$PSIGN= 0
##$REVERSE= no
##$SF= 200.130006529622
##$SI= 16384
##$SIGF1= 3
##$SIGF2= 2
##$SINO= 5.538805
##$SIOLD= 16384
##$SREGLST= <1H.CDCl3>
##$SSB= 0
##$STSI= 16384
##$STSR= 0
##$SW_p= 4006.41025641026
##$SYMM= 0
##$S_DEV= 0
##$TDeff= 16384
##$TDoff= 0
##$TI= <>
##$TILT= no
##$TM1= 0
##$TM2= 0
##$TOPLEV= 0
##$USERP1= <user>
##$USERP2= <user>
##$USERP3= <user>
##$USERP4= <user>
##$USERP5= <user>
##$WDW= 1
##$XDIM= 16384
##$YMAX_p= 350289369
##$YMIN_p= -128889
$$ End of Bruker specific parameters
$$ ---------------------------------
##NTUPLES= NMR SPECTRUM
##VAR_NAME=  FREQUENCY,     SPECTRUM/REAL,   SPECTRUM/IMAG
##SYMBOL=    X,             R,               I
##VAR_TYPE=  INDEPENDENT,   DEPENDENT,       DEPENDENT
##VAR_FORM=  AFFN,          ASDF,            ASDF
##VAR_DIM=   16384,         16384,           16384
##UNITS=     HZ,            ARBITRARY UNITS, ARBITRARY UNITS
##FACTOR=    0.24454680195387, 1,            1
##FIRST=     3502.67553612975, 0,            0
##LAST=      -503.734720280514, 0,           0
##MIN=       -503.734720280514, -128889,     0
##MAX=       3502.67553612975, 350289369,    0
$$ Real data points
##PAGE= N=1
##DATA TABLE= (X++(R..R)), XYDATA
$$ [...]
6364g4809l333L1838M2402j8783L5376L6892p645k5944j9474L2995j300l678q670
6351A5867r327l5541K8257K6277j4940m8474m270J8666P407q94K5185N665L5843
6338D9721k6039l5028P012l4804j806L5365K2029L0325k9447J269j2787k271k3243
6325a9704L8132j1847p370J7525j9428L2235L3693m3294P061L7721j89K0082p050
6312G7567j2705j6809p309m8255K5514K7995k0330j3888K0762P431l256j6113
6300B0604l087L9095j4351k9081j5860Q369M121j5341k6147J6974P693O818L5341
6287C5148m3112L5839K5148j6767k3102k0712K576M3288J5616J1394k3778k734
6275C8804M1401k4071k6734k4645K4250l5717K4273J9982J919j4295p27M920K6815
$$ plain form
6364 -74809 -78142 -46304 -3902 -22685 12691 49583 41938 15994 -3480 29515 28215 24537 15867
6351 15867 6540 -29001 -744 25533 10593 -37881 -42151 -23485 -16078 -16972 8213 13878 49721
6338 49721 23682 -11346 -4334 -39138 -40944 -5579 16450 46775 17328 18597 5810 3539 -19704
6325 -19704 18428 6581 -789 16736 -2692 29543 63236 19942 27003 64724 64535 84617 77567
6312 77567 64862 48053 40744 -7511 18003 45998 25668 11780 32542 39973 36717 20604
6300 20604 17517 56612 42261 13180 -2680 5689 9810 -5531 -31678 -14704 -7011 -193 35148
6287 35148 -7964 27875 53023 36256 13154 -7558 -4982 38306 53922 65316 41538 38804
6275 38804 80205 56134 29400 4755 29005 -6712 17561 37543 39462 25167 24440 29360 56175
6262E6175M8889K8529p3953k4563p208r857N6774j2822P79j0460k7984L7624J8237
6249H0160m187M4533O977O436k9897l682q730M778n7555p409j8252j2670q749
6236h247K9621L8401k1537K3874l0043K613J7624k1141j769J3648j652J0822M837
6223E7051J6855k3502l7831K5803J0275P514J7001p731r376k6333l934k5833L3963
6210C3922l6416J7530L9948j0235l672j7848J838j8828L4496k1291M2760O5942
6198A28146J3270l7434j7145K8381j4516m937k0768l5980O3597k316J0232j3829
6186I6701n960m5883J0937O9803l3470j8621K9196p823M6202K9532j3884l5369
6174A21361R403m6000k0022L7093m7735L026P289k8484k4343K0461J2519l202
$$ plain form
6262 56175 105064 133593 59640 35077 27869 18012 74786 61964 62743 52283 24299 61923 80160
6249 80160 75973 120506 127483 133919 104022 100340 91610 96388 38833 31424 13172 502 -8247
6236 -8247 21374 59775 38238 62112 32069 34682 52306 31165 29396 43044 41392 52214 57051
6223 57051 73906 50404 12573 38376 48651 56165 73166 65435 56059 29726 25792 -41 33922
6210 33922 -2494 15036 54984 44749 41077 23229 25067 6239 40735 19444 62204 128146
6198 128146 141416 103982 86837 115218 100702 95765 74997 39017 102614 100298 110530 96701
6186 96701 90741 44858 55795 125598 92128 73507 102703 94880 141082 170614 156730 121361
6174 121361 130764 84764 64742 101835 54100 57126 64415 35931 11588 32049 44568 41366
6162D1366p463K2025K7115l1271k1972J7322n149j8785j0696J5175q522j928J6551
6149C3768J8633n311N460k6128p899K3126K032L7513M105m2946J240J273r764
6136C5102m4805J3595J6024j7608N8210k2198j5316R083R287N174k1990p17m1206
6123a7365M1750j9848K2260J1829j6539K8520K1505j7608k3095J5774L0976o8723
6111I436K4757l185j0537K3654q528J7665k4349J4685J8190R234j1424l809R336
6098F5125n1794K637M2310J2679n237M9585j4369j387O003o54m7625k9956o754
6085B0563L4186L339j2592M5104n0990L1205k5747j210M1139L9830J2462r845
6073A27444n2460n196r271J2860M8511k5383m0720K9773J1591k3731J9975j906
$$ plain form
6162 41366 33903 55928 83043 51772 29800 47122 41973 23188 12492 27667 19145 17217 33768
6149 33768 52401 47090 52550 26422 18523 41649 43681 81194 85299 42353 43593 44866 35102
6136 35102 -9703 3892 19916 2308 60518 38320 23004 32087 41374 46548 24558 23841 -17365
6123 -17365 24385 4537 26797 38626 22087 50607 72112 54504 31409 47183 78159 9436
6111 9436 34193 31008 20471 44125 35597 53262 28913 43598 61788 71022 59598 55789 65125
6098 65125 13331 15968 58278 70957 65720 115305 100936 99549 105552 104898 57273 27317 20563
6085 20563 54749 58088 45496 90600 39610 70815 45068 43858 84997 124827 137289 127444
6073 127444 74984 69788 60517 73377 121888 96505 55785 85558 97149 73418 93393 91487
6061I1487J251q586J9148M761j0482J654n0641J0944K0024J314L3847J5976Q791
6048A39488o82K3178p355m9077J6295K8392L0471K1336n272l3860J8081L1972
6036B12967j567l4224K1966J0786K3875l4740m57L6597M7497L6558N4319N2688
6024D26265O4734J8393M6474o770L8644P5630P9854P8776L969M5017O0064K1612
6012I52662J3047K6398O8125M2425l2820K3969J0771R6168Q1762L5542P6219O0541
6000A454809M0694J4728o373k2086p7844j12535j14550n3219q6602k2386r799
5989A004837J4632N20J7389n5139o8770Q098m7528l4499n2905j16869p2164k4758
5977E72844m9008q0959M020j2044k7082k2674n1653J0818m5806p915O1251o8656
$$ plain form
6061 91487 92738 84152 103300 108061 97579 99233 48592 59536 79560 80874 114721 130697 139488
6048 139488 138806 161984 154629 105552 121847 150239 180710 202046 196774 162914 180995 212967
6036 212967 211400 177176 199142 209928 233803 199063 198606 235203 282700 319258 373577 426265
6024 426265 490999 509392 555866 549096 587740 663370 743224 822000 825969 870986 931050 952662
6012 952662 965709 992107 1060232 1102657 1069837 1093806 1104577 1200745 1282507 1318049 1394268 1454809
6000 1454809 1495503 1510231 1503858 1481772 1403928 1291393 1176843 1123624 1037022 1014636 1004837
5989 1004837 1019469 1019989 1037378 982239 913469 921567 874039 839540 786635 669766 597602 572844
5977 572844 523836 442877 446897 434853 407771 385097 333444 344262 298456 290541 351792 283136
5965B83136k5260K3032l8257j8271j0514k0913o0373K2298K8423j4897K6433p169
5953A87668k6487m2258M1285O3077n2967j8048K7587j1039n9493J035L2921l2574
5941A10707J7064K9113j9957k8232J4586O451j225J3028k1937J9277l1157j0916
5929I6802p692j1086K8129r769j890j5011P0135J5117k6498k3210j1795K2506
5917A25738J5550o135l2661k9325J8923N5629m2737j4198N7215L5235m6527j8207
5905A18500J531k493O7321J8481o8626J8594K1028j5196k7138l5460J7458j4615
5893I9385K1756j6512n192o705K1307L0943o997k3257L7010m8221m2616K1232
5881H2133K9054k2021n8306L3178l01J2376K8360m376L3099k2573j6928m83J1256
$$ plain form
5965 283136 257876 280908 242651 224380 213866 192953 132580 154878 183301 168404 194837 187668
5953 187668 161181 118923 160208 223285 170318 152270 179857 168818 109325 110360 143281 110707
5941 110707 127771 156884 136927 108695 123281 129732 128507 141535 119598 138875 107718 96802
5929 96802 89110 78024 106153 96384 94494 79483 149618 164735 138237 115027 103232 125738
5917 125738 141288 135153 102492 73167 92090 147719 104982 90784 147999 183234 136707 118500
5905 118500 120031 117538 184859 203340 134714 153308 174336 159140 132002 96542 114000 99385
5893 99385 121141 104629 99437 92732 114039 144982 137985 114728 151738 103517 60901 82133
5881 82133 111187 89166 30860 64038 63737 76113 104473 100097 133196 110623 93695 93212 104468
5868A04468j569O813n948J3363L8991k4424Q207l3115l1363K1429Q779m7180J2233
5855G0684M3709R804l5122l806k7293J8647m5368Q681Q0338N787j4115J159p1318
5842D1787n136J4318l0445J6071J0086J4489k5250o28l0253M7082L3096p5009
5830A0208p426M5438Q761q900R044J9138L8239N383j6873m8553j301L9875N8498
5817A51531K197l8988j7474o470o091n773m7097L7269k9858j0200J5646k1887
5805B2805K2461R130N3035m998m2160J8402N0308k6025l1554M1795q147J707K3674
5792A30433n4781J5273M704j7812L5534k3977M3692l88p105J2741l8030l7668
5780F2616K1851N88l5374K5255J7838P3853j0580J2803l3484k3992j2676j2090
$$ plain form
5868 104468 102899 109712 103764 117127 156118 131694 139901 106786 75423 96852 105631 58451 70684
5855 70684 114393 124197 89075 85269 57976 76623 31255 39936 120274 126061 111946 113105 41787
5842 41787 36651 50969 20524 36595 46681 61170 35920 35292 5039 52121 85217 10208
5830 10208 2782 48220 56981 48081 57125 76263 114502 119885 103012 54459 53158 93033 151531
5817 151531 153728 114740 97266 90796 84705 78932 31835 69104 39246 29046 44692 22805
5805 22805 45266 54396 107431 102433 60273 78675 128983 102958 71404 113199 105052 106759 130433
5792 130433 75652 90925 95629 77817 113351 89374 133066 132678 125573 138314 100284 62616
5780 62616 84467 85055 49681 74936 92774 166627 156047 168850 135366 111374 98698 86608
5768H6608L0208o856J388m380L4169L246K6629n9879m774M2424J4225p2089O180
5755I7099K9723J4999K9385p026j7602J6999L9857k3490n4206l470O8866j378
5743A89756l9123n5512N6320O663O695L8661l1539p1925L1821J4512M2605k0877
5731A68057J7084l6100k0583M1681L9288p7479J5841k8592R588M3717O066J480
5719A80048J6278k0222J6833K0508J1133N1141o4639k6704K5097k8354j0925k1264
5707A48930j8772L0670M5650K2016L204R84l2751n850J0649L2282o305J8624n5689
5694A93642L2015M2181n5550k3105L9757L5962j2771p40J2120k4669J4809K2559
5682B76210J7362j9297M2125k074J8049j7610K9404J6303K8783M78K0700R445
$$ plain form
5768 86608 116816 109960 111348 106968 141137 144383 171012 111133 106359 148783 163008 90919 97099
5755 97099 126822 141821 171206 164180 146578 163577 203434 179944 125738 122268 191134 189756
5743 189756 150633 95121 151441 158104 164799 203460 171921 99996 131817 146329 188934 168057
5731 168057 185141 149041 128458 170139 209427 131948 147789 119197 128785 172502 178568 180048
5719 180048 196326 176104 192937 213445 224578 275719 211080 184376 209473 181119 170194 148930
5707 148930 130158 160828 206478 228494 231698 232682 199931 194081 204730 237012 230707 249331 193642
5694 193642 225657 267838 212288 189183 228940 264902 252131 251391 263511 238842 253651 276210
5682 276210 293572 274275 316400 314326 332375 314765 344169 360472 389255 389733 410433 419878
5670D19878j2343R462L916J1931J9351J1974K460M1022j9737m0334N927M6348
5658D99855k6139p8794O1306K6035J0364n437K0244j5031L9022k4635J4357K128
5646E23275q92K2223Q921L7375P632L8537R033J8188j7738K6273r624L1523p5504
5633F19222M442j9237j4670L5685J6998m8803o4653L9178J2657j5571k0300m2680
5621E02268N850K8817k9582k8568J930K9036M8584L3193K9637k2429M8099O1899
5609G08734L6171n1396q733L0584m6145k0991n5571L9414O450j4609K8428m1633
5597F10703m894J6128j2423K0974K079K8674M8758k9088L2073j1724j3783K4467
5585G11944J684K104k0191j4705L2061L3379k8125j2104l1251j0863j9295M483
$$ plain form
5670 419878 407535 416997 420913 432844 452195 464169 466629 507651 487914 447580 453507 499855
5658 499855 473716 394922 456228 482263 492627 487190 507434 492403 531425 506790 521147 523275
5646 523275 522383 544606 553527 590902 598534 637071 646104 664292 646554 672827 663203 694726 619222
5633 619222 623664 604427 589757 625442 642440 593637 528984 568162 580819 565248 544948 502268
5621 502268 508118 536935 507353 478785 480715 509751 558335 591528 621165 598736 646835 708734
5609 708734 744905 693509 684776 715360 669215 648224 592653 632067 638517 623908 652336 610703
5597 610703 605809 621937 609514 630488 632567 661241 709999 680911 712984 701260 687477 711944
5585 711944 713628 715732 695541 680836 712897 746276 718151 706047 674796 663933 644638 649121
5573F49121J1341Q9013J8965J562m813j1256K2891M6671p749k1039K202K0970
5561H17879M5493M5021L0185l5190j1983k1453L9170j6044K2941j8320k2414L1423
5549I06708J3913K2052O31L462M2946M702L1600J0009K7280M12P7275O6755L3353
5536A241098N9972K1721M9137L6420Q8214N9135K9917J0852L4015J03967j1713
5525A722735k3709J7354k6155K2853L5677L6854j1166K2822k84K833Q3112P2659
5513A955585O66P2939p108O2768Q7510L8498K5018M3618Q6658O7018L2473J03532
5501B569175O4084M3626P2145J6838M3451J4606N2650P539R93L0441K8822J8718
5489B963088L2329m2182l9340r0766n2382l2897n4313m7274K1536p5374p53K1661
$$ plain form
5573 649121 660462 749475 768440 770002 765189 753933 776824 823495 815746 794707 796909 817879
5561 817879 863372 908393 938578 903388 891405 869952 909122 893078 916019 897699 875285 906708
5549 906708 920621 942673 943304 946766 989712 994414 1026014 1036023 1063303 1063715 1140990 1207745 1241098
5536 1241098 1301070 1322791 1371928 1408348 1496562 1555697 1585614 1596466 1630481 1734448 1722735
5525 1722735 1699026 1716380 1690225 1713078 1748755 1785609 1774443 1797265 1796981 1799814 1882926 1955585
5513 1955585 1956251 2029190 2022082 2084850 2172360 2210858 2235876 2279494 2366152 2433170 2465643 2569175
5501 2569175 2633259 2676885 2749030 2765868 2809319 2823925 2876575 2884114 2885107 2915548 2944370 2963088
5489 2963088 2995417 2953235 2913895 2823129 2770747 2737850 2683537 2636263 2657799 2582425 2581672 2603333
5477B603333q768O0965J0130L8560L3267O6942P3751L4114P3837L0264N1692J1262
5465C079349P787J00890J8444j7535k103j9139k0080L3187l116l1021l7119l3876
5453C075668K3337J1371o8635Q642K3271K4547l43Q283P0203P4243P3816J15735
5441C440138N8792J06378Q6232J02817R1030J34344J01794J07908J16304J03316
5431D449053J25619J12451J25064J05098J19725J35563J54226J14988J53812J44711
5421E740310J52564J53600J44230K20999K12926K08510L11930K86467L10565L78473
5411H120574L65923L55517L85458M80700M89782N00709N97575O62213P42829Q36238
5401A3537518R45237J098323J287484J434002J527840J617916J902022K062206
$$ plain form
5477 2603333 2594565 2655530 2665660 2704220 2737487 2804429 2878180 2912294 2986131 3016395 3068087 3079349
5465 3079349 3087136 3188026 3206470 3188935 3186832 3167693 3147613 3180800 3177684 3146663 3109544 3075668
5453 3075668 3099005 3110376 3041741 3050383 3073654 3098201 3097858 3106141 3176344 3250587 3324403 3440138
5441 3440138 3498930 3605308 3691540 3794357 3885387 4019731 4121525 4229433 4345737 4449053
5431 4449053 4574672 4687123 4812187 4917285 5037010 5172573 5326799 5441787 5595599 5740310
5421 5740310 5892874 6046474 6190704 6411703 6624629 6833139 7145069 7431536 7742101 8120574
5411 8120574 8486497 8842014 9227472 9708172 10197954 10698663 11296238 11958451 12701280 13537518
5401 13537518 14482755 15581078 16868562 18302564 19830404 21448320 23350342 25412548
5393B5412548K221475K420578K520322K316509J926476J165312K77561o61570
5385C7599211j413306j728545j736537j605872j365466r92057p93473m28283j32052
5376B7403620J08716L82160P12682J030578J318418J639584J932865K272012K619756
5367C9420391K936621L302335L693561L874353M001776L906066L422772K569854
5359F7127729J179849m44300k153623l455752m279731m505782m330117m066915
5351D5071358l550401l049121k593285k136864j701875j284232r37586o63152
5343B9154842l68730q7076J27393L79439N43420Q00547J015169J210348J452379
5334C4227731J609004J717684J527196J015635K39742q02016j780192k492923
$$ plain form
5393 25412548 27634023 30054601 32574923 34891432 36817908 37983220 38260781 37599211
5385 37599211 36185905 34457360 32720823 31114951 29749485 28757428 27963955 27535672 27403620
5376 27403620 27512336 27894496 28607178 29637756 30956174 32595758 34528623 36800635 39420391
5367 39420391 42357012 45659347 49352908 53227261 57229037 61135103 64557875 67127729
5359 67127729 68307578 67863278 65709655 62253903 57974172 53468390 49138273 45071358
5351 45071358 41520957 38471836 35878551 33741687 32039812 30755580 29817994 29154842
5343 29154842 28786112 28699036 28826429 29205868 29749288 30549835 31565004 32775352 34227731
5334 34227731 35836735 37554419 39081615 40097250 40336992 39534976 37754784 35261861
5326C5261861k898144k900204k725300k478444k185803j889543j568611j400336
5318A7215476j203181j076842r23513p97833p10343o80855n97272n34168n61153
5309A0130316m77285m26682l88239l33657k91410k81868k47396k42872k49321
5300G191586k19965k32074k34718j92493k11220j94601j88832j75039j64604j47029
5290E231011j44048j09148j26057r5498j07247r8284p2893n7686r2332q562o1493
5279D257763o1774J2980r2933p1766n9738l8924q4735p0758j06084j05471q2445
5268C496115j36177j23998j24517j49650j02860n1087p2409o4957q9732o3993
5258B516735m5360r9107o732k2721q9603q262m5866l9j5252p4948m8524o0503
$$ plain form
5326 35261861 32363717 29463513 26738213 24259769 22073966 20184423 18615812 17215476
5318 17215476 16012295 14935453 14011940 13214107 12503764 11822909 11225637 10691469 10130316
5309 10130316 9653031 9226349 8838110 8504453 8213043 7931175 7683779 7440907 7191586
5300 7191586 6971621 6739547 6504829 6312336 6101116 5906515 5717683 5542644 5378040 5231011
5290 5231011 5086963 4977815 4851758 4756260 4649013 4550729 4477836 4420150 4327818 4319256 4257763
5279 4257763 4195989 4208969 4116036 4044270 3984532 3945608 3860873 3790115 3684031 3578560 3496115
5268 3496115 3359938 3235940 3111423 2961773 2858913 2807826 2735417 2670460 2580728 2516735
5258 2516735 2471375 2372268 2365536 2342815 2253212 2244950 2199084 2199045 2183793 2108845 2060321 1999818
5246A999818m7084l7059K283L1541q6110k6970j135J4469m3683o0913r638n0772
5234A684747l6892K349k3147m3185j5829q901K3768l2041L352J0915l5532l2515
5222A497089k5032L1412K8369K960K9750n9412j7637J9629M5376k9959L2595k3102
5210A532038j9128O307p587j4952M067J6492l6592j0425o0662K0988L4661J1955
5198A477162m4278r638l1548j0392o0569m8316O2351q799l0624j0922n6164l954
5186A224309k4474K4282J220J5553J4782O023K0925k8945j2198n9558j2231K6682
5174A196370N250o549R513k9545N6062J838L364j3202m0684K7720l3161J6081
5162A193057L4662k7919K7891j632M819m194k3119o553N8111M8263p866k3714
$$ plain form
5246 1999818 1952734 1915675 1917958 1949499 1863389 1836419 1835284 1849753 1806070 1745157 1735519 1684747
5234 1684747 1647855 1650204 1627057 1583872 1568043 1559142 1582910 1550869 1554221 1565136 1529604 1497089
5222 1497089 1472057 1503469 1531838 1534798 1564548 1505136 1487499 1507128 1552504 1522545 1555140 1532038
5210 1532038 1512910 1519217 1511630 1496678 1500745 1517237 1480645 1470220 1409558 1430546 1465207 1477162
5198 1477162 1432884 1423246 1391698 1381306 1320737 1272421 1334772 1325973 1295349 1284427 1228263 1224309
5186 1224309 1199835 1224117 1225337 1240890 1255672 1261695 1282620 1253675 1241477 1181919 1169688 1196370
5174 1196370 1201620 1195071 1204584 1175039 1231101 1232939 1236303 1223101 1182417 1210137 1176976 1193057
5162 1193057 1227719 1199800 1227691 1226059 1230878 1226684 1203565 1197012 1255123 1303386 1295520 1271806
5150A271806M1336P4083K5330M3288J2544n515N5091M8873L1537M3827K2332K9728
5138A694260L8649P2997L9883P6861M8441O7389P7131P3468P2449J04974Q4860
5127B451362P9598O2702N9083k3857l0051j8881o1498J1582r0508n4050j8039
5116B367443J747K2655l9065j8301m0069l871r3J6969P5707r138K5626L4163J9961
5103B453734R228O7571L2286P809N039J8417N0427j054q439M9973K0415n434J9714
5090B719686P9324N2237J06096R8732P0994J17713R1221J12546J89278J66158
5080C803985K04322K42417J52979J84609J65808K42191J44343J76627K41635K10232
5070E769148J17593J13255Q5375L5819M7932K2458K8359J0700J8423K4384Q0742
$$ plain form
5150 1271806 1313142 1387225 1412555 1455843 1468387 1462872 1517963 1566836 1598373 1642200 1664532 1694260
5138 1694260 1732909 1805906 1845789 1922650 1971091 2038480 2115611 2189079 2261528 2366502 2451362
5127 2451362 2530960 2593662 2652745 2628888 2598837 2579956 2518458 2530040 2439532 2385482 2367443
5116 2367443 2369190 2391845 2352780 2334479 2294410 2290539 2290446 2307415 2383122 2373984 2399610 2433773 2453734
5103 2453734 2462962 2530533 2562819 2570628 2575667 2594084 2644511 2643457 2635018 2684991 2705406 2699972 2719686
5090 2719686 2799010 2851247 2957343 3056075 3127069 3244782 3336003 3448549 3637827 3803985
5080 3803985 4008307 4250724 4403703 4588312 4754120 4996311 5140654 5317281 5558916 5769148
5070 5769148 5886741 5999996 6085371 6121190 6169122 6191580 6219939 6230639 6249062 6273446 6354188
5059F354188R8551R9839P5210J06580P9394J59536J61129Q0137J47812K04735
5049G567111J31300J63337J71405J87396J89733J96893K36206K22100K60663L25636
5039I651780L09900L05907L23613M21217M54861N08237N78653N74817O58438P17750
5029A4505173P91192Q32552R41848R81594J098988J134097J281275J534553J659676
5020B4760948J856145K103643K307053K698683L102230L508881M006058M560134
5012D8903775N098613N662277O214805O713215P041578P180312P088777O648314
5004A00551666N948107M808997L022327P57884j791447m012579n618261o444276
4996I7222418o835851o959024o898458o680730o272373n851630n364799m861975
$$ plain form
5059 6354188 6452739 6552578 6627788 6734368 6813762 6973298 7134427 7214564 7362376 7567111
5049 7567111 7698411 7861748 8033153 8220549 8410282 8607175 8843381 9065481 9326144 9651780
5039 9651780 9961680 10267587 10591200 11012417 11467278 11975515 12554168 13128985 13787423 14505173
5029 14505173 15296365 16128917 17070765 18052359 19151347 20285444 21566719 23101272 24760948
5020 24760948 26617093 28720736 31027789 33726472 36828702 40337583 44343641 48903775
5012 48903775 54002388 59664665 65879470 72592685 79634263 86814575 93903352 100551666
5004 100551666 106499773 111308770 114331097 115088981 113297534 109284955 103666694 97222418
4996 97222418 90386567 83427543 76529085 69848355 63575982 57724352 52359553 47497578
4988D7497578m269851l687566l216938k844362k405134k088950j887933j638816
4980B5458028j407862j224617j097189r18552p75078o21831m89008m88786m32894
4971A8002211l61246k91475k51246k65715l00843l47481l51933m07404m49272
4962A4975596n65211o63659p78172p46500p56237o11579n71048m76207m67544
4953I339439m20522l43405l30707l09409l04236k13853k45086k36345k34099j57829
4943F543948k11576j46075j81086j94960j24857k6930j12445j35773r8788p3409
4933E238049p8911j13439k38662j26655j60734r7194j04607q7903j19304o9329
4923D041311j09227o2462n0448o2217n2406l0995n7646l9818j3343l9509m5321
$$ plain form
4988 47497578 43227727 39540161 36323223 33478861 31073727 28984777 27096844 25458028
4980 25458028 24050166 22825549 21728360 20809808 20034730 19412899 18923891 18435105 18002211
4971 18002211 17640965 17349490 17098244 16832529 16531686 16184205 15832272 15424868 14975596
4962 14975596 14410385 13746726 12968554 12222054 11465817 10854238 10283190 9806983 9339439
4953 9339439 8918917 8575512 8244805 7935396 7631160 7417307 7172221 6935876 6701777 6543948
4943 6543948 6332372 6186297 6005211 5810251 5685394 5658464 5546019 5410246 5311458 5238049
4933 5238049 5159138 5045699 4807037 4680382 4519648 4422454 4317847 4229944 4110640 4041311
4923 4041311 3932084 3869622 3819174 3756957 3704551 3673556 3615910 3576092 3562749 3523240 3477919
4912C477919p8287J646j17316p6948k8766q9018k4292L5177p0746m7044l7631
4901B944694p1926n0541L965R065k4070m2444j4688k1165l6322L837j1911l6207
4889B652287j4244j1867j5252P642K0721M2283M1895K9868L4348j4186l3756j04796
4877B634943r1928m3824q1265q4979o0226n6273n0649j08135o2376J9913l8819
4866A976382n3618j4852n4406m579O607k259j2378O114r272M8191j0397m0188
4854A835345q4008j3793R847p7861m7053n1433L20k5457n4204J2803j2258n8964
4842A433284o197j4605m4448J9554N690K549m9495k4976K796R455J6687n6099
4830A294195l8514r799l5649L032r578J774l2045m7046J6053J5439p228n622L61
$$ plain form
4912 3477919 3399632 3401278 3283962 3207014 3178248 3089230 3064938 3100115 3029369 2982325 2944694
4901 2944694 2872768 2822227 2826192 2835257 2811187 2768743 2754055 2732890 2696568 2700405 2688494 2652287
4889 2652287 2638043 2626176 2610924 2618566 2639287 2681570 2723465 2753333 2787681 2773495 2739739 2634943
4877 2634943 2543015 2499191 2417926 2332947 2272721 2216448 2165799 2057664 1995288 2015201 1976382
4866 1976382 1922764 1907912 1853506 1848927 1855534 1853275 1840897 1847011 1837739 1885930 1875533 1835345
4854 1835345 1751337 1737544 1747391 1669530 1622477 1571044 1571364 1545907 1491703 1504506 1492248 1433284
4842 1433284 1427087 1412482 1368034 1387588 1393278 1395827 1346332 1321356 1324152 1333607 1350294 1294195
4830 1294195 1255681 1245882 1210233 1213265 1203687 1205461 1173416 1126370 1142423 1157862 1150634 1145012 1145373
4817A145373k2976J3646m1214J5198j1234m1170j3351M6445M740q5469p396k4742
4805I77850J2246j7998l3862j9581K6495K6357L0816l7657L9143J1141M7739K9026
4793A091715m66J2026K0654M6997J8293K9476M3839K5022K4860N5269R3309P0296
4781A531290L8499J06154P6372R3539R6622J25869J06340O4387Q0376R6681L5574
4770B451703M4984L1829O1433k4531N2631N1783L3669l541J09475J19934K13186
4759C142555J73765L08807M57279N97183O48822N27589j08012q05549o69645o81293
4749C591501n12413l91722l12385k29953j37360o6144m4382j02744k9732l1387
4739A733279M0246j0793p7684j685q56r131K4748K8777j2262J6568K9643O7362
$$ plain form
4817 1145373 1122397 1136043 1094829 1110027 1098793 1057623 1044272 1090717 1095457 1009988 1002592 977850
4805 977850 990096 972098 938236 918655 945150 971507 1002323 964666 1003809 1014950 1062689 1091715
4793 1091715 1091249 1103275 1123929 1170926 1189219 1218695 1262534 1287556 1312416 1367685 1460994 1531290
4781 1531290 1569789 1675943 1752315 1845854 1942476 2068345 2174685 2239072 2319448 2416129 2451703
4770 2451703 2496687 2528516 2589949 2565418 2618049 2669832 2703501 2699960 2809435 2929369 3142555
4759 3142555 3316320 3625127 4082406 4679589 5328411 5856000 5747988 4942439 4272794 3591501
4749 3591501 3079088 2687366 2374981 2145028 2007668 1941524 1897142 1794398 1764666 1733279
4739 1733279 1773525 1762732 1685048 1683363 1682507 1673376 1698124 1726901 1714639 1731207 1760850 1828212
4727A828212r389J19445L7100L0881m8432P430Q7752K9113J5047k9038j3321L2256
4715B087056N645k5287l7311j10808q3875j18472q1784n9367o278p3506j01502
4704A394511j02128n7234k681n0060l0904L162j0148n8701k4448k4023n2371O937
4692I91912K595j7913p458l3149K0847K8710L1340j2929m4343k9522N2206M826
4680I87122r91M0871k6922j263J9544J1340j2887J1710L8858M149J3871q15j2753
4667A071834k7762J4745K1035M5397K5661m6637R914L8170K3489J1699K8796L7411
4655A253752n52m2382K0945L9108P3838J15p407k6407k4796R685J0931L9754k390
4642A344194j4933o818k4709M9769J8150M5608L43k468M1811J5378M4467L9581
$$ plain form
4727 1828212 1818823 1938268 1975368 2006249 1957817 1965247 2052999 2082112 2097159 2068121 2054800 2087056
4715 2087056 2092701 2067414 2030103 1919295 1835420 1716948 1635164 1575797 1569519 1496013 1394511
4704 1394511 1292383 1235149 1232468 1182408 1151504 1154666 1144518 1085817 1061369 1037346 984975 991912
4692 991912 994507 976594 969136 935987 956834 985544 1016884 1003955 959612 930090 982296 987122
4680 987122 986131 1027002 1000080 998817 1018361 1029701 1016814 1028524 1067382 1071531 1085402 1084587 1071834
4667 1071834 1044072 1058817 1079852 1125249 1150910 1104273 1114187 1152357 1175846 1187545 1216341 1253752
4655 1253752 1253200 1210818 1231763 1270871 1344709 1344824 1337417 1311010 1286214 1295899 1306830 1346584 1344194
4642 1344194 1329261 1322443 1297734 1347503 1365653 1411261 1411604 1409136 1450947 1466325 1510792 1550373
4630A550373m6387m9335k3966q1000L914j7688r280L9936k9348n5790L8788Q414
4618A328631o7962k8137K8911L4338k5106J0877J2920k2822l54N9369j3497k8248
4606A288920p999J7961L6541m5404n250j4026o0469L6344M1943K1687o860M3356
4594A346744J112k1933J3319L234J9108j8991P150k1107L4157K2240J8223J2091
4582A415347j3991J5818L294O0390k601J0688q343K2135K1712k1361J2047M334
4570A519469K2671L5333o9388l604M9804J9448r489r790l95L9968K4295j9686
4558A598636p853J4597K9431K047O374K202L2820j3883m3303M0977O0583l4469
4546A688159K3289l7428k0532L877J1263J9170k1161l0822R9113l3325O2955L9235
$$ plain form
4630 1550373 1503986 1454651 1430685 1349685 1353599 1335911 1326631 1366567 1337219 1281429 1320217 1328631
4618 1328631 1260669 1232532 1261443 1295781 1270675 1281552 1294472 1271650 1271296 1330665 1317168 1288920
4606 1288920 1280921 1298882 1335423 1290019 1284769 1270743 1210274 1246618 1288561 1310248 1303388 1346744
4594 1346744 1347856 1325923 1339242 1342476 1361584 1342593 1349743 1328636 1362793 1385033 1403256 1415347
4582 1415347 1401356 1417174 1420468 1480858 1478257 1488945 1480602 1502737 1524449 1503088 1515135 1519469
4570 1519469 1542140 1577473 1508085 1504481 1554285 1573733 1564244 1554454 1554059 1594027 1618322 1598636
4558 1598636 1590783 1605380 1634811 1636858 1643232 1645434 1678254 1664371 1621068 1662045 1722628 1688159
4546 1688159 1711448 1674020 1653488 1657365 1668628 1687798 1666637 1635815 1734928 1701603 1764558 1803793
4534A803793k6659J3337J3250N4880K5281K8182l870J9499O1445L2898J4712M6333
4522B083081M5029l356j1587N7916L2383Q588O2966L1522N7740M1039K4722J2856
4510B442899M6058M9625N1862L1485M8829J05478J9511N9133P5536P6573J7567
4499C024556M321P2109Q7168N4601M0540R7453O6237L5565R3770R3355Q4273N7294
4487C811242M2405O1857J16989J20355Q1497Q4151Q7180M3591k401L2813P6865
4476D556544N0338J16943P8661O9014J01792O7809R0330J12690J18278Q5872Q9755
4465E538026Q4996P9192O3064Q8385M7953R845O5234O5590Q9269J32138J45395
4454F409087J49760K26832J39896J80946K51548K50735K56963K90706K36151K68769
$$ plain form
4534 1803793 1777134 1790471 1803721 1858601 1883882 1912064 1908194 1927693 1989138 2022036 2036748 2083081
4522 2083081 2128110 2124754 2113167 2171083 2203466 2212054 2275020 2306542 2364282 2405321 2430043 2442899
4510 2442899 2488957 2538582 2590444 2621929 2670758 2776236 2795747 2854880 2930416 3006989 3024556
4499 3024556 3028877 3100986 3188154 3242755 3283295 3380748 3446985 3482550 3576320 3669675 3753948 3811242
4487 3811242 3853647 3915504 4032493 4152848 4234345 4318496 4405676 4449267 4446866 4479679 4556544
4476 4556544 4606882 4723825 4802486 4871500 4973292 5041101 5131431 5244121 5362399 5448271 5538026
4465 5538026 5623022 5702214 5765278 5853663 5901616 5911461 5976695 6042285 6131554 6263692 6409087
4454 6409087 6558847 6785679 6925575 7106521 7358069 7608804 7865767 8156473 8392624 8661393
4444H661393K87474L34666L97214L29315L42349L82443L65846L71227M52244M48620
4434A2372791M39507M37234L75067L63038M20604M24707M56398M86837M85996
4425A6262179N52372N31390N63746N77138O15406O26176N91094O40464O42412
4416B1602377O04124O34337O89994P03989O88076P16610P52044Q07712Q34928
4407B8034191R68830J038738J147295J174045J181469J261182J364961J564329
4399C7735040J761446J994826K192235K531672K763007L067928L286134L428193
4391E8760481L570656L758454L879314M078458M272058M514172M591573M619615
4383I2044781M656933M767055N008546N342259N724191O038159O344215O481190
$$ plain form
4444 8661393 8948867 9283533 9680747 10010062 10352411 10734854 11100700 11471927 11924171 12372791
4434 12372791 12812298 13249532 13624599 13987637 14408241 14832948 15289346 15776183 16262179
4425 16262179 16814551 17345941 17909687 18486825 19102231 19728407 20319501 20959965 21602377
4416 21602377 22206501 22840838 23530832 24234821 24922897 25639507 26391551 27199263 28034191
4407 28034191 29003021 30041759 31189054 32363099 33544568 34805750 36170711 37735040
4399 37735040 39496486 41491312 43683547 46215219 48978226 52046154 55332288 58760481
4391 58760481 62331137 66089591 69968905 74047363 78319421 82833593 87425166 92044781
4383 92044781 96701714 101468769 106477315 111819574 117543765 123581924 129926139 136407329
4375A36407329O379008N886465N140927M082220K704001J002742j002305l022552
4367A57577835n123940o790975p755468p909914p314427o324922n113133m039214
4359A07205842l381496l427766l984474m988333n857011o298438o333100n910668
4351F7024556n322720m606634l901340l414143k934988k505002k144283j807573
4343D0387873j564223j302057j168200j023525r50346q64950q83512r64488r97865
4334C0668707j027729j018433j014222r54201r42393q83200q34631p78237p14030
4325B2501631o20305o05388n88692m88692n50793n94081n16868n97734o16552
4316A7322526n75391n95780n14509m65669m40273m22045l73586l91274l34535
$$ plain form
4375 136407329 142786337 148672802 153813729 157895949 160599950 161602692 160600387 157577835
4367 157577835 152453895 145662920 137907452 129997538 122683111 116358189 111245056 107205842
4359 107205842 103824346 100396580 96412106 91423773 85566762 79268324 72935224 67024556
4351 67024556 61701836 57095202 53193862 49779719 46844731 44339729 42195446 40387873
4343 40387873 38823650 37521593 36353393 35329868 34379522 33514572 32631060 31666572 30668707
4334 30668707 29640978 28622545 27608323 26654122 25711729 24828529 23993898 23215661 22501631
4325 22501631 21881326 21275938 20687246 20198554 19647761 19053680 18536812 17939078 17322526
4316 17322526 16747135 16151355 15636846 15171177 14730904 14308859 13935273 13543999 13209464
4307A3209464k84237k15451j88054k54763j28855j16254j29189j40901j53924
4298A1597836j45433j61379j02188j25977j53584j40764j36241r1544l3781o8905
4288A0438040p9018n9495l1136k7320j4894j8069m0511o5348k2498J9458p4524
4277A0024685L2236J4872K9508O1336J21860J31379J42743J90646K31019K43586
4267A1223870J00753R8887J48778J55119J49040J89358K29763K03539K21132J73717
4257A2893956J04530l4042n7550j82287j17622j45501k25658j82664j71076j53242
4247A1728844j17691q3029r7255o8946q8591n7814J0276j0002q096K7097N0728
4236A1285521N6879K7764N7426N0159M8053P4942P2261P6032J6934L8040J24123
$$ plain form
4307 13209464 12925227 12709776 12521722 12266959 12138104 12021850 11892661 11751760 11597836
4298 11597836 11452403 11291024 11188836 11062859 10909275 10768511 10632270 10540726 10506945 10438040
4288 10438040 10359022 10299527 10268391 10241071 10226177 10208108 10167597 10102249 10079751 10099209 10024685
4277 10024685 10056921 10071793 10101301 10162637 10284497 10415876 10558619 10749265 10980284 11223870
4267 11223870 11324623 11423510 11572288 11727407 11876447 12065805 12295568 12499107 12720239 12893956
4257 12893956 12998486 12964444 12906894 12724607 12606985 12461484 12235826 12053162 11882086 11728844
4247 11728844 11611153 11528124 11430869 11361923 11273332 11215518 11225794 11215792 11207696 11234793 11285521
4236 11285521 11342400 11370164 11427590 11477749 11525802 11600744 11673005 11749037 11765971 11804011 11928134
4225A1928134J33063J61717K13553K28271K11493L11059L12401L89759M16292
4216A4305742M88591N57008N35498N47145P10260O72408P64485R11461J010603
4207B0503201J062451J180327J286317J436308J632077J747918J914342K119187
4199C2882128K350465K558682K576209K532615K145524J490261O00190l71276
4191D6764798j066459j479143j585795j476355j220612q25559n42336k03101Q7316
4182C8452754L86950P25306J020722J348867J663245K016440K259938K612420
4174E0486642K827101L204370L566324M072989M585144N051710N326431N113739
4166H4234450M348668K548416K66284j988113l668031m335938m219095l653527
$$ plain form
4225 11928134 12061197 12222914 12436467 12664738 12876231 13187290 13499691 13889450 14305742
4216 14305742 14794333 15351341 15886839 16433984 17144244 17816652 18581137 19492598 20503201
4207 20503201 21565652 22745979 24032296 25468604 27100681 28848599 30762941 32882128
4199 32882128 35232593 37791275 40367484 42900099 45045623 46535884 47136074 46764798
4191 46764798 45698339 44219196 42633401 41157046 39936434 39110875 38568539 38365438 38452754
4182 38452754 38839704 39565010 40585732 41934599 43597844 45614284 47874222 50486642
4174 50486642 53313743 56518113 60084437 64157426 68742570 73794280 79120711 84234450
4166 84234450 88583118 91131534 91397818 89409705 85741674 81405736 77186641 73533114
4158G3533114k843515k044915j243166n82575m3946N94365J156133J725531K403330
4149G2654356L169654M034311N143714O134236P139016Q106150R038555J0337544
4141A25757536J1740009J3341139J5199617J6898157J8477368J9400743J8639243
4134B39453812J4413240N267916p806541j9351090k4950615k5681863k3666079
4127A57678780k0041151j6277764j3124377j0540406q585183p103370n999157
4120G6007372n122174m457221l881426l519840l182268k941664k607442k305574
4112D7989763j984760j623869j308699r11890o51786n11593p22380j034689j290805
4103C7949292j358751j316760j067886q86614p19111o53691n72263o52310r37643
$$ plain form
4158 73533114 70689599 68644684 67401518 66818943 66774997 67369362 68525495 70251026 72654356
4149 72654356 75824010 79858321 85002035 91136271 98275287 106381437 115419992 125757536
4141 125757536 137497545 150838684 166038301 182936458 201413826 220814569 239453812
4134 239453812 253867052 259134968 251328427 231977337 207026722 181344859 157678780
4127 157678780 137637629 121359865 108235488 97695082 89109899 82006529 76007372
4120 76007372 70885198 66427977 62546551 59026711 55844443 52902779 50295337 47989763
4112 47989763 46005003 44381134 43072435 42160545 41508759 40997166 40274786 39240097 37949292
4103 37949292 36590541 35273781 34205895 33319281 32600170 31946479 31374216 30721906 29784263
4094B9784263j221466j373580j473769j418583j334682j136990j001926r09548
4086A9913719q01407o92221o16657o01177m90746m37255m37502m60140l74255
4077A5002359m05968m19506l88080m10830l99631l61527l91986l58543l61698
4068A1504590l31222l51145k89412k16204k00801j96966j51931j31363j47408
4059I488138j19882j83973j37902j39647j98080q1412j22786r8186j00381p1260
4049H234629p7482o0920j19497j39559j11898j90240j87127j78897k08050j99409
4039F761550j91884j12968j92617j71622j87008j76353p5984o8035q1727m8355
4029E454997q9331q6307r931l4687l875q9371p2357m0935R305M987l1057l5925
$$ plain form
4094 29784263 28562797 27189217 25715448 24296865 22962183 21825193 20823267 19913719
4086 19913719 19112312 18420091 17803434 17202257 16711511 16274256 15836754 15376614 15002359
4077 15002359 14596391 14176885 13788805 13377975 12978344 12616817 12224831 11866288 11504590
4068 11504590 11173368 10822223 10532811 10316607 10115806 9918840 9766909 9635546 9488138
4059 9488138 9368256 9184283 9046381 8906734 8708654 8627242 8504456 8406270 8305889 8234629
4049 8234629 8157147 8096227 7976730 7837171 7725273 7535033 7347906 7169009 6960959 6761550
4039 6761550 6569666 6456698 6264081 6092459 5905451 5729098 5653114 5585079 5503352 5454997
4029 5454997 5365666 5279359 5269428 5234741 5230866 5141495 5069138 5028203 5037508 5042495 5011438 4975513
4017D975513m8418k1508j16459l3864l1326q4177o6921o4195k5218k9578q4527
4006D369322n4167k1630j0346j8215l3569k173m0723r435k563K0621o729j0083
3994D180310l0715J015M467K1185o4803O79R180m9573q749n7224j9758J0600l86
3981C996228n3179j4282K7720m7724j3185m236K5413R130k6156M1692k0644P33
3969C921510j8757J1453j04228j19581j19496j18138q4893m6226q8501k6035n0416
3958C156692p3884n4022m1297J6267p1697n0198j4793n3110m3971K563k7555j427
3946B743568J4849m9812m7802K2395M499j2479l7145k3230o8286l0078q8960J202
3934B428721K7011L2608K9896O6105J802L3685Q1739K7549k208N3191L5597q371
$$ plain form
4017 4975513 4927095 4905587 4789128 4755264 4723938 4639761 4572840 4508645 4483427 4453849 4369322
4006 4369322 4315155 4293525 4283179 4264964 4231395 4229222 4188499 4179064 4176501 4197122 4190393 4180310
3994 4180310 4149595 4150610 4155077 4176262 4111459 4112138 4121318 4071745 4062996 4005772 3986014 3996614 3996228
3981 3996228 3943049 3928767 3956487 3908763 3895578 3891342 3916755 3925885 3899729 3941421 3920777 3921510
3969 3921510 3902753 3914206 3809978 3690397 3570901 3452763 3367870 3321644 3233143 3207108 3156692
3958 3156692 3082808 3028786 2987489 3003756 2932059 2881861 2867068 2813958 2769987 2772550 2744995 2743568
3946 2743568 2758417 2708605 2660803 2683198 2687697 2675218 2638073 2614843 2546557 2516479 2427519 2428721
3934 2428721 2455732 2488340 2518236 2584341 2586143 2619828 2701567 2729116 2726908 2780099 2815696 2807325
3922B807325N386J979K3510m9309j5159M917j0327J1275l0890K8014M284K0032
3910B801037P9271J6674N622n969P631J2204k897O6465O7979J03639P7068M1239
3898C269963O5389M2046N5631O4830Q0491N0212J26982K3310J6872Q5911M0645
3887C922282N7889J1602J6038J6570m8703N8459N7510k2175J2024N2498l1057
3876D102937o391P090m7569J7358N0496K0153k978Q4842O8339P7407N8680N0892
3864D481256O8774M4728L3242K5474O7528K5710P751p6912p8670r6327l6973q2443
3852D383138n6644J0393J9909R297j859n2440q126m055j788L332l9008N058K4886
3839D292093O980o7709K1650j9799O0698K9073L4431L6024j11L9241M648M6959
$$ plain form
3922 2807325 2812711 2814690 2838200 2788891 2773732 2778649 2768322 2779597 2748707 2776721 2781005 2801037
3910 2801037 2880308 2896982 2902604 2896635 2904266 2916470 2913573 2980038 3048017 3151656 3228724 3269963
3898 3269963 3335352 3377398 3433029 3497859 3578350 3628562 3755544 3778854 3795726 3881637 3922282
3887 3922282 3980171 3991773 4007811 4024381 3975678 4034137 4091647 4069472 4081496 4133994 4102937
3876 4102937 4096546 4103636 4056067 4073425 4123921 4144074 4141096 4225938 4294277 4371684 4430364 4481256
3864 4481256 4550030 4594758 4628000 4653474 4721002 4746712 4754463 4677551 4598881 4502554 4465581 4383138
3852 4383138 4326494 4336887 4356796 4366093 4364234 4311794 4303668 4299613 4297825 4301157 4262149 4267207 4292093
3839 4292093 4299073 4231364 4253014 4233215 4293913 4322986 4357417 4393441 4393330 4432571 4437219 4484178
3827D484178P9925O4159R2094O7181R9193M7123O7201J07129L1697N5845O6871
3816E262596J20526P5550N2632J26306J18661P3431J04924O0268K9682K4053O1465
3805F110094P1524J09679J24524J45243J21195J56938J09824J52615J30924J74451
3795G407011J56909J56210J98443J47495K11650K06868K03229J62783K24835K45269
3785I320702K42687K20299K06987K20471K70153K74621L00994K97255L49331L80016
3775A2083516L73089L94642M25622M05831M85052N34282N47076O00846N98199
3766A6448155P01221P63248Q33011Q89094Q93077R55999J038946J157878J245909
3757B4926538J346419J410278J514795J583053J713651J816536J910563K113305
$$ plain form
3827 4484178 4564103 4628262 4720356 4787537 4886730 4933853 5001054 5108183 5139880 5195725 5262596
3816 5262596 5383122 5458672 5511304 5637610 5756271 5829702 5934626 5994894 6024576 6048629 6110094
3805 6110094 6181618 6291297 6415821 6561064 6682259 6839197 6949021 7101636 7232560 7407011
3795 7407011 7563920 7720130 7918573 8066068 8277718 8484586 8687815 8850598 9075433 9320702
3785 9320702 9563389 9783688 9990675 10211146 10481299 10755920 11056914 11354169 11703500 12083516
3775 12083516 12456605 12851247 13276869 13682700 14167752 14702034 15249110 15849956 16448155
3766 16448155 17149376 17912624 18745635 19634729 20527806 21483805 22522751 23680629 24926538
3757 24926538 26272957 27683235 29198030 30781083 32494734 34311270 36221833 38335138
3749C8335138K141924K185454K289676K426327K466981K485708K601447K653284
3741E7585939K712665K770726K834083K864852K834028K851601K812801K684411
3733G9951106K572186K471334K288166K203436K082354J898089J730206J663707
3725I6860584J573116J307377J096050Q33308N86424K17766j33465l80501o26250
3716A01334409q55422j021154j215463j391579j468510j631900j818347k025307
3708H9906727k187355k374118k499660k646464k702692k772974k778052k704621
3700F9240791k707220k639459k639970k551555k553266k459971k375883k376585
3692D8936882k304744k297695k208782k076286j984458j850282j749876j661891
$$ plain form
3749 38335138 40477062 42662516 44952192 47378519 49845500 52331208 54932655 57585939
3741 57585939 60298604 63069330 65903413 68768265 71602293 74453894 77266695 79951106
3733 79951106 82523292 84994626 87282792 89486228 91568582 93466671 95196877 96860584
3725 96860584 98433700 99741077 100837127 101670435 102256859 102474625 102341160 101960659 101334409
3716 101334409 100478987 99457833 98242370 96850791 95382281 93750381 91932034 89906727
3708 89906727 87719372 85345254 82845594 80199130 77496438 74723464 71945412 69240791
3700 69240791 66533571 63894112 61254142 58702587 56149321 53689350 51313467 48936882
3692 48936882 46632138 44334443 42125661 40049375 38064917 36214635 34464759 32802868
3684C2802868j525306j439294j278119j228782j179512j123290r70396r48980
3676B3109189q68671p69160p51258o41911n90417n24060n01205m26204m20524
3667A7615779l70393k98741k46595k83211k61173k64048k32976j94529k24879
3658A5239234k00076j52149j54006j04539j13780q5715j01588j16847j09698j04131
3648A3996705l4574L6999k0169J6950O0095L8469J09957L5505J22001J09770J08570
3637A4580278R5170J37847J80241J15832J66572K88696K64298L07547L18185L28454
3627A6783120M05772M57257N35085N37629O48516O39686O47500O84285O00802
3618B1939652M77570L21630J03715L4748n6563j47072j00509j30525J9666J30373
$$ plain form
3684 32802868 31277562 29838268 28560149 27331367 26151855 25028565 24058169 23109189
3676 23109189 22240518 21471358 20720100 20078189 19487772 18963712 18462507 18036303 17615779
3667 17615779 17245386 16946645 16700050 16416839 16155666 15891618 15658642 15464113 15239234
3658 15239234 15039158 14887009 14733003 14628464 14514684 14428969 14327381 14210534 14100836 13996705
3648 13996705 13962131 13999130 13978961 13995911 14056006 14094475 14204432 14239937 14361938 14471708 14580278
3637 14580278 14675448 14813295 14993536 15109368 15275940 15564636 15828934 16136481 16454666 16783120
3627 16783120 17188892 17646149 18181234 18718863 19367379 20007065 20654565 21338850 21939652
3618 21939652 22417222 22738852 22842567 22877315 22820752 22673680 22573171 22442646 22462312 22592685
3608B2592685J97212L17694L40853N10793O07684P22122Q84892R98009J101065
3599B8273009J181572J359250J571807J638309J793886K021979K041805J999872
3591D1881489J815321J390419Q29300J78658n19848j065753j416959j549558j548492
3582C9994577j359562j172283r37323p07653m94001k57654P0503K64255M96423
3573C5897282P45739R82745J153143J278444J560220J789635J985036K142067
3565D7534311K347505K401287K395479K029843J385480M12824o04672j505748
3557E6396309k172838k554452k662020k543012k355659k096145j823211j573498
3549C8615474j249489j004301p58360n26219k99746j09471L3783K41446L73481
$$ plain form
3608 22592685 22789897 23107591 23448444 23959237 24566921 25289043 26173935 27171944 28273009
3599 28273009 29454581 30813831 32385638 34023947 35817833 37839812 39881617 41881489
3591 41881489 43696810 45087229 45916529 46095187 45575339 44509586 43092627 41543069 39994577
3582 39994577 38635015 37462732 36525409 35817756 35323755 35066101 35136604 35400859 35897282
3573 35897282 36643021 37625766 38778909 40057353 41617573 43407208 45392244 47534311
3565 47534311 49881816 52283103 54678582 56708425 58093905 58506729 57902057 56396309
3557 56396309 54223471 51669019 49006999 46463987 44108328 42012183 40188972 38615474
3549 38615474 37365985 36361684 35603324 35077105 34777359 34667888 34701671 34943117 35316598
3540C5316598N92726P56080Q59356R96728J170009J152395J061445Q83166M46201
3531D3234704j41756p75912j345613j726489j982589k004131j896439j750766
3523C1611009j553549j325379j202978j035395q40288o80968o04955n01163l92178
3514B3474156l24392k71155j62518q7016k2230O6265Q1644J13276J80310J25080
3504B3173420P1062J4403j20638k68542l83912n02769n52169m94031m45320m03668
3494B0087836l42171l31850k39428k12477j51063j34523l1175k0317j0461J7345
3484A8631716Q53K0028N7304J47154P4488J43498J04526J94159J98644J74074
3474A9746444K11800L11713K56481K75537L01626L12168L55011L62132M12920
$$ plain form
3540 35316598 35909324 36665404 37524760 38521488 39691497 40843892 41905337 42788503 43234704
3531 43234704 43092948 42317036 40971423 39244934 37262345 35258214 33361775 31611009
3523 31611009 30057460 28732081 27529103 26493708 25653420 24972452 24367497 23866334 23474156
3514 23474156 23149764 22878609 22716091 22629075 22606845 22673110 22754754 22868030 23048340 23173420
3504 23173420 23244482 23258885 23138247 22869705 22485793 21983024 21430855 20936824 20491504 20087836
3494 20087836 19745665 19413815 19174387 18961910 18810847 18676324 18645149 18624832 18614371 18631716
3484 18631716 18632569 18652597 18709901 18857055 18931543 19075041 19179567 19373726 19572370 19746444
3474 19746444 19958244 20269957 20526438 20801975 21103601 21415769 21770780 22132912 22545832
3465B2545832M29143M61839N58945N92901O94117O73446P66047Q89265Q63023
3456B8474558R70021J045668J074503J190334J220618J239837J219278J194364
3448C7629181J205647J113826J063495R91859R44919R09853R12771R02267Q32387
3439D6506205P97510P08634O21570N77434L39810K41408J14260q297l2887q0469
3429D9785178l6974n1206O7084J11459J83419J99292K57269L05760L11716M31345
3419E1564342M86363O51029P95218R75671J112708J314905J618475J878208K046319
3410F2443238K312871K568418K790328L116945L412029L643909L869756M082569
3402H8240063M332103M393747M375926M450763M430250M324757M325370M366353
$$ plain form
3465 22545832 22974975 23436814 23995759 24588660 25282777 25956223 26722270 27611535 28474558
3456 28474558 29444579 30490247 31564750 32755084 33975702 35215539 36434817 37629181
3448 37629181 38834828 39948654 41012149 42004008 42948927 43858780 44771551 45673818 46506205
3439 46506205 47303715 48012349 48633919 49211353 49551163 49792571 49906831 49898534 49865647 49785178
3429 49785178 49748204 49696998 49764082 49875541 50058960 50258252 50515521 50821281 51132997 51564342
3419 51564342 52050705 52701734 53496952 54472623 55585331 56900236 58518711 60396919 62443238
3410 62443238 64756109 67324527 70114855 73231800 76643829 80287738 84157494 88240063
3402 88240063 92572166 96965913 101341839 105792602 110222852 114547609 118872979 123239332
3394A23239332M366652M436923M442354M412687M381705M212456M028004L699822
3386A57219935L310048K955068K634713K425278K228047K190604K194266K372254
3378A77530213K455158K518912K649004K611510K508462K476229K218096K059426
3370A97027010J952586J822257J932343K116424K505753K780172L140921L581893
3362B16859359M029596M335063M744227N176255N465667O051634O608701P231787
3354B60502289Q067984Q933827R816627J0642511J1107459J1049069J0413575
3347C30533341Q778581O467703L660528Q49216j627669l529261m697807n121641
3339C35312991n096054m906505m811070n056217n661266o996867q941223j1146911
$$ plain form
3394 123239332 127605984 132042907 136485261 140897948 145279653 149492109 153520113 157219935
3386 157219935 160529983 163485051 166119764 168545042 170773089 172963693 175157959 177530213
3378 177530213 179985371 182504283 185153287 187764797 190273259 192749488 194967584 197027010
3370 197027010 198979596 200801853 202734196 204850620 207356373 210136545 213277466 216859359
3362 216859359 220888955 225224018 229968245 235144500 240610167 246661801 253270502 260502289
3354 260502289 268570273 277504100 287320727 297963238 309070697 320119766 330533341
3347 330533341 339311922 345779625 349440153 350289369 348661700 345132439 340434632 335312991
3339 335312991 330216937 325310432 320499362 315443145 309781879 302785012 293843789 282696878
3331B82696878j3207865j5013633j6099096j6413930j6048824j5117459j3746925
3324A77049146j2371296j1072115r730135q591152p550425o679280n861871n148187
3316A10044685m536836m013070l574774l230048k956664k728886k634999k560901
3308H3808507k478552k436531k413785k338456k243097k326025k178681k142508
3300F5250872k139343j979202j957111j911000j867603j864185j871010j832682
3292D9828736j895111j851218j758348j697623j646523j492778j402825j395542
3284C6688768j235970j173566j066156j006660q99526q62454q98567q32752q91449
3275B7821668p76327p36423p00678o43179o62195n18915n98039n72132m68440
$$ plain form
3331 282696878 269489013 254475380 238376284 221962354 205913530 190796071 177049146
3324 177049146 164677850 153605735 143875600 135284448 127734023 121054743 115192872 110044685
3316 110044685 105507849 101494779 97920005 94689957 91733293 89004407 86369408 83808507
3308 83808507 81329955 78893424 76479639 74141183 71898086 69572061 67393380 65250872
3300 65250872 63111529 61132327 59175216 57264216 55396613 53532428 51661418 49828736
3292 49828736 47933625 46082407 44324059 42626436 40979913 39487135 38084310 36688768
3284 36688768 35452798 34279232 33213076 32206416 31306890 30444436 29545869 28713117 27821668
3275 27821668 27045341 26308918 25608240 24965061 24302866 23783951 23185912 22613780 22145340
3266B2145340n63745n00990m52489m33552m62085m40226m54204l95842l76433
3257A8065774l57357l35315m07101l50378m17740m30119l61188l56402l54382
3248A4695792l85319l37941k53024k61084l53371l05633k57795k67055k56922
3239A2017648k95447k26253k08503k54636j99711k27099k18853j60877j73526
3230A0052743j77563j60299j32122j45304j44396j37179j45275j63373j64686
3221H682546j30178r9219j06626j06636j56442j59840m6642j53093j38488j49198
3211G436184j06629m9094j33182r3761j01821o2479q3176r8244l8710j9212j02943
3200F546933n1771p9736r0699m3810o0132l5321k8166q5724q3164m2012q4023
$$ plain form
3266 22145340 21581595 21080605 20628116 20194564 19732479 19292253 18838049 18442207 18065774
3257 18065774 17708417 17373102 16966001 16615623 16197883 15767764 15406576 15050174 14695792
3248 14695792 14310473 13972532 13719508 13458424 13105053 12799420 12541625 12274570 12017648
3239 12017648 11722201 11495948 11287445 11032809 10833098 10605999 10387146 10226269 10052743
3230 10052743 9875180 9714881 9582759 9437455 9293059 9155880 9010605 8847232 8682546
3221 8682546 8552368 8453149 8346523 8239887 8083445 7923605 7876963 7723870 7585382 7436184
3211 7436184 7329555 7280461 7147279 7053518 6951697 6889218 6806042 6707798 6669088 6649876 6546933
3200 6546933 6495162 6415426 6324727 6280917 6220785 6185464 6157298 6071574 5988410 5946398 5862375
3189E862375p4497m3761m6249n9080m1890p3812p5517o8504o5325l4817m9939
3178E228984j07516q7469j9735n1161o6557j00751j12015n6430q2291p9456n0097
3167D415506r8138n5318n6791k0312k3828m1813q6256m3077j8570q3442l1736
3156C856225j7312l2899k8749p4061n6044m0740j16764o2298k2106L8719k8318
3145C415653o374M9679k4126m7690n3K5398J039k5222L095J6699J964n6079m4896
3132C309087M1110K6252K846J9287M0677L0631Q521P9401J262N415j0622l5259
3120C518608j4347M0744k1680L1122J4764J4005M1032j8054J3022J0292K2304
3109C651812J261K1825J8558L3033O460n437K5885N6474N5348L4408N7841Q9446
$$ plain form
3189 5862375 5787878 5744117 5697868 5638788 5596898 5523086 5447569 5379065 5313740 5278923 5228984
3178 5228984 5121468 5033999 5014264 4963103 4896546 4795795 4683780 4627350 4545059 4465603 4415506
3167 4415506 4317368 4262050 4205259 4184947 4161119 4119306 4033050 3989973 3971403 3887961 3856225
3156 3856225 3838913 3806014 3777265 3703204 3647160 3606420 3489656 3427358 3405252 3443971 3415653
3145 3415653 3409279 3458958 3434832 3387142 3387089 3412487 3413526 3388304 3391399 3408098 3410062 3353983 3309087
3132 3309087 3350197 3376449 3379295 3398582 3439259 3469890 3478411 3557812 3559074 3564489 3553867 3518608
3120 3518608 3504261 3545005 3523325 3554447 3569211 3583216 3624248 3606194 3619216 3629508 3651812
3109 3651812 3653073 3674898 3693456 3726489 3732949 3727512 3753397 3809871 3865219 3899627 3957468 4046914
3097D046914j0871P9555J01170N4572Q3744Q3019J12514Q8666P7081J02247m594
3086D814017M1442m1281n5219j08461p3391j12173j14056l1498m0541o6753q1557
3075D130529r0934p1994k1730r7111q6862j49318q7875q6647n6742p8509j13459
3064C189348q1503p0190q6301r9570q3153r3935l5511k9140n1425o6328m0441
3053B451851m556m4074o3553m1679j0827J3377m2956M55K2125j0148j5466o0889
3041B193660L134j1188m2334o1201m5974P770r279j9050j9839q842K6929K9745
3029B043531J0458J9605k4752M2645O8024N5954J6401R0748M5227O8315J55134
3018B591290J73899J54962Q4625o7304j78608j75893k05545j40391o7908p5940
$$ plain form
3097 4046914 4036043 4115598 4216768 4271340 4355084 4438103 4550617 4639283 4716364 4818611 4814017
3086 4814017 4855459 4814178 4758959 4650498 4577107 4464934 4350878 4319380 4278839 4212086 4130529
3075 4130529 4039595 3967601 3945871 3848760 3761898 3612580 3524705 3438058 3381316 3302807 3189348
3064 3189348 3107845 3037655 2951354 2851784 2768631 2674696 2639185 2610045 2558620 2492292 2451851
3053 2451851 2447295 2403221 2339668 2297989 2287162 2300539 2257583 2258038 2280163 2270015 2254549 2193660
3041 2193660 2196794 2185606 2143272 2082071 2036097 2043867 2034588 2015538 1995699 1986857 2013786 2043531
3029 2043531 2053989 2073594 2048842 2091487 2159511 2215465 2231866 2322614 2367841 2436156 2591290
3018 2591290 2765189 2920151 3004776 2937472 2758864 2582971 2377426 2237035 2169127 2093187
3008B093187q0550L7407l6236l8312n9493j6837N5494N484O7632M4599O5388P4989
2996B212752K7882J46655Q8499J52563J65970J93896L27593L71971L54674J11320
2986D153775k25339l52693l65166l26465j64529p0871m2499q9907j13816j12674
2976B289816r0898j24676p0851n0408m9693K1679K5115Q218l6737J3243K8577
2965A963385M0346O6013P3963Q8535J59279K04658J62617j4377j30796j39658
2955B473965j05935j33455j27939j28196j28614j33812j37969q1910o5461k6553
2945A404121m8947l8763l5186l6625m1431Q38n831k2877n6411l4848m294J4223
2933A093969j6448n9963L0654j2948j9508j7162j9348J4108l9114K246n129n1233
$$ plain form
3008 2093187 2012637 2050044 2013808 1975496 1916003 1899166 1954660 1960144 2027776 2072375 2137763 2212752
2996 2212752 2240634 2387289 2475788 2628351 2794321 2988217 3315810 3687781 4042455 4153775
2986 4153775 3928436 3575743 3210577 2884112 2719583 2648712 2606213 2516306 2402490 2289816
2976 2289816 2198918 2074242 2003391 1952983 1903290 1924969 1950084 1958302 1921565 1934808 1963385
2965 1963385 2003731 2069744 2143707 2232242 2391521 2596179 2758796 2744419 2613623 2473965
2955 2473965 2368030 2234575 2106636 1978440 1849826 1716014 1578045 1496135 1430674 1404121
2945 1404121 1355174 1316411 1281225 1244600 1203169 1204007 1198176 1175299 1118888 1084040 1079746 1093969
2933 1093969 1077521 1017558 1048212 1035264 1015756 998594 979246 993354 954240 956486 951357 900124
2921I00124J4971m7017m821k308K6991k2661L355K7918k3957m1343J0278j946
2909H39584m5293r497L464Q833N8929j77l2526m8348L147J6808j9597k3529Q82
2896G52680K2907l1093l6544K359k6762j766o808K7579K4317q4541M4996j7198
2884F70126N6872J4516q746m6801k7429k482j7589k6946j9504N681O4801L2954
2872F95453j9799R235l8722K9570N989m3474K317j5978J88j6364J7839K8448q501
2859F46201m7734KK8147O1047k6150l0780L2176L0553K6291o4468o6397p017M2380
2846F24251L7966l0990K1730L940M4861p656l8635n18k4186L3161k4753n8381
2834E80790L7987K2778K8847l2803L1213M7475n2707k5611J9065J0869J477r294
$$ plain form
2921 900124 915095 868078 863257 860949 887940 865279 868634 896552 872595 831252 841530 839584
2909 839584 794291 784794 788258 797091 856020 855843 823317 774969 778116 794924 775327 751798 752680
2896 752680 775587 744494 707950 710309 683547 681781 674973 702552 726869 642328 687324 670126
2884 670126 726998 741514 732768 685967 658538 656056 638467 611521 592017 597698 662499 695453
2872 695453 675654 684889 646167 675737 681726 638252 640569 624591 624779 608415 626254 654702 646201
2859 646201 598467 598469 626616 687663 661513 630733 662909 693462 719753 655285 588888 581871 624251
2846 624251 662217 631227 652957 656897 701758 694102 655467 654949 630763 663924 639171 580790
2834 580790 618777 641555 670402 637599 668812 716287 663580 637969 657034 667903 669380 660086
2822F60086l2780K7873P9132L1073n6579L4917K0535j7865L8681P5311L255N5916
2810I19555Q1141L992j4156k9622k8214l3619j2140K0786K7094m8021l5218Q0646
2798I32224j6705J0764J3408o9603M6178K7812r573l7085J0277L7823K8679K5011
2786I99210L8767L1084L2552M7805Q7510J05710J7576m0191n6346n6530m3514
2775A163633p7205q8575n4020k7512p156l2154m696n2475K9331k3199j2092j9591
2763G94289p771k1629k468k8797j4279Q1931N675p8115M1603K8508J6307q155
2751H07099l0640j4216J5221j1587J4514m0585n9505o7426J1717l1772J2744j2813
2739E92751l2389J8603j5958l3259M0814j8290q340J9800o982k5995K4874r617
$$ plain form
2822 660086 627306 655179 734311 765384 708805 743722 764257 746392 785073 860384 863639 919555
2810 919555 1000696 1004688 990532 960910 932696 899077 886937 907723 934817 886796 851578 932224
2798 932224 915519 926283 939691 870088 916266 944078 934505 897420 907697 945520 974199 999210
2786 999210 1037977 1069061 1101613 1149418 1236928 1342638 1360214 1320023 1263677 1207147 1163633
2775 1163633 1086428 997853 943833 916321 909165 877011 872315 819840 849171 825972 813880 794289
2763 794289 786518 764889 762421 733624 719345 801276 806951 728836 770439 798947 815254 807099
2751 807099 776459 762243 777464 765877 780391 739806 680301 612875 624592 592820 605564 592751
2739 592751 560362 578965 563007 529748 570562 552272 543932 563732 556750 530755 555629 546012
2727E46012q3392K0254q084O054m0125o205N984k6645p276J9781l7503k158k5028
2714C61669L319k3852N881k9680l0764q452K7967j0300j6278l416N9804n018k9362
2701C01518o5907k2140M2710o349j4704j9834L692L3616l3973m4708R312l301
2689A79932k7705j641j1202J3705n031K3559O8j2172K4879K3480j0314p326K517
2676A92749l7530m9450M5920J8580K6084O8740m1096k7704m8598l5627K7407K4955
2664A64430j6083K9472J1336l6086J4886j2708J4132j9113k1889J5309m277M3117
2652A82526K6923n7717N52K9616m5496j6745M7522J4727n4156n349o28j5998o7
2639A05710k905P346J3070k2994k3736P602O179J8344k2358j6390M4397K5868
$$ plain form
2727 546012 462620 482874 474790 480844 440719 434514 440498 413853 406577 426358 388855 386697 361669
2714 361669 364988 341136 347017 317337 286573 278121 306088 295788 279510 276094 335898 330880 301518
2701 301518 235611 213471 256181 249832 235128 215294 218986 252602 218629 173921 183233 179932
2689 179932 152227 150586 139384 153089 148058 171617 171685 159513 184392 207872 197558 190232 192749
2676 192749 155219 105769 151689 170269 196353 265093 223997 196293 147695 112068 139475 164430
2664 164430 148347 177819 189155 153069 167955 155247 169379 150266 128377 143686 139409 182526
2652 182526 209449 151732 152284 181900 136404 119659 167181 181908 127752 122403 121775 105777 105710
2639 105710 102805 110151 123221 100227 76491 84093 90272 108616 86258 69868 114265 140133
2627A40133k9304n6085M2947Q358k2068K310l9055M1086j0513j0971K2277k7298
2615F1817Q261K1991K3852j673k1765k4837J5655k6162K8565m584j4289L1392
2603I8223q2192O3K7694J5270M2801l0168j5234j1938K718m7616L660L9248R983
2590E2512o841j9919M2813m5018J6582K1762j8380J0228R836K6243k3472j7603
2578D8743J8363R303n0919k1579k2047O5264M3439j1692m8308l4083N1263L085
2566E0832M2042n4435k4493K8195j6805K8090l8563J8165l6421j5261Q3876K4605
2554H9827k5518j5695N898K0303m7607j5294J8596K1791m6744O342N8516L2685
2542A03100l7191l1110K1552n4419L1280k3040L1412L061l624J363M7034m671
$$ plain form
2627 140133 110829 54744 97691 106049 83981 86291 47236 88322 77809 66838 89115 61817
2615 61817 70078 92069 115921 114248 92483 67646 83301 57139 85704 81120 66831 98223
2603 98223 16031 16094 43788 59058 101859 71691 56457 44519 47237 -379 3281 42529 52512
2590 52512 45671 25752 68565 23547 40129 61891 43511 53739 63575 89818 66346 48743
2578 48743 67106 76409 25490 3911 -18136 47128 90567 78875 30567 -3516 47747 50832
2566 50832 92874 38439 13946 42141 25336 53426 14863 33028 -3393 -18654 65222 89827
2554 89827 64309 48614 54512 74815 27208 11914 30510 52301 5557 11899 70415 103100
2542 103100 65909 34799 56351 1932 33212 10172 41584 44645 41021 42384 89418 84747
2530H4747m4724o724J1037N55l8321q196M078k3903k0706L9834Q491p188j7146
2517a8166J3476K0008j0507k2702n568J5879J7806l305q573Q347q558q714J0J1686
2503A119l46J2000J0411k927k4128J501O0062n1710j1805J3437L5977l4171l7830
2490b8410j2346p367N1264J199k5715M0095l8465q0M1561m55n9255N4347N7634
2477G4007m4914l0347j1705k9557K1469L4369L680k5959R351J7798q457K3033
2465C2768m9328m6514N5136L8614k8634J8784m9522K4149k4215L4274J7092R287
2453C1891j1265p7479j1983L5323M7688k9943J8742m5621R050Q076J7751L9553
2441C1783m8311j7657j3644L8806J2335k1696k7095r796J4722Q5126K0782j5892
$$ plain form
2530 84747 40023 33299 44336 44891 6570 -1626 2452 -21451 -42157 -2323 6168 -1020 -18166
2517 -18166 -4690 15318 4811 -17891 -23459 -7580 10226 6921 -1652 6695 -1863 -10577 -10567 1119
2503 1119 773 12773 23184 20257 -3871 -2370 57692 5982 -5823 7614 43591 9420 -28410
2490 -28410 -40756 -48123 3141 4340 -21375 18720 -19745 -19825 21736 21281 -37974 16373 74007
2477 74007 29093 -1254 -12959 -42516 -21047 13322 17002 -8957 394 18192 9735 32768
2465 32768 -16560 -63074 -7938 30676 2042 20826 -28696 -4547 -28762 5512 22604 31891
2453 31891 20626 -56853 -68836 -33513 14175 -15768 2974 -42647 -33597 -25521 -7770 31783
2441 31783 -16528 -34185 -47829 -9023 3312 -18384 -45479 -55275 -40553 44573 65355 49463
2429D9463j7274k9274j7789J2720J478M9301m7590k322J210o1263n2322L7121
2417g6541O1789j6086j9905K0615l514K0419l2603J24L2835L2245j7640K3938
2405B5676j5731k5855o329N339L3410l3938M5032n2741J086j3471L7568K0230
2393B0276m3551L0148j3500J1020n4942L273J5763m427k1390K481R542L4744K717
2380g846m2913J5526q275r076J9910K9387k7616J3549k2903j1676K5504j348R870
2367a7907J1637r861M3020j6772l4704l559m045k7618Q322J9488J8227K1350j0216
2354b638Q755k6108M414j6030r25N271r818N5166l308k7330n8265j084L3908o373
2340d4365p82L0136J430k4523L5279L1895n0468m385k8536L3267j0347K0301K5787
$$ plain form
2429 49463 32189 2915 -14874 -2154 -676 48625 1035 -1287 -77 -61340 -113662 -76541
2417 -76541 -14752 -30838 -50743 -30128 -33642 -13223 -45826 -45702 -12867 19378 1738 25676
2405 25676 9945 -15910 -22239 -16900 16510 -17428 27604 -25137 -24051 -37522 46 20276
2393 20276 -23275 6873 -6627 4393 -50549 -47276 -31513 -35940 -57330 -54849 -45307 -10563 -7846
2380 -7846 -50759 -35233 -43508 -52584 -32674 -3287 -30903 -17354 -40257 -51933 -26429 -27777 -17907
2367 -17907 -6270 -16131 26889 10117 -24587 -28146 -32191 -59809 -51487 -31999 -13772 7578 -2638
2354 -2638 6117 -19991 -15577 -31607 -32532 -27261 -37079 18087 14779 -12551 -70816 -71900 -37992 -44365
2340 -44365 -45147 -15011 -13581 -38104 -2825 29070 -21398 -25783 -54319 -21052 -31399 -11098 14689
2327A4689j7559k3353K6200j8195Q157q424j2305J5490J5164n264l3239l1238
2315f9877K9431j1055Q577K7002K8066K1268K93j9594K7619j0831K1113m1618
2303A0394J6227m916J9019j8601k6502q687p605N83l6589J5208j2732O2728j7378
2290h851K7666k9468K6167j6491p150r157J7645L3846l5096m1246L423k5895P1313
2277F706j3967l9907m7672j393K5892L7740k3478J7687J0385K1558K0914l9572
2265b5107K7901K1778n2827k3414K7703L7235J7240k945l1238k7414m4466J788
2253g3766N6677K3207l7873J4613K1556m1219K4434q362J9896m4678J909L0824
2241a2782k3674L4573M993l1461j0922o633j0350n744N573K3651J0283M345O241
$$ plain form
2327 14689 -2870 -26223 -23 -18218 -10061 -18485 -30790 -15300 -136 -5400 -38639 -69877
2315 -69877 -40446 -51501 -42924 -15922 12144 33412 33705 14111 41730 30899 52012 10394
2303 10394 26621 21705 40724 22123 -4379 -13066 -20671 -20088 -56677 -41469 -54201 8527 -8851
2290 -8851 18815 -10653 15514 -977 -8127 -17284 361 34207 -889 -42135 -38712 -64607 6706
2277 6706 -7261 -47168 -94840 -96233 -70341 -32601 -56079 -38392 -28007 -6449 14465 -25107
2265 -25107 2794 24572 -28255 -51669 -23966 13269 30509 27564 -3674 -31088 -75554 -73766
2253 -73766 -17089 6118 -31755 -17142 4414 -36805 -12371 -20733 -837 -45515 -43606 -12782
2241 -12782 -36456 -1883 3110 -28351 -39273 -45906 -56256 -62000 -56427 -32776 -22493 -18148 -11907
2228a1907n38k4055k7383j1327K9626j1831o078J6019L1547n286n14J8474j484
2215d737j6107Q717l7427J8465N0458J8534n428r868l0064M680J1229N986J2964
2202B7402k8392j7067k452K7232J0712O725j0728N458M3228m223l4678j0606m3
2189A2568J5646l4949j3890K6709J670k7652M9865k7019L1440q904P697L5034
2177F8215k727n238L2929r2690J3431o705J2162K2470j1137L9178q231l737k6318
2164C1602k120J1344J9292J3997k815J6257k2427Q033P533o1321K4191k2002K2027
2151D3591k0850j3840O8499m244p331l2145N590j3877L3650J6504K8935K98m3814
2138F0966J7008L084O2365q264K2293J1318k1800J2657k9716K7805N1904j5302
$$ plain form
2228 -11907 -12445 -36500 -63883 -75210 -45584 -57415 -63493 -47474 -15927 -21213 -21727 -3253 -4737
2215 -4737 -20844 -12127 -49554 -31089 19369 37903 32475 22607 -7457 -2777 8452 14438 27402
2202 27402 -990 -18057 -20509 6723 17435 24160 13432 18890 62118 57895 23217 12611 12568
2189 12568 28214 -6735 -20625 6084 7754 -19898 29967 2948 34388 25484 33181 68215
2177 68215 65488 60250 93179 489 13920 7215 19377 41847 30710 69888 61657 57920 31602
2164 31602 29482 40826 60118 74115 71300 87557 65130 73163 80696 19375 43566 21564 43591
2151 43591 22741 8901 77400 73156 65825 33680 39270 25393 59043 75547 104482 104780 60966
2138 60966 77974 81058 143423 135159 157452 168770 146970 159627 129911 157716 209620 194318
2126A94318N750N6201k4937m8181M7844l4190n624J1851K9286K8400m930j0563
2114B45225J999M260L1968k548J0044N346k0323K0411k7091J7530R3773q245k4125
2101C48224J1079J7279k772K7429K9090K7994r426K1092R915M0227L2449O890
2089E59470N1848K8002N2117O0629P2073N7547J1444O6601P0509J04203R8220
2078A232663N4362J19875J14469J48138K31362K80662K89209K15336K50892K60165
2068C197133M26433N18380N99211O61180R28342J181414J522208J636931J169221
2059A1840453n05293j968437j602447j615306j231573q58366o16944m68424l61387
2050B612276k21783j44817j45817r8169j22913j30718j41173j39221j38197j18093
$$ plain form
2126 194318 200068 256269 231332 183151 230995 196805 191181 203032 232318 260718 255788 245225
2114 245225 247224 251484 283452 280904 290948 296294 275971 296382 269291 286821 380594 372349 348224
2101 348224 359303 376582 373810 401239 430329 458323 448897 469989 479904 520131 552580 559470
2089 559470 611318 639320 691437 752066 824139 881686 893130 959731 1030240 1134443 1232663
2078 1232663 1287025 1406900 1521369 1669507 1900869 2181531 2470740 2686076 2936968 3197133
2068 3197133 3623566 4141946 4741157 5402337 6330679 7512093 9034301 10671232 11840453
2059 11840453 11335160 9366723 7764276 6148970 4917397 4059031 3442087 2973663 2612276
2050 2612276 2390493 2245676 2099859 2001690 1878777 1748059 1606886 1467665 1329468 1211375
2040A211375j49141m7213p7018o7085q1809l0445K3283j5036k1430j6295k2558
2029G06628n4304l2490n8253K0038j8521n7781N454k2695j01899J6805j0089N584
2017C98477m9463l5043K8622j8300m2008J8926J6184K0468p7465K5032o2934n914
2005B16582K7492p454Q250n7964J0732n156R15j1855N780J3527n7515m4224K8643
1992A27753j076k2844J5566l568j2547n99K3714k2138j6967J0147j3478l3491
1980E0472J0748K2183k500l7274L6715m2164N710K7792o3L2853J8710l3213M312
1967I4281m3779k8858J5002J1473N92l0014k0169K594j8684k423N7094k6952L605
1954A3762K9355p876k9789M232J5825K2224k1606m0523K448J3042O32J4000K8681
$$ plain form
2040 1211375 1062234 1015021 938003 870918 789109 758664 781947 766911 745481 729186 706628
2029 706628 652324 619834 561581 581619 563098 505317 510771 488076 386177 402982 392893 398477
2017 398477 349014 313971 342593 324293 282285 301211 317395 337863 260398 285430 222496 216582
2005 216582 244074 236620 244870 186906 197638 192482 193397 181542 187322 200849 143334 99110 127753
1992 127753 126677 103833 119399 115831 103284 102685 126399 104261 87294 97441 83963 50472
1980 50472 61220 83403 80903 43629 80344 38180 43890 71682 71619 104472 123182 89969 94281
1967 94281 50502 21644 36646 48119 48711 18697 -1472 1122 -17562 -19985 37109 10157 13762
1954 13762 43117 35241 5452 9684 25509 47733 26127 -14396 -11948 1094 1726 15726 44407
1941D4407l8561l5849M9855j9556k0723m5875M9934J7759k4016j1562j6054M186
1929d6055O8070J1714k8867J1672n2501O715M790j204L1709q682m1063J9079K7337
1916B714Q356K94K3920P378m7255k2637N508L133q596L1564J6270l6851L373O112
1902f717k8009N2349j2284l1036P439o330j6201j0236J7775N2836n3075K2086
1890a1403K3901j1444m5369M2830j1476q32j1541n4618N598L8163j6826R979O3114
1877B0076M471j1453o2933J7709J5251j3966m3550m789L0254R896l6939N293L052
1864f7628K5967K1061j5227j2435P905J6418J6598m2787O3539j6501l3118n532
1852d1740J8041j2584k027k6392k3095O0162K0335l0382m358j1774j3145K4547
$$ plain form
1941 44407 5846 -30003 19852 296 -20427 -66302 -16368 1391 -22625 -34187 -50241 -46055
1929 -46055 22015 33729 4862 16534 -35967 -29252 -24462 -25666 6043 -2639 -43702 -24623 2714
1916 2714 11070 11364 35284 42662 -4593 -27230 -21722 -18589 -27185 4379 20649 -16202 -12829 -6717
1902 -6717 -34726 17623 5339 -25697 -18258 -24588 -40789 -51025 -33250 19586 -33489 -11403
1890 -11403 12498 1054 -44315 -1485 -12961 -13793 -25334 -79952 -74354 -36191 -53017 -43038 20076
1877 20076 24547 13094 -49839 -32130 -16879 -30845 -74395 -79184 -48930 -39034 -75973 -70680 -67628
1864 -67628 -41661 -20600 -35827 -48262 -40357 -23939 -7341 -50128 13411 -3090 -36208 -41740
1852 -41740 -23699 -36283 -38310 -64702 -87797 -27635 -7300 -37682 -42040 -53814 -66959 -42412
1840d2412n202M422J3637J2779j4917P472j5667N291k3062Q198K5135m6204Q286
1827f2244L7500k0425k2298O4563K2494j1294K5909k334k0675K2913L79m9214
1815a4726j2910M225j7198q536L2358j9537k1767q224J9609r659j0050L5620j1687
1802d2482j9281l0816L153O1550p480l176j2741j9093J3435K3261n9897M8629
1790d4938M8186k5189l5984j0985P868K0877K0901J1987n1677J2694K5120R883
1778a1257q659n577r540n2459M3380j0992L8861n2947k703J5808K8007j4680l94
1765d3152R456k9294j7546J6949M3192n6370L183M632l2701K0427J2307K0471
1753d8446p716p2727K2924L5454k949M0221o581Q407J0773L241l3746j6182K2746
$$ plain form
1840 -42412 -47614 -43192 -29555 -16776 -31693 -24221 -39888 -34597 -57659 -49461 -24326 -70530 -62244
1827 -62244 -24744 -45169 -67467 -2904 19590 8296 34205 31871 11196 34109 34488 -14726
1815 -14726 -27636 -23411 -40609 -49145 -16787 -36324 -58091 -66315 -46706 -56365 -66415 -30795 -42482
1802 -42482 -61763 -92579 -89426 -27876 -35356 -38532 -51273 -70366 -56931 -33670 -93567 -44938
1790 -44938 3248 -21941 -57925 -68910 -61042 -40165 -19264 -7277 -58954 -46260 -21140 -11257
1778 -11257 -19916 -25493 -35033 -87492 -44112 -55104 -16243 -69190 -71893 -56085 -28078 -42758 -43152
1765 -43152 -33696 -62990 -80536 -63587 -20395 -76765 -73582 -68950 -101651 -81224 -68917 -48446
1753 -48446 -56162 -128889 -105965 -70511 -73460 -33239 -39820 -31413 -20640 -17399 -51145 -67327 -44581
1740d4581j9928K6944M1293k8085n3169M3722k601n1529L3243J8075R228m0348
1728f7736K3989L654n0319k8738M5901K7239j1765J2051K4876m3299L8664m2199
1716f7682L797N3062k6234m129J713j1530j252J9847l4850j7928J2118K8939L5738
1703h391k3124l0969L3459l4661R219J8733m4447j337R221J1590K7275M5896p390
1690E074q7048P319P603L4679n7640k849J4731N5303K5375n3215l9868K3126o953
1677g4363k0156N3505J6920k5464l1850l6540L1684P75K2661m565M3159j9685
1665d3919L456J886k9569J4115j4369O304K7522r080j8166p137j9092N5877p298
1652c9470k3764J8158O623K2605q660k1141m0002L0968L8745k3430j313n6303
$$ plain form
1740 -44581 -64509 -37565 3728 -24357 -77526 -33804 -36405 -87934 -54691 -36616 -27388 -67736
1728 -67736 -43747 -40093 -90412 -119150 -73249 -46010 -57775 -45724 -20848 -64147 -25483 -67682
1716 -67682 -63885 -10823 -37057 -41186 -39473 -51003 -52255 -32408 -67258 -85186 -73068 -44129 -8391
1703 -8391 -31515 -62484 -29025 -63686 -54467 -35734 -80181 -81518 -72297 -60707 -33432 12464 5074
1690 5074 -81974 -74655 -67052 -32373 -90013 -92862 -78131 -22828 2547 -50668 -90536 -67410 -74363
1677 -74363 -94519 -41014 -24094 -49558 -81408 -117948 -86264 -85489 -62828 -67393 -24234 -43919
1665 -43919 -40463 -38577 -68146 -54031 -68400 -62096 -34574 -43654 -61820 -68957 -88049 -32172 -39470
1652 -39470 -63234 -45076 -38453 -15848 -24508 -45649 -85651 -54683 -15938 -39368 -40681 -96984
1640i6984j3323L3942N7533p985K4087J9851J0768j3092m4368j6832M3776j7124
1628a9751J6208j095m6362j4145N4729k5772l0719p592j6059L2042K777j2391
1616f8130K8883R401q573J5125K749o6891l6277P019L5770M6277m6841j1971N3804
1603c9655k8547K3999P025j7594K1504J5740k4999O588M3394o1696L0806n2035
1591g5470r935K2396j8260K3560n827n511M9695r684l3489Q321M5212M522m5161
1578d9631k3702J5557j7058j8197L9058j5031q057L2981j9005j18O005m6935K4245
1565g9888K0647K6419o675J1046j6768J3901j5718j4432m1992m495K3861J1360
1553g2734o177J5568j2158J84O5789l6893K0756K00J1510k6133N42K8074J662
$$ plain form
1640 -96984 -110307 -76365 -18832 -26817 -2730 17121 27889 14797 -29571 -46403 -2627 -19751
1628 -19751 -3543 -4638 -51000 -65145 -10416 -36188 -66907 -74499 -90558 -58516 -55739 -68130
1616 -68130 -39247 -29846 -38419 -23294 -20545 -87436 -123713 -116694 -80924 -34647 -81488 -93459 -39655
1603 -39655 -68202 -44203 -37178 -54772 -33268 -17528 -42527 -35939 7455 -54241 -23435 -75470
1591 -75470 -85405 -63009 -81269 -57709 -63536 -69047 -19352 -29036 -62525 -54204 -8992 -4470 -49631
1578 -49631 -73333 -57776 -74834 -93031 -53973 -69004 -77061 -44080 -63085 -63203 -57198 -104133 -79888
1565 -79888 -59241 -32822 -39497 -28451 -45219 -31318 -47036 -61468 -103460 -107955 -84094 -72734
1553 -72734 -78911 -63343 -75501 -75317 -9528 -46421 -25665 -25465 -13955 -40088 -39546 -11472 -9810
1540i810k2186L4186n9240K401N632k2396J4703R241M1110n011J922r19q321n5579
1526g4267J3441L0633J4187n276o2012P425R113l465K7348k3671K2975K7594J4342
1513a633p983k1228J224l2889J8456j4353K4142M556l3594K3152k0215k7207K6285
1500f1287J7763J7928l1150K7959k1118j0112k2810o178J0438K650L4913m5089
1488h6093K6526Q395K0477l545o253L3470n5958m4689J7709P228M8778r885J1951
1475c1889m7125k456q458K6681J2855q773M6569m8162K1096L9316p3166j0503
1463h4015M2641j3839K7419Q723l6737j0547K6136J2913L94o373j3449J2964k3742
1450e7512J9601j9268j3749P559Q957q114L4337L4042j979J3904l5020j0607J4289
$$ plain form
1540 -9810 -31996 2190 -57050 -54649 -49017 -71413 -56710 -47469 -6359 -11370 -9448 -10367 -18688 -74267
1526 -74267 -60826 -30193 -16006 -21282 -83294 -75869 -66756 -70221 -42873 -66544 -43569 -15975 -1633
1513 -1633 -9616 -30844 -29620 -62509 -44053 -58406 -34264 -29708 -63302 -40150 -60365 -87572 -61287
1500 -61287 -43524 -25596 -56746 -28787 -49905 -60017 -82827 -89005 -78567 -75917 -41004 -86093
1488 -86093 -59567 -51172 -30695 -34240 -40493 -7023 -62981 -107670 -89961 -82733 -33955 -43840 -31889
1475 -31889 -79014 -81470 -89928 -63247 -50392 -59165 -12596 -60758 -39662 -346 -73512 -84015
1463 -84015 -41374 -55213 -27794 -19071 -55808 -66355 -40219 -27306 -26912 -33285 -46734 -33770 -57512
1450 -57512 -37911 -57179 -70928 -63369 -54412 -62526 -28189 5853 3874 17778 -17242 -27849 -13560
1437a3560j4994j6833J4877M365J2715K0671k6876l5621K66n71J6456M4596R217
1424A4708J829j7666R11K1363l4510j874Q012k4589k3244O760Q703L7896K2085
1411B0384j9887m2001M3670N616m0653m6383P015J1867K7922m755k6377J1942
1399e1640K0500j1391j9867N514L3744J1961k6278j5108J7782q218n1180L5439
1387e8742l3438M9673K2195k8467m1899k3587J9458L8532M0087j4909J1043k998
1375b3052P698k809l7210k2133J5379K4452J9534k2741j5770p692L2048L3018
1363G22j5895J3774J6639m075K0432l8297j0479M4909j6611n4447J9766K18k2125
1350d5469j6215L3405M44j952m5808K6887L2270k4659K1558L7284p646o0853N2744
$$ plain form
1437 -13560 -28554 -45387 -30510 -26145 -13430 7241 -19635 -55256 -54990 -55561 -39105 5491 14708
1424 14708 16537 -1129 -218 21145 -13365 -15239 -7227 -31816 -55060 -48300 -39597 -1701 20384
1411 20384 497 -41504 2166 7782 -32871 -79254 -72239 -60372 -32450 -37205 -63582 -51640
1399 -51640 -31140 -42531 -62398 -56884 -23140 -11179 -37457 -52565 -34783 -43001 -94181 -58742
1387 -58742 -92180 -42507 -20312 -48779 -90678 -114265 -94807 -56275 -16188 -31097 -20054 -23052
1375 -23052 -15354 -18163 -55373 -77506 -62127 -37675 -18141 -40882 -56652 -64344 -32296 722
1363 722 -15173 -1399 15240 11165 31597 -6700 -17179 27730 11119 -43328 -23562 -23344 -45469
1350 -45469 -61684 -28279 -27835 -29787 -75595 -48708 -16438 -41097 -19539 17745 10099 -50754 1990
1337A990N335j2449k007J5249k0684O801m7507J3057J3990P860M413n193k796
1324b1941M699J5806j4224J3959o240j9902N437n658l6539N256L1371K9839l2640
1311c0777K1975m0231l2920J7286Q742K1683J3096l7604K0853j1685p168K8221
1299b8529j6548J8144r78k4791m637R283M8185L9282k0853K2214K0320l1825r921
1286A9346l4862j4023k3227M621N3771J1272J536J6039n926j601J6244K82m4348
1273h76j1314O127M792J1063l5964r555m252J3885l4304M0887L2043n886m5128
1260c8482l7535M7468L5685l4048m113k1369L2813J5536j0846k0605q658J3259
1248c0895r742j7368O718L488P6064l4577j2206l4176J7292J8757L2881q861K0784
$$ plain form
1337 1990 7325 -5124 -7131 8118 -12566 -5765 -53272 -40215 -26225 -18365 -13952 -19145 -21941
1324 -21941 -17242 -1436 -15660 -1701 -7941 -27843 -22406 -28064 -64603 -59347 -27976 1863 -30777
1311 -30777 -8802 -49033 -81953 -64667 -55925 -34242 -21146 -58750 -37897 -49582 -56750 -28529
1299 -28529 -45077 -26933 -27911 -52702 -57339 -48056 129 39411 18558 40772 61092 29267 19346
1286 19346 -15516 -29539 -52766 -48145 5626 16898 18434 34473 28547 26946 43190 43472 -876
1273 -876 -12190 -6063 -1271 9792 -26172 -35727 -39979 -26094 -60398 -19511 12532 6646 -38482
1260 -38482 -76017 -28549 7136 -26912 -31025 -52394 -19581 -4045 -14891 -35496 -44154 -30895
1248 -30895 -40637 -58005 -51287 -47799 28265 -6312 -18518 -52694 -35402 -16645 16236 7375 28159
1235B8159j7893o0831J6322K4669Q865L674K354R653K9899k0032K5502m5349m5641
1222d0649l0907M5402N623l205j1344J1657k7982N9573M0424m934n0129n6143
1210f2614m583O5188M365M317m9845m0599K396O0855m319k3595K6611j1735n234
1197c8792k3800K9677j3550J2747j26j6901l41J576M5556r197J2557J5575p749
1184G232j7410L3841P053l2491J1707P944l197j4464j2381L3662l6943j3460K4598
1171d309j0168k5980k994J1363l2890K4808J9006J9596k4119K9773J7810m687
1159A7209m4130l6321Q827K0469L0759K0949J9158m9115k3308M933L0141p05J6578
1146A5444k5215K1341N519n0400J7572l841o806m6207P0056J6859k2159J2736
$$ plain form
1235 28159 10266 -50565 -34243 -9574 -709 2965 5319 14972 44871 24839 50341 4992 -40649
1222 -40649 -71556 -26154 -20531 -23736 -35080 -23423 -51405 8168 48592 43658 -6471 -62614
1210 -62614 -67197 -2009 2356 6673 -43172 -83771 -81375 -20520 -24839 -48434 -21823 -33558 -38792
1197 -38792 -62592 -32915 -46465 -33718 -33844 -50745 -51086 -49510 -3954 -13151 -594 14981 7232
1184 7232 -10178 23663 30716 -1775 9932 17876 14679 215 -12166 21496 -15447 -28907 -4309
1171 -4309 -14477 -40457 -43451 -32088 -64978 -40170 -21164 -1568 -25687 4086 21896 17209
1159 17209 -26921 -63242 -54415 -33946 -3187 17762 36920 -12195 -35503 -30570 -429 -1134 15444
1146 15444 -9771 11570 17089 -33311 -15739 -19580 -26386 -72593 -2537 14322 -7837 4899
1134D899k7209J4000N4687q203l6744M639j6688K7553n7714P058K4499m0408L9036
1121a0595K3689k6324M9661K934k5387n904l2968l1085J5219N0665m9602M3421
1109C724n539K0312j9173L204L0833l1313J2163k0028k2778j9684R139p587L5556
1096a1171j7942O031J7844j0033j8742j5720J2539p09P222n938R160q485O3045
1083B7101M430k5034j686j5127K0438M3263k8881K5474n298k8934l3197j1185
1071b8636L3693k6865r132K1789L0455K3397k1310n242k1340J2624l3101K6135
1059B467R119J9370R668n3661N678K205R327o296K4500j7215q237j8481o341J6102
1045a1795j0884J6327K2225R698l343l8745k3903j1308J745k0842K4351l598J5287
$$ plain form
1134 4899 -22310 -8310 46377 38174 1430 6069 -10619 16934 -40780 -33722 -9223 -49631 -10595
1121 -10595 13094 -13230 36431 39365 13978 8074 -24894 -55979 -40760 9905 -39697 3724
1109 3724 -1815 18497 -676 2528 33361 2048 14211 -5817 -28595 -48279 -39140 -46727 -11171
1096 -11171 -29113 -23082 -5238 -15271 -34013 -49733 -37194 -37903 -30681 -36619 -27459 -35944 27101
1083 27101 31531 6497 4811 -10316 10122 53385 24504 49978 44680 15746 -17451 -28636
1071 -28636 5057 -21808 -30940 -9151 21304 44701 23391 18149 -3191 9433 -23668 2467
1059 2467 11586 30956 40624 -13037 -7359 -5154 4173 -2123 22377 5162 -3075 -21556 -27897 -11795
1045 -11795 -22679 -6352 15873 25571 22228 -16517 -40420 -51728 -49983 -70825 -46474 -50072 -34785
1032c4785L3884L5118k8336k052l5714Q165r594K449P839K4388m7897L7552J0793
1019A810l7238k3026L6137m224k9897P3411j5250R94J3107k3019j5475M342k656
1006b0984L9749k4595L369k781n3092j3910J9947K3000J2438p472L3861m3683
994c4153J2475O3823q75k5979M005k4566L4268J2238l6584K7219j9777k2332L946
981f292K0335N395k3323k374k3414O3324q351J4169k8874M4721j5905j1732m540
968B3139j1815k1041P090J0984L165J6945j0868q212N74M4427m7995k6045K8804
955I152N485K5729k2227k5442p939L778L1313J7383M876j7250m6701l1757K0959
942c2641J3104K4860J018K6882j7142l1370P568K6783m397k2010L584P1996l4480
$$ plain form
1032 -34785 -901 34217 5881 3829 -31885 -23720 -33314 -30865 -23026 1362 -46535 -8983 1810
1019 1810 -35428 -58454 -22317 -26541 -56438 16973 1723 2717 15824 -7195 -22670 -18328 -20984
1006 -20984 18765 -5830 -2461 -5242 -58334 -72244 -52297 -29297 -16859 -24331 9530 -34153
994 -34153 -21678 42145 41270 15291 19296 -5270 28998 41236 4652 31871 12094 -10238 -6292
981 -6292 14043 19438 -3885 -6259 -29673 33651 25300 39469 10595 55316 39411 27679 23139
968 23139 11324 -9717 -2627 8357 11522 28467 17599 9387 9961 54388 6393 -19652 9152
955 9152 14637 40366 18139 -7303 -15242 -11464 19849 37232 42108 24858 -21843 -53600 -32641
942 -32641 -19537 5323 6341 33223 16081 -15289 -7721 19062 14665 -7345 -3761 68235 33755
929C3755K7605n0554O14k3908k8885M6604j6890m5659j4250M8734L5945m4940
917c1829M3484j5752K282K6361j8737m0217K4692L1979j7598m2976k8975O5722
905a564K1072r548K4986j1298L1684k9508m6318J4460M2015J1870p739j2671n6
892B7385j8518K3223M019j7624l5l0364K4601q50J0520l2542J0395M5246m409
879D1047R012k1433k243N6560l7505k4431q30j1742J4513k777J5195Q972p2354
866b8016J8602J7717K3993q181J2541Q302k0541j1917k7607j7022K1991J5980
854E842K492k1157O0648q127k7122J167k59J9770J829k8218K9054n4319J629J5355
840a416L1739k7514m9349J3863o980J967Q402O4180N482k1511k3869M01k3445
$$ plain form
929 33755 61360 10806 11420 -12488 -41373 5231 -11659 -57318 -71568 -22834 13111 -31829
917 -31829 11655 -4097 -1815 24546 5809 -34408 -9716 22263 4665 -38311 -67286 -1564
905 -1564 19508 9960 34946 23648 55332 25824 -20494 -6034 35981 47851 40112 27441 27385
892 27385 8867 32090 36109 18485 18450 -11914 12687 11837 22357 -10185 210 45456 41047
879 41047 50059 28626 26383 82943 45438 21007 20177 8435 22948 20171 35366 44338 -28016
866 -28016 -9414 8303 32296 24115 36656 44958 24417 12500 -15107 -32129 -10138 5842
854 5842 8334 -12823 47825 39698 12576 13743 13484 33254 35083 6865 35919 -18400 -16771 -1416
840 -1416 30323 2809 -46540 -32677 -39657 -37690 -29288 34892 40374 18863 -5006 -4605 -28050
827b8050L1450Q2214r041l1149k6531l335K4828p204l1245j2907J9175j6875K015
814f655M1239J2166K3019l4664n2624O1042K2441n7242M305l834l0091p901M0077
801A1278j6217j4552R128m130n2067O4417L4918n3833M93k9866K5306K5244R275
788I394n5906K0543J1464M3923M655q035J3652J1840Q598n6769k5379K9930k6159
775a8249k0321K0318k715K7918K0361n242K6236K9433k5733l7702m904j4065J4132
762I467j720J6138k709R285J6055j9925J1755j1667k9183k0560o358K983J9677
749f762k559L6697j5858J5727J6879l0021J7150k0272j882J6003j321k1112l129
736d60J098O610q196k564j071k6648K1170N1378p945M7013n0756j3102N884L8092
$$ plain form
827 -28050 3400 85614 76573 45424 18893 15558 40386 33182 1937 -10970 8205 -8670 -6655
814 -6655 34584 46750 69769 35105 -17519 43523 65964 8722 13027 9193 -20898 -28799 11278
801 11278 -4939 -19491 -10363 -14493 -66560 -2143 32775 -21058 -20565 -50431 -25125 119 9394
788 9394 -46512 -25969 -14505 29418 34073 26038 39690 51530 60128 3359 -22020 7910 -18249
775 -18249 -38570 -18252 -20967 6951 27312 22070 48306 77739 52006 14304 9400 -4665 9467
762 9467 7747 23885 21176 30461 46516 26591 38346 26679 -2504 -23064 -29422 -26439 -6762
749 -6762 -9321 27376 11518 27245 44124 14103 31253 10981 9099 25102 23781 2669 -460
736 -460 638 7248 -948 -3512 -4583 -31231 -10061 41317 33372 80385 29629 16527 22411 60503
722F0503j8606k2450K0748q709k3805J7313K1587J169j8061M3062m2345L0940
710F1346p606l9951J9770l1040k7270J6531M4879r318J3096J9816j6018j1328
698C2907M2091k2857J5782k1238l190n852P397k419L7609k6204k9195j9282L0951
685C6500K7354m1200n29J4775n3833N4378L0122K364r709k7876k4081L6543k8023
672A6785j847k2780k2817L083k2214M4047J9010q280L084J9107j704M5737p26
659G0485m2920J6877O091k9383l4153p681K9604j249J7774J8671l9875k4233M6089
646B6097j6263L4396k4621r222K2202k9128L1537M293J0988o496j9548K2201j8366
633B8070k7210J0657P575K872j1842J6067K4397m1979N658K7839l7279l1521K104
$$ plain form
722 60503 41897 19447 40195 31486 7681 24994 46581 47750 29689 72751 30406 61346
710 61346 53740 13789 33559 2519 -24751 -8220 36659 27341 40437 60253 44235 32907
698 32907 74998 52141 67923 46685 43495 37643 45040 42621 80230 54026 24831 5549 36500
685 36500 63854 22654 22125 36900 -16933 37445 67567 69931 60222 32346 8265 44808 16785
672 16785 14938 -7842 -30659 -27576 -49790 -5743 13267 4987 8071 27178 25474 71211 70485
659 70485 27565 44442 50533 21150 -13003 -20684 8920 7671 25445 44116 4241 -19992 26097
646 26097 9834 44230 19609 10387 32589 3461 34998 39291 50279 43783 24235 46436 28070
633 28070 860 11517 19092 21964 10122 26189 50586 8607 14265 42104 4825 -26696 -24592
620b4592J1322m81m0803N063L5103N3660K6606l7755K5090o425K4144r231l4392
607B7309R234O5459j5887n8745L991K4094j82k3813N691K1810k2830k9915K5342
594C1558R064j8952j8320M3642J105k9834QL3660m765J0168k8374j0501J6975
581C5434n421j4929m100M185j0900k5023J6675K2682O0304l6075P900J1391m1697
568B0426K7162j0039L091J8204j9374k8806J4775J3741m099k6589p390J5073K2911
555C9086l9489M9854K4605l0701n7205J9975L3087m6202K658L9811P516k7973
543A5022J0551l2460J4980L2610k7129n793l6803J3014P1765M0852m6099J3649
531F4159L3326J7335j0479m4923j9084m973P366l024l9227M8632l299j5495P034
$$ plain form
620 -24592 -13270 -13751 -54554 -49491 -14388 39272 65878 28123 53213 46788 70932 61701 27309
607 27309 36543 102002 86115 27370 31361 55455 55273 31460 37151 58961 36131 6216 31558
594 31558 40622 21670 3350 46992 48097 18263 18271 51931 47166 57334 28960 18459 35434
581 35434 30013 15084 10984 15169 4269 -20754 -4079 18603 78907 42832 50732 62123 20426
568 20426 47588 37549 40640 58844 39470 10664 25439 39180 35081 8492 1102 16175 39086
555 39086 -403 49451 74056 43355 -13850 6125 39212 -6990 -4332 35479 42995 15022
543 15022 25573 -6887 8093 40703 13574 7781 -29022 -16008 55757 96609 50510 64159
531 64159 97485 114820 104341 59418 40334 35361 42727 39703 476 49108 45809 30314 37348
518C7348q337o153n638k6816l9780M4621k8919N3421L061l8335N272j4594M1073
505A6224L9117j8453K9121o338k1407j0693m9680K2642K1736j8789O192L5912
493D5584L9573k6659k1506M4266o526k9444j4190J3846m4858J3403J5102j8649
481I942M2529J7685P844l7038J2670J8301K5351n5167L5884l3965K5852O691m151
468G2428k5965K5094j7791M945K8415j8230n091M687m867j2220n5061L4945L7389
455F8678k0247N2616k9916m357m6456k5291M5631J2876k6473J3899k828K8235
443F6367j8899q047j1808N2730l7879j8117K5001K091p46N602j4809k257m3663
430d434j0196J0914K3535j5495M9171O042m6034j2396J6258O414j7441l0855L5241
$$ plain form
518 37348 29011 22858 17220 -9596 -49376 -4755 -33674 19747 22808 -15527 -10255 -24849 16224
505 16224 55341 36888 66009 59671 38264 27571 -22109 533 22269 3480 9672 45584
493 45584 85157 58498 36992 81258 74732 45288 31098 44944 86 13489 28591 9942
481 9942 52471 70156 78000 40962 53632 71933 97284 42117 78001 44036 69888 76579 72428
468 72428 46463 71557 53766 58711 87126 68896 63805 68492 63625 51405 -3656 31289 68678
455 68678 48431 101047 71131 66774 20318 -4973 40658 53534 27061 40960 38132 66367
443 66367 47468 39421 27613 80343 42464 24347 49348 51439 50693 56295 41486 39229 -4434
430 -4434 -14630 -3716 19819 4324 53495 59537 13503 1107 17365 23779 6338 -24517 10724
417A0724J5479r014K558j9821M0276J9842O972j7627J2911j3351J9859R939J910
404H0657k0716J3839j1375k5876L8469J0286J9021m8345l6570N654L9644K9687
392I4375l40q595J0704n3050J5431l0368N382l079P895K4933m5794M8114j9528
379D6080J9502L1021m0518P821j189l2076M1077K639m0206p77K5095K1607o686
366G3390l6987L4701k1722j7082N822j8642P519K9272J5235R376K635L061q579
353G7999n540J4325J1705j30j382m0735l0906r066K9969M8890k3467k1024L5882
340H6520l906j1708M470J686r732q513K3238l8153k4988O0184J0056j3251k5945
327D9958M3040L7257j0026o6067M026J1938R968k2234l4624L8921L3360l3031
$$ plain form
417 10724 26203 17189 19747 -74 40202 60044 67016 49389 62300 48949 68808 78747 80657
404 80657 59941 73780 62405 36529 74998 85284 104305 55960 19390 25044 64688 94375
392 94375 94035 85440 96144 43094 58525 28157 33539 30460 38355 63288 17494 65608 46080
379 46080 65582 96603 56085 63906 62717 30641 71718 74357 34151 33374 58469 80076 73390
366 73390 36403 71104 49382 32300 38122 19480 26999 56271 71506 80882 83517 86578 77999
353 77999 72459 86784 98489 98359 96977 56242 25336 16270 46239 95129 71662 50638 86520
340 86520 82614 70906 75376 77062 67330 58817 82055 43902 18914 79098 89154 75903 49958
327 49958 92998 130255 120229 54162 58188 70126 80094 57860 23236 62157 95517 62486
315F2486L7053M607k2916k0300k186L0799m3527J4835J7991o790O093l7722P21
302D1144K1151Q124K0571n2486J4208j4393k0224K4598K3991l8752K7463J3491
290F8886j8548j372J0421l4350J2392L922J0464j5798M3463j2014q869K3206q174
277G3629p33j1141k7217K8572K4949n2406j5784N1301m250o3972Q386K4117J4174
264D9625N3777o087m924m372m850O2975J7592j1491k8485L0875k0784o4959j1310
251E7582P1201m6641k981J2873k7596m3521Q270p007K8415K0070r242m6669K0579
238C5333K5104J8240o815o655K0297L0631n0446L2446k1460j0694K2346k8333
226E9994N4769q244l885j4417J5193j6515k7238j2898k3698J3060J8895m7883
$$ plain form
315 62486 99539 104146 81230 60930 58744 89543 46016 60851 78842 72052 78145 40423 41144
302 41144 62295 70419 90990 38504 52712 38319 18095 42693 66684 27932 55395 68886
290 68886 50338 48966 59387 25037 37429 41351 51815 36017 79480 67466 58597 81803 73629
277 73629 72896 61755 34538 63110 88059 35653 19869 71170 66920 2948 11334 35451 49625
264 49625 103402 97315 92391 88019 83169 146144 163736 152245 123760 154635 133851 68892 57582
251 57582 128783 82142 79161 92034 64438 20917 29187 22180 50595 70665 61423 14754 35333
238 35333 60437 78677 71862 65207 85504 116135 65689 98135 76675 65981 88327 59994
226 59994 114763 106519 102634 88217 103410 86895 59657 46759 23061 36121 55016 7133
214G133P058K2016L4151l0453l5888O0854N280K2367m103q4429K8579Q746J8319
201E9630k3038k1791J6327J3142k2855R731J3378P632P883L8449k5717j3466j4792
188D4513J8095r559k3663K7709n495k4331K3555N807L4278J6274l1627L150L1139
175A09845k4311k9464M0526M527N175R703k796j3925l8460J607m56K6020n978
162H2013j287K0997J0607j26n3063J5995K7782K5438m1342k5079N721q66l355
149F3435N276k9632k9831M1540K4374J1973J7249m7156J5797n148J7149k4631
137F0395m446N933K30J9988R793J4967j3690n303j7511M0852l1373k834L887K822
123H3710j8945J3574J1194m1648K0078m2535L5142p502N1760j6453k038L270J6567
$$ plain form
214 7133 14191 36207 70358 39905 4017 64871 70151 92518 88415 3986 32565 41311 59630
201 59630 36592 14801 31128 44270 21415 31146 44524 52156 60039 98488 72771 59305 44513
188 44513 62608 53049 29386 57095 51600 27269 50824 56631 90909 107183 75556 78706 109845
175 109845 85534 56070 96596 101123 106298 116001 113205 99280 60820 62427 61971 87991 82013
162 82013 80726 101723 112330 112204 59141 75136 102918 128356 87014 61935 67656 66790 63435
149 63435 68711 39079 9248 50788 75162 87135 104384 57228 73025 67877 85026 60395
137 60395 55949 61882 62112 82100 91893 106860 93170 87867 70356 111208 79835 77001 80888 83710
123 83710 64765 78339 89533 47885 67963 25428 60570 53068 104828 88375 86337 89607 106174
110A06174l4553l6801P496m475K4755l4589l439P969K8421Q522O375j9799L3736
97H9792k5061l0441O840l155J5182l463J9816K6344J5813l8255l2368J0387J3484
84F4915J1163l5447R641K7475J8421q218k4844K2000L731k6340L1236k6211q557
71E8965N377R887L354p873m554K906O203q96J8602q502k9167r637R84J2510k4775
56C3384L9446K9576p026l3226j1851K2826K561k5093k4903K2486r005L6069J1711
43H6955K018l3117K9738k756J1357J0771J247R841n203n706j6067j4170J3563
30H8471j1848J1464M832j6733O918r915o150j3043r733K4545j6960q611K7781
17G1018j424K6310k7452M862L523n692p368J183K3906M184p461l4881o724K3948
$$ plain form
110 106174 71621 34820 42316 37841 62596 28007 24568 32537 60958 69480 75855 56056 89792
97 89792 64731 34290 41130 37975 53157 49694 69510 95854 111667 73412 41044 51431 64915
84 64915 76078 40631 50272 77747 96168 87950 63106 85106 88837 62497 93733 67522 58965
71 58965 64342 74229 77583 69710 65156 68062 74265 73369 91971 83469 54302 44665 45649 58159 33384
56 33384 72830 102406 95380 62154 50303 73129 75690 50597 25694 48180 39175 75244 86955
43 86955 88973 55856 85594 82838 94195 104966 106213 116054 110851 105145 89078 74908 88471
30 88471 76623 88087 92919 76186 83104 73189 67039 53996 44263 68808 51848 43237 71018
17 71018 69594 95904 68452 73314 76837 71145 63777 64960 88866 93050 85589 50708 43984 67932
3F7932K103j3735L2853
0H9153
$$ plain form
3 67932 70035 56300 89153
0 89153
$$ Imaginary data points
##PAGE= N=2
##DATA TABLE= (X++(I..I)), XYDATA
16383a851584K9279L0879K6554N0302K1201Q685P995M6539K1030L8778J9006M7237
16371a504099K7528j0331K9149M541L5727K5692M7707O712J6109j1370N3144M9899
16359a229592L8909L3337K1355n401K9917L3945J16L6178M5260P421J143L1883
16347i55529L9409L9286J8636m102K7844J7146L063K0320J1451L9110J8203N6724
16335f68439o679L4084l790O3707J0411O752M3038M1243J8017k7705L6244L3272
16323d19845J3916K6168J8858P754L4823K0025N8553p090j6093M3934L5524L8197
16311a45276K3764J052N1207K4400l2251L5879R886M7298J5745O398p970M3430
16299G3562M8740L2724J8556l3986j0137K6600M2540J3555K1176J1282M5115M0112
$$ plain form
16383 -1851584 -1822305 -1791426 -1764872 -1714570 -1693369 -1684684 -1676689 -1630150 -1609120 -1570342 -1551336 -1504099
16371 -1504099 -1476571 -1486902 -1457753 -1453212 -1417485 -1391793 -1344086 -1337374 -1321265 -1332635 -1279491 -1229592
16359 -1229592 -1190683 -1157346 -1135991 -1141392 -1111475 -1077530 -1077414 -1041236 -995976 -988555 -987412 -955529
16347 -955529 -916120 -876834 -858198 -862300 -834456 -817310 -814247 -793927 -782476 -743366 -725163 -668439
16335 -668439 -675118 -641034 -644824 -581117 -570706 -563954 -520916 -479673 -461656 -489361 -453117 -419845
16323 -419845 -405929 -379761 -360903 -353149 -318326 -298301 -239748 -246838 -262931 -218997 -183473 -145276
16311 -145276 -121512 -120460 -69253 -44853 -77104 -41225 -31339 15959 31704 38102 30132 73562
16299 73562 122302 155026 173582 139596 129459 156059 198599 212154 233330 244612 289727 329839
16287C29839n458k940K1933N4850j2086J4523R074q560M6583N3838Q123L587M4318
16274E57624J8833n288K6288L7242r299k892L2278K7396J2978Q119J3034J4107
16262G30420k526Q509K0527N2576N382J1994k3946N5255L5331K5898R526j233
$$ plain form
16287 329839 324381 321441 343374 398224 386138 400661 409735 401175 447758 501596 509719 513306 557624
16274 557624 576457 571169 597457 634699 625400 622508 654786 682182 695160 703279 716313 730420
16262 730420 727894 736403 756930 809506 814888 826882 802936 858191 893522 919420 928946 927713
$$ [...]
##END NTUPLES=NMR SPECTRUM
##END=
