##TITLE=1H_EC-3254(5-22)
 CDCl3, 8 sc, 
 9.07.2021
##JCAMPDX= 6.0         $$ Bruker NMR JCAMP-DX V2.0
##DATA TYPE= NMR SPECTRUM
##DATA CLASS= NTUPLES
##ORIGIN= UXNMR, Bruker Analytische Messtechnik GmbH
##OWNER= root
$$ XWIN-NMR		Version 3.5
$$ Fri Jul  9 09:30:36 2021 Russian Standard Time (UT+4h)  she@DPX200
##.OBSERVE FREQUENCY= 200.131506
##.OBSERVE NUCLEUS= ^1H
##.ACQUISITION MODE= SIMULTANEOUS
##.ACQUISITION SCHEME= undefined
##.AVERAGES= 8
##.DIGITISER RES= 18
##SPECTROMETER/DATA SYSTEM= spect
##.PULSE SEQUENCE= zg30
##.SOLVENT NAME= CDCl3
##.SHIFT REFERENCE= (INTERNAL, CDCl3, 0, 17.5069)
##AUDIT TRAIL= $$ (NUMBER, WHEN, WHO, WHERE, WHAT)
$$ ##TITLE= Audit trail, XWIN-NMR		Version 3.5
$$ ##JCAMPDX= 5.01
$$ ##ORIGIN= Bruker BioSpin GmbH
$$ ##OWNER= she
$$ F:/spectra/data/she/nmr/H-F/1/pdata/1/auditp.txt
$$ ##AUDIT TRAIL=  $$ (NUMBER, WHEN, WHO, WHERE, WHAT)
(   1,<2021-07-09 09:29:17.04 +0400>,<she>,<DPX200>,
      <created by zg, POWCHK disabled, PULCHK disabled
       configuration hash MD5:
       00 E9 B6 7A A2 85 ED C7 34 08 36 98 17 FE 4E 26
       data hash MD5: 16K
       24 49 70 2E EA BB F4 98 28 D4 5D E5 3F CC E4 22>)
(   2,<2021-07-09 09:29:19.78 +0400>,<she>,<DPX200>,
      <Start of raw data processing
       efp BC_mod = 2 LB = 0.24 FT_mod = 6 PKNL = 1 PHC0 = -12280.18 PHC1 = 21.80101 SI = 16K 
       data hash MD5: 16K
       70 D7 6C 28 DB E7 3B D1 65 31 41 EE BA F9 0A E0>)
(   3,<2021-07-09 09:29:40.81 +0400>,<she>,<DPX200>,
      <pk PHC0 = 1.444292 PHC1 = -2.6 
       data hash MD5: 16K
       1F 73 22 55 72 1C 1C 2B 5E B8 6E AA B8 96 B1 CD>)
(   4,<2021-07-09 09:29:43.89 +0400>,<she>,<DPX200>,
      <abs ABSG = 5 
       data hash MD5: 16K
       8E 7A D3 56 67 CE 60 95 2E D3 EF 4E 5F 82 74 41>)
$$ ##END=
$$ 
$$ hash MD5
$$ 17 37 37 01 BC F7 A7 57 B8 33 67 EF F1 B2 AF A9
##$RELAX= 
##$RELAX= 
##$RELAX= 
##$RELAX= 
##$RELAX= 
##$RELAX= 
$$ Bruker specific parameters
$$ --------------------------
##$DU= <F:/spectra>
##$EXPNO= 1
##$NAME= <H-F>
##$PROCNO= 1
##$TYPE= <nmr>
##$USER= <she>
##$AMP= (0..31)
100 100 100 100 100 100 100 100 100 100 100 100 100 100 100 100 100 100 
100 100 100 100 100 100 100 100 100 100 100 100 100 100 
##$AQSEQ= 0
##$AQ_mod= 1
##$AUNM= <au_zg>
##$AUTOPOS= <>
##$BF1= 200.13
##$BF2= 200.13
##$BF3= 200.13
##$BF4= 200.13
##$BF5= 200.13
##$BF6= 200.13
##$BF7= 200.13
##$BF8= 200.13
##$BYTORDA= 1
##$CFDGTYP= 0
##$CFRGTYP= 5
##$CHEMSTR= <none>
##$CNST= (0..31)
1 1 145 1 1 1 1 1 1 1 1 1 1 1 1 1 1 1 1 1 1 1 1 1 1 1 1 1 1 1 1 1 
##$CPDPRG= <>
##$CPDPRG1= <>
##$CPDPRG2= <>
##$CPDPRG3= <>
##$CPDPRG4= <mlev>
##$CPDPRG5= <mlev>
##$CPDPRG6= <mlev>
##$CPDPRG7= <mlev>
##$CPDPRG8= <mlev>
##$CPDPRGB= <>
##$CPDPRGT= <>
##$D= (0..31)
0 1.2 0 0 0 0 0 0 0 0.06 0 0.03 0 0 0 0 0.0002 0 0 0 0 0 0 0 0 0 0 0 0 
0 0 0 
##$DATE= 1625808556
##$DBL= (0..7)
120 120 120 120 120 120 120 120 
##$DBP= (0..7)
150 150 150 150 150 150 150 150 
##$DBP07= 0
##$DBPNAM0= <>
##$DBPNAM1= <>
##$DBPNAM2= <>
##$DBPNAM3= <>
##$DBPNAM4= <>
$$ [...]
##$SUBNAM3= <"">
##$SUBNAM4= <"">
##$SUBNAM5= <"">
##$SUBNAM6= <"">
##$SUBNAM7= <"">
##$SUBNAM8= <"">
##$SUBNAM9= <"">
##$SW= 20.0188882624521
##$SWIBOX= (0..15)
0 0 2 0 0 0 0 0 0 0 0 0 0 0 0 0 
##$SW_h= 4006.41025641026
##$TD= 16384
##$TD0= 1
##$TE= 0
##$TE2= 300
##$TE3= 300
##$TEG= 300
##$TL= (0..7)
0 120 120 120 120 120 120 120 
##$TP= (0..7)
150 150 150 150 150 150 150 150 
##$TP07= 0
##$TPNAME0= <>
##$TPNAME1= <>
##$TPNAME2= <>
##$TPNAME3= <>
##$TPNAME4= <>
##$TPNAME5= <>
##$TPNAME6= <>
##$TPNAME7= <>
##$TPOAL= (0..7)
0.5 0.5 0.5 0.5 0.5 0.5 0.5 0.5 
##$TPOFFS= (0..7)
0 0 0 0 0 0 0 0 
##$TUNHIN= 0
##$TUNHOUT= 0
##$TUNXOUT= 0
##$USERA1= <user>
##$USERA2= <user>
##$USERA3= <user>
##$USERA4= <user>
##$USERA5= <user>
##$V9= 5
##$VALIST= <valist>
##$VCLIST= <CCCCCCCCCCCCCCC>
##$VD= 0
##$VDLIST= <DDDDDDDDDDDDDDD>
##$VPLIST= <PPPPPPPPPPPPPPP>
##$VTLIST= <TTTTTTTTTTTTTTT>
##$WBST= 1024
##$WBSW= 4
##$XGAIN= (0..3)
0 0 0 0 
##$XL= 0
##$YL= 0
##$YMAX_a= 287657
##$YMIN_a= -482030
##$ZGOPTNS= <>
##$ZL1= 120
##$ZL2= 120
##$ZL3= 120
##$ZL4= 120
##$ABSF1= 17.51055
##$ABSF2= -2.50849
##$ABSG= 5
##$ABSL= 3
##$ALPHA= 0
##$AQORDER= 0
##$ASSFAC= 0
##$ASSFACI= 0
##$ASSFACX= 0
##$ASSWID= 0
##$AUNMP= <proc_1d>
##$AZFE= 0.1
##$AZFW= 0.1
##$BCFW= 0
##$BC_mod= 2
##$BYTORDP= 0
##$COROFFS= 0
##$CY= -3
##$DATMOD= 1
##$DC= 0
##$DFILT= <>
##$DTYPP= 0
##$F1P= 0
##$F2P= 0
##$FCOR= 1
##$FTSIZE= 16384
##$FT_mod= 6
##$GAMMA= 0
##$GB= 0
##$INTBC= 1
##$INTSCL= 1.334414e-10
##$ISEN= 128
##$LB= 0.24
##$LEV0= 0
##$LPBIN= 0
##$MAXI= 10000
##$MC2= 0
##$MEAN= 0
##$ME_mod= 0
##$MI= 1.114404
##$NCOEF= 0
##$NC_proc= -7
##$NLEV= 6
##$NOISF1= 3.799351
##$NOISF2= 2.8
##$NSP= 0
##$NTH_PI= 0
##$NZP= 0
##$OFFSET= 17.50688
##$PC= 1
##$PHC0= -12278.74
##$PHC1= 19.20101
##$PH_mod= 1
##$PKNL= yes
##$PPARMOD= 0
##$PSCAL= 0
##$PSIGN= 0
##$REVERSE= no
##$SF= 200.130005552685
##$SI= 16384
##$SIGF1= 3
##$SIGF2= 2
##$SINO= 5.538805
##$SIOLD= 16384
##$SREGLST= <1H.CDCl3>
##$SSB= 0
##$STSI= 16384
##$STSR= 0
##$SW_p= 4006.41025641026
##$SYMM= 0
##$S_DEV= 0
##$TDeff= 16384
##$TDoff= 0
##$TI= <>
##$TILT= no
##$TM1= 0
##$TM2= 0
##$TOPLEV= 0
##$USERP1= <user>
##$USERP2= <user>
##$USERP3= <user>
##$USERP4= <user>
##$USERP5= <user>
##$WDW= 1
##$XDIM= 16384
##$YMAX_p= 409843878
##$YMIN_p= -487429
$$ End of Bruker specific parameters
$$ ---------------------------------
##NTUPLES= NMR SPECTRUM
##VAR_NAME=  FREQUENCY,     SPECTRUM/REAL,   SPECTRUM/IMAG
##SYMBOL=    X,             R,               I
##VAR_TYPE=  INDEPENDENT,   DEPENDENT,       DEPENDENT
##VAR_FORM=  AFFN,          ASDF,            ASDF
##VAR_DIM=   16384,         16384,           16384
##UNITS=     HZ,            ARBITRARY UNITS, ARBITRARY UNITS
##FACTOR=    0.24454680195387, 1,            1
##FIRST=     3503.65195288875, 0,            0
##LAST=      -502.758303521513, 0,           0
##MIN=       -502.758303521513, -487429,     0
##MAX=       3503.65195288875, 409843878,    0
$$ Real data points
##PAGE= N=1
##DATA TABLE= (X++(R..R)), XYDATA
$$ [...]
6087G324530k90379j56780m6193j26190l53491k96795j2172j09357k95929k18819
$$ 7324530 7034151 6877371 6831178 6704988 6351497 6054702 6042530 5933173 5637244 5418425
6077E418425j11738j92985j01732l28465j94347j20596R4319r5990n9002k09749
$$ 5418425 5306687 5113702 5011970 4683505 4489158 4368562 4462881 4366891 4307889 4098140
6067D098140j63459k65886L9876n2082K3648l25284q2745q260j40838N1133r4983
$$ 4098140 3934681 3668795 3708671 3656589 3680237 3354953 3272208 3263948 3123110 3174243 3079260
6056C079260o9789N2610j72003k8908j38139Q6845q9185j16385M1028r9640j7085
$$ 3079260 3009471 3062081 2890078 2861170 2723031 2809876 2720691 2604306 2645334 2545694 2528609
6045B528609j51146j4451p8936o2629j05100j48526J16730p6277j6856j75883
$$ 2528609 2377463 2363012 2284076 2221447 2116347 1967821 2084551 2008274 1991418 1815535
6035A815535J34492P859j4951l8960o1039O4178j11524l1368k46626k1592k88430
$$ 1815535 1950027 1957886 1942935 1903975 1842936 1907114 1795590 1764222 1517596 1496004 1207574
6024A207574J22232N5977R9452j1984r8136R2925p1432J02339j14156K5937N751
$$ 1207574 1329806 1385783 1485235 1473251 1375115 1468040 1396608 1498947 1384791 1410728 1416479
6013A416479j00791P449l2670J54771j51371M1184k0707j31677Q7097L9490j68358
$$ 1416479 1315688 1323137 1290467 1445238 1293867 1335051 1314344 1182667 1269764 1309254 1140896
6002A140896J84604J17033q4456j17521o6476J51616j99729P9929R9722j37181
$$ 1140896 1325500 1442533 1358077 1240556 1174080 1325696 1125967 1205896 1305618 1168437
5992A168437J65936J00178k5150j75219k3602j53810R116M0734o3362J25957j51240
$$ 1168437 1334373 1434551 1409401 1234182 1210580 1056770 1065886 1106620 1043258 1169215 1017975
5981A017975O2281N6395J7477J53624n0603j85737j125m4990P1461N510m1521
$$ 1017975 1080256 1136651 1154128 1307752 1257149 1071412 1070287 1025297 1096758 1102268 1060747
5970A060747l733J77103j4151J2341k8825j346J80157q6230r596l1255P3598p0197
$$ 1060747 1057014 1234117 1219966 1232307 1203482 1202136 1382293 1296063 1286467 1255212 1328810 1258613
5958A258613m5146j93421Q7951L3821k23983K7213l9294j78509J99765j44000
$$ 1258613 1213467 1020046 1107997 1141818 917835 945048 905754 727245 927010 783010
5948G83010Q3348K18391r9436Q121L7028J00066j2000j79080J13762J7442k6025
$$ 783010 866358 1084749 985313 993434 1030462 1130528 1118528 939448 1053210 1070652 1044627
5937A044627r2956O1272j63920m9639L4419P9924P8469k2006l4216J02694n3582
$$ 1044627 951671 1012943 849023 799384 833803 913727 992196 970190 935974 1038668 985086
5926I85086Q1662k8432j40059l0J7026P4553O2174q1423K798j69734q8731K03423
$$ 985086 1066748 1038316 898257 898227 915253 989806 1051980 970557 973355 803621 714890 918313
5914I18313j86197J20302k1788L3142o9283J99983J78948q6984J58500l6231k43101
$$ 918313 732116 852418 830630 863772 794489 994472 1173420 1086436 1244936 1208705 965604
5903I65604P040L9887k2262K42642J33652k07329j21024j90754J26245J44569
$$ 965604 972644 1012531 990269 1232911 1366563 1159234 1038210 847456 973701 1118270
5893A118270L5309j15807P7050K1739j30325P8626Q2669j53830o6428P7966J93234
$$ 1118270 1153579 1037772 1114822 1136561 1006236 1084862 1167531 1013701 947273 1025239 1218473
5882A218473M4306l3488M575j08049l755Q6530j50564J01682O1445K14881j85037
$$ 1218473 1262779 1229291 1233866 1125817 1122062 1208592 1058028 1159710 1221155 1436036 1250999
5871A250999o3618K93816l1886L0341M0577O9154M0585j50569j14677K47542k6765
$$ 1250999 1187381 1481197 1449311 1479652 1520229 1589383 1629968 1479399 1364722 1612264 1585499
5860A585499k9058O7863M805j4231J60818K85152P4884J77189j1000Q3329o7356
$$ 1585499 1556441 1624304 1629109 1614878 1775696 2060848 2135732 2312921 2301921 2385250 2317894
5849B317894L0603k16316j7375j08369o5494j5473l3164J7265p8068j40084J09401
$$ 2317894 2348497 2132181 2114806 2006437 1940943 1925470 1892306 1909571 1831503 1691419 1800820
5838A800820j22439m5715k09124O4810J07664k02193L3925q9513J90195o5448
$$ 1800820 1678381 1632666 1423542 1488352 1596016 1393823 1427748 1338235 1528430 1462982
5828A462982K0006k5477M4046M3227j97506R9300J2757m4160J64183Q534K6405
$$ 1462982 1482988 1457511 1501557 1544784 1347278 1446578 1459335 1415175 1579358 1587892 1614297
5817A614297J3589J5947j91398Q4453m3217O0920m3573j7358M6852l1974N8526
$$ 1614297 1627886 1643833 1452435 1536888 1493671 1554591 1511018 1493660 1540512 1508538 1567064
5806A567064R6800r6399L4219R3694K2493j02258N9843n88R6402j10631j78191
$$ 1567064 1663864 1567465 1601684 1695378 1717871 1615613 1675456 1674868 1771270 1660639 1482448
5795A482448R7653l0979N9372L7754j35817J28076l2131j9240l7640P1071j01129
$$ 1482448 1580101 1549122 1608494 1646248 1510431 1638507 1606376 1587136 1549496 1620567 1519438
5784A519438j30639R7494J16321j31656J01630M7039m7770J34142J12120k08403
$$ 1519438 1388799 1486293 1602614 1470958 1572588 1619627 1571857 1705999 1818119 1609716
5774A609716j22368N4349M457n4791O584K14723K1088l6016L8880j32246R2566
$$ 1609716 1487348 1541697 1546154 1491363 1497947 1712670 1733758 1697742 1736622 1604376 1696942
5763A696942o4918k3435N6024m3619J27011q0644q0275J12855j22371p351O2104
$$ 1696942 1632024 1608589 1664613 1620994 1748005 1667361 1587086 1699941 1577570 1570219 1632323
5752A632323r4167M7704Q5982q5046j28876K88872Q1850j24329k38894Q6706J4538
$$ 1632323 1538156 1585860 1671842 1586796 1457920 1746792 1828642 1704313 1465419 1552125 1566663
5741A566663l4998K12971j44908m4334P8988q9366R9412j53148j23036K82155
$$ 1566663 1531665 1744636 1599728 1555394 1634382 1545016 1644428 1491280 1368244 1650399
5731A650399L00252j5735P4073Q1653K50847j17267O4634P527j07899Q1146L2662
$$ 1650399 1950651 1934916 2008989 2090642 2341489 2224222 2288856 2296383 2188484 2269630 2302292
5720B302292q5312m2583J35814k00566j22434K02047J17094l0458j47857J09057
$$ 2302292 2216980 2174397 2310211 2109645 1987211 2189258 2306352 2275894 2128037 2237094
5710B237094R5505J79412j12027l1485K9584j55512J71289n8940O0556R1709N988
$$ 2237094 2332599 2512011 2399984 2368499 2398083 2242571 2413860 2354920 2415476 2507185 2513173
5699B513173J28782m0733O6529m229J39739N3607L5332P7727q1678J21144j4048
$$ 2513173 2641955 2601222 2667751 2663522 2803261 2856868 2892200 2969927 2888249 3009393 2995345
5688B995345M4348O5325n2986J48772P6155j3706N1415J97789K83466K9953j04756
$$ 2995345 3039693 3105018 3052032 3200804 3276959 3263253 3314668 3512457 3795923 3825876 3721120
5677C721120R4291J36414J29682J2124P7198L5656J1937J39013K29399J57652
$$ 3721120 3815411 3951825 4081507 4093631 4170829 4206485 4218422 4357435 4586834 4744486
5667D744486l5427J92178K03237K5392Q4419J74915M7303L66691J26224j21344
$$ 4744486 4709059 4901237 5104474 5129866 5214285 5389200 5436503 5803194 5929418 5808074
5657E808074j6271L08801L33917m3939J10467K37424Q5021K47526J97301K05177
$$ 5808074 5791803 6100604 6434521 6390582 6501049 6738473 6823494 7071020 7268321 7473498
5647G473498L29706K43502L58148K75843J38563L55437J68645J88381L71841L82535
$$ 7473498 7803204 8046706 8404854 8680697 8819260 9174697 9343342 9531723 9903564 10286099
5637A0286099L51042J86166L41981M96295M42674M86075M16403P26815Q19282
$$ 10286099 10637141 10823307 11165288 11661583 12104257 12590332 13006735 13733550 14552832
5628A4552832M40919P79093P22647O80400J125502J473542J222134J569143J772450
$$ 14552832 14993751 15772844 16495491 17175891 18301393 19774935 20997069 22566212 24338662
5619B4338662J662168J709218J795337J794332J770697K047467K185723K567801
$$ 24338662 26000830 27710048 29505385 31299717 33070414 35117881 37303604 39871405
5611C9871405K394416K389688J826350Q99010k41567j312156j807424k110114
$$ 39871405 42265821 44655509 46481859 47380869 47139302 45827146 44019722 41909608
5603D1909608j630604j427255j013937l99165j55583L44893P55764J287012J779818
$$ 41909608 40279004 38851749 37837812 37438647 37283064 37627957 38383721 39670733 41450551
5594D1450551K112585K584534K829569K958443K894339K773952K911781K954747
$$ 41450551 43563136 46147670 48977239 51935682 54830021 57603973 60515754 63470501
5586F3470501L356984L970521M435249M374090L085602J673516n62051l699481
$$ 63470501 66827485 70798006 75233255 79607345 82692947 84366463 83804412 80104931
5578H0104931o012100o772074o358451n686089m205268l271577k788681k140017
$$ 80104931 74092831 67320757 60962306 55276217 51070949 47799372 45010691 42870674
5570D2870674j375104q73002q00254J09139L09514O61826J190646Q77066J096094
$$ 42870674 41495570 40622568 39822314 39931453 40240967 40902793 42093439 42970505 44066599
5561D4066599R31938N66845N99697Q28325R09445R24670M36191J20381q57021
$$ 44066599 44998537 45565382 46165079 46993404 47902849 48827519 49263710 49384091 48527070
5552D8527070k112827l144905l671402l517898l397494l009152k434340k096813
$$ 48527070 46414243 43269338 39597936 36080038 32682544 29673392 27239052 25142239
5544B5142239j902018j432959j210883j066298j003519p33241p53793o42712n01433
$$ 25142239 23240221 21807262 20596379 19530081 18526562 17793321 17039528 16396816 15895383
5535A5895383k86950m45383n57447m80918o55390o57330o64073o04237m66201
$$ 15895383 15608433 15163050 14605603 14124685 13469295 12811965 12147892 11543655 11077454
5526A1077454l54846n48909n16719l57188k68044l56177q2724k83428k31559j04644
$$ 11077454 10722608 10173699 9656980 9299792 9031748 8675571 8592847 8309419 8077860 7973216
5516G973216k60705m35979k91519J1945l54776k18645o8330j65587j56915j54749
$$ 7973216 7712511 7276532 6985013 6996958 6642182 6423537 6355207 6189620 6032705 5877956
5506E877956k34893m1191J12705j01337k44285j000j51797k02708J2031J00491
$$ 5877956 5643063 5601872 5714577 5613240 5368955 5367955 5216158 5013450 5025481 5125972
5496E125972J8831k10094K7335l503j03440n3270j36247l0044j27655p9541k8665
$$ 5125972 5144803 4934709 4962044 4958541 4855101 4801831 4665584 4635540 4507885 4428344 4399679
5485D399679k23503J46483L2985j36715J47116j10151j88954M8644R2049J1508
$$ 4399679 4176176 4322659 4355644 4218929 4366045 4255894 4066940 4115584 4207633 4219141
5475D219141K5087K062L1500J8982M862J1791l8815O1012J50294p2218m0815K14393
$$ 4219141 4244228 4246290 4277790 4296772 4301634 4313425 4274610 4335622 4485916 4413698 4372883 4587276
5463D587276J62490N4610j52024q2404K6056L0284m9215J42798j08590q5475K8417
$$ 4587276 4749766 4804376 4652352 4569948 4596004 4626288 4577073 4719871 4611281 4525806 4554223
5452D554223k2000L8899r6581q5731N6980K52246j00134n8953J03589J89604K20760
$$ 4554223 4532223 4571122 4474541 4388810 4445790 4698036 4597902 4538949 4642538 4832142 5052902
5441E052902J17995M5865K32510j25905J11613o7914M42026K94538R5680J98277
$$ 5052902 5170897 5216762 5449272 5323367 5434980 5367066 5809092 6103630 6199310 6397587
5431F397587J50222J74022p220q3928p5503J39984J63412J70058J78049K15909
$$ 6397587 6547809 6721831 6714611 6630683 6555180 6695164 6858576 7028634 7206683 7422592
5421G422592O9372K38123M52528L69191M12359L21682O32098O31576N99700Q16243
$$ 7422592 7491964 7730087 8182615 8551806 8964165 9285847 9917945 10549521 11149221 11965464
5411A1965464O88954R10123J073213J070460R28975P65896L31754K74297j96225
$$ 11965464 12654418 13564541 14637754 15708214 16637189 17403085 17734839 18009136 17812911
5402A7812911o53440r34828q37174p35062m87297l59451n52488l16814j82186
$$ 17812911 17159471 16224643 15387469 14652407 14165110 13805659 13253171 12936357 12754171
5393A2754171j18803K94516M57696L89889M91664N64270O33662J053919J171396
$$ 12754171 12635368 12929884 13387580 13777469 14269133 14833403 15467065 16520984 17692380
5384A7692380J233417J152877J531687J593158J777096J677202J349149J121030
$$ 17692380 18925797 20078674 21610361 23203519 24980615 26657817 28006966 29127996
5376B9127996N26313O3813q68304j328352j730049j891391j815406j607549j578487
$$ 29127996 29654309 29718122 28849818 27521466 25791417 23900026 22084620 20477071 18898584
5367A8898584j372469r70050r34550o82882o15362n86395j04806l17208j78580
$$ 18898584 17526115 16556065 15621515 14938633 14323271 13736876 13632070 13314862 13136282
5358A3136282O6349L82276L07973K77267P73470N38452O22327O90462R85171Q02115
$$ 13136282 13202631 13584907 13892880 14170147 14943617 15482069 16104396 16794858 17780029 18582144
5348A8582144N74894K52246k06033n94147r78138j043802j001437j052579r42856
$$ 18582144 19157038 19409284 19203251 18609104 17630966 16587164 15585727 14533148 13590292
5339A3590292p80663q76764p23415l68256o09147p79325m39689k38162n24453
$$ 13590292 12809629 11932865 11209450 10841194 10232047 9452722 9013033 8774871 8250418
5330H250418k53489l90462l64913m16085j45477k31955n5433l4799m3490l4996
$$ 8250418 7996929 7606467 7241554 6825469 6679992 6448037 6392604 6357805 6314315 6279319
5320F279319k97207j53246O5800N5923K39786J24923k57622J19314K05771j24933
$$ 6279319 5982112 5828866 5894666 5950589 6190375 6315298 6057676 6176990 6382761 6257828
5310F257828M7041l7212j40486j57419m10380k18920j43215k25496j46311o0067
$$ 6257828 6304869 6267657 6127171 5969752 5559372 5340452 5197237 4971741 4825430 4765363
5300D765363k25421q7118k28028n3280j67763j28073Q0570j21212L4187J2597
$$ 4765363 4539942 4452824 4224796 4171516 4003753 3875680 3956250 3835038 3869225 3881822
5290C881822q6960k4238N2130R2742n5223J25620j84434N2327O9539j28093n3686
$$ 3881822 3794862 3770624 3822754 3915496 3860273 3985893 3801459 3853786 3923325 3795232 3741546
5279C741546L0866o6266j9933k4605q4168k25434O2317r6157m6186r6496K7461
$$ 3741546 3772412 3706146 3686213 3661608 3577440 3352006 3414323 3318166 3271980 3175484 3202945
5268C202945N0062J03009J8845r0939k54993o1210K68962J38301q6145j69847
$$ 3202945 3253007 3356016 3374861 3283922 3028929 2967719 3236681 3374982 3288837 3118990
5258C118990k12771k4347m3181j33175k4534J31552n977J06700J8888j16049P4484
$$ 3118990 2906219 2881872 2838691 2705516 2680982 2812534 2806557 2913257 2932145 2816096 2890580
5247B890580q6814m3996P8257L1963o4418p602j41961m7335j3737J56593K53679
$$ 2890580 2803766 2759770 2838027 2869990 2805572 2797970 2656009 2608674 2594937 2751530 3005209
5236C005209r6341q2521r2072o2982J32785j25833Q1077J43416J37585J24122
$$ 3005209 2908868 2826347 2734275 2671293 2804078 2678245 2759322 2902738 3040323 3164445
5226C164445l6562o6282J56970O7037J07515o9265J02155p3489m1276j30911m3403
$$ 3164445 3127883 3061601 3218571 3285608 3393123 3323858 3426013 3352524 3311248 3180337 3136934
5215C136934p5896j98275J09985r895K597k08289q7779J36515p3259K4513J06926
$$ 3136934 3061038 2862763 2972748 2962853 2965450 2757161 2669382 2805897 2732638 2757151 2864077
5204B864077j96180k59365L21328K0803k33140K6331k5685N9161M2320o8564p6923
$$ 2864077 2667897 2408532 2729860 2750663 2517523 2543854 2518169 2577330 2619650 2551086 2474163
5193B474163q3029P4094k7430n5345K13787J24189j265j54937o1056J10818j5548
$$ 2474163 2391134 2465228 2437798 2382453 2596240 2720429 2719164 2564227 2503171 2613989 2598441
5182B598441j49428N2256J5198j32768L0105R717j42986p6904J75013J04526l05942
$$ 2598441 2449013 2501269 2516467 2383699 2413804 2423521 2280535 2203631 2378644 2483170 2177228
5171B177228q9807P0454K49163r7064j11463J22417j59279p6595j20952J82444
$$ 2177228 2087421 2157875 2407038 2309974 2198511 2320928 2161649 2085054 1964102 2146546
5161B146546O2312N4901m7516J41597O1285k42198K8322k7717O1626J23737k9414
$$ 2146546 2208858 2263759 2216243 2357840 2419125 2176927 2205249 2177532 2239158 2362895 2333481
5150B333481O5617J05624K5135J25794l7789K3678M5932p0895J72246J74082J39589
$$ 2333481 2399098 2504722 2529857 2655651 2617862 2641540 2687472 2616577 2788823 2962905 3102494
5139C102494l5827j21994j92030m297J40883r4258J37191j53260k1566J21654
$$ 3102494 3066667 2944673 2752643 2748346 2889229 2794971 2932162 2778902 2757336 2878990
5129B878990O5959Q6975j4682M0934P2671o2227j04192J71617O9166K290J00504
$$ 2878990 2944949 3031924 3017242 3058176 3130847 3068620 2964428 3136045 3205211 3207501 3308005
5118C308005P3794m7140K678J9751K3021p1945J22707k8743j35472O1194K10835
$$ 3308005 3381799 3334659 3337337 3357088 3380109 3308164 3430871 3402128 3266656 3327850 3538685
5107C538685N2966p3811O052K3028K00650k2779R0974J33217J29809J70989M2074
$$ 3538685 3591651 3517840 3523892 3546920 3747570 3724791 3815765 3948982 4078791 4249780 4291854
5096D291854M1715m4761Q4579R7642o217L05962j25564p3995J99485N8210K31154
$$ 4291854 4333569 4288808 4373387 4471029 4464812 4770774 4645210 4571215 4770700 4828910 5060064
5085E060064P6078J39946K62658K15298k5965K1406r9374O185J08598J17070P6521
$$ 5060064 5136142 5276088 5538746 5754044 5728079 5749485 5650111 5656296 5764894 5881964 5958485
5074E958485k3982J02062J88704R5339L51306K13331j003Q1210K60346J78231
$$ 5958485 5934503 6036565 6225269 6320608 6671914 6885245 6884242 6965452 7225798 7404029
5064G404029L63859M78123K0012M15498L27635L98157K35065L14645K73991M16992
$$ 7404029 7767888 8246011 8266023 8681521 9009156 9407313 9642378 9957023 10231014 10648006
5054A0648006L97562M97773K37355J47480K09724J53361J69789L53596L42057
$$ 10648006 11045568 11543341 11780696 11928176 12137900 12291261 12461050 12814646 13156703
5045A3156703J69328N21544O39186M76317L42224O30346O49044M87207O77280
$$ 13156703 13326031 13847575 14486761 14963078 15305302 15935648 16584692 17071899 17749179
5036A7749179Q27456N77379N91939O22841Q33292O87366P94805J171416J088491
$$ 17749179 18576635 19154014 19745953 20368794 21202086 21889452 22684257 23855673 24944164
5027B4944164J064243J349804J555033J894306J793317J839714J908683K316267
$$ 24944164 26008407 27358211 28913244 30807550 32600867 34440581 36349264 38665531
5019C8665531K728642L067092L586133L755377M020573M491155M750027M550348
$$ 38665531 41394173 44461265 48047398 51802775 55823348 60314503 65064530 69614878
5011F9614878M686672M591678M228081L865398L247266K492195J813649J244716
$$ 69614878 74301550 78893228 83121309 86986707 90233973 92726168 94539817 95784533
5003I5784533R46488J030812J206834J484471K172000K731793L311954M082400
$$ 95784533 96731021 97761833 98968667 100453138 102625138 105356931 108668885 112751285
4995A12751285M975495N061540M935255M809974M356584L543244K524386J041657
$$ 112751285 117726780 122788320 127723575 132533549 136890133 140433377 142957763 143999420
4987A43999420r61807l076080n092902o685724p817371q133390q050954q277073
$$ 143999420 143037613 139961533 134868631 128182907 120365536 112232146 104181192 95904119
4979I5904119p991057p526530p056736o604627n858370n119578m558230m158915
$$ 95904119 87913062 80386532 73329796 66725169 60866799 55747221 51188991 47030076
4971D7030076l459783k955214k791363k451629j962906j733552j804594j695748
$$ 47030076 43570293 40615079 37823716 35372087 33409181 31675629 29871035 28175287
4963B8175287j470774j093076j242937j142067j114320p60974p53059q65065o62143
$$ 28175287 26704513 25611437 24368500 23226433 22112113 21351139 20598080 19733015 19070872
4954A9070872o50003p11264o96268l92709m75362m99013l00340n39545n06130
$$ 19070872 18420869 17709605 17013337 16620628 16145266 15646253 15345913 14806368 14300238
4945A4300238m99835m72563l10384k86211m21130l59166k04862l27359m34117
$$ 14300238 13800403 13327840 13017456 12731245 12310115 11950949 11746087 11418728 10984611
4936A0984611l75393k67745o8803l55147k06448j60309j83323k47589k63582J0677
$$ 10984611 10609218 10341473 10272670 9917523 9711075 9550766 9367443 9119854 8856272 8866949
4926H866949j62559k31370j58123j47420k25839p9746R9352j94083k14126j43629
$$ 8866949 8704390 8473020 8314897 8167477 7941638 7861892 7961244 7767161 7553035 7409406
4916G409406l94082o1217k4999J2100j9423n1459M32l4596J27254j54263J90835
$$ 7409406 7015324 6954107 6929108 6941208 6921785 6870326 6870758 6836162 6963416 6809153 6999988
4905F999988K83737J22678p6789K22236J81300M38977j4990L2883K1970k33825
$$ 6999988 7283725 7406403 7329614 7551850 7733150 8172127 8157137 8190020 8211990 7978165
4895G978165l20292k14731k06669l82006o7696n4722M9401l48497l67508l52759
$$ 7978165 7657873 7443142 7236473 6854467 6786771 6732049 6781450 6432953 6065445 5712686
4885E712686j59955k63260j83177k24082j73674j83168j04427J04203j25946L9274
$$ 5712686 5552731 5289471 5106294 4882212 4708538 4525370 4420943 4525146 4399200 4438474
4875D438474q0303k24955Q7769p7701j02589p0360N8238m2887P0893q6372M3096
$$ 4438474 4358171 4133216 4220985 4143284 4040695 3970335 4028573 3985686 4056579 3970207 4013303
4864D013303r8778j28543R6457j07339Q0331M8071M1409q948j75680O6118j62455
$$ 4013303 3914525 3785982 3882439 3775100 3855431 3903502 3944911 3935963 3760283 3826401 3663946
4853C663946P7765O4797n2592J6326J8698j0642k81572L13559k3066n4909o2074
$$ 3663946 3741711 3806508 3753916 3770242 3788940 3778298 3496726 3810285 3787219 3732310 3670236
4842C670236j02317J51945M329J25104J35858L58343J0653K460J38957L24406
$$ 3670236 3567919 3719864 3724193 3849297 3985155 4343498 4354151 4356611 4495568 4819974
4832D819974K82766K94411L40868L87430M73963P67961K05673J54374M39158R59634
$$ 4819974 5102740 5397151 5738019 6125449 6599412 7367373 7573046 7727420 8166578 9126212
4822I126212M96321p24435j049492j145808r20025n69235m58412k43247k21345
$$ 9126212 9622533 8898098 7848606 6702798 5782773 5213538 4755126 4511879 4290534
4813D290534k39553k72275j63639j14913n2043J2243j98315j65663m9572M7415
$$ 4290534 4050981 3778706 3615067 3500154 3448111 3460354 3262039 3096376 3046804 3094219
4803C094219j12672m9332j87385P1628j7085J62461r2072k62306K3225j10420
$$ 3094219 2981547 2932215 2744830 2816458 2799373 2961834 2869762 2607456 2630681 2520261
4793B520261o1581R3942M6524O3091j03492j5282N5397R9471M9849L13808O5104
$$ 2520261 2458680 2552622 2599146 2662237 2558745 2543463 2598860 2698331 2748180 3061988 3127092
4782C127092j14227r2824J74186m2184J71345O1781j34815j22408K7327j8270
$$ 3127092 3012865 2920041 3094227 3052043 3223388 3285169 3150354 3027946 3055273 3037003
4772C037003p6850J1595k30686j2510j9378j37030J36043n8870p4899P118N2673
$$ 3037003 2960153 2971748 2741062 2728552 2709174 2572144 2708187 2649317 2574418 2581536 2634209
4761B634209r8994k164J9742J08358O4589j30253m793p1434j811L5969J16785
$$ 2634209 2535215 2533051 2552793 2661151 2725740 2595487 2590694 2519260 2517449 2553418 2670203
4750B670203m9150J68751m3473j56286j40945J19838Q2254Q5621J19313J28499
$$ 2670203 2621053 2789804 2746331 2590045 2449100 2568938 2651192 2736813 2856126 2984625
4740B984625O5336N0894n2735Q24J28589J83516L6101Q7280R0248J11537n50k16181
$$ 2984625 3049961 3100855 3048120 3048944 3177533 3361049 3397150 3484430 3574678 3686215 3685665 3469484
4728C469484j4179J66444l0928J27861J67953P6941J12686P0760j0988M6832J34798
$$ 3469484 3455305 3621749 3590821 3718682 3886635 3963576 4076262 4147022 4136034 4182866 4317664
4717D317664R7067K12776L06079M1845j80597k53625J3005o6869k7651j02722
$$ 4317664 4414731 4627507 4933586 4975431 4794834 4541209 4554214 4487345 4459694 4356972
4707D356972j65282j4636j21635R695o3895J09052M7689p7837o2845O6482O1822
$$ 4356972 4191690 4177054 4055419 4065114 4001219 4110271 4157960 4080123 4017278 4083760 4145582
4696D145582n7382k4169R7642k8603m904k0553R3586k48369j12778j9986k7067
$$ 4145582 4088200 4064031 4161673 4133070 4128166 4107613 4201199 3952830 3840052 3820066 3792999
4685C792999J55521O1654r6381l44100n993r144J43855r6497k80171j307J92879
$$ 3792999 3948520 4010174 3913793 3569693 3563700 3554556 3698411 3601914 3321743 3320436 3513315
4674C513315j58186M3006O625K2967n2038k0206J64686p8800O4167n9912q3863
$$ 3513315 3355129 3398135 3404760 3427727 3375689 3355483 3520169 3441369 3505536 3445624 3361761
4663C361761N6734J12270K69248O4608j82764P8831L6194J48921q6967l3192q5779
$$ 3361761 3418495 3530765 3800013 3864621 3681857 3760688 3796882 3945803 3858836 3825644 3739865
4652C739865j36564J55746J00683q0012n3116j46837J3821J62349J02923k3591
$$ 3739865 3603301 3759047 3859730 3779718 3726602 3579765 3593586 3755935 3858858 3835267
4642C835267q5470N5174j93427j01435j4277P5557O2744J52910m5107o0612J93268
$$ 3835267 3749797 3804971 3611544 3510109 3495832 3571389 3634133 3787043 3741936 3681324 3874592
4631C874592m7201j2245p668J12570O0318J05115j07817P2799Q4379k9673m0360
$$ 3874592 3827391 3815146 3807478 3920048 3980366 4085481 3977664 4050463 4134842 4105169 4064809
4620D064809l9972k27403K1460O898k2618k7157j33458K2730J54273j763J52083
$$ 4064809 4024837 3797434 3818894 3825792 3803174 3776017 3642559 3665289 3819562 3817799 3969882
4609C969882O0173k38763K7333Q8352o8909J56953R2418M1286J08974K9551k50621
$$ 3969882 4030055 3791292 3818625 3906977 3838068 3995021 4087439 4128725 4237699 4267250 4016629
4598D016629j26583J68801M8635P8521J15245R6523o6402J2401M5209P1239J30856
$$ 4016629 3890046 4058847 4107482 4186003 4301248 4397771 4331369 4343770 4388979 4460218 4591074
4587D591074n2340k61128J26301O8828o084J8112K0601j14569M6027J26213j08305
$$ 4591074 4538734 4277606 4403907 4472735 4466651 4484763 4505364 4390795 4436822 4563035 4454730
4576D454730J9362l8519J0424J50422L3289K03320p6665j2850O507J94006j20335
$$ 4454730 4474092 4435573 4445997 4596419 4629708 4833028 4756363 4743513 4750020 4944026 4823691
4565D823691o6675j28206j25102j24515j6482P7452j88601j17110Q4978J01075
$$ 4823691 4757016 4628810 4503708 4379193 4362711 4440163 4251562 4134452 4219430 4320505
4555D320505J00224j08823p7515J59909P1319j20389Q3564Q9099n5421J47360
$$ 4320505 4420729 4311906 4234391 4394300 4465619 4345230 4428794 4517893 4462472 4609832
4545D609832j14072K52428r1236r9596l1374J7888N7586l1508q4070J56479L20243
$$ 4609832 4495760 4748188 4656952 4557356 4525982 4543870 4601456 4569948 4485878 4642357 4962600
4534D962600j70769l0685M6709j10746K84719K26311n6809M6386J29680J6335
$$ 4962600 4791831 4761146 4807855 4697109 4981828 5208139 5151330 5197716 5327396 5343731
4524E343731j18136J30519J8244J13823j18288J17175q2531N0293J39890O3129
$$ 5343731 5225595 5356114 5374358 5488181 5369893 5487068 5404537 5454830 5594720 5657849
4514E657849j7083J59718k18664l9190L68678R469p1503J47272R9757k61422K0198
$$ 5657849 5640766 5800484 5581820 5542630 5911308 5920777 5849274 5996546 6096303 5834881 5855079
4503E855079L82835J18047q9265J72990J42364L39746J51048j3600J40001J73431
$$ 5855079 6237914 6355961 6266696 6439686 6582050 6921796 7072844 7059244 7199245 7372676
4493G372676J20325K77559K25043R6812J85792K39701K76520K10702J70539J94617
$$ 7372676 7493001 7770560 7995603 8092415 8278207 8517908 8794428 9005130 9175669 9370286
4483I370286J22367M08503J56917L56071J24831M23294K90194J70682J27468J00285
$$ 9370286 9492653 9901156 10058073 10414144 10538975 10962269 11252463 11423145 11550613 11650898
4473A1650898J17955O4253K04707K43162R2839K71350L23890J40206J15016K34263
$$ 11650898 11768853 11833106 12037813 12280975 12373814 12645164 12969054 13109260 13224276 13458539
4463A3458539M45514L31235K20047M67153L48106L21738N25457P28249O08331
$$ 13458539 13904053 14235288 14455335 14922488 15270594 15592332 16117789 16846038 17454369
4454A7454369O13408N05656P84291Q70884O81357Q43672Q80894R53746J004388
$$ 17454369 18067777 18573433 19357724 20228608 20909965 21753637 22634531 23588277 24592665
4445B4592665J149170J190424J316868J129204J096319R73527Q82329Q73735Q57542
$$ 24592665 25741835 26932259 28249127 29378331 30474650 31448177 32330506 33204241 34061783
4436C4061783Q40458Q42257J236159J005978J068825J357365J169998J407174
$$ 34061783 34902241 35744498 36980657 37986635 39055460 40412825 41582823 42989997
4428D2989997J649959J607556J543813J667700J787268J961431K070672K211091
$$ 42989997 44639956 46247512 47791325 49459025 51246293 53207724 55278396 57489487
4420E7489487K266211K495601K411478K392915K456867K527871K295976K382358
$$ 57489487 59755698 62251299 64662777 67055692 69512559 72040430 74336406 76718764
4412G6718764K223130K012386K444920K544908K667430K966857L434683L870624
$$ 76718764 78941894 80954280 83399200 85944108 88611538 91578395 95013078 98883702
4404I8883702L814381M126658M469008M557830M552949M055288M162332L960417
$$ 98883702 102698083 106824741 111293749 115851579 120404528 124459816 128622148 132582565
4396A32582565L639627L963691M176862M466704N200223N098318N461090O069254
$$ 132582565 136222192 140185883 144362745 148829449 154029672 159127990 164589080 170658334
4388A70658334O420648O537525O168496O117412M950417M108382L155089J486116
$$ 170658334 177078982 183616507 189785003 195902415 200852832 204961214 208116303 209602419
4380B09602419J42402q40511k075078l165890l817569l984573l786550l147368
$$ 209602419 209744821 208904310 206829232 203663342 199845773 195861200 192074650 188927282
4372A88927282k456788k037031k494377k816841m089943n311724o312156p874007
$$ 188927282 186470494 184433463 181939086 179122245 175032302 169720578 163408422 155534415
4364A55534415p830098p413062p001297n430821m170095l180877j841420o78134
$$ 155534415 147704317 140291255 133289958 127859137 123689042 120508165 118666745 117988611
4356A17988611n5507l0157n28105j745913l943196n343695o140124o285151o151685
$$ 117988611 117933104 117902947 117374842 115628929 111685733 106342038 100201914 93916763 87765078
4347H7765078n567966m549849l770382l175207k992939k404470k199700j698884
$$ 87765078 82197112 77647263 73876881 70701674 67708735 65304265 63104565 61405681
4339F1405681j346789j157054r00211r76553r54797j029443j069848j398225j550830
$$ 61405681 60058892 58901838 58001627 57025074 56070277 55040834 53970986 52572761 51021931
4330E1021931j780523j803133j690054j731728j570745j530130j355459j280886
$$ 51021931 49241408 47438275 45748221 44016493 42445748 40915618 39560159 38279273
4322C8279273j134640j277654j238009j172526j331739j145972j367715j337815
$$ 38279273 37144633 35866979 34628970 33456444 32124705 30978733 29611018 28273203
4314B8273203j164510o67750r34833p53361o95123o49100n34765o07087o37130
$$ 28273203 27108693 26440943 25506110 24752749 24057626 23408526 22873761 22266674 21629544
4305B1629544m12661m34022m94924n03603l45938k80038m64198j97175m74308
$$ 21629544 21216883 20782861 20287937 19784334 19438396 19158358 18694160 18496985 18022677
4296A8022677j79383l17279j79852j77523j55111l46674j14298k53620j69957
$$ 18022677 17843294 17526015 17346163 17168640 17013529 16666855 16552557 16298937 16128980
4287A6128980k54670K11892j86670j69632R797k75085j4961j8287j30999R434
$$ 16128980 15874310 16086202 15899532 15729900 15739697 15464612 15449651 15431364 15300365 15309799
4277A5309799j99299N376r1553L9191K07411o7822k07060P0019j33169k03193
$$ 15309799 15110500 15115876 15024323 15063514 15270925 15203103 14996043 15066062 14932893 14729700
4267A4729700r3386k6139J89515J5504J3220R5380P6929m8218j87315K11289L26717
$$ 14729700 14636314 14610175 14799690 14815194 14828414 14923794 15000723 14952505 14765190 14976479 15303196
4256A5303196j24381j4496N7383M4110n7871K69411K56396P5658Q7413K25421
$$ 15303196 15178815 15164319 15221702 15265812 15207941 15477352 15733748 15809406 15896819 16122240
4246A6122240J37306J12406l2228J52688K21269J64553N8114J13114R9407K57554
$$ 16122240 16259546 16371952 16339724 16492412 16713681 16878234 16936348 17049462 17148869 17406423
4236A7406423O7723J75919J65293J68276L38988J21482K76114K14617J30046J33136
$$ 17406423 17474146 17650065 17815358 17983634 18322622 18444104 18720218 18934835 19064881 19198017
4226A9198017K66650K42426N01701L39959L30148L94014M65293L19974N11547
$$ 19198017 19464667 19707093 20208794 20548753 20878901 21272915 21738208 22058182 22569729
4217B2569729P01746N00108P50496P52167R21943R77784J191907J022516J324867
$$ 22569729 23271475 23771583 24522079 25274246 26196189 27173973 28365880 29388396 30713263
4208C0713263J503506J532349J465152J410496J094690P89331L15263k45949o03914
$$ 30713263 32216769 33749118 35214270 36624766 37719456 38508787 38824050 38578101 37974187
4199C7974187m92170l29410o20567m90218j0622J53758J05276K19263M94322N74680
$$ 37974187 37482017 37152607 36532040 36041822 36031200 36184958 36290234 36509497 37003819 37578499
4189C7578499P92877R54314R69511J349070J286398J540849J787866J849572K232791
$$ 37578499 38371376 39325690 40295201 41644271 42930669 44471518 46259384 48108956 50341747
4180E0341747K524940K905544K730913K943858K648210K254442J462336M69437
$$ 50341747 52866687 55772231 58503144 61447002 64095212 66349654 67811990 68281427
4172F8281427k32336q40138j079139j439171j208181q06923l39658N9605K91979
$$ 68281427 68049091 67208953 66129814 64690643 63482462 62675539 62335881 62395486 62687465
4163F2687465O39118P53515J257423J515726J755426K230855K572010L364804
$$ 62687465 63326583 64080098 65337521 66853247 68608673 70839528 73411538 76776342
4155G6776342L945413M379435M927213N815903O711704P463723Q254327R187448
$$ 76776342 80721755 85101190 90028403 95844306 102556010 110019733 118274060 127461508
4147A27461508R673564J0966721J2321034J3529846J5620632J7218245J8485515
$$ 127461508 137135072 148101793 160422827 173952673 189573305 206791550 225277065
4140B25277065J8253531J5706126J1543608N371402N23514m04619J774513N440685
$$ 225277065 243530596 259236722 270780330 276151732 276675246 276270627 278045140 283485825
4132B83485825Q510371Q547482M971713m167470j6402148k5359421k8649276k7581972
$$ 283485825 291996196 300543678 305515391 301347921 284945773 259586352 230937076 203355104
4124B03355104k3290261j8848783j5083084j2471024j0123071q372810p316411
$$ 203355104 180064843 161216060 146132976 133661952 123538881 115166071 107849660
4117A07849660o293336n404272m771524m550404l866271l477908l076758k527008
$$ 107849660 101556324 96152052 91380528 86830124 82963853 79485945 76409187 73882179
4109G3882179k115108j812213j452050j273369q72169p85572q00201j193686r25499
$$ 73882179 71767071 69954858 68502808 67229439 66357270 65571698 64771497 63577811 62652312
4100F2652312j210845j549077j352200j262627j242184r18632p89974k37722Q7229
$$ 62652312 61441467 59892390 58540190 57277563 56035379 55116747 54326773 54089051 54176280
4091E4176280L23000M38077P27839J307915J659153J622772K082133K563349L057174
$$ 54176280 54499280 54937357 55665196 56973111 58632264 60255036 62337169 64900518 67957692
4082F7957692L619325L807829L995030L676397L147659J487181k89712k477201
$$ 67957692 71577017 75384846 79379876 83056273 86203932 87691113 87401401 84924200
4074H4924200l402007l855150m070691l873779l605026k703989k031297j409215
$$ 84924200 81522193 77667043 73596352 69722573 66117547 63413558 61382261 59973046
4066E9973046q25293l95099J61012O59352J167097J707831K207746K845535L187438
$$ 59973046 59147753 58752654 58913666 59573018 60740115 62447946 64655692 67501227 70688665
4057G0688665L853209M638331N206477N667263N934487N719775M617168K303570
$$ 70688665 74541874 79180205 84386682 90053945 95988432 101708207 106325375 108628945
4049A08628945o83672l889992o850107q277074q075723p260385o359442n103674
$$ 108628945 107945273 104055281 97205174 88928100 80852377 73591992 67232550 62128876
4041F2128876m348849l397299k833104k085641j545371j390793r36023m87113
$$ 62128876 57780027 54382728 51549624 49463983 47918612 46527819 45591796 45104683
4033D5104683k85963k85959J85195N02452Q37218J242663J357382J575770J830094
$$ 45104683 44818720 44532761 44717956 45220408 46057626 47300289 48657671 50233441 52063535
4024E2063535J378481R95829L23613j116557k347312l064641l478019l297502
$$ 52063535 53442016 54437845 54761458 53644901 51297589 48232948 44754929 41457427
4016D1457427k929029k629879k423766j948198j575610j317442j161207q98188
$$ 41457427 38528398 35898519 33474753 31526555 29950945 28633503 27472296 26574108
4008B6574108p32024r99283o76644m80452o64066o04767o55116n49884n74014
$$ 26574108 25842084 24842801 24166157 23685705 23021639 22416872 21761756 21211872 20637858
3999B0637858k35509l67173k38020j25240m62577j57280l36804l93927m16462
$$ 20637858 20402349 20035176 19797156 19671916 19209339 19052059 18715255 18321328 17904866
3990A7904866k50892m01771j55631j90650j62454k33375Q0380j55523j63175o6734
$$ 17904866 17653974 17252203 17096572 16905922 16743468 16510093 16590473 16434950 16271775 16205041
3980A6205041j05429r6727M9496J55933o1017N5143Q1494J8443K54122M01420
$$ 16205041 16099612 16002885 16052381 16208314 16147297 16202440 16283934 16302377 16556499 16957919
3970A6957919K49312L80385N99484M25602J34148M63696J94098k29468j07043
$$ 16957919 17207231 17587616 18187100 18612702 18746850 19210546 19404644 19175176 19068133
3961A9068133j01828k06616N8020k55921m37307l91208l62510l95900k71763j36384
$$ 19068133 18966305 18759689 18817709 18561788 18124481 17733273 17370763 16974863 16703100 16566716
3951A6566716j13894j82875j20419j56692m0801k36703O6021J00698q6105J09845
$$ 16566716 16452822 16269947 16149528 15992836 15952035 15715332 15781353 15882051 15795946 15905791
3941A5905791j25655L9652K40108P5247j5873J04261P3684K18352L10301O5326
$$ 15905791 15780136 15819788 16059896 16135143 16119270 16223531 16297215 16515567 16825868 16891194
3931A6891194M42341L05507J14504J36249K45621M51213L36564L42821L49384
$$ 16891194 17333535 17639042 17753546 17889795 18135416 18586629 18923193 19266014 19615398
3922A9615398M59254N06113L75571M86293L41984M27944N08982M83280M43794
$$ 19615398 20074652 20580765 20956336 21442629 21784613 22212557 22721539 23204819 23648613
3913B3648613K83360N27220P62387P99736O99924P30799Q42300P44126R52796
$$ 23648613 23931973 24459193 25221580 26021316 26721240 27452039 28294339 29038465 29991261
3904B9991261P54604R86949J317341J620751J410334J539958J982614K227840
$$ 29991261 30745865 31732814 33050155 34670906 36081240 37621198 39603812 41831652
3896D1831652K283125K499236K965506L329839L724648M243405M539705M465569
$$ 41831652 44114777 46614013 49579519 52909358 56634006 60877411 65417116 69882685
3888F9882685M450374M146226M776066N986100P268118R169131J1153122J2677433
$$ 69882685 74333059 78479285 83255351 89241451 96509569 105678700 116831822 129509255
3880A29509255J2390644J0518831N733547m358205j2995142j6413453j5821876
$$ 129509255 141899899 152418730 158152277 153794072 140798930 124385477 108563601
3873A08563601j2770456r200335o476837m402770l130354k033710j772567j604317
$$ 108563601 95793145 86592810 80115973 75713203 72582849 70549139 68776572 67172255
3865F7172255j254731j244743j721659k415534k987468l006836k670898j767292
$$ 67172255 65917524 64672781 62951122 60535588 57548120 54541284 51870386 50103094
3857E0103094j515039j109128p72121m77248J03989M60526O70592P38662P08108
$$ 50103094 48588055 47478927 46706806 46229558 46333547 46794073 47464665 48203327 48911435
3848D8911435L15582l17789q81747j222364j453038j385478r77477p68177j043645
$$ 48911435 49227017 48909228 48027481 46805117 45352079 43966601 42989124 42220947 41177302
3839D1177302j040576q86615j152461j322466r25721r71099q32905j032468p45966
$$ 41177302 40136726 39250111 38097650 36775184 35849463 34878364 34045459 33012991 32267025
3830C2267025q07211p74916o20735n04672l29148n78847m60156k65662m28994
$$ 32267025 31459814 30684898 30064163 29559491 29230343 28651496 28191340 27925678 27496684
3821B7496684n95240m57552l55972o02420k68807k43115l86769k62797l40845
$$ 27496684 26901444 26443892 26087920 25485500 25216693 24973578 24586809 24324012 23983167
3812B3983167l03258j28923Q7297p7803k90823O4334j38387k75280K36132R0522
$$ 23983167 23679909 23550986 23638283 23560480 23269657 23333991 23195604 22920324 23156456 23246978
3802B3246978j61714j60393K22744K73651J55062J54609J79741J61147K50457
$$ 23246978 23085264 22924871 23147615 23421266 23576328 23730937 23910678 24071825 24322282
3793B4322282L97141L94582K65359L26636L98632N67479M45920M91846M44022
$$ 24322282 24719423 25114005 25379364 25706000 26104632 26672111 27118031 27609877 28053899
3784B8053899M49069M58110P12126M87576O43645R68623O99617R34417P88904
$$ 28053899 28502968 28961078 29673204 30160780 30804425 31773048 32472665 33407082 34195986
3775C4195986Q86487J220927R94668J197755J130976J160339J293807J364552
$$ 34195986 35082473 36303400 37298068 38495823 39626799 40787138 42080945 43445497
3767D3445497J587385J866152J656550J560417J786307J913771K078838K015781
$$ 43445497 45032882 46899034 48555584 50116001 51902308 53816079 55894917 57910698
3759E7910698K179117K182411K136597K288794K315184K418701K616167K253219
$$ 57910698 60089815 62272226 64408823 66697617 69012801 71431502 74047669 76300888
3751G6300888K589393K499774K502426K572656K689905K634805K678459K654082
$$ 76300888 78890281 81390055 83892481 86465137 89155042 91789847 94468306 97122388
3743I7122388K639273K410678K330532K537586K528268K390208K232468K358119
$$ 97122388 99761661 102172339 104502871 107040457 109568725 111958933 114191401 116549520
3735A16549520K049976J967120K193349K022877K016128J815733J644929J587812
$$ 116549520 118599496 120566616 122759965 124782842 126798970 128614703 130259632 131847444
3727A31847444J689474J460531J639428J388251J209824J253914J082256J183666
$$ 131847444 133536918 134997449 136636877 138025128 139234952 140488866 141571122 142754788
3719A42754788J055785Q67108Q76156J169683J155539R67582R91107R09530R87077
$$ 142754788 143810573 144677681 145553837 146723520 147879059 148846641 149837748 150747278 151734355
3710A51734355R37216O47607M63071L27753O38880J91741J09214M9416M00055
$$ 151734355 152671571 153319178 153782249 154110002 154748882 154940623 155049837 155099253 155499308
3701A55499308O21176K65710J98321K21762J45760J16490J06469J0158k40807
$$ 155499308 156120484 156386194 156584515 156806277 156952037 157068527 157174996 157185154 156944347
3692A56944347j41818j6330L5155J18745M12256O92228P74556Q93009J038230
$$ 156944347 156802529 156786199 156821354 156940099 157352355 158044583 158819139 159712148 160750378
3683A60750378J414082J721882J622828J766148J816944K059749K192546J893366
$$ 160750378 162164460 163886342 165509170 167275318 169092262 171152011 173344557 175237923
3675A75237923J414284O16834p35566k314292l324952m038369m497654m889161
$$ 175237923 176652207 177269041 176533475 174219183 170894231 166855862 162358208 157469047
3667A57469047n057674m760299m380162m221617m107108m675886n112773n563765
$$ 157469047 152411373 147651074 143270912 139049295 134942187 130266301 125153528 119589763
3659A19589763n874485o240615o334597o496416o264347n738759n205581m368561
$$ 119589763 113715278 107474663 101140066 94643650 88379303 82640544 77434963 73066402
3651G3066402l804322l385377l046463k591103k406777j991524j643301j587897
$$ 73066402 69262080 65876703 62830240 60239137 57832360 55840836 54197535 52609638
3643E2609638j498327j303587q64467r86635j006522p62734p17936o81263n98820
$$ 52609638 51111311 49807724 48943257 47956622 46950100 46187366 45469430 44788167 44189347
3634D4189347m82590m77691m95733n34328l07165o39577o83385n67251n16148
$$ 44189347 43706757 43229066 42733333 42199005 41891840 41252263 40568878 40001627 39485479
3625C9485479p09613o09879k71849k32229k04604k59980J93284N7309j54418J35690
$$ 39485479 38775866 38165987 37894138 37661909 37457305 37197325 37390609 37447918 37293500 37429190
3615C7429190K61767J48693L39769N99226Q23593O75364N68395R16715J076043
$$ 37429190 37690957 37839650 38179419 38778645 39602238 40277602 40845997 41762712 42838755
3606D2838755P75713Q09820O58161N18705M44517J9751l85506o31237l73440n03857
$$ 42838755 43614468 44424288 45082449 45601154 46045671 46065422 45679916 45048679 44675239 44171382
3596D4171382l37872j23138J3726P1763p022J91402L00792N06769O05116P40090
$$ 44171382 43833510 43710372 43724098 43795861 43788839 43980241 44281033 44787802 45392918 46133008
3586D6133008P95724P96419J116090J344083J382213J404149J507074J611346
$$ 46133008 46928732 47725151 48841241 50185324 51567537 52971686 54478760 56090106
3578E6090106J736441J551703J620285J471857J219443R47644M71522K53727j5186
$$ 56090106 57826547 59378250 60998535 62470392 63689835 64637479 65109001 65362728 65347542
3569F5347542J39812L82638N23729M60244P20886J006334J124088J270987J574008
$$ 65347542 65487354 65869992 66393721 66853965 67574851 68581185 69705273 70976260 72550268
3560G2550268J652784K173517K639716K541841L472598L855281M392706N110832
$$ 72550268 74203052 76376569 79016285 81558126 85030724 88886005 93278711 98389543
3552I8389543O135850P068013Q109216Q684524J0039508J1297260J2235929J3482335
$$ 98389543 104525393 111593406 119702622 128387146 138426654 149723914 161959843 175442178
3544A75442178J4626101J6069946J7410886J7716567J7450955J5878748J2823159
$$ 175442178 190068279 206138225 223549111 241265678 258716633 274595381 287418540
3537B87418540Q728679M331589J010158j760882l461973l862892l267551k918745
$$ 287418540 296147219 300478808 301488966 299728084 296266111 292403219 289135668 286216923
3529B86216923k342596j938287k032590l246325n330713p724515j1015919j4128599
$$ 286216923 283874327 281936040 279903450 276657125 271326412 263601897 252585978 238457379
3521B38457379j6093524j7310487j7325615j6427450j4551396j2847847j1401688
$$ 238457379 222363855 205053368 187727753 171300303 156748907 143901060 132499372
3514A32499372r518652q502146p195672o289744n661589m852585m340953l851390
$$ 132499372 122980720 114478574 107282902 100993158 95331569 90478984 86138031 82286641
3506H2286641l553863l065855k952726k624798k219705j884832j773165j459734
$$ 82286641 78732778 75666923 72714197 70089399 67869694 65984862 64211697 62751963
3498F2751963j398467j326960j080905r22419q75804o39476o67560q69064m31477
$$ 62751963 61353496 60026536 58945631 58023212 57147408 56507932 55840372 54971308 54539831
3489E4539831k03734l75792l19997p3519Q8088o6681J06693O3159K5792M24832
$$ 54539831 54336097 53960305 53640308 53566789 53654877 53588196 53694889 53758048 53783840 54208672
3479E4208672L12606L52451N56344Q69612P54940R19344J352969J237284J471731
$$ 54208672 54521278 54873729 55430073 56299685 57054625 57973969 59326938 60564222 62035953
3470F2035953J416542K001205K084819K536208K331189K584178K565714K359569
$$ 62035953 63452495 65453700 67538519 70074727 72405916 74990094 77555808 79915377
3462G9915377K385061K134167J663888J475574J094340J160057J306063J138513
$$ 79915377 82300438 84434605 86098493 87574067 88668407 89828464 91134527 92273040
3454I2273040J427840J394676J712938J263412J335994J477087J160466J314451
$$ 92273040 93700880 95095556 96808494 98071906 99407900 100884987 102045453 103359904
3446A03359904J051728Q17720J090476R99183J409228J956232K314677K583489
$$ 103359904 104411632 105229352 106319828 107319011 108728239 110684471 112999148 115582637
3438A15582637K917968L470962L759837M059994M153317L982908L954539L413556
$$ 115582637 118500605 121971567 125731404 129791398 133944715 137927623 141882162 145295718
3430A45295718L250648L201370L385144L425785L651030L996681M342180M177945
$$ 145295718 148546366 151747736 155132880 158558665 162209695 166206376 170548556 174726501
3422A74726501M278426L994260L694267L152886K729798K285061J838510J752995
$$ 174726501 179004927 182999187 186693454 189846340 192576138 194861199 196699709 198452704
3414A98452704K100435K135974K408770K794495L225035L383776L509541L525104
$$ 198452704 200553139 202689113 205097883 207892378 211117413 214501189 218010730 221535834
3406B21535834L321528K917753L212822L072170L010758L488884L679971M370216
$$ 221535834 224857362 227775115 230987937 234060107 237070865 240559749 244239720 248609936
3398B48609936M720386N340968O133601O866898P528991Q227518Q931128J0072884
$$ 248609936 253330322 258671290 264804891 271671789 279200780 287428298 296359426 306432310
3390C06432310J0344193J0481733J0108815Q733699P593652N677074M293825L446521
$$ 306432310 316776503 327258236 337367051 346100750 353694402 359371476 363665301 367111822
3382C67111822L484362M411583N211572N959241O501197O735745N521227L762540
$$ 367111822 370596184 375007767 380219339 386178580 392679777 399415522 404936749 408699289
3374D08699289J144589j740846m831664p203633r007546r840772j0068961r351500
$$ 408699289 409843878 408103032 403271368 396067735 387060189 377219417 367150456 357798956
3366C57798956q414966p564037o258879n830513n642170n754038o443402p169136
$$ 357798956 349383990 341819953 335561074 329730561 324088391 318334353 311890951 304721815
3358C04721815p607986p566659p327467o809038o013685n034844m086201l716539
$$ 304721815 297113829 289547170 282219703 275410665 269396980 264362136 260275935 256559396
3350B56559396l992784m067621m721895n177517n551811n904188n826176n679818
$$ 256559396 252566612 248498991 243777096 238599579 233047768 227143580 221317404 215637586
3342B15637586n360719n524348n399415n164102n565326o244828o767392p524079
$$ 215637586 210276867 204752519 199353104 194189002 188623676 182378848 175611456 168087377
3334A68087377q031884q240044q348203p998147p372034o859357o108319n477772
$$ 168087377 160055493 151815449 143467246 135469099 128097065 121237708 115129389 109651617
3326A09651617n109292m467008l949820l476460l151780k883490k768730k494230
$$ 109651617 104542325 100075317 96125497 92649037 89497257 86613767 83845037 81350807
3318H1350807k244890k127282j845220j866764j649630j711510j986609j813752
$$ 81350807 79105917 76978635 75133415 73266651 71617021 69905511 67918902 66105150
3310F6105150j595501j789088j872446k053778j951737j845091j811974j526219
$$ 66105150 64509649 62720561 60848115 58794337 56842600 54997509 53185535 51659316
3302E1659316j512343j638019j394139j381827j149259j288520j226531j117688
$$ 51659316 50146973 48508954 47114815 45732988 44583729 43295209 42068678 40950990
3294D0950990j201415j309082r79757r40619r10973o49994q81979o30865o08249
$$ 40950990 39749575 38440493 37460736 36520117 35609144 34959150 34077171 33446306 32838057
3285C2838057p61325m73437m04717l98868n98653q22497o67844q16824o81440
$$ 32838057 32076732 31603295 31198578 30799710 30201057 29378560 28710716 27893892 27212452
3276B7212452o06778n58750n40501n51993m15777m32755l68399n01036o09630
$$ 27212452 26605674 26046924 25506423 24954430 24538653 24105898 23737499 23236463 22626833
3267B2626833m03053l77771m32361m26430l76264l08950l27183m54556m22816
$$ 22626833 22223780 21846009 21413648 20987218 20610954 20302004 19974821 19520265 19097449
3258A9097449k44683k60866j08082k56369n66509k60386k35682o5193m65490k68531
$$ 19097449 18852766 18591900 18483818 18227449 17660940 17400554 17164872 17099679 16634189 16365658
3248A6365658m50029m01651k31493o3776j69579k25371m16306j48209k18856j36940
$$ 16365658 15915629 15513978 15282485 15218709 15049130 14823759 14407453 14259244 14040388 13903448
3238A3903448o5167m87991j63724n4970j18236j71698j59601O052j59848l53871
$$ 13903448 13838281 13350290 13186566 13131596 13013360 12841662 12682061 12688113 12528265 12174394
3228A2174394j0597J15799K6173j22997k35706j3896o9260Q9685Q7818o05k24294
$$ 12174394 12163797 12279596 12305769 12182772 11947066 11933170 11863910 11953595 12041413 12040808 11816514
3217A1816514j50472J16772j20343J47333J99412k9456k87583m3067R612J27218
$$ 11816514 11666042 11782814 11662471 11809804 12009216 11979760 11692177 11649110 11658722 11785940
3207A1785940n4864r315N8755K5717j18218k47726j26921k06614k07351p3161
$$ 11785940 11731076 11721761 11780516 11806233 11688015 11440289 11313368 11106754 10899403 10826242
3197A0826242m91514j93119k60142l37114k36286J96249k13444m1200K1897j96758
$$ 10826242 10334728 10141609 9881467 9544353 9308067 9504316 9290872 9249672 9271569 9074811
3187I074811j01682M8196J0929j30308j62371M3948p1598j05584n5218q3290J58112
$$ 9074811 8973129 9021325 9032254 8901946 8739575 8783523 8711925 8606341 8551123 8467833 8625945
3176H625945j87701M4352l0860L6192K1370k46260j476J60546J40078j02202j53045
$$ 8625945 8438244 8482596 8451736 8487928 8509298 8263038 8261562 8422108 8562186 8459984 8306939
3165H306939J31182k01506J54428R2068K4765n2680m3439R4813l0477r837M9862
$$ 8306939 8438121 8236615 8391043 8483111 8507876 8455196 8411757 8506570 8476093 8466256 8516118
3154H516118R9011J5348k6763O6371J27387J65571j54933n6675J70439j15481
$$ 8516118 8615129 8630477 8603714 8670085 8797472 8963043 8808110 8751435 8921874 8806393
3144H806393k5520K01634m4249m1713J30645J21773J00292K21501J53833R5017
$$ 8806393 8780873 8982507 8938258 8896545 9027190 9148963 9249255 9470756 9624589 9719606
3134I719606R4499J45420L901M3337J13545q649K96552L9074K96748J70040J04826
$$ 9719606 9814105 9959525 9963426 10006763 10120308 10111659 10408211 10447285 10744033 10914073 11018899
3123A1018899J5687J79185J87263R7295J81549K06628J02888K7108J57932K74249
$$ 11018899 11034586 11213771 11401034 11498329 11679878 11886506 11989394 12016502 12174434 12448683
3113A2448683J79205P7560J64748K68654l4442r9501K97506K59378L51396K51407
$$ 12448683 12627888 12705448 12870196 13138850 13104408 13004907 13302413 13561791 13913187 14164594
3103A4164594J96588L43557L09580O1134L04212L00290M75476L30005L56076N64869
$$ 14164594 14361182 14704739 15014319 15075453 15379665 15679955 16155431 16485436 16841512 17406381
3093A7406381O13848O84213O98662O55544P09391O67590J007819R38814Q45286
$$ 17406381 18020229 18704442 19403104 20058648 20768039 21435629 22443448 23382262 24227548
3084B4227548M49473M80029L29232p2734n84559j062940j212996j031822j082516
$$ 24227548 24677021 25157050 25486282 25413548 24828989 23766049 22553053 21521231 20438715
3075B0438715j024989p62642o99525n85810p27865m27322m89898l42852k89431
$$ 20438715 19413726 18651084 17951559 17365749 16637884 16210562 15720664 15377812 15088381
3066A5088381l98467l22392l3867l4673r9295k98874r6375M9154J52506l39666
$$ 15088381 14689914 14367522 14333655 14298982 14199687 13900813 13804438 13853592 14006098 13666432
3056A3666432j51380j57675l08036j05207j03724j57227m8343Q1738P8900K56425
$$ 13666432 13515052 13357377 13049341 12944134 12840410 12683183 12634840 12716578 12795478 13051903
3046A3051903L8824n1071Q5118k75601j22761l46542l82576M8110j19433l0949
$$ 13051903 13090727 13039656 13124774 12849173 12726412 12379870 11997294 12045404 11925971 11895022
3036A1895022o7800K64278j352Q2264j0581J6000K87883j23265l35820o89387
$$ 11895022 11827222 12091500 12090148 12172412 12161831 12177831 12465714 12342449 12006629 11317242
3026A1317242m56222n83215n48564N3880l51141p3528K1827K8059j22624l0819
$$ 11317242 10861020 10277805 9729241 9783121 9431980 9358452 9380279 9408338 9285714 9254895
3016I254895j9797k914j52665o4120P5764j88600j87838k11204M8080M0216r8299
$$ 9254895 9235098 9232184 9079519 9015399 9091163 8902563 8714725 8503521 8551601 8591817 8493518
3005H493518n4709J73178n6444j56542K5788m6852j86391j86888k57500l2353
$$ 8493518 8438809 8611987 8555543 8399001 8424789 8377937 8191546 8004658 7747158 7714805
2995G714805l35208m1393k40421r6629o2318j67735j86709k79520J867J35081
$$ 7714805 7379597 7338204 7097783 7001154 6938836 6771101 6584392 6304872 6306739 6441820
2985F441820j75333l78413J68705l8142R6253J39677p3915j74564J16810j02022
$$ 6441820 6266487 5888074 6056779 6018637 6114890 6254567 6180652 6006088 6122898 6020876
2975F020876j18305K50047p4766j64350J65599k7154J5553K04046k04659l3746
$$ 6020876 5902571 6152618 6077852 5913502 6079101 6051947 6067500 6271546 6066887 6033141
2965F033141j23307o700j45218j14912K6393k08890N6829K8071k34937o4624R3107
$$ 6033141 5909834 5903134 5757916 5643004 5669397 5460507 5517336 5545407 5310470 5245846 5338953
2954E338953L50199J72773l6233k572j37147K8888O4885p3674j39413O8884j71787
$$ 5338953 5689152 5861925 5825692 5823120 5685973 5714861 5779746 5706072 5566659 5635543 5463756
2943E463756J23801P9771j88917p2656j5582o8704K6565k36052Q004J8207L1151
$$ 5463756 5587557 5667328 5478411 5405755 5390173 5321469 5348034 5111982 5119986 5138193 5169344
2932E169344j78459j79067p6709k0647Q4534r179Q3179o8201j38595j72629J10937
$$ 5169344 4990885 4811818 4735109 4714462 4798996 4789817 4872996 4804795 4666200 4493571 4604508
2921D604508Q974k01119N0274j26695L3847J0934j29012J26974l5901j51756j68507
$$ 4604508 4613482 4412363 4462637 4335942 4369789 4380723 4251711 4378685 4342784 4191028 4022521
2910D022521R3418Q9477K4402P1929j61432n0065K96930k14883k0126K17124J4017
$$ 4022521 4115939 4205416 4229818 4301747 4140315 4090250 4387180 4172297 4152171 4369295 4383312
2899D383312j44491o4130j6988P1510J50275Q5333j26764J05124P1545Q7556Q6183
$$ 4383312 4238821 4174691 4157703 4229213 4379488 4464821 4338057 4443181 4514726 4602282 4688465
2888D688465k4793J44941J72987J89031r473j5001j02929m8907M3453j15037O7325
$$ 4688465 4663672 4808613 4981600 5170631 5161158 5146157 5043228 4994321 5037774 4922737 4990062
2877D990062j26819p6812k46356J87363L66375j38054j9383J93301M7497K15J02570
$$ 4990062 4863243 4786431 4540075 4727438 5093813 4955759 4936376 5129677 5177174 5177389 5279959
2866E279959J3309N6627L78586O211J7124J9074k7906J52454J41234P732o9413
$$ 5279959 5293268 5349895 5728481 5734692 5751816 5770890 5742984 5895438 6036672 6044404 5974991
2855E974991j12083K6877m3010l08829r4478J00506K39932m3163Q2002L0203J1698
$$ 5974991 5862908 5889785 5846775 5537946 5443468 5543974 5783906 5740743 5822745 5852948 5864646
2844E864646J43629J84110l018K04137P6351L84328L80383K43024L49468M66553
$$ 5864646 6008275 6192385 6189367 6393504 6469855 6854183 7234566 7477590 7827058 8293611
2834H293611L04942J73548K19616L33397M89506M66779N18995P13056Q09183O04951
$$ 8293611 8598553 8772101 8991717 9325114 9814620 10281399 10800394 11513450 12322633 12927584
2824A2927584P39517N64842n7226l46672o35431j030335p97770n23533m67917
$$ 12927584 13667101 14231943 14174717 13828045 13192614 12162279 11364509 10840976 10373059
2815A0373059l07343l01913p2047l2751O6279n0040J34891K77284J33011K78596
$$ 10373059 10065716 9763803 9691756 9659005 9725284 9675244 9810135 10087419 10220430 10499026
2805A0499026L69157N49095O32476O44565L78523P20111Q45017Q58913J275536
$$ 10499026 10868183 11417278 12049754 12694319 13072842 13792953 14637970 15496883 16772419
2796A6772419J214261J554186J442025Q16131L3906r08416j517180j800418j448576
$$ 16772419 17986680 19540866 20982891 21799022 21832928 20924512 19407332 17606914 16158338
2787A6158338j242521q07644o65171n54445l79901k92123k15646j15309j64208
$$ 16158338 14915817 14108173 13443002 12888557 12508656 12216533 12000887 11885578 11721370
2778A1721370j23119P1915r87Q0350k28436N9759j12498P9826J47122J25949m434
$$ 11721370 11598251 11670166 11669179 11749529 11521093 11580852 11468354 11548180 11695302 11821251 11816817
2767A1816817L23611L31015O29884N80944M27579K09966l38168o23755n45153
$$ 11816817 12140428 12471443 13101327 13682271 14109850 14319816 13981648 13357893 12812740
2758A2812740m85335o81003m61903k61039k17762k28937k10082k95599o025j65260
$$ 12812740 12327405 11646402 11184499 10923460 10705698 10476761 10266679 9971080 9965055 9799795
2748I799795p6699l62221k85872k29726J45411L08430l8314j98366N1332L942
$$ 9799795 9723096 9360875 9075003 8845277 8990688 9299118 9260804 9062438 9113770 9117712
2738I117712J23989J09808q1888M2586J36971j73720Q6705J01401j37759j08551
$$ 9117712 9241701 9351509 9269621 9312207 9449178 9275458 9362163 9463564 9325805 9217254
2728I217254o6433n1873p298k42217m00198o24154m59858m82972m00483j65249
$$ 9217254 9150821 9098948 9091650 8849433 8449235 7825081 7365223 6882251 6481768 6316519
2718F316519k09680j51447l23621k11443j19547k09762j51235p0677N0681l125
$$ 6316519 6106839 5955392 5631771 5420328 5300781 5091019 4939784 4869107 4919788 4916663
2708D916663r2241O161n0700N7090k03732k12397p9562j39679k51415j69086j92317
$$ 4916663 4824422 4830583 4779883 4836973 4633241 4420844 4341282 4201603 3950188 3781102 3588785
2697C588785j21564q0488j53914j76381O8171q0560M1479K4258q5883o0263j1320
$$ 3588785 3467221 3386733 3232819 3056438 3124609 3044049 3085528 3109786 3023903 2963640 2952320
2686B952320q3281k9730Q1383k1050J8418j00435r0466n3672P8648J71009m6677
$$ 2952320 2869039 2839309 2920692 2899642 2918060 2817625 2727159 2673487 2752135 2923144 2876467
2675B876467j15277n014k84919K4425K02566J4512j37735R1212j38217j14711
$$ 2876467 2761190 2756176 2471257 2495682 2698248 2712760 2575025 2666237 2528020 2413309
2665B413309q2314l6735j70903P1308O1144K1676k20788J20075q2283r9958O9390
$$ 2413309 2330995 2294260 2123357 2194665 2255809 2277485 2056697 2176772 2094489 1994531 2063921
2654B063921j0480K4634k4795J17530k36451j6286J0748l4707j58428m1430j00433
$$ 2063921 2053441 2078075 2053280 2170810 1934359 1918073 1928821 1894114 1735686 1694256 1593823
2643A593823J50757K6756J03939R9239Q177j97391j51416O4029j24295O1785J12169
$$ 1593823 1744580 1771336 1875275 1974514 1982691 1785300 1633884 1697913 1573618 1635403 1747572
2632A747572O8453K1219k66606m8902l3388L7563R677P3737L9115k26741J168
$$ 1747572 1816025 1837244 1570638 1521736 1488348 1525911 1535588 1609325 1648440 1421699 1422867
2621A422867O4085K5165O1385o8990n6466p0950K3678O2528q1949J42894k14121
$$ 1422867 1486952 1512117 1573502 1504512 1448046 1377096 1400774 1463302 1381353 1524247 1310126
2610A310126J36132J24834j63285q560j74406J41820j55609j44854K11369P9604
$$ 1310126 1446258 1571092 1407807 1399247 1224841 1366661 1211052 1066198 1277567 1357171
2600A357171j90990R751J73433j98914O4116J80924j22687N9041r2217J24441
$$ 1357171 1166181 1175932 1349365 1150451 1214567 1395491 1272804 1331845 1239628 1364069
2590A364069j36858M214k240m4326q4049o7433J58179J38663K6858j27757Q6593
$$ 1364069 1227211 1231425 1229185 1184859 1100810 1033377 1191556 1330219 1357077 1229320 1315913
2579A315913K2071k50884R9121J79310N0185q4992q3952j20871N3120J10257Q3199
$$ 1315913 1337984 1087100 1186221 1365531 1415716 1330724 1246772 1125901 1179021 1289278 1372477
2568A372477j93228J54518j78855J30733J07564k39292J50412n8978O8907M5763
$$ 1372477 1179249 1333767 1154912 1285645 1393209 1153917 1304329 1245351 1314258 1360021
2558A360021j011j4129n6780n9735k1742L5065M2678J17289k1321j19980R0194
$$ 1360021 1359010 1344881 1288101 1228366 1206624 1241689 1284367 1401656 1380335 1260355 1350549
2547A350549l2514N7630O3338j54618J28663j05611q9473K08634r5607J2547n5165
$$ 1350549 1318035 1375665 1439003 1284385 1413048 1307437 1217964 1426598 1330991 1343538 1288373
2536A288373J56506J39782K2320L6021J16092k79659K078q5491k9123O8290K9953
$$ 1288373 1444879 1584661 1606981 1643002 1759094 1479435 1481513 1396022 1366899 1435189 1465142
2525A465142m0387P7451J24549L231j49521J17131j43375j1057j830j35556J74331
$$ 1465142 1424755 1502206 1626755 1629986 1480465 1597596 1454221 1443164 1441334 1305778 1480109
2514A480109J81390j47604M0847M6218K8400q4350j11937J05007Q3933J12860
$$ 1480109 1661499 1513895 1554742 1600960 1629360 1545010 1433073 1538080 1622013 1734873
2504A734873O7678k4286K5332j55522J77708k26960J22727J64479l6614K5657
$$ 1734873 1802551 1778265 1803597 1648075 1825783 1598823 1721550 1886029 1849415 1875072
2494A875072m6493q8654r2968L541l8954L4182j46815J1762N0261N1562j36284
$$ 1875072 1828579 1739925 1646957 1650498 1611544 1645726 1498911 1510673 1560934 1612496 1476212
2483A476212K03487p8451p2753j9815O311Q1695K4755M4364o6369q5790p271r4122
$$ 1476212 1679699 1601248 1528495 1508680 1514991 1596686 1621441 1665805 1599436 1513646 1506375 1412253
2471A412253O9946J06043m9342J11048j80782p1745J29315j6335l9548Q8435m2425
$$ 1412253 1482199 1588242 1538900 1649948 1469166 1397421 1526736 1510401 1470853 1559288 1516863
2460A516863l5785P8103J1448M4413j06144k11131n9134Q9108q7257J3003j22557
$$ 1516863 1481078 1559181 1570629 1615042 1508898 1297767 1238633 1327741 1240484 1253487 1130930
2449A130930R8810l8592Q8843J22532k12231J4652J01930q8615j37231j6838J74744
$$ 1130930 1229740 1191148 1279991 1402523 1190292 1204944 1306874 1218259 1081028 1064190 1238934
2438A238934J18426k23576J3133O8520j54696P1373q00j33490J5298O3729j27556
$$ 1238934 1357360 1133784 1146917 1215437 1060741 1132114 1131314 997824 1013122 1076851 949295
2427I49295K22254o8028M4971j0918j0146n0254K3233O9537M0512R3261m2903
$$ 949295 1171549 1103521 1148492 1137574 1127428 1077174 1100407 1169944 1210456 1303717 1260814
2416A260814j05320K0187n5908j20292k3952L9018M2482q6091M446o1399M4838
$$ 1260814 1155494 1175681 1119773 999481 975529 1014547 1057029 970938 975384 913985 958823
2405I58823o8576m1224K24638o81j64544j67177j1961Q0397J62540p2094j62474
$$ 958823 890247 849023 1073661 1072980 908436 741259 729298 809695 972235 900141 737667
2394G37667J8231P0976Q9925l1933j01157j43746J34093J74129j12326n8338j95628
$$ 737667 755898 826874 916799 884866 783709 639963 774056 948185 835859 777521 581893
2383E81893J05158J88783j6814j17673j34944P7127P1220m5759j1813K0119P0244
$$ 581893 687051 875834 859020 741347 606403 683530 754750 708991 697178 717297 787541
2372G87541j06414m6297Q9200k0104j0446j3930k8139K4990M0362l1488J3559
$$ 787541 681127 634830 724030 703926 693480 679550 651411 676401 716763 685275 698834
2361F98834L5638L3396l9814j01325P3516K11213o1464j3288q7526n5278J10290
$$ 698834 734472 767868 728054 626729 700245 911458 849994 836706 749180 693902 804192
2350H04192K5521j46477j07284J74056K5632n9923M98K1706j48524o4701n562
$$ 804192 829713 683236 575952 750008 775640 715717 716215 737921 589397 524696 519134
2339E19134J08126R6109j36134R0192K25474k3622k10709J32309j85722M6590
$$ 519134 627260 723369 587235 677427 902901 879279 668570 800879 615157 661747
2329F61747j8395N2959J36113j87872K5080M892R584J19106p5836O8718m4118
$$ 661747 643352 696311 832424 644552 669632 674524 684108 803214 727378 796096 751978
2318G51978M7050j93037j6860Q2152K7919j5781J19189m843L6870L0682k4931
$$ 751978 799028 605991 589131 671283 699202 683421 802610 797767 834637 865319 840388
2307H40388j34432P968l7645q533J62771n5416N2343M2153j07359p4607k5837
$$ 840388 705956 713924 676279 667746 830517 775101 827444 869597 762238 687631 661794
2296F61794J23838J10821l9571K8581j65140L9801J35638j83918m682m3964J83709
$$ 661794 785632 896453 856882 885463 720323 760124 895762 711844 707162 663198 846907
2285H46907K715k3183l6351m7409r1472M9195m3217P3840L1270j5150n4410l5104
$$ 846907 849622 826439 790088 742679 651207 700402 657185 731025 762295 747145 692735 657631
2273F57631Q0200J23275N4948j84763O0149J2077r1988n230m1267p2935J95779
$$ 657631 737831 861106 916054 731291 791440 803517 711529 706299 665032 592097 787876
2262G87876L613r5216j8452J4840q7155p6203n670K14650j56951K1050M1993K36295
$$ 787876 791489 696273 677821 692661 605506 529303 523633 738283 581332 602382 644375 880670
2250H80670K9o6988n6635m4271k4368m7897p829J09593r8481K13695m5755p1134
$$ 880670 880699 813711 757076 712805 688437 640540 632711 742304 643823 857518 811763 740629
2238G40629N5833j66833j50686N2065J90265J61251N968k30594r326k9202M8137
$$ 740629 796462 629629 478943 531008 721273 882524 888492 657898 648572 619370 667507
2227F67507j4630j01918M1865r8271L6718J47518P2471l5582o0040j15665l2923
$$ 667507 652877 550959 592824 494553 531271 678789 751260 715678 655638 539973 507050
2216E07050Q7562J16578q6758M7421o6925j3672K5285J96539K8099j81858r9499
$$ 507050 594612 711190 624432 671853 604928 591256 616541 813080 841179 659321 559822
2205E59822J25338P9662r7903l7197P8855Q2239P0050p3142M663M3046p7193p2773
$$ 559822 685160 764822 666919 629722 708577 790816 860866 787724 792387 835433 758240 685467
2193F85467J5379R2774p7852j6303o9967l7636J46730j26246j315J8662k0296
$$ 685467 700846 793620 715768 699465 629498 591862 738592 612346 611031 629693 609397
2182F09397J3644L4555p5155K0710M9938J23480J87346p0040l803m1300q1136
$$ 609397 623041 657596 582441 603151 653089 776569 963915 893875 890072 848772 767636
2171G67636j61284K19764l6695j86626k05646K17172J01808K2158J42480J02625
$$ 767636 606352 826116 789421 602795 397149 614321 716129 738287 880767 983392
2161I83392o6923M774P1218K8378j61227j4260P5176j21359K9216m4256J02339
$$ 983392 916469 921243 992461 1020839 859612 845352 920528 799169 828385 784129 886468
2150H86468K84676k23321j03644n0651L3117J0019J95584J67509k1438j22606
$$ 886468 1171144 947823 844179 793528 826645 836664 1032248 1199757 1178319 1055713
2140A055713O0091K7798k45504j19931J05841K20801M2656K7414j14884Q1390
$$ 1055713 1115804 1143602 898098 778167 884008 1104809 1147465 1174879 1059995 1141385
2130A141385J05205L6240m8707O6567R1354J8798J60787j53584J04392j43353
$$ 1141385 1246590 1282830 1234123 1300690 1392044 1410842 1571629 1418045 1522437 1379084
2120A379084j12817J1494J88923M122O8616L6973L57863L9255j53393K9669Q3628
$$ 1379084 1266267 1277761 1466684 1470806 1539422 1576395 1934258 1973513 1820120 1849789 1933417
2109A933417L1331j5832R2882n6147o2126P1018N5077J5419Q7029p3680p8502
$$ 1933417 1964748 1948916 2041798 1985651 1923525 1994543 2049620 2065039 2152068 2078388 1999886
2098A999886N2898R7226Q7354R5149J03845J98259R314R3103O0009J48457N2232
$$ 1999886 2052784 2150010 2237364 2332513 2436358 2634617 2643931 2737034 2797043 2945500 2997732
2087B997732R6832L38056J27160o8941Q8856K65610M0894J5266M26920M52437
$$ 2997732 3094564 3432620 3559780 3490839 3579695 3845305 3886199 3901465 4328385 4780822
2077D780822R1246J49138M90496J79018M66614L59941O73662O64681R00355J074170
$$ 4780822 4872068 5021206 5511702 5690720 6157334 6517275 7190937 7855618 8755973 9830143
2067I830143R77428J289037J166116J421666J541825K062047K465845L194502
$$ 9830143 10807571 12096608 13262724 14684390 16226215 18288262 20754107 23948609
2059B3948609L870104N096705O374200N988690M096336k784525o163639o415644
$$ 23948609 27818713 32915418 39289618 45278308 49374644 46590119 40426480 34010836
2051C4010836o583518n053928l473150k611769k135950j407746j044998q38025
$$ 34010836 27427318 22373390 18900240 16288471 14152521 12744775 11699777 10861752
2043A0861752p37425n82563n08697m73434p00492n56887n47495m43531l32413
$$ 10861752 10124327 9541764 9033067 8559633 7859141 7302254 6754759 6311228 5978815
2034E978815n33299j67577k09323l29016k07751o3990j2332k90123l09571m9077
$$ 5978815 5445516 5277939 5068616 4739600 4531849 4467859 4455527 4165404 3855833 3806756
2024C806756l13410j89638J47403m5011o7581q7236k42463k02042j53320R853
$$ 3806756 3493346 3303708 3451111 3406100 3338519 3251283 3008820 2806778 2653458 2663311
2014B663311J33581m7656j21140k50253k6809K7431k44099j69452P8390P8213
$$ 2663311 2796892 2749236 2628096 2377843 2351034 2378465 2134366 1964914 2043304 2121517
2004B121517j54789j12379R9196j20922J5743k2292k5124j74358M0248r6331J05687
$$ 2121517 1966728 1854349 1953545 1832623 1848366 1826074 1800950 1626592 1666840 1570509 1676196
1993A676196J82965k09329j03150k25341M3233J08316K9973o5021j83377Q748
$$ 1676196 1859161 1649832 1546682 1321341 1364574 1472890 1502863 1437842 1254465 1263213
1983A263213j60258j316M4423p0487J07321M6418k38916R3143j39101j6220R5110
$$ 1263213 1102955 1101639 1146062 1075575 1182896 1229314 990398 1083541 944440 928220 1023330
1972A023330q0385r274j95223P0076P9853j33487Q6915M3965O3403M848j21971
$$ 1023330 942945 933671 738448 808524 888377 754890 841805 885770 949173 954021 832050
1961H32050j07596n2299l1647L2961J14767p332N5999M1732R6053r094K3078J8141
$$ 832050 724454 672155 640508 673469 788236 780904 836903 878635 974688 965594 988672 1006813
1949A006813M2824j90956o1743M9507L4144K8702q4184j01422P1421j14497K8263
$$ 1006813 1049637 858681 796938 846445 880589 909291 825107 723685 795106 680609 708872
1938G08872j71405l2486J91543j3940P2946l7992k09r9561r475N4343O4453M3274
$$ 708872 537467 504981 696524 682584 755530 717538 717329 617768 608293 662636 727089 770363
1926G70363j11259n7662l7241K59357J5989j85616R8637r2880K11167o4610J02525
$$ 770363 659104 601442 564201 823558 839547 653931 752568 659688 870855 806245 908770
1915I08770K5180j40062j27145p0684m1594R3248R2434p5458L2540k2624j00061
$$ 908770 933950 793888 666743 596059 554465 647713 740147 664689 697229 674605 574544
1904E74544r5095j0555O776o1352J83609l4821L4853J05193j485j50621p5635
$$ 574544 479449 468894 475670 414318 597927 563106 597959 703152 701667 551046 475411
1893D75411P4682L768q9700L0790k1199M4377J1799l6021q0326l9997J5956l0963
$$ 475411 550093 553861 464161 494951 473752 518129 529928 493907 413581 373584 389540 358577
1881C58577J57445O2985m4720j50175L1797q0586J11254j18861Q7187p570j13826
$$ 358577 516022 579007 534287 384112 415909 335323 446577 327716 414903 407333 293507
1870B93507O6579P7770P8960q7211K14603l02195Q133Q5648j16410J43330R2678
$$ 293507 360086 437856 516816 429605 644208 342013 350146 435794 319384 462714 555392
1859E55392m7275m8951J36510M3724n8698j10446J03394J7740J780j91575M0981
$$ 555392 508117 459166 595676 639400 580702 470256 573650 591390 593170 401595 442576
1848D42576L4928J20637p3698Q7497j18845L9240L4889j9852J20432n5860j19847
$$ 442576 477504 598141 524443 611940 493095 532335 567224 547372 667804 611944 492097
1837D92097l691K2526J56826r561J3279q968j14436j567P1071K5626p1548l0014
$$ 492097 488406 510932 667758 658197 671476 662508 548072 546505 617576 643202 571654 541640
1825E41640l906n2379l1734J22787j13595J6880P1385j26K975j74996k6239Q1692
$$ 541640 537734 485355 453621 576408 462813 479693 551078 550952 553927 378931 352692 434384
1813D34384L10806R8483o1076J72209k29628k87489Q1332l9124p5660J83845J7717
$$ 434384 745190 843673 782597 954806 725178 437689 519021 479897 404237 588082 605799
1802F05799j27680j09341J48308J22080k38359o0460J29471r4850m986M9282J5772
$$ 605799 478119 368778 517086 639166 400807 340347 469818 374968 369982 419264 435036
1791D35036J37678O0276k65514J62065r1465j57060O4398J61213J0761m6848r0738
$$ 435036 572714 632990 367476 529541 438076 281016 345414 506627 517388 470540 379802
1780C79802j04491J17892N6525q6770L4728j25814J85545M0895q1629r7068k74013
$$ 379802 275311 393203 449728 362958 397686 271872 457417 498312 416683 319615 45602
1769D5602K21082J61205j17197j33294J6884J60702j3833J20874K9292Q6820j11016
$$ 45602 266684 427889 310692 177398 194282 354984 341151 462025 491317 578137 467121
1758D67121r7289p5529r9700N7340J00820j61671J46906J45489p8369k2205o7678
$$ 467121 369832 294303 194603 251943 352763 191092 337998 483487 405118 382913 315235
1747C15235M7112j54938R8908K3387O4922j08219J30221O4618j34260O9980o8279
$$ 315235 362347 207409 306317 329704 394626 286407 416628 481246 346986 416966 348687
1736C48687j00174J51863m2628P3119p6919J74733P3210j53557O6303j45698j82176
$$ 348687 248513 400376 357748 430867 353948 528681 601891 448334 514637 368939 186763
1725A86763K22758l3980l5758R5716j21696J19316P7870j29429k6689P1678j73012
$$ 186763 409521 375541 339783 435499 313803 433119 510989 381560 354871 426549 253537
1714B53537r7860N5287J18108P6376k22215q9843J31567J37595k0557k58737J28619
$$ 253537 155677 210964 329072 405448 183233 93390 224957 362552 341995 83258 211877
1703B11877O0263Q2508L3079l7825m4762K4084R2796j33213m1753J63556k5648
$$ 211877 272140 354648 387727 349902 305140 329224 422020 288807 247054 410610 384962
1692C84962j35159j2261n6441P6943n235R9264n1801P571J45517q3812N243n593
$$ 384962 249803 237542 181101 258044 252809 352073 300272 307843 453360 369548 374791 369198
1680C69198N8556k04912Q1875J09936p2782J11130j44711O4166j28606M6233J70744
$$ 369198 427754 222842 304717 414653 341871 453001 308290 372456 243850 290083 460827
1669D60827p4150l9695q2799m025R6278K8378j02598O4127J48254r1623j37267
$$ 460827 386677 346982 264183 260158 356436 384814 282216 346343 494597 402974 265707
1658B65707j0921l5602J05498K8544L1627j25223k8476N6096r2352r3290N2962
$$ 265707 254786 219184 324682 353226 384853 259630 231154 287250 194898 101608 154570
1647A54570l0379R967n11J06907J83787j60888O9839P9765n3606R5782k0043n3334
$$ 154570 124191 134158 133647 240554 424341 263453 333292 413057 359451 455233 435190 381856
1635C81856o3259K5475L5632o8850P7419j35426P3283O3528J85722j78661m0759
$$ 381856 318597 344072 379704 310854 388273 252847 326130 389658 575380 396719 355960
1624C55960O7786j09120j19718j6534k5213P2871L4955K7033J4132j25312p293
$$ 355960 423746 314626 194908 178374 153161 226032 260987 288020 302152 176840 169547
1613A69547j8363J40507J60741j56906j41979O49R1069K3064j11077j3296j5703
$$ 169547 151184 291691 452432 295526 153547 154196 245265 268329 157252 143956 128253
1602A28253R5367j22898J71602R0131j06069p5794J4975J87678Q3693L8330p4732
$$ 128253 223620 100722 272324 362455 256386 180592 195567 383245 466938 505268 430536
1591D30536k78134Q6993q6924n2444L1297Q0391J1197N1508M9580K0209l5906
$$ 430536 152402 239395 152471 100027 131324 211715 222912 274420 324000 344209 308303
1580C08303n4629q2701M5450P8168N235j11385M1145P6O9209Q1534p9977j02660
$$ 308303 253674 170973 216423 294591 299826 188441 229586 229662 298871 380405 300428 197768
1568A97768M0093r9500K13855K6702K3863r2480l8281J37427k00299k1383j73308
$$ 197768 237861 138361 352216 378918 402781 310301 272020 409447 209148 187765 14457
1557A4457K42577j04664M0487J09694J35509k80318O7543j4877J40378j98442
$$ 14457 257034 152370 192857 302551 438060 157742 225285 210408 350786 152344
1547A52344j39445J77661J14j3992Q539K23103m3022p8054j22144R2623O6295
$$ 152344 12899 190560 190674 176682 185221 408324 365302 287248 165104 257727 324022
1536C24022k1303j68232m3298J28620o0169L7420J33870r1513k4652j1406j22310
$$ 324022 302719 134487 91189 219809 159640 197060 330930 239417 214765 203359 81049
1525H1049J12924N7301q3246J16594L9913o5753N3902M540j7301o5699j31197
$$ 81049 193973 251274 168028 284622 324535 258782 312684 317224 299923 234224 103027
1514A03027J55931j98508P5505J9128m4338p5556j11224Q1408J51723L23635K4934
$$ 103027 258958 60450 135955 155083 110745 35189 -76035 5373 157096 480731 505665
1503E05665l66743K2066J17532k91132R8875K8862j08069J77757Q9270K5930l301
$$ 505665 138922 160988 278520 -12612 86263 115125 7056 184813 274083 300013 296712
1492B96712j10751J62279M5211j17189j16723j27096o6883J75760K83834m3307
$$ 296712 185961 348240 393451 276262 159539 32443 -34440 141320 425154 381847
1482C81847n2729M2342n80j45718q4744N0091J61879J3995r8875J31197k38380
$$ 381847 329118 371460 370880 225162 140418 190509 352388 366383 267508 398705 160325
1471A60325j3974O6515J8727M640r4198K1197J01660j1550N6470n9827j16563
$$ 160325 146351 212866 231593 236233 142035 163232 264892 253342 309812 249985 133422
1460A33422j07919N4035J59729K4709m8296j74176J5594K8645K11732R7023P64
$$ 133422 25503 79538 239267 263976 215680 41504 57098 85743 297475 394498 395262
1449C95262k66483j2179P8984N2329J13407j52085j2368K2676R5062j14057n8162
$$ 395262 128779 116600 195584 247913 361320 209235 196867 219543 314605 200548 142386
1438A42386n4946J88114j4048k49894J37262M7869K69709j66777j50219m0340
$$ 142386 87440 275554 261506 11612 148874 196743 466452 299675 149456 109116
1428A09116l7519p3801J36439L8499k8969m055O0601M2580j52748J57561J23980
$$ 109116 71597 -2204 134235 172734 143765 139710 200311 242891 90143 247704 371684
1417C71684K328r7010L9393j19407j3075J35831o5691j00325K03740M3525p5409
$$ 371684 374012 277002 316395 196988 183913 319744 254053 153728 357468 400993 325584
1406C25584j7902J67317j37538j21682o1240r2695J70030O703p3974K9358j24959
$$ 325584 307682 474999 337461 215779 154539 61844 231874 238577 164603 193961 69002
1395F9002J4393J75278k22555k36942J4572J76060J04105j6796Q9624p6641j65852
$$ 69002 83395 258673 36118 -200824 -186252 -10192 93913 77117 166741 90100 -75752
1384g5752o564P4215J03352L9876J15261j22000k22106K90712J37209j57451K6310
$$ -75752 -82316 -8101 95251 135127 250388 128388 -93718 196994 334203 176752 203062
1373B03062r3857r0763K96J20302q9656p6403K03265k09509R7396J88098j28693
$$ 203062 109205 18442 18738 139040 49384 -27019 176246 -33263 64133 252231 123538
1362A23538P2010P7424M0314K5133N1761j54651j39203K041J28066M9345j0331
$$ 123538 195548 272972 313286 338419 390180 235529 96326 98367 226433 275778 265447
1351B65447r6670J13359l9086r1857J0507K1181J03441R5059o7069o3182n8857
$$ 265447 168777 282136 243050 151193 161700 182881 286322 381381 314312 251130 192273
1340A92273r6677J04975J17718N0475K4281m0518j53281k8317L3510J9493r4620
$$ 192273 95596 200571 318289 368764 393045 352527 199246 170929 204439 223932 129312
1329A29312l4950J23140N3354q4821j03309J72522j03216L0136j13195r9665K01965
$$ 129312 94362 217502 270856 186035 82726 255248 152032 182168 68973 -30692 171273
1318A71273k3907o8421O5663q2189j01347R6439J39681j60844Q2012J95930p3170
$$ 171273 147366 78945 144608 62419 -38928 57511 197192 36348 118360 314290 241120
1307B41120O3595j85406Q695O8179j1078n5261o975J0346O7383j11871k9177R4888
$$ 241120 304715 119309 128004 196183 185105 129844 122869 133215 200598 88727 59550 154438
1295A54438k474M1440j27842R8857n8224j94161J67904q2623K34933O282j07220
$$ 154438 151964 193404 65562 164419 106195 -87966 79938 -2685 232248 238530 131310
1284A31310L8764L6941l8327l536n901j56413l9445l6699J33346K07384p5365
$$ 131310 170074 207015 168688 165152 159251 2838 -36607 -73306 60040 267424 192059
1273A92059j02095K09538j01550r0086k7543M7681J35143k13224j20906M7491
$$ 192059 89964 299502 197952 107866 80323 128004 263147 49923 -70983 -23492
1263b3492M1108J88450r2029M7694M0573o8368J60050p2875r2756q0839J98762
$$ -23492 17616 206066 114037 161731 202304 133936 293986 221111 128355 47516 246278
1252B46278r0997j10711n1129r6433l7233M2044R5961J67760m9633J047o687K30727
$$ 246278 155281 44570 -6559 -102992 -140225 -98181 -2220 165540 115907 116954 110267 340994
1240C40994q5848l9513o3092j634k4356j03021R5524J7832l0136N9452r250j18928
$$ 340994 255146 215633 152541 150907 126551 23530 119054 136886 106750 166202 156952 38024
1228C8024P3516J36932l4745J0604K1682m2109m148K6087P7549j17001k327o4524
$$ 38024 111540 248472 213727 224331 246013 203904 199756 225843 303392 186391 184064 119540
1216A19540L0834j9926l1227O3377m4227k29448J07336K9611J95813Q831O0260
$$ 119540 150374 130448 99221 162598 118371 -111077 -3741 25870 221683 230514 290774
1205B90774o0717j03744j46172J59165J3709o3752L0402m4801J3596K9673j73669
$$ 290774 230057 126313 -19859 139306 153015 89263 119665 74864 88460 118133 -55536
1194e5536p3664J65069j38110M2937K43393j18552J1537K03166k313j30853K13128
$$ -55536 -129200 35869 -102241 -59304 184089 65537 77074 280240 277927 147074 360202
1183C60202m4258j82415k27354Q8772k9253L2485R7J3549j16187l154Q0846J39107
$$ 360202 315944 133529 -93825 -5053 -34306 -1821 -1724 11825 -104362 -107516 -26670 112437
1171A12437n2334j04115J26063j6956K74010j39915j02631k1838O1956K48280
$$ 112437 60103 -44012 82051 65095 339105 199190 96559 74721 136677 384957
1161C84957k4101j13117r9228j51138P0335K7964L7988Q7218O1252k03055L0442
$$ 384957 360856 247739 148511 -2627 67708 95672 133660 220878 282130 79075 109517
1150A09517J16120j3096j75915m4587L8162J41934j20225o3643k0828M4985L2326
$$ 109517 225637 212541 36626 -7961 30201 172135 51910 -11733 -32561 12424 44750
1139D4750J30496j35066P7267J30347p2907m2954K0101Q8676q7300l627J8723
$$ 44750 175246 40180 117447 247794 174887 131933 152034 240710 153410 149783 168506
1128A68506L2128M5018J1565j76962n9609J19017j04499N5423Q9813K3295o852
$$ 168506 200634 245652 257217 80255 20646 139663 35164 90587 180400 203695 196843
1117A96843k90566l5031N1040N0935K18320k18543j86671Q1511O2569Q3322J30619
$$ 196843 -93723 -128754 -77714 -26779 191541 -27002 -213673 -132162 -69593 13729 144348
1106A44348K4855o2916L5789J8546k31514P6435M0653J88696j4903o2583K7012
$$ 144348 169203 106287 142076 160622 -70892 5543 46196 234892 219989 157406 184418
1095A84418j91810M8861L0769N0404J2500k347J53391o9772k14443N1405J86484
$$ 184418 -7392 41469 72238 122642 135142 132795 286186 216414 1971 53376 239860
1084B39860n9481r2838p1086N4065J5935o8343L3550k21733L2447M5250K13985
$$ 239860 180379 87541 16455 70520 86455 18112 51662 -170071 -137624 -92374 121611
1073A21611O4563m7077j79504m9028R2938j9138M3910P2468j9575k87502j03542
$$ 121611 186174 139097 -40407 -89435 3503 -15635 28275 100743 81168 -206334 -309876
1062c09876L12430p3654O6118j87845K15940J60868j3r8416j4990N119j38008
$$ -309876 2554 -71100 -4982 -192827 23113 183981 183968 85552 70562 75681 -62327
1051f2327m0107J3180O5779L0534J20363K8257j10012J00327l036j67314J96251
$$ -62327 -102434 -89254 -23475 7059 127422 155679 45667 145994 142958 -24356 171895
1040A71895O9628N4358j59573o9586j56916j215Q1718n982J83850l637j97769
$$ 171895 241523 295881 136308 66722 -90194 -91409 -9691 -15673 168177 164540 -33229
1029c3229R3910O7755o4422k22040J41758J00349J8737j2529P1527j59913j17084
$$ -33229 60681 128436 64014 -158026 -16268 84081 102818 90289 161816 1903 -115181
1018a15181J09087p45j13513R959L3939N3105j3231P5095N282K7426J75957O7754
$$ -115181 -6094 -6839 -120352 -110393 -76454 -23349 -36580 38515 43797 71223 247180 314934
1006C14934j35666j69687r3078M4560n5908j52606J64448K27820J1115J6164j54507
$$ 314934 179268 9581 -83497 -38937 -94845 -247451 -83003 144817 155932 172096 17589
995A7589j7069q0972o362J15980o7239k9757P8928j05753N6080J63566l20848
$$ 17589 520 -80452 -86814 29166 -38073 -67830 11098 -94655 -38575 124991 -195857
984a95857Q2633M1783J11150j29281J6052l2886P8071m5972M182Q7746R0689N830
$$ -195857 -113224 -71441 39709 -89572 -73520 -106406 -28335 -74307 -70125 17621 108310 114140
972A14140n3250p4072Q5350k1153R2407p3570j45598J32442O7648k14672N9906
$$ 114140 60890 -13182 72168 51015 143422 69852 -75746 56696 124344 -90328 -30422
961c0422j5159k7470J54359J94157j22741k91568K5084l3497j71159L3284L88927
$$ -30422 -45581 -73051 81308 275465 152724 -138844 -113760 -147257 -318416 -285132 103795
950A03795J2782r0192l5281L5960q9248J3939R7599j2525r6764O6265J35229n3070
$$ 103795 116577 26385 -8896 27064 -62184 -48245 49354 36829 -59935 6330 141559 88489
938H8489j01727o4199L815L9439P3590Q314k30813J90316P1912k31858J39309
$$ 88489 -13238 -77437 -73622 -34183 39407 47721 -183092 7224 79136 -152722 -13413
927a3413j8416j77001J98258J07002O5347j6053k68149L0413R2418q4329L782
$$ -13413 -31829 -208830 -10572 96430 161777 145724 -122425 -92012 406 -83923 -80141
916h0141M6378l3250N3551R3105k36158o883J84445Q5314j57405k7692J08649
$$ -80141 -33763 -67013 -13462 79643 -156515 -163398 21047 106361 -51044 -78736 29913
905B9913k12771J71131J289k20205K43595P7708J5148m8417O8635p2230J32135
$$ 29913 -182858 -11727 -10438 -230643 12952 90660 105808 57391 126026 53796 185931
894A85931o05l4196r4915j63572M8281j64857O1875Q8211L2403l816j5988K02737
$$ 185931 185326 151130 56215 -107357 -59076 -223933 -162058 -73847 -41444 -45260 -61248 141489
882A41489j57767m3922L2651J7757P9067r4681J51859n1336j07921j8097O856
$$ 141489 -16278 -60200 -27549 -9792 69275 -25406 126453 75117 -32804 -50901 -44045
871d4045J2917o4845J04519N7086j53637m4860j3291M9725j76653o7641L29599
$$ -44045 -31128 -95973 8546 65632 -88005 -132865 -146156 -96431 -273084 -340725 -11126
860a1126j53537J24475M9138j02103M4606j6831J96566j16886o1890n6070L3439
$$ -11126 -164663 -40188 8950 -93153 -48547 -65378 131188 14302 -47588 -103658 -70219
849g0219P0750k9871p6085Q719Q698o6489N8251J86086j95818L7508K2014m5878
$$ -70219 531 -29340 -105425 -96706 -88008 -154497 -96246 89840 -105978 -68470 -46456 -92334
837i2334J11144L0453j3261J57865j04604j30860n7237j10K73525j35070k7026
$$ -92334 18810 49263 36002 193867 89263 -41597 -98834 -98944 174581 39511 12485
826A2485j24356m9644P461L3652K22837j3956M6640j45798N1235n2602j4992J14044
$$ 12485 -111871 -161515 -154054 -120402 102435 88479 135119 -10679 40556 -12046 -27038 87006
814H7006j01270o3923J4764J5396j9082l6618L2517J17851j14472P2498j3634
$$ 87006 -14264 -78187 -63423 -48027 -67109 -103727 -71210 46641 -67831 4667 -8967
803h967o6658J17802l4171j42527m5414P3605J60226r4735L7585j13745O3442
$$ -8967 -75625 42177 8006 -134521 -179935 -106330 53896 -40839 -3254 -116999 -53557
792e3557P2345k33408J7245J69804N9901n1417O074J05693j57695l6560K5507
$$ -53557 18788 -214620 -197375 -27571 32330 -19087 -13013 92680 -65015 -101575 -76068
781g6068O4640L3590Q1705O5086p6329q1614m0122r4206R753o7620p4833J56718
$$ -76068 -11428 22162 103867 168953 92624 11010 -29112 -123318 -113565 -181185 -256018 -99300
769i9300M7085r4013K2557K42415J48195k12928j56955J28323M8752j56337l1833
$$ -99300 -52215 -146228 -123671 118744 266939 54011 -102944 25379 74131 -82206 -114039
758a14039J89448P4921j15482p3072P8436R2580j42365j344j75420j60404O6826
$$ -114039 75409 150330 34848 -38224 40212 132792 -9573 -10917 -186337 -346741 -279915
747b79915J57673k6796j6142J96814m9711J22654j11492K4309J2930j3814q2299
$$ -279915 -122242 -149038 -165180 31634 -18077 104577 -6915 17394 30324 16510 -65789
736f5789J93768j46259l3193k3040p4869k5518J56394j9607j37896K06262l6321
$$ -65789 127979 -18280 -51473 -74513 -149382 -174900 -18506 -38113 -176009 30253 -6068
725f068k03434Q3719p8963M2416l5909j78430J82247j0630j053J4936P7298O384
$$ -6068 -209502 -125783 -204746 -162330 -198239 -376669 -194422 -205052 -206105 -191169 -113871 -107487
713a07487j10184J2013j10069J60944J17434r0768j1918P4183o7074K6509N6874
$$ -107487 -217671 -205658 -315727 -154783 -37349 -128117 -140035 -65852 -132926 -106417 -49543
702d9543L0375j62928P2449l2374Q4643J01143j52012j7348K55088l0301j65710
$$ -49543 -19168 -182096 -109647 -142021 -57378 43765 -108247 -125595 129493 99192 -66518
691f6518k53609J759L5820n5729J60243m4105J66850p9135K0376M4764k181K0259
$$ -66518 -320127 -318368 -282548 -338277 -178034 -222139 -55289 -134424 -114048 -69284 -71465 -51206
679e1206N2435j3105R7675n5673J5143M4324j92283J34185Q4063j14239J5731
$$ -51206 1229 -11876 85799 30126 45269 89593 -102690 31495 115558 1319 17050
668A7050l3184K8784r7063J1125J041P0763j20266J8096Q0797p6122j03054n454
$$ 17050 -16134 12650 -84413 -73288 -72247 -1484 -121750 -103654 -22857 -98979 -202033 -207487
656b07487p2700O9285K83397o4740j85624L41473j02704l5240k12506O7435M4395
$$ -207487 -280187 -210902 72495 7755 -177869 163604 60900 25660 -186846 -119411 -75016
645g5016J36427j32173J12944k10832J49464J54298k00751j617p325J46510q3015
$$ -75016 61411 -70762 42182 -168650 -19186 135112 -65639 -67256 -74581 71929 -11086
634a1086j64199j1259j03260J77339J63009m7835k8306p9769p5772j57878J01258
$$ -11086 -175285 -186544 -289804 -112465 50544 2709 -25597 -105366 -181138 -339016 -237758
623b37758k2972K74730k809m7770o2017j71450m9885L58855J293j38584l5978
$$ -237758 -260730 14000 11191 -36579 -98596 -270046 -319931 38924 40217 -98367 -134345
612a34345K90839j36905j75230O3169J157p9757r8196j52155J03310J56089N8519
$$ -134345 156494 19589 -155641 -92472 -91315 -171072 -269268 -421423 -318113 -162024 -103505
601a03505n0242L7904L0049J97245k5509j22916p4775L4730P2756K9274N1275
$$ -103505 -153747 -115843 -85794 111451 85942 -36974 -111749 -77019 -4263 25011 76286
590G6286j70415K9614K9893j66043k4335l6573o9956o5862r0038K31466J07791
$$ 76286 -94129 -64515 -34622 -200665 -225000 -261573 -331529 -397391 -487429 -255963 -148172
579a48172j5219R9557J22806j49955j01314l9447J18614J9744J28273N8682j52346
$$ -148172 -163391 -63834 58972 -90983 -192297 -231744 -113130 -93386 34887 93569 -58777
568e8777J07389j80805M2434o1025q5598M9448K8685o708j22927M4851J64547
$$ -58777 48612 -132193 -89759 -150784 -236382 -186934 -158249 -164957 -287884 -243033 -78486
557g8486j6007r7484j55111J77769j04195l9145J74977K2728P7524k9290m4000
$$ -78486 -94493 -191977 -347088 -169319 -273514 -312659 -137682 -114954 -37430 -66720 -110720
546a10720J98155j48253j68175J38334R2958l1470k6323N187j52669l2688K0136
$$ -110720 87435 -60818 -228993 -90659 2299 -29171 -55494 -50307 -202976 -235664 -215528
535b15528j9710J76569J18235k14869r7740j3945j11886K05416J12043l2164K7332
$$ -215528 -235238 -58669 59566 -155303 -253043 -266988 -378874 -173458 -61415 -93579 -66247
524f6247j9132n8303l5454L0425M8395Q1643q1134p6648k06739J12409J6122r9484
$$ -66247 -85379 -143682 -179136 -148711 -100316 -18673 -99807 -176455 -383194 -270785 -254663 -354147
512c54147K5970N2434Q8513P9373j9889J17824O5548n073j30392K3089N1864r47
$$ -354147 -328177 -275743 -187230 -107857 -127746 -9922 55626 50553 -79839 -56750 -4886 -5833
500e833o6047J28009j10672j61427j57998J68180p2791m4481K28803O5932j5106
$$ -5833 -71880 56129 -54543 -215970 -373968 -205788 -278579 -323060 -94257 -28325 -43431
489d3431L539q2252r7836J627l5122O4852o6341N275P3596Q8556j72556j19629
$$ -43431 -39892 -122144 -219980 -218353 -253475 -188623 -254964 -249689 -176093 -87537 -260093 -379722
477c79722J45632R8228j22290n1606j74819J49124J56956j63975J33478M8202
$$ -379722 -234090 -135862 -258152 -309758 -484577 -335453 -178497 -342472 -208994 -160792
467a60792j59482l4608J68772R405l1608R241O9463J12074k26864J9919R3039
$$ -160792 -320274 -354882 -186110 -176705 -208313 -199072 -129609 -17535 -244399 -224480 -131441
456a31441k9596j02675J283O4189k2216j14214J340J09653K8402J87195j78687
$$ -131441 -161037 -263712 -262429 -198240 -220456 -334670 -333330 -223677 -195275 -8080 -186767
445a86767j12169J5279R0956l484M4137K5349n1557j6827R2587k9807j41147L2527
$$ -186767 -298936 -283657 -192701 -196185 -152048 -126699 -178256 -195083 -102496 -132303 -273450 -240923
433b40923L2229j69230N9522J31582Q0028J1320R5079l3946k71276M1306O9349
$$ -240923 -208694 -377924 -318402 -186820 -106792 -95472 -393 -34339 -305615 -264309 -194960
422a94960n7864n222K16177o8565m2421k1204K5269k55462L77784r7190j37049
$$ -194960 -252824 -258046 -41869 -110434 -152855 -174059 -148790 -404252 -26468 -123658 -260707
411b60707J46444j2829k18929N5561n7096J1340Q0860M6828J20893J37156m8416
$$ -260707 -114263 -127092 -346021 -290460 -347556 -336216 -255356 -208528 -87635 49521 1105
400A105L9990l4712j2934P6270j2157j29694r5993O4877j40585J16275L5023j27297
$$ 1105 41095 6383 -6551 69719 57562 -72132 -168125 -103248 -243833 -127558 -92535 -219832
388b19832J1729J58656o2303j94305q4395J14661Q4929o6661K6872J20660p4998
$$ -219832 -208103 -49447 -111750 -306055 -390450 -275789 -190860 -257521 -230649 -109989 -184987
377a84987j88171m6444K12398k20731J78390Q772k3036j59857q3786J35744J74178
$$ -184987 -373158 -419602 -207204 -427935 -249545 -240773 -263809 -423666 -507452 -371708 -197530
366a97530j71526K72771l4632j55119j01520J57524J40928N885n3624J1111K2166
$$ -197530 -369056 -96285 -130917 -286036 -387556 -230032 -89104 -83219 -136843 -125732 -103566
355a03566O0046j03038k11810L05491r4566k01331j4262O8491m2098L6832k7839
$$ -103566 -43520 -146558 -358368 -52877 -147443 -348774 -363036 -294545 -336643 -299811 -327650
344c27650j1291R1191K58137R6661m3182j32804j60352l1258J44330J16244j85300
$$ -327650 -338941 -247750 10387 107048 63866 -68938 -229290 -260548 -116218 26 -185274
333a85274n3528j07565P7551J30317p904o6425j76674R7565n3137m1995J56556
$$ -185274 -238802 -346367 -268816 -138499 -146403 -212828 -389502 -291937 -345074 -387069 -230513
322b30513J09311q2146Q5114k5988L1482P7241N904j31863j61177o0296J66920
$$ -230513 -121202 -203348 -118234 -144222 -112740 -35499 -29595 -161458 -322635 -382931 -216011
311b16011J6582L7253J9125N4069N516j30147j22211P8246j34003q9931K01081
$$ -216011 -199429 -162176 -143051 -88982 -83466 -213613 -335824 -257578 -391581 -481512 -280431
300b80431Q0888J8923j29783Q4587M8371r4603J24665J06634p3649p0998l111
$$ -280431 -199543 -180620 -310403 -225816 -177445 -272048 -147383 -40749 -114398 -185396 -188507
289a88507j19566q722P0197j15470P3711n6929P9444K98150k24388q5412l4090
$$ -188507 -308073 -316795 -246598 -362068 -288357 -345286 -265842 32308 -192080 -277492 -311582
$$ [...]
##END NTUPLES=NMR SPECTRUM
##END=
