##TITLE=1H_EC-3254(5-21)
 CDCl3, 8 sc, 
 9.07.2021
##JCAMPDX= 6.0         $$ Bruker NMR JCAMP-DX V2.0
##DATA TYPE= NMR SPECTRUM
##DATA CLASS= NTUPLES
##ORIGIN= UXNMR, Bruker Analytische Messtechnik GmbH
##OWNER= root
$$ XWIN-NMR		Version 3.5
$$ Fri Jul  9 09:36:04 2021 Russian Standard Time (UT+4h)  she@DPX200
##.OBSERVE FREQUENCY= 200.131506
##.OBSERVE NUCLEUS= ^1H
##.ACQUISITION MODE= SIMULTANEOUS
##.ACQUISITION SCHEME= undefined
##.AVERAGES= 8
##.DIGITISER RES= 18
##SPECTROMETER/DATA SYSTEM= spect
##.PULSE SEQUENCE= zg30
##.SOLVENT NAME= CDCl3
##.SHIFT REFERENCE= (INTERNAL, CDCl3, 0, 17.513)
##AUDIT TRAIL= $$ (NUMBER, WHEN, WHO, WHERE, WHAT)
$$ ##TITLE= Audit trail, XWIN-NMR		Version 3.5
$$ ##JCAMPDX= 5.01
$$ ##ORIGIN= Bruker BioSpin GmbH
$$ ##OWNER= she
$$ F:/spectra/data/she/nmr/H-F/1/pdata/1/auditp.txt
$$ ##AUDIT TRAIL=  $$ (NUMBER, WHEN, WHO, WHERE, WHAT)
(   1,<2021-07-09 09:34:59.43 +0400>,<she>,<DPX200>,
      <created by zg, POWCHK disabled, PULCHK disabled
       configuration hash MD5:
       00 E9 B6 7A A2 85 ED C7 34 08 36 98 17 FE 4E 26
       data hash MD5: 16K
       98 CA E3 12 55 22 C9 ED 97 74 9F 8E 35 FD 46 0C>)
(   2,<2021-07-09 09:35:02.04 +0400>,<she>,<DPX200>,
      <Start of raw data processing
       efp BC_mod = 2 LB = 0.24 FT_mod = 6 PKNL = 1 PHC0 = -12278.74 PHC1 = 19.20101 SI = 16K 
       data hash MD5: 16K
       DA 38 54 D8 8D 7B 87 84 50 8D 04 9B CB 15 EB 36>)
(   3,<2021-07-09 09:35:15.65 +0400>,<she>,<DPX200>,
      <pk PHC0 = 3.307256 PHC1 = -4.2 
       data hash MD5: 16K
       F5 1A 40 B5 26 7A E8 58 47 F0 79 D5 E7 C3 EB 74>)
(   4,<2021-07-09 09:35:18.81 +0400>,<she>,<DPX200>,
      <abs ABSG = 5 
       data hash MD5: 16K
       96 77 B6 B2 FE A6 B0 BD F1 DE 5B 97 E4 B3 7C B1>)
$$ ##END=
$$ 
$$ hash MD5
$$ 19 21 04 6A 6E A3 05 A1 D4 F1 19 98 C1 CA B2 55
##$RELAX= 
##$RELAX= 
##$RELAX= 
##$RELAX= 
##$RELAX= 
##$RELAX= 
$$ Bruker specific parameters
$$ --------------------------
##$DU= <F:/spectra>
##$EXPNO= 1
##$NAME= <H-F>
##$PROCNO= 1
##$TYPE= <nmr>
##$USER= <she>
##$AMP= (0..31)
100 100 100 100 100 100 100 100 100 100 100 100 100 100 100 100 100 100 
100 100 100 100 100 100 100 100 100 100 100 100 100 100 
##$AQSEQ= 0
##$AQ_mod= 1
##$AUNM= <au_zg>
##$AUTOPOS= <>
##$BF1= 200.13
##$BF2= 200.13
##$BF3= 200.13
##$BF4= 200.13
##$BF5= 200.13
##$BF6= 200.13
##$BF7= 200.13
##$BF8= 200.13
##$BYTORDA= 1
##$CFDGTYP= 0
##$CFRGTYP= 5
##$CHEMSTR= <none>
##$CNST= (0..31)
1 1 145 1 1 1 1 1 1 1 1 1 1 1 1 1 1 1 1 1 1 1 1 1 1 1 1 1 1 1 1 1 
##$CPDPRG= <>
##$CPDPRG1= <>
##$CPDPRG2= <>
##$CPDPRG3= <>
##$CPDPRG4= <mlev>
##$CPDPRG5= <mlev>
##$CPDPRG6= <mlev>
##$CPDPRG7= <mlev>
##$CPDPRG8= <mlev>
##$CPDPRGB= <>
##$CPDPRGT= <>
##$D= (0..31)
0 1.2 0 0 0 0 0 0 0 0.06 0 0.03 0 0 0 0 0.0002 0 0 0 0 0 0 0 0 0 0 0 0 
0 0 0 
##$DATE= 1625808899
##$DBL= (0..7)
120 120 120 120 120 120 120 120 
##$DBP= (0..7)
150 150 150 150 150 150 150 150 
##$DBP07= 0
##$DBPNAM0= <>
##$DBPNAM1= <>
##$DBPNAM2= <>
##$DBPNAM3= <>
##$DBPNAM4= <>
$$ [...]
##$SUBNAM3= <"">
##$SUBNAM4= <"">
##$SUBNAM5= <"">
##$SUBNAM6= <"">
##$SUBNAM7= <"">
##$SUBNAM8= <"">
##$SUBNAM9= <"">
##$SW= 20.0188882624521
##$SWIBOX= (0..15)
0 0 2 0 0 0 0 0 0 0 0 0 0 0 0 0 
##$SW_h= 4006.41025641026
##$TD= 16384
##$TD0= 1
##$TE= 0
##$TE2= 300
##$TE3= 300
##$TEG= 300
##$TL= (0..7)
0 120 120 120 120 120 120 120 
##$TP= (0..7)
150 150 150 150 150 150 150 150 
##$TP07= 0
##$TPNAME0= <>
##$TPNAME1= <>
##$TPNAME2= <>
##$TPNAME3= <>
##$TPNAME4= <>
##$TPNAME5= <>
##$TPNAME6= <>
##$TPNAME7= <>
##$TPOAL= (0..7)
0.5 0.5 0.5 0.5 0.5 0.5 0.5 0.5 
##$TPOFFS= (0..7)
0 0 0 0 0 0 0 0 
##$TUNHIN= 0
##$TUNHOUT= 0
##$TUNXOUT= 0
##$USERA1= <user>
##$USERA2= <user>
##$USERA3= <user>
##$USERA4= <user>
##$USERA5= <user>
##$V9= 5
##$VALIST= <valist>
##$VCLIST= <CCCCCCCCCCCCCCC>
##$VD= 0
##$VDLIST= <DDDDDDDDDDDDDDD>
##$VPLIST= <PPPPPPPPPPPPPPP>
##$VTLIST= <TTTTTTTTTTTTTTT>
##$WBST= 1024
##$WBSW= 4
##$XGAIN= (0..3)
0 0 0 0 
##$XL= 0
##$YL= 0
##$YMAX_a= 330867
##$YMIN_a= -643627
##$ZGOPTNS= <>
##$ZL1= 120
##$ZL2= 120
##$ZL3= 120
##$ZL4= 120
##$ABSF1= 17.50688
##$ABSF2= -2.512159
##$ABSG= 5
##$ABSL= 3
##$ALPHA= 0
##$AQORDER= 0
##$ASSFAC= 0
##$ASSFACI= 0
##$ASSFACX= 0
##$ASSWID= 0
##$AUNMP= <proc_1d>
##$AZFE= 0.1
##$AZFW= 0.1
##$BCFW= 0
##$BC_mod= 2
##$BYTORDP= 0
##$COROFFS= 0
##$CY= -3
##$DATMOD= 1
##$DC= 0
##$DFILT= <>
##$DTYPP= 0
##$F1P= 0
##$F2P= 0
##$FCOR= 1
##$FTSIZE= 16384
##$FT_mod= 6
##$GAMMA= 0
##$GB= 0
##$INTBC= 1
##$INTSCL= 1.334414e-10
##$ISEN= 128
##$LB= 0.24
##$LEV0= 0
##$LPBIN= 0
##$MAXI= 10000
##$MC2= 0
##$MEAN= 0
##$ME_mod= 0
##$MI= 1.114404
##$NCOEF= 0
##$NC_proc= -6
##$NLEV= 6
##$NOISF1= 3.799351
##$NOISF2= 2.8
##$NSP= 0
##$NTH_PI= 0
##$NZP= 0
##$OFFSET= 17.51299
##$PC= 1
##$PHC0= -12275.43
##$PHC1= 15.00101
##$PH_mod= 1
##$PKNL= yes
##$PPARMOD= 0
##$PSCAL= 0
##$PSIGN= 0
##$REVERSE= no
##$SF= 200.130004329259
##$SI= 16384
##$SIGF1= 3
##$SIGF2= 2
##$SINO= 5.538805
##$SIOLD= 16384
##$SREGLST= <1H.CDCl3>
##$SSB= 0
##$STSI= 16384
##$STSR= 0
##$SW_p= 4006.41025641026
##$SYMM= 0
##$S_DEV= 0
##$TDeff= 16384
##$TDoff= 0
##$TI= <>
##$TILT= no
##$TM1= 0
##$TM2= 0
##$TOPLEV= 0
##$USERP1= <user>
##$USERP2= <user>
##$USERP3= <user>
##$USERP4= <user>
##$USERP5= <user>
##$WDW= 1
##$XDIM= 16384
##$YMAX_p= 384979608
##$YMIN_p= -268642
$$ End of Bruker specific parameters
$$ ---------------------------------
##NTUPLES= NMR SPECTRUM
##VAR_NAME=  FREQUENCY,     SPECTRUM/REAL,   SPECTRUM/IMAG
##SYMBOL=    X,             R,               I
##VAR_TYPE=  INDEPENDENT,   DEPENDENT,       DEPENDENT
##VAR_FORM=  AFFN,          ASDF,            ASDF
##VAR_DIM=   16384,         16384,           16384
##UNITS=     HZ,            ARBITRARY UNITS, ARBITRARY UNITS
##FACTOR=    0.24454680195387, 1,            1
##FIRST=     3504.87495494959, 0,            0
##LAST=      -501.535301460669, 0,           0
##MIN=       -501.535301460669, -268642,     0
##MAX=       3504.87495494959, 384979608,    0
$$ Real data points
##PAGE= N=1
##DATA TABLE= (X++(R..R)), XYDATA
$$ [...]
6449A57911M8107J0057q1036o388M2964Q084Q607L9514k4938N4676K8210m3297
6437B42471j6962k9057Q6948L222j5673k4667j1841n8618L4451j3549n1357P9240
6425B24608k4664N8098j8540j01878P9751Q1327n9031l1615j4548m420R6143k7482
6413B57749m2886N7489P0533j11324m4180l2488J22926O936m0963k0618l722K5259
6401B44711N6609m8728Q0952n5033L2052q4178L7684O5755K444j0090j152K0259
6389C41285M6052o7621J7237M2145l4606K5731l4516M9034Q2224N888j5829K4116
6377D81140m0620j2088L1897M9051L0620L7827m7150O3098m9814M0360J6418L3765
6365F34504j6792J2863J13701J10424o8904Q5285o4620j17881R8790m795K3217
$$ y = [157911, 206018, 216075, 135039, 128651, 171615, 179699, 188306, 227820, 202882, 257558, 285768, 242471, 225509, 196452, 283400, 286622, 270949, 246282, 234441, 175823, 210274, 196725, 145368, 224608, 199944, 258042, 239502, 137624, 217375, 298702, 239671, 208056, 193508, 189088, 285231, 257749, 214863, 272352, 342885, 231561, 187381, 154893, 277819, 284755, 243792, 223174, 219452, 244711, 301320, 252592, 333544, 278511, 310563, 226385, 264069, 329824, 332268, 322178, 321026, 341285, 387337, 319716, 336953, 379098, 344492, 370223, 335707, 384741, 466965, 472853, 457024, 481140, 440520, 428432, 460329, 509380, 540000, 577827, 530677, 593775, 543961, 584321, 600739, 634504, 617712, 630575, 744276, 854700, 785796, 871081, 806461, 688580, 787370, 782575, 805792]
6354H05792j2056p7187N7645P4278n2526o8278m9879L9444j8522O559o0850j710
6342F42710J0715M181L8692n5103m4621O6590K6144l1263J02766Q7093q3012k8047
6330G36845P0592m2791q1835j1735o592J8821j6581K1455m636k1846J15016o7185
6318G09528P1271K1602k4485o9336j10501M8086K2599r403j7729J08543K7591
6307G77766r9648N0408Q9639k4258J349Q6130n6870m282n2152L9024J8333n3586
6295G71853O887O465Q2948N0759L1244Q9422m8445L6731J8206l770o4449j5590
6283I62261l9884O6575M695K0459k7703k148J3824Q9354j6231L3705O7635p1564
6271A100978n8210K7035R5180M1844j1021P0678R7047k406j9682K0689J43060
$$ y = [805792, 793736, 716549, 774194, 848472, 795946, 727668, 677789, 717233, 698711, 705270, 644420, 642710, 653425, 657606, 696298, 641195, 596574, 663164, 689308, 658045, 760811, 847904, 764892, 736845, 807437, 764646, 682811, 671076, 664484, 683305, 666724, 688179, 683543, 661697, 776713, 709528, 780799, 802401, 777916, 708580, 598079, 646165, 668764, 659361, 641632, 750175, 777766, 678118, 728526, 818165, 793907, 795256, 881386, 824516, 820234, 768082, 807106, 825439, 771853, 778740, 785205, 868153, 918912, 950156, 1039578, 991133, 1027864, 1046070, 1042300, 977851, 962261, 922377, 988952, 993647, 1014106, 986403, 984255, 998079, 1087433, 1071202, 1104907, 1172542, 1100978, 1042768, 1069803, 1164983, 1206827, 1195806, 1266484, 1363531, 1361125, 1341443, 1362132, 1505192]
6260A505192P2624Q5432j20012K9789j5223l7927J34177M7285r045P7973P0144
6249A840409M3397l5119K414Q8285J7305L1667O3896M3951L6621O8114J14461
6238B315401j7864k6244L2441J05349p771J25484J08271N9407N6625J6072K6941
6227B794112J14499J37064L6014J5861J28287Q4422J09422O9652J47154R6493
6217C732980Q8596R0889J60639J44031P3252J50988R1808J23090J33796J45238
6207D935307J13412K47427J74658Q9037J16742J15618K55647K22421J19344K06715
6197F596328K48465K42037J39177J98342L59465K95594L33447K39754L20367L84512
6187I357488L69103L99163M39861M47916M72951N45375N74930O70195O30369O20862
$$ y = [1505192, 1577816, 1663248, 1543236, 1573025, 1557802, 1519875, 1654052, 1701337, 1692292, 1770265, 1840409, 1883806, 1848687, 1851101, 1939386, 1956691, 1988358, 2052254, 2096205, 2132826, 2200940, 2315401, 2297537, 2271293, 2303734, 2409083, 2401312, 2526796, 2635067, 2694474, 2751099, 2767171, 2794112, 2908611, 3045675, 3081689, 3097550, 3225837, 3310259, 3419681, 3489333, 3636487, 3732980, 3821576, 3912465, 4073104, 4217135, 4290387, 4441375, 4533183, 4656273, 4790069, 4935307, 5048719, 5296146, 5470804, 5559841, 5676583, 5792201, 6047848, 6270269, 6389613, 6596328, 6844793, 7086830, 7226007, 7424349, 7783814, 8079408, 8412855, 8652609, 8972976, 9357488, 9726591, 10125754, 10565615, 11013531, 11486482, 12031857, 12606787, 13276982, 13907351, 14528213]
6177A4528213P22145P48583Q87294R88953R73010J065379J216446J284025J351697
6168B3765745J431830J551677J750619J774865K005305K091719K174851K236055
6160C8782666K305987K315355K206223K060074J742290J519006J105158O94939
6152E2731698J85420n18981r48876j406748j820575j948878k288362k364964k367141
6143C9252593k305699k199471k130720j944937j867216j754141j502799j537093
6135B4010517j421518j263869j027840j155780j033594j045888p96367o82925
6127A5582736p81871p20769o34971n14888o34241m15981m93499n48977m99129
6118A0338410l90233l76192k73305m20630l56179k59514l23287l63003k86483
$$ y = [14528213, 15250358, 15998941, 16886235, 17875188, 18848198, 19913577, 21130023, 22414048, 23765745, 25197575, 26749252, 28499871, 30274736, 32280041, 34371760, 36546611, 38782666, 41088653, 43404008, 45610231, 47670305, 49412595, 50931601, 52036759, 52731698, 52917118, 52398137, 51449261, 50042513, 48221938, 46273060, 43984698, 41619734, 39252593, 36946894, 34747423, 32616703, 30671766, 28804550, 27050409, 25547610, 24010517, 22588999, 21325130, 20297290, 19141510, 18107916, 17062028, 16265661, 15582736, 14800865, 14080096, 13445125, 12930237, 12295996, 11880015, 11386516, 10837539, 10338410, 9948177, 9571985, 9298680, 8878050, 8521871, 8262357, 7939070, 7576067, 7289584]
6109G289584l12432k20123k13678j25114k61402j52175k51558j07865j04281j85377
6099E355579j93983n0959j56279r3288j31329k28700j08133p7921j81254p7212
6089D056521n9582j72154m4896o6805j40916q0185r7604j09103m4660j29396m7927
6078C063293r0716l7865k0467n6398j56696r6108q6016m8568N7103q2868j34602
6067B310092m3741j09383j14699L9647N7183o0436j19647k5911k2615n9235J6208
6056A867463l4087j2644r1300p2597p572K537n5252n02j2612n0496P205K997m0507
6043A502633K14q5453K2359n2787p8671L0546L4495o2638k8442r236K0212n3618
6031A239614o2869M4887j0293n774M9777q4824o6156J8792q8339k1585M7231K3517
$$ y = [7289584, 6977152, 6757029, 6543351, 6418237, 6156835, 6004660, 5753102, 5645237, 5540956, 5355579, 5161596, 5110637, 4954358, 4861070, 4729741, 4501041, 4392908, 4314987, 4133733, 4056521, 3996939, 3824785, 3779889, 3713084, 3572168, 3491983, 3394379, 3285276, 3240616, 3111220, 3063293, 2972577, 2934712, 2914245, 2857847, 2701151, 2605043, 2519027, 2470459, 2527562, 2444694, 2310092, 2266351, 2156968, 2042269, 2081916, 2139099, 2078663, 1959016, 1933105, 1910490, 1851255, 1867463, 1833376, 1820732, 1729432, 1656835, 1649263, 1651800, 1596548, 1596046, 1583434, 1532938, 1540143, 1543140, 1502633, 1502847, 1417394, 1439753, 1386966, 1308295, 1338841, 1373336, 1310698, 1282256, 1273020, 1293232, 1239614, 1176745, 1221632, 1211339, 1205565, 1255342, 1170518, 1104362, 1123154, 1034815, 1013230, 1060461, 1083978]
6019A083978m9840J6564j7898j19396p029j9967K2197j9548K6246K505o2421J1664
6007H67055n8538N0849K6913j17939O114j3583L6967j510L9701Q090L3315k7050
5995H50384k8034K9807k8894J3501K6350j4719J03056n679j08812K134p856l1704
5983G99534L748L4467n616k633l9368j4991L0987M635j2693O6534j6718J3613
5971H61499l1205p387j4001J3705K3802m2902m6132K8656p4694O7096n2176o1405
5959F64856j4829L8309q3290K6391M3137n3968J7671j471n5624P8226P2346q658
5947G23096K4205J1038L9664m1269K3992L0375N4009j2384K085m1362P4653j3093
5935H75009p0918n9633k7613Q032J2198o9407n3783k3453L4447k3404k1486M1202
$$ y = [1083978, 1034138, 1050702, 1032804, 913408, 906379, 886412, 908609, 889061, 915307, 917812, 855391, 867055, 808517, 859366, 886279, 768340, 774454, 760871, 797838, 796328, 836029, 844119, 877434, 850384, 822350, 852157, 823263, 836764, 863114, 848395, 951451, 945772, 836960, 839094, 831238, 799534, 803282, 837749, 832133, 829500, 790132, 775141, 806128, 810763, 798070, 864604, 847886, 861499, 830294, 822907, 808906, 822611, 846413, 803511, 757379, 786035, 711341, 778437, 726261, 664856, 650027, 688336, 605046, 631437, 674574, 620606, 638277, 636806, 581182, 659408, 731754, 723096, 747301, 758339, 798003, 756734, 780726, 811101, 865110, 852726, 854811, 813449, 888102, 875009, 804091, 744458, 716845, 724877, 737075, 667668, 613885, 590432, 624879, 601475, 579989, 621191]
5923F21191N3520l5556r2373K7528o8005j09416j2270L4678K9305K6816L6797
5912E12215k1957J7969j7188p672M2993J667q2913K1952n419k7028n6501o2008
5900C16110N0971K1160M4067P5971L2856q1374q7993N7089J58297m3242n4774
5889D89138m3323n3472O8701N3826m4730Q2282J9758k9386M4972o3503o4194J96869
5877F56938k4679p170q0528J6391k4108P5766M9340Q027k5510m8429n4985M2926
5865E83979O0033m5966l9325M3661N8660j292j03252N778M9954L5533N0478l9135
5853F59106N7242L2894M4137L1965J02633J0599O359J318k1496r0752n4434m4256
5841G35315M2541k4728J2060r4435M9018k687j7438J4139N6257J0727k2849q5613
$$ y = [621191, 674711, 639155, 546782, 574310, 506305, 396889, 384619, 419297, 448602, 475418, 512215, 490258, 508227, 491039, 483367, 526360, 528027, 445114, 467066, 461647, 434619, 378118, 316110, 367081, 388241, 432308, 508279, 541135, 459761, 371768, 428857, 587154, 543912, 489138, 445815, 392343, 461044, 514870, 470140, 552422, 572180, 542794, 587766, 524263, 460069, 656938, 632259, 625089, 544561, 560952, 536844, 612610, 661950, 669977, 644467, 596038, 541053, 583979, 644012, 598046, 558721, 602382, 661042, 659750, 556498, 562276, 612230, 647763, 698241, 659106, 716348, 749242, 793379, 825344, 927977, 938576, 944935, 946253, 924757, 834005, 779571, 735315, 777856, 753128, 765188, 670753, 719771, 717084, 699646, 713785, 770042, 780769, 757920, 672307]
5829F72307O1506L824q0243J2557R4673o4219l9546o691J6246L9906N172J3139
5817G28631J4339N2287j11741n323M1882m2055L3848k745l2247J3147j2663j7369
5805F59991j4989j8491M1251k1557m350j749k1198J06730M06j6690l6144n847
5793F67363k5064q5902K9981Q4633m7291r8732M0754k0851R93P2752J06348o6310
5781F58674j24426J41392N1077K4927J5112k1573k0806N8285J2031r1531Q6168
5770G89330M6977m6802J7553M6990J5006q0065K5041m0826k5432j7065J5054k3937
5758G21824R141j15747Q5932K9931l7024L9842J4561M613l9579K7469k8219k319
5746G10425P408L3930K6108N933L3292M0693K6265q185K1740R6702O5261K0197
$$ y = [672307, 733813, 737637, 657394, 669951, 764624, 700405, 660859, 654168, 670414, 710320, 715492, 728631, 742970, 795257, 683516, 678193, 720075, 678020, 711868, 709123, 676876, 690023, 677360, 659991, 645002, 626511, 667762, 646205, 641855, 640106, 618908, 725638, 726044, 709354, 673210, 667363, 642299, 556397, 586378, 671011, 623720, 524988, 565742, 544891, 545884, 618636, 724984, 658674, 534248, 675640, 726717, 751644, 766756, 745183, 724377, 782662, 794693, 703162, 789330, 836307, 789505, 807058, 854048, 869054, 788989, 814030, 773204, 747772, 730707, 745761, 721824, 730965, 615218, 701150, 731081, 694057, 733899, 748460, 753073, 713494, 740963, 712744, 710425, 717833, 751763, 777871, 783804, 817096, 857789, 884054, 875869, 897609, 994311, 1059572, 1079769]
5734A079769j660j30454k7021Q4789k7409J0918J8697l3200K592j4557j4640M9034
5722I96858Q0725j0559j02005Q3961J7260L456M1734o2399q978J0101J64367j8628
5710A195893K4310L3170O4019R3392n4420q0974O1074R8239R4041P0189q0993
5699A517940L2294K5107l2200L0439p5077M2638L1962j425l3009o9370L3059M7469
5687A549827J85159N4397r904P469J33320K3423N1107J619J11025K8909P8102
5676B214453p850K81J8027O1855M2419K4815M7431m573M686J02038O2970J2453
5664B579005M4290M9172O1230R4715J33660J63038J11016L4819P8679R3030R9448
5653C542102J17132J02705O7134J74615J07618P2145J04593J27474M0550J04311
$$ y = [1079769, 1078109, 947655, 920634, 1005423, 978014, 988932, 1007629, 974429, 977021, 962464, 947824, 996858, 1077583, 1067024, 965019, 1048980, 1066240, 1069696, 1111430, 1049031, 1040053, 1050154, 1214521, 1195893, 1220203, 1253373, 1317392, 1410784, 1356364, 1275390, 1336464, 1434703, 1528744, 1598933, 1517940, 1550234, 1575341, 1543141, 1573580, 1498503, 1541141, 1573103, 1571678, 1538669, 1469299, 1502358, 1549827, 1734986, 1789383, 1779479, 1786948, 1920268, 1943691, 1994798, 1996417, 2107442, 2136351, 2214453, 2206603, 2206884, 2224911, 2286766, 2329185, 2354000, 2401431, 2396858, 2401544, 2503582, 2566552, 2579005, 2623295, 2672467, 2733697, 2828412, 2962072, 3125110, 3236126, 3270945, 3349624, 3442654, 3542102, 3659234, 3761939, 3829073, 4003688, 4111306, 4183451, 4288044, 4415518, 4456068, 4560379]
5643D560379O6424J13123J30619J25295R2614J89549J53405L7416K43656J86799
5633E899279K19011J21417J60069K67400K12305J83832J92010J88201K43552K57715
5623G944791J74122M24295K90239L58015K49385L88663M71941M33125M39938M09967
5613A1584481N27608N29364N87397O53046O04289O84145P81967J066457J115523
5604A8134277J172315J395910J470070J688970J952909K211983K381440K755918
5596C3163792L087514L495655L708665L774859L694416L119252K011718L71570
5588E6427441j066339k184934k779312k848226k411551j917991j385137q51961
5580D0981990n01390L186M01657Q61986J204801J828517K364715K770671L338875
$$ y = [4560379, 4626803, 4739926, 4870545, 4995840, 5088454, 5278003, 5431408, 5468824, 5712480, 5899279, 6118290, 6239707, 6399776, 6667176, 6879481, 7063313, 7255323, 7443524, 7687076, 7944791, 8118913, 8543208, 8833447, 9191462, 9440847, 9829510, 10301451, 10734576, 11174514, 11584481, 12112089, 12641453, 13228850, 13881896, 14486185, 15170330, 15952297, 17018754, 18134277, 19306592, 20702502, 22172572, 23861542, 25814451, 28026434, 30407874, 33163792, 36251306, 39746961, 43455626, 47230485, 50924901, 54044153, 56055871, 56427441, 55361102, 53176168, 50396856, 47548630, 45137079, 43219088, 41833951, 40981990, 40480600, 40483786, 40885443, 41747429, 42952230, 44780747, 47145462, 49916133, 53255008]
5571E3255008M034732M580550N275628O125435O974537P320085P266054O382898
5563A01214927M262761J011869k912201o308192q355614q934524q172488o850433
5555F4956105n648649m557143l545229k865300k361988j902906j306889p97855
5547D1970146l23940O4133N61281R10902J335936J566782J948664K415105K595948
5538E3044957K656380K200072J516419N8049j511319l065203m181202m677674
5530D6040479m634580m097477l549477l086564k558232k366347k021948j724890
5522B2000964j523047j328876j154862j143417r33706p69254p72565p11289n54913
5513A3109035n34632n09077m73894n07715n14814k95604l13131l89141k31272
$$ y = [53255008, 57289740, 61870290, 67145918, 73271353, 80245890, 87565975, 94832029, 101214927, 105477688, 106489557, 103577356, 97269164, 88913550, 79979026, 71806538, 64956105, 59307456, 54750313, 51205084, 48339784, 45977796, 44074890, 42768001, 41970146, 41646206, 41710339, 42271620, 43182522, 44518458, 46085240, 48033904, 50449009, 53044957, 55701337, 57901409, 59417828, 59475877, 57964558, 54899355, 50718153, 46040479, 41405899, 37308422, 33758945, 30672381, 28114149, 25747802, 23725854, 22000964, 20477917, 19149041, 17994179, 16850762, 15917056, 15147802, 14375237, 13663948, 13109035, 12574403, 12065326, 11591432, 11083717, 10568903, 10273299, 9960168, 9571027, 9339755]
5504I339755l52007l26208l41588k61648k41274k24500k54123j66399k29392k42985
5494F699631k29996k66863j89177j53638k21963j06818j39576k32965j50972j43104
5484D864559j85518j37288r9663j10878J96p7527j26461j9070n9483j75320m2924
5473C830623l7687n0809n1989l0211j63241r9772l7810j38096q9636N3449m0160
5462C144661p4272n5256o0089j66316m4871r070l7739P932M2810n2755q8412p8917
5450B527706J8141l6986n9202L5541q5636m8285M2147j4944j7740q1700j20197
5439B158845J06021p8893j59444j16329O4394l2763m3036J2136m4946j9431p2095
5428A774459L0884k0679m5167m6724J1879N8498n1802q6519p1321R9110O250k7726
$$ y = [9339755, 8987748, 8661540, 8319952, 8058304, 7817030, 7592530, 7338407, 7172008, 6942616, 6699631, 6469635, 6202772, 6013595, 5859957, 5637994, 5531176, 5391600, 5158635, 5007663, 4864559, 4679041, 4541753, 4442090, 4331212, 4331408, 4253881, 4127420, 4108350, 4048867, 3873547, 3830623, 3792936, 3742127, 3690138, 3659927, 3496686, 3396914, 3359104, 3221008, 3131372, 3184821, 3144661, 3070389, 3015133, 2955044, 2788728, 2743857, 2734787, 2697048, 2704980, 2747790, 2695035, 2606623, 2527706, 2545847, 2508861, 2449659, 2485200, 2399564, 2351279, 2393426, 2378482, 2360742, 2279042, 2158845, 2264866, 2185973, 2026529, 1910200, 1974594, 1941831, 1898795, 1910931, 1865985, 1846554, 1774459, 1805343, 1784664, 1739497, 1692773, 1704652, 1763150, 1711348, 1624829, 1553508, 1652618, 1658868, 1631142]
5416A631142Q0721k2870j48047n8909N0368n069L0039O6609r1418K5403r8629
5405A459340M154m155n5628m542J0727l8817j10040P2268R937l2812j9110q5756
5393A205566J1551k3703L1782k3367j02582O1569K5358r5345j7913K7566K5890
5382A126372o7791k3606J4194n6564L399M3595j00199Q0014J706o4600k7700K6044
5370I54864l529J667P6040R540m1357r896k0938K5044j6322j71571m5749o1502
5358F96291Q0586J9303q0020p3434P2243K0673r201j03526K3680P1156M5556L1499
5346G94806P5784n2112J26854K1809o2205m7532q4476j1124n479M7045m4290O8712
5334H27792J3159l5837l3950k916k4003K3162j33328l565L2877O7721M3735r3782
$$ y = [1631142, 1711863, 1688993, 1540946, 1482037, 1532405, 1527336, 1557375, 1623984, 1532566, 1557969, 1459340, 1463494, 1459339, 1403711, 1399169, 1409896, 1371079, 1261039, 1333307, 1343244, 1310432, 1291322, 1205566, 1217117, 1193414, 1225196, 1201829, 1099247, 1160816, 1186174, 1090829, 1072916, 1100482, 1126372, 1058581, 1034975, 1049169, 992605, 996004, 1039599, 939400, 1019414, 1021120, 956520, 928820, 954864, 951335, 953002, 1029042, 1038582, 997225, 987329, 966391, 991435, 975113, 803542, 757793, 696291, 776877, 796180, 716160, 642726, 714969, 735642, 726441, 622915, 646595, 717751, 763307, 794806, 870590, 818478, 945332, 967141, 904936, 857404, 772928, 761804, 756325, 803370, 759080, 827792, 840951, 805114, 771164, 768248, 744245, 767407, 634079, 630514, 663391, 731112, 774847, 681065]
5322F81065J5771J1872L5434j7587O4282l8208O377K3414J12375q2465N083L4563
5310H51976l1287J02188m5429P7580Q1357n7930p2055O5467M0525N790q6086o7951
5298H64145Q6920K4408r8750J3234n814J08306j2222O126K3729j47771Q0409O2134
5286A004854Q712N6175P9058p8790l4985R5161M6890K365Q019J37068O9068K9478
5274A423073K6850r2765N3808R2321l3549k3158k9936l2234J4838o0774M7246
5263A385720P9078P7065N2569O9546k5266J5293J3607L3421J8008P4093m8115
5252A745019R1189Q300p9282l7347l0633R1650K7013r9464j01077n9889l6064
5241A519415l0975k07896j00488K8983K1355m7854J519j00790l3414K881J9564
$$ y = [681065, 696836, 708708, 744142, 726555, 790837, 752629, 759006, 782420, 894795, 812330, 817413, 851976, 820689, 922877, 877448, 955028, 1036385, 978455, 906400, 971867, 1012392, 1018182, 932096, 864145, 951065, 975473, 876723, 889957, 884143, 992449, 980227, 986353, 1010082, 862311, 942720, 1004854, 1013566, 1069741, 1148799, 1070009, 1035024, 1130185, 1177075, 1179440, 1187459, 1324527, 1393595, 1423073, 1449923, 1357158, 1410966, 1503287, 1469738, 1446580, 1416644, 1384410, 1399248, 1338474, 1385720, 1464798, 1541863, 1594432, 1663978, 1638712, 1654005, 1667612, 1701033, 1719041, 1793134, 1745019, 1836208, 1844508, 1765226, 1727879, 1697246, 1788896, 1815909, 1716445, 1615368, 1555479, 1519415, 1488440, 1280544, 1180056, 1209039, 1230394, 1182540, 1184059, 1083269, 1049855, 1052736, 1072300]
5230A072300j9966j066L0831r3464j09986O9600O9862n0611k768L1316J7859m3390
5218I70517n7112P0776j3578K2039P0597P5445J1442P8797O6115L345m4537j0161
5206A243685j2234J987K0309p9452P2236k6699j20794J3583P5729r5978m9332
5195A043040j3996j2656N7764j0924N6969r1623k8801M808L699o0216L7035L9238
5183A024337R6359j7360j6377l4321K6215r0121k8569O9112l1275j15565N507
5172H87942O0554l4414p2471P7861j04448q5986o966R9249P8410R041j8711l8388
5160H51673O0505M7825P1558P690N3553J5462K8765N1753O9139N1974J37600m6308
5148A401189J18089k2517j9910l6770J277n5028r4376N4415K020n156K2676l9691
$$ y = [1072300, 1052334, 1051268, 1082099, 988635, 878649, 948249, 1018111, 967500, 964732, 996048, 1013907, 970517, 913405, 984181, 970603, 992642, 1063239, 1138684, 1150126, 1228923, 1295038, 1298383, 1253846, 1243685, 1231451, 1233438, 1253747, 1174295, 1246531, 1219832, 1099038, 1112621, 1188350, 1092372, 1043040, 1029044, 1016388, 1074152, 1063228, 1120197, 1028574, 999773, 1004581, 1008280, 948064, 985099, 1024337, 1120696, 1103336, 1086959, 1052638, 1078853, 988732, 960163, 1029275, 998000, 882435, 887942, 948496, 914082, 841611, 919472, 815024, 729038, 722072, 821321, 899731, 908772, 890061, 851673, 912178, 960003, 1031561, 1039251, 1092804, 1108266, 1137031, 1188784, 1257923, 1309897, 1447497, 1401189, 1519278, 1496761, 1476851, 1440081, 1441358, 1386330, 1291954, 1346369, 1348389, 1343233, 1365909, 1326218]
5136A326218R0832k7786j9378R5662L1340o2214O5808j3335l7608K352P072Q1377
5124A540340m0205m6631K8348p2951P1433K4130M3944M5152K2153K8330n0001
5113A594042J2604j3326K6703K9917N1814K891K1434J7068N7487k1709O9142K1579
5101A869646M5146Q3201J8268J56964K0407M027M059K1952P7483Q7308J02308
5090B490769R0199Q0646N7959Q5335M0086Q5059J71822L6620J10256J98782J78488
5079C626021R1911R6874N9113J76067k821P2905L5636L0213L6853L0255K80457
5068D533484J94698L8987J11468J49809J63037J93254K19268K73990L07286L40853
5058F526134M24162L64822M40697M82008K69536L16948o7180k71055l31179k17541
$$ y = [1326218, 1417050, 1389264, 1369886, 1465548, 1496888, 1434674, 1500482, 1487147, 1449539, 1451891, 1458963, 1540340, 1500135, 1453504, 1481852, 1408901, 1480334, 1504464, 1548408, 1593560, 1615713, 1644043, 1594042, 1606646, 1593320, 1620023, 1649940, 1701754, 1704645, 1726079, 1743147, 1800634, 1778925, 1848067, 1869646, 1914792, 1997993, 2016261, 2173225, 2193632, 2197659, 2201718, 2223670, 2301153, 2388461, 2490769, 2580968, 2661614, 2719573, 2804908, 2844994, 2930053, 3101875, 3138495, 3248751, 3447533, 3626021, 3717932, 3814806, 3873919, 4049986, 4047165, 4120070, 4155706, 4185919, 4222772, 4253027, 4533484, 4728182, 4767169, 4878637, 5028446, 5191483, 5384737, 5604005, 5877995, 6185281, 6526134, 6950296, 7315118, 7755815, 8237823, 8507359, 8824307, 8757127, 8486072, 8154893, 7937352]
5048G937352j26198R522r784J42265J49437J43036K37489K06318K74529L81369
5038I345335L63507M13902M59208O00909N30691N74972P14136N98918Q02005Q28221
5028A5231804J022753J156599R85747Q95474M57965k73850q11589p85067o28145
5019A7251691k92964j43215J11907L20408L73852K55182L65821O22709O46321
5010A9511712P68027R03239J005086J137553J213353J391875J683126J741030
5002B9355001K129287K357067K532382K970861L357947L420611L671154L431449
4994E3225759L057307L329615L893785M803501N886615O967150P962653Q760083
4986I7886468R376709R635845R604624R378003Q722839P433508N766705L491796
$$ y = [7937352, 7811154, 7820676, 7810892, 7953157, 8102594, 8245630, 8483119, 8689437, 8963966, 9345335, 9708842, 10122744, 10581952, 11182861, 11713552, 12288524, 13002660, 13601578, 14403583, 15231804, 16254557, 17411156, 18396903, 19292377, 19750342, 19476492, 18664903, 17879836, 17251691, 16958727, 16815512, 16927419, 17247827, 17621679, 17876861, 18242682, 18865391, 19511712, 20279739, 21182978, 22188064, 23325617, 24538970, 25930845, 27613971, 29355001, 31484288, 33841355, 36373737, 39344598, 42702545, 46123156, 49794310, 53225759, 56283066, 59612681, 63506466, 68309967, 74196582, 81163732, 89126385, 97886468, 107263177, 116899022, 126503646, 135881649, 144604488, 152037996, 157804701, 161296497]
4978A61296497M67568k830009n788957p885489q934698r338215r344781r369161
4970A08272755r207883q788549q242828p515634p071229o342245n650677m911308
4962E0542402m279962l616230l290360k787023k496631k106855j814635j688730
4954B8461976j543672j472609j162492j128852j097055j090935q56885p88782
4946A9320694q71286q29652p53935o87356o61677p03756o28372n52802m57513
4937A3174345n58056m46675l56346l73132m14822l80977l79343l25698k31412
4928I707884l03335k49286k83879j91005k50292j52434j56580j45763k08546j70536
4918G596228j74310l0717j36651j52862j30409k85863j29700o7995n5563k59708
$$ y = [161296497, 161764065, 158934056, 153145099, 145259610, 136324912, 126986697, 117641916, 108272755, 99064872, 90276323, 82033495, 74517861, 67446632, 61104387, 55453710, 50542402, 46262440, 42646210, 39355850, 36568827, 34072196, 31965341, 30150706, 28461976, 26918304, 25445695, 24283203, 23154351, 22057296, 20966361, 20109476, 19320694, 18449408, 17619756, 16865821, 16178465, 15516788, 14813032, 14184660, 13631858, 13174345, 12616289, 12169614, 11813268, 11440136, 11025314, 10644337, 10264994, 9939296, 9707884, 9404549, 9155263, 8871384, 8680379, 8430087, 8277653, 8121073, 7975310, 7766764, 7596228, 7421918, 7391201, 7254550, 7101688, 6971279, 6685416, 6555716, 6487721, 6432158, 6172450]
4908F172450k14833j96688j19516r0458j55963j07081j39559j24734j9208j89043
4898D815367J9252m6861j81182j70437q3701p3856j55827p6521j74192j62224
4888C709818j17486j37314n2556P1680j52119j10678J42274q9993m8241n7115
4878C158270j15112J6248j13551L0623o3729j5505R54r2094N1194p6020P7699
4867B858977k7847j32805o6513j2689p8690J2998l8012m4010q4491J5576m312
4856B398182m1840o561M2843r7452n0301j4330p4842P5242M04n4093q9613l9493
4844B048146l2662J7431K793r7227L0372J240j08368L9442m4201l973j7815p9506
4832A755672n4051P0796k3364l3107L7946p9189l8675N1770k7179N67Q47j37861
$$ y = [6172450, 5957617, 5760929, 5641413, 5550955, 5394992, 5287911, 5148352, 5023618, 5004410, 4815367, 4834619, 4787758, 4606576, 4436139, 4352438, 4278582, 4122755, 4046234, 3872042, 3709818, 3592332, 3455018, 3402462, 3474142, 3322023, 3211345, 3353619, 3263626, 3215385, 3158270, 3043158, 3059406, 2945855, 2976478, 2912749, 2897244, 2898198, 2806104, 2857298, 2781278, 2858977, 2831130, 2698325, 2631812, 2619123, 2540433, 2553431, 2515419, 2471409, 2386918, 2402494, 2398182, 2356342, 2349781, 2392624, 2295172, 2244871, 2230541, 2155699, 2230941, 2231345, 2177252, 2087639, 2048146, 2015484, 2032915, 2035708, 1938481, 1968853, 1970093, 1861725, 1901167, 1856966, 1852993, 1835178, 1755672, 1701621, 1772417, 1749053, 1715946, 1753892, 1674703, 1636028, 1687798, 1660619, 1661186, 1662033, 1524172]
4820A524172o556J20434k9448l0950J43838m3183j1594l9915n2301J4769O1023
4809A650289N1005N0134l2176n7633J4582l3815l2120k9795R9005M2422J47263
4798A869161J9025R4281N5209P5408J85691J82362K31344J20557K12219K36014
4788C281271K10213M437k86680l47496l85169k92032k41071q9093q2326j42612
4778A629442j62624k5292n5686j11838j3263k5908j21041K20m0197n7111j0220
4767A006482J3854j2928M4292J5874J2955J7970L0400L6390o5804n889l5695o5160
4755I92741L0998K3808o8106R8791K3398k0182l525p7130L3168L5655q9697p2730
4743I07189j1583M4694R191m3361M8308j407J514J17159M0996L1984K4729l6809
$$ y = [1524172, 1517616, 1638050, 1608602, 1577652, 1721490, 1678307, 1666713, 1626798, 1574497, 1589266, 1650289, 1701294, 1751428, 1719252, 1661619, 1676201, 1642386, 1610266, 1580471, 1679476, 1721898, 1869161, 1888186, 1982467, 2037676, 2113084, 2298775, 2481137, 2712481, 2833038, 3045257, 3281271, 3491484, 3495921, 3209241, 2861745, 2476576, 2184544, 1943473, 1854380, 1772054, 1629442, 1466818, 1441526, 1385840, 1274002, 1260739, 1234831, 1113790, 1114010, 1073813, 1016702, 1006482, 1020336, 1007408, 1051700, 1067574, 1080529, 1098499, 1128899, 1165289, 1099485, 1093596, 1057901, 992741, 1023739, 1047547, 979441, 1078232, 1101630, 1081448, 1077923, 1000793, 1033961, 1069616, 979919, 907189, 895606, 940300, 949491, 906130, 954438, 953031, 954545, 1071704, 1112700, 1144684, 1169413, 1132604]
4731A132604P733J0891Q1726j04515l4579Q4995Q6279L1305J1470O9118n5927
4720A321100j8579j8976Q6547O0781N2582J7208O0236R0415n4421L2777J10338
4709A740008J23799J17096O9925m6977l1041J6056l9244P1294L990l9273q13l4600
4697A950220p7122j02314r7521l7570P694k6067m3340r8952L6275l0526p7923
4686A402854J55372q3898j15123L8392j7158l811n0937P284R1179P521j2966r0450
4674A328259N589Q1711m7122K7959L522m91P3576k2216M4772PM7378l5731K7266
4661A534479M0500M2905M1530R195K7258K4915N6421J24955L2407J3920r117k0316
4649A919052K9182J29260l5447k5993P7266N1196J5698q1885j49127k2434O6440
$$ y = [1132604, 1140337, 1151228, 1232954, 1128439, 1093860, 1178855, 1265134, 1296439, 1307909, 1377027, 1321100, 1302521, 1283545, 1370092, 1430873, 1483455, 1500663, 1560899, 1651314, 1596893, 1629670, 1740008, 1863807, 1980903, 2050828, 2003851, 1972810, 1988866, 1949622, 2020916, 2024906, 1985633, 1984820, 1950220, 1873098, 1770784, 1673263, 1635693, 1643387, 1617320, 1573980, 1475028, 1511303, 1480777, 1402854, 1558226, 1474328, 1359205, 1397597, 1380439, 1376628, 1325691, 1332975, 1424154, 1431675, 1418709, 1328259, 1333848, 1415559, 1368437, 1396396, 1399918, 1399427, 1473003, 1450787, 1495559, 1495566, 1542944, 1507213, 1534479, 1574979, 1617884, 1659414, 1668609, 1695867, 1720782, 1777203, 1902158, 1934565, 1948485, 1939368, 1919052, 1948234, 2077494, 2042047, 2016054, 2093320, 2144516, 2160214, 2078329, 1929202, 1906768, 1973208]
4638A973208m5088p4828N2491j9808j2028k6127j047J07469L166M7370J2087k9878
4626A986987M5420P423J6626j1559K8579N3426j46R0743p3393n9366J9549j1958
4614B092331n7833p194n269L6632L1966m293j06794K9512P0534l4127N5431N5703
4602B156599p5709q782q32O8936J4256J5637J807K1882P043l2822j37051q299
4590B022665j9599m6651L1856J18932L565p8578K9861J1568m120L402l424l0154
4578B039323M7608j7225N7943M7981o6171n2702J2193J2215M5381O394j6984r924
4566B106032q5545k824P6069L6474j42176j0476k3316Q5620R4458o5765Q0282
4555B148833l2245K8210j3789N9516J5398M5302P6866k5719O7117L1634L110J09882
$$ y = [1973208, 1928120, 1853292, 1905783, 1885975, 1873947, 1847820, 1846773, 1954242, 1957408, 2004778, 2016865, 1986987, 2032407, 2039830, 2056456, 2044897, 2073476, 2126902, 2126756, 2217499, 2144106, 2084740, 2104289, 2092331, 2034498, 2027304, 2022035, 2058667, 2090633, 2086340, 1979546, 2009058, 2079592, 2045465, 2100896, 2156599, 2080890, 2072108, 2071276, 2140212, 2154468, 2170105, 2171912, 2193794, 2200837, 2168015, 2030964, 2022665, 2003066, 1956415, 1988271, 2107203, 2110768, 2032190, 2062051, 2073619, 2069499, 2072901, 2069477, 2039323, 2086931, 2069706, 2127649, 2175630, 2109459, 2056757, 2068950, 2081165, 2126546, 2132940, 2115956, 2106032, 2020487, 2017663, 2093732, 2130206, 1988030, 1977554, 1954238, 2039858, 2134316, 2068551, 2148833, 2116588, 2144798, 2131009, 2190525, 2205923, 2251225, 2328091, 2302372, 2369489, 2401123, 2404233, 2514115]
4543B514115j7379K2466L8752J9814L599K8053Q5662n656k758l8387M7181N0010
4531B745472J926O3536M5903j2680P7046P8062R4392o248N5814J3732k0220n8164
4519C078571k8717J49227N7119J1390P6775O792P7051O7816K5824J20686j0762
4508C631772J656K4289L5503J02568L5476K0329L2045Q9104O8921Q2O5469J50632
4496D257846J05769K7101R0586R9265J9845R6989J05668J48311P8529J24033J33201
4485E287143n108J28444O7954P3918O0752P5455K14734J26682Q6885J45274J63020
4474F425153N9521Q1169J58291J18113J47463J00967Q0729K00628R6829J42744
4464G611607J79416J13438J69422J77414K23833K03534Q6162K32075K77598J19284
$$ y = [2514115, 2496736, 2519202, 2557954, 2577768, 2581367, 2609420, 2695082, 2689426, 2686668, 2648281, 2695462, 2745472, 2747398, 2810934, 2856837, 2844157, 2921203, 2999265, 3093657, 3087409, 3143223, 3156955, 3136735, 3078571, 3049854, 3199081, 3256200, 3267590, 3344365, 3351157, 3428208, 3496024, 3521848, 3642534, 3631772, 3633428, 3657717, 3693220, 3795788, 3831264, 3851593, 3883638, 3972742, 4041663, 4041745, 4107214, 4257846, 4363615, 4390716, 4481302, 4580567, 4600412, 4697401, 4803069, 4951380, 5029909, 5153942, 5287143, 5282035, 5410479, 5478433, 5552351, 5613103, 5688558, 5903292, 6029974, 6116859, 6262133, 6425153, 6484674, 6565843, 6724134, 6842247, 6989710, 7090677, 7171406, 7372034, 7468863, 7611607, 7791023, 7904461, 8073883, 8251297, 8475130, 8678664, 8764826, 8996901, 9274499, 9393783]
4454I393783K86020J26876K52797K94563K90162K80980L20145K36129K96067L80802
4444A2158324L67245L75318L87528L91373N02971L68019M31614N59900M34284
4435A5976576N01822M87519N89715P77245O89938P74387Q29744Q31430Q45646
4426B2304022R32218R15564R69168J001301J060098J128011J088064J130166J081516
4417C1610128J067450J160176J202275J298259J367200J277658J335267J326824
4409D1645237J407103J454708J346979J245955J167859J269054J443485J424422
4401E2404802J625396J803029K091986K274883K722602L093439L415414L645603
4393G3077154L856593L777291L835379L735155L777356L760296L679661L561921
$$ y = [9393783, 9679803, 9806679, 10059476, 10354039, 10644201, 10925181, 11245326, 11481455, 11777522, 12158324, 12525569, 12900887, 13288415, 13679788, 14182759, 14550778, 14982392, 15542292, 15976576, 16478398, 16965917, 17555632, 18332877, 19022815, 19797202, 20626946, 21458376, 22304022, 23236240, 24151804, 25120972, 26122273, 27182371, 28310382, 29398446, 30528612, 31610128, 32677578, 33837754, 35040029, 36338288, 37705488, 38983146, 40318413, 41645237, 43052340, 44507048, 45854027, 47099982, 48267841, 49536895, 50980380, 52404802, 54030198, 55833227, 57925213, 60200096, 62922698, 66016137, 69431551, 73077154, 76933747, 80711038, 84546417, 88281572, 92058928, 95819224, 99498885, 103060806]
4385A03060806L223651K941382K491867K460259K606258K800203L308455L530404
4377A26423285L801584L964953M005924M269193M250257M022521L586208L116856
4369A57440781K663256K175929J799503J690429J571855J567110J439504R71551
4361A71319918O0144j184622k745655m343211o037947p058438p456844p214472
4353A35338873o379065m877450l305501j882373n18184N04736J056557Q74654
4345A20812247m58355k479673m822429o702534p627047p656994o848303o038612
4337G8178300m923297m112898l413142k857643k416309k027816j755698j401298
4329E5270199j204586r73872p14126q65073p91661r77078j240766j452906j657615
$$ y = [103060806, 106284457, 109225839, 111717706, 114177965, 116784223, 119584426, 122892881, 126423285, 130224869, 134189822, 138195746, 142464939, 146715196, 150737717, 154323925, 157440781, 160104037, 162279966, 164079469, 165769898, 167341753, 168908863, 170348367, 171319918, 171380062, 170195440, 167449785, 163106574, 157068627, 150010189, 142553345, 135338873, 128959808, 124082358, 120776857, 118894484, 118376300, 118881036, 119937593, 120812247, 120353892, 117874219, 113051790, 106349256, 98722209, 91065215, 84216912, 78178300, 73255003, 69142105, 65728963, 62871320, 60455011, 58427195, 56671497, 55270199, 54065613, 53091741, 52377615, 51512542, 50720881, 49743803, 48503037, 47050131, 45392516]
4320D5392516j810784j843873j799704j612202j442547j192089j055337r32671
4312C3703309p72354r00634r47959j036399j140451j119957j156189j076223j049793
4303B4503350q79075q72286p21744o66065o45768n78024n97508m39626m79704
4294A8623550l79113m68450l81410m18619l97961n02502m06208k70281m27527
4285A4971479m00407k66761m30043k45159k47408k27636k17091k50878j96182
4276A2489914j62404k21856l03690j16122r8431j46258k59374j83098j8934m6843
4266A0932904r6409k24924j90884j56308j13507j13344j48920P47j80731j12666
4256I595958j33475k27083p0644l8396q9462n6359m2924m9069j55051l6088J9162
$$ y = [45392516, 43581732, 41737859, 39938155, 38325953, 36883406, 35691317, 34635980, 33703309, 32930955, 32030321, 31082362, 30045963, 28905512, 27785555, 26629366, 25553143, 24503350, 23624275, 22751989, 22030245, 21364180, 20718412, 20140388, 19542880, 19103254, 18623550, 18244437, 17775987, 17394577, 16975958, 16577997, 16075495, 15669287, 15399006, 14971479, 14571072, 14304311, 13874268, 13629109, 13381701, 13154065, 12936974, 12686096, 12489914, 12327510, 12105654, 11801964, 11685842, 11587411, 11441153, 11181779, 10998681, 10979747, 10932904, 10836495, 10611571, 10420687, 10264379, 10150872, 10037528, 9888608, 9889355, 9708624, 9595958, 9462483, 9235400, 9164756, 9126360, 9036898, 8980539, 8937615, 8888546, 8733495, 8697407, 8716569]
4245H716569j4749o9123l1242J1920j165K021l8654J77286O622r9497l5098K0571
4233H645461p0809J4635o1221l0788O9199k2567l6210k6351L7284J6401N5491
4222H590525O0684L6566O8955j1784K0709N2611N4448P8015q330R6412N6487k0837
4210I074461J1253J07310l4132J11474K3313O0819J08371J07061Q8789J09223
4200I767942K2017R8519J84365R9519J69798K6418K61122J34479J85242K27220
4190A1176641J92787K42416K36470K27461J69062K49244J49353J73892L69102
4181A3186428L01619L81606L95383K27610K26807L37405L83198L70997M19396
4172A6230449M97467L26277L82993L82441M18943L74081M94859N36271N96884
$$ y = [8716569, 8701820, 8632697, 8601455, 8613375, 8612210, 8614231, 8575577, 8752863, 8759485, 8659988, 8624890, 8645461, 8574652, 8589287, 8528066, 8497278, 8566477, 8543910, 8507700, 8481349, 8518633, 8535034, 8590525, 8651209, 8687775, 8756730, 8744946, 8765655, 8818266, 8872714, 8950729, 8942399, 9038811, 9095298, 9074461, 9085714, 9193024, 9158892, 9270366, 9293679, 9354498, 9462869, 9569930, 9658719, 9767942, 9789959, 9888478, 10072843, 10172362, 10342160, 10368578, 10629700, 10764179, 10949421, 11176641, 11369428, 11611844, 11848314, 12075775, 12244837, 12494081, 12643434, 12817326, 13186428, 13488047, 13869653, 14265036, 14492646, 14719453, 15056858, 15440056, 15811053, 16230449, 16727916, 17054193, 17437186, 17819627, 18238570, 18612651, 19107510, 19643781, 20240665]
4163B0240665M90002M26314O21151N33794O51182O01582P84595Q15068R89605
4154B6153958J071432J198641J222189J392679J560325J617102J867845J946635
4146C8030806K218938K330462K544482K687426K868920L084519L554814M148078
4138F1468445M720257N515121O288180P253925Q516612R570232J0769228J2181110
4130A26283110J3923993J6367829J9191982K2378198K5739893K8462283K8680855
4123B81028143K4573068J5017358p38679j8404314l0085214l4528945l3042420
4116B03818997k7967271k2182714j7338880j3808880j1416681r495945q201051
4109I3407575p032715o152627n301049m682122m072235l698982l435588k977806
$$ y = [20240665, 20730667, 21156981, 21778132, 22311926, 22963108, 23564690, 24349285, 25164353, 26153958, 27225390, 28424031, 29646220, 31038899, 32599224, 34216326, 36084171, 38030806, 40249744, 42580206, 45124688, 47812114, 50681034, 53765553, 57320367, 61468445, 66188702, 71703823, 77992003, 85245928, 93762540, 103332772, 114102000, 126283110, 140207103, 156574932, 175766914, 198145112, 223885005, 252347288, 281028143, 305601211, 320618569, 319879890, 301475576, 271390362, 236861417, 203818997, 175851726, 153669012, 136330132, 122521252, 111104571, 101608626, 93407575, 86374860, 80222233, 74921184, 70239062, 66166827, 62467845, 59032257, 56054451]
4101E6054451k788227k417633k107569j982360j739434j352340j325887j110739
4093D1230262j156286r13056p74746p94550q20052q03576o97297o74040n79353
4084C4017306m49108l64591l57514j68678M9563q217K86493L77539N53850O22611
4074C4559254P79950J013272J157286J478628J689805K000465K345601K606209
4066D7630470K992605L478197L877691M039284L853725L176104K101559L75994
4058G1525629j470900k721420l555074l541816l043057k560293j954425j367467
4050E1311177p87979l36535J00546N05086J017604J492631J939059K446175L032021
4041F0719785L761762M423011N276589O177783P181551P983840P892581O878514
$$ y = [56054451, 53266224, 50848591, 48741022, 46758662, 45019228, 43666888, 42341001, 41230262, 40073976, 39160920, 38386174, 37591624, 36771572, 35967996, 35270699, 34596659, 34017306, 33568198, 33203607, 32846093, 32677415, 32726978, 32718761, 33005254, 33382793, 33936643, 34559254, 35339204, 36352476, 37509762, 38988390, 40678195, 42678660, 45024261, 47630470, 50623075, 54101272, 57978963, 62018247, 65871972, 69048076, 71149635, 71525629, 70054729, 67333309, 63778235, 60236419, 57193362, 54633069, 52678644, 51311177, 50523198, 50186663, 50287209, 50792295, 51809899, 53302530, 55241589, 57687764, 60719785, 64481547, 68904558, 74181147, 80358930, 87540481, 95524321, 103416902, 110295416]
4033A10295416M473374O38107l737970p358485r316736r563858q605551p306720
4025F9517577n807967m631566l640205k981084k262594j862993j413824r40663
4017D5976681m44005j86662J99891O01696R55655J375359J820193K155000K442455
4008E4896263K519854K157905J455951J15763j552110l124561m050166m528686
4000D7890213m541687l928279l518383k928462k386524k164746j872321j651265
3992B4898546j389372j222776j161020j050757r32932r38126p93229o45300o40017
3983A6125017n35134m85982m80727m88370m34117k50221m25958l26763k67616
3974A2430129k46751j92158k29065k21667k17669k37433m2135k41391k09818n9469
$$ y = [110295416, 114768790, 115406897, 111668927, 104310442, 94993706, 85429848, 76824297, 69517577, 63709610, 59078044, 55437839, 52456755, 50194161, 48331168, 46917344, 45976681, 45532676, 45346014, 45545905, 46147601, 47103256, 48478615, 50298808, 52453808, 54896263, 57416117, 59574022, 61029973, 61145736, 59593626, 56469065, 52418899, 47890213, 43348526, 39420247, 35901864, 32973402, 30586878, 28422132, 26549811, 24898546, 23509174, 22286398, 21125378, 20074621, 19141689, 18203563, 17410334, 16765034, 16125017, 15589883, 15103901, 14623174, 14134804, 13700687, 13450466, 13024508, 12697745, 12430129, 12183378, 11991220, 11762155, 11540488, 11322819, 11085386, 11043251, 10801860, 10592042, 10532573]
3964A0532573o5888j08516j0309p0570q9833M6284J6331J04189J83254J26310
3954A0663825P9494j06194l43752m65756l89556m33159m85197k36350k25847k68307
3944G789201j69995j63630k38029j00318j52346k08723j04939j7057J1800j04719
3934F541245j33954p5429m4700m1932j10043q4524p073j62445j52185j88609r4332
3923E446019k03027j35825m4024r4248K3110j5261o6422l8804p6708N0762L547
3912D849119j2698m5321j19244Q5665O1684p4210j26473N0756q8844K5946L668
3901D610048Q065O5247M3778R8742J09585Q5708Q0318M3898j5426J52042O3802
3890E345807j1529J36674J19647J68941K54447J51681J29759M571j44132r7112
$$ y = [10532573, 10466685, 10358169, 10347860, 10277290, 10187457, 10233741, 10250072, 10354261, 10537515, 10663825, 10743319, 10637125, 10293373, 9827617, 9438061, 9004902, 8519705, 8283355, 8057508, 7789201, 7619206, 7455576, 7217547, 7117229, 6964883, 6756160, 6651221, 6634164, 6645964, 6541245, 6407291, 6331862, 6287162, 6245230, 6135187, 6050663, 6043590, 5881145, 5728960, 5540351, 5446019, 5242992, 5107167, 5063143, 4968895, 4992005, 4976744, 4910322, 4871518, 4794810, 4845572, 4849119, 4836421, 4791100, 4671856, 4757521, 4819205, 4744995, 4618522, 4669278, 4580434, 4606380, 4610048, 4618113, 4683360, 4727138, 4825880, 4935465, 5021173, 5101491, 5145389, 5129963, 5282005, 5345807, 5334278, 5470952, 5590599, 5759540, 6013987, 6165668, 6295427, 6299998, 6155866, 6058754]
3880F058754j40844j32604j53445j83684O7556k9554j43916N3688l9608m4371
3870E311972L6825k6641J27235O0992L3351Q3641r4531n0576J39547J93433N7563
3859E872811K05147K20346K97219K65383K80477L01331K41067K1399R4980j65950
3849G634210k33470k35876j35121k17109m02205j75710j91570j17891j20222j65026
3839E640010j10556m8771n4020l2331k4561j55998q0838j4009M5432j6253k995
3828E145110m6517p2488J8210N1381j28696j19962N9312r3999N3990o897o887
3817D852557L278J11914Q576K3813l8725O2831P6737K7587Q7820L2592M2332J6113
3805E307425N6886P8771R9885J77660J09836O3632J81147J17590R6197J46036
$$ y = [6058754, 5917910, 5785306, 5631861, 5448177, 5515733, 5486179, 5342263, 5395951, 5356343, 5311972, 5348797, 5322156, 5449391, 5510383, 5543734, 5627375, 5532844, 5482268, 5621815, 5815248, 5872811, 6077958, 6298304, 6595523, 6860906, 7141383, 7442714, 7683781, 7705180, 7800160, 7634210, 7400740, 7164864, 7029743, 6812634, 6410429, 6234719, 6043149, 5925258, 5805036, 5640010, 5529454, 5480683, 5426663, 5394332, 5369771, 5213773, 5132935, 5118926, 5164358, 5148105, 5145110, 5098593, 5026105, 5044315, 5095696, 4967000, 4847038, 4906350, 4812351, 4866341, 4859444, 4852557, 4855835, 4967749, 4976325, 5000138, 4961413, 5024244, 5100981, 5128568, 5216388, 5248980, 5291312, 5307425, 5364311, 5443082, 5542967, 5720627, 5830463, 5894095, 6075242, 6192832, 6289029, 6435065]
3795F435065J41334J47223J43653K01519J29738J07045O0701J81985J02138Q6441
3785G736842R9469J21210K20731K25145J15652P5372Q6250J61891J58166J07570
3775I108298J29271J31955J17655J06534R2813N0721P3347J65914J43471K8508
3765A0148487R8458K02238J58410J82223K91748J82300K12708J95340L22218L47192
3755A2341322L87204K66953L88374K75609M70094N26525L89308M55274L95109
3746A5895772O14073N48607N80594M85603N69451N23668O89849O46009Q41126
3737B1394752Q47480R13943R32554R19005R61424R87379J233216J143451J322110
3728C0655314J247757J374800J407147J593988J763618J854718K013669K105072
$$ y = [6435065, 6576399, 6723622, 6867275, 7068794, 7198532, 7305577, 7366278, 7548263, 7650401, 7736842, 7836311, 7957521, 8178252, 8403397, 8519049, 8594421, 8680671, 8842562, 9000728, 9108298, 9237569, 9369524, 9487179, 9593713, 9686526, 9737247, 9810594, 9976508, 10119979, 10148487, 10246945, 10449183, 10607593, 10789816, 11081564, 11263864, 11476572, 11671912, 11994130, 12341322, 12728526, 12995479, 13383853, 13659462, 14129556, 14656081, 15045389, 15500663, 15895772, 16509845, 17058452, 17639046, 18124649, 18694100, 19217768, 19907617, 20553626, 21394752, 22242232, 23156175, 24088729, 25007734, 25969158, 26956537, 28189753, 29333204, 30655314, 31903071, 33277871, 34685018, 36279006, 38042624, 39897342, 41911011, 44016083]
3720D4016083K226789K494526K552393K599428K680061K858717L063775L051448
3712F5543220L160120L195841L281643L391854L543069L672906L704960L802276
3704I3295889L924024L849662L676560L541350L257286L061969K904567K755877
3696A20267184K548794K429997K229381K190073K087252J748974J569107J073898
3688A36144660O83342K82796j83100p29175j025443j281099j511669j579941j695667
3679A29104704j938314k008521k213012k557565k676110l139582l371239l419620
3671A07780741l648839l600378l624308l520541l385187l221556l155385l079177
3663H0545370l061024l098111k987816k850927k721520k837859k806719k766991
$$ y = [44016083, 46242872, 48737398, 51289791, 53889219, 56569280, 59427997, 62491772, 65543220, 68703340, 71899181, 75180824, 78572678, 82115747, 85788653, 89493613, 93295889, 97219913, 101069575, 104746135, 108287485, 111544771, 114606740, 117511307, 120267184, 122815978, 125245975, 127475356, 129665429, 131752681, 133501655, 135070762, 136144660, 136828002, 137110798, 136927698, 136198523, 135173080, 133891981, 132380312, 130800371, 129104704, 127166390, 125157869, 122944857, 120387292, 117711182, 114571600, 111200361, 107780741, 104131902, 100531524, 96907216, 93386675, 90001488, 86779932, 83624547, 80545370, 77484346, 74386235, 71398419, 68547492, 65825972, 62988113, 60181394, 57414403]
3655E7414403k658084k558629k381592k144041k029591k043508j902979j692832
3647D0003147j523014j551626j410292j375987j280346j213424j197885j190885
3639B9259688r93743q83804q67423q27863p21494o23567n97889l87819m41700
3630B2914386m68659m42448m71036k94849k95355k45467j54184k72884j33743
3621B0135761k25106j81142k09613m2305j08469j60043j13606k19607j03845n7651
3611A8714374j03817o1361n459j7608J30941p7161j5259J05890p64L8147J00567
3600A8808490J30692N3579R3772J37758K10469J66526J62849K20737L29234K79661
3590B0593767M24513L44685L45911L74139M90928M56372L95306N00342M94395
$$ y = [57414403, 54756319, 52197690, 49816098, 47672057, 45642466, 43598958, 41695979, 40003147, 38480133, 36928507, 35518215, 34142228, 32861882, 31648458, 30450573, 29259688, 28265945, 27382141, 26514718, 25686855, 24965361, 24341794, 23743905, 23356086, 22914386, 22445727, 22003279, 21532243, 21237394, 20942039, 20696572, 20542388, 20269504, 20135761, 19910655, 19729513, 19519900, 19477595, 19369126, 19209083, 19095477, 18875870, 18772025, 18714374, 18610557, 18549196, 18543737, 18526129, 18657070, 18579909, 18564650, 18670540, 18669776, 18707923, 18808490, 18939182, 18992761, 19086533, 19224291, 19434760, 19601286, 19764135, 19984872, 20314106, 20593767, 21018280, 21362965, 21708876, 22083015, 22573943, 23030315, 23425621, 23925963, 24420358]
3581B4420358O28490N91560N51872O20982N85270O55755O23115O80382P37398
3572C0095182P23949Q49046P36280R86147R60538R11072R12844J101431J096480
3563C8372969J191291J232413J313946J516153J646136J641197J769384K021255
3555E0704744K138430K230789K518921K771717K870004L051313L494339L894788
3547G3675045M397333M911734N535753O362920P119703Q076190R301910J0501956
3539A29882544J2037176J3567055J5269487J7335744J9313067K1631360K3775309
3532B52811742K5190113K5648355K4733411K1769099J7049581J1290116N622332
3525C84114749Q64859k388789m057531m404843l688943k826286k244188k014396
$$ y = [24420358, 25048848, 25640408, 26192280, 26813262, 27398532, 28054287, 28677402, 29357784, 30095182, 30819131, 31668177, 32404457, 33390604, 34351142, 35262214, 36175058, 37276489, 38372969, 39564260, 40796673, 42110619, 43626772, 45272908, 46914105, 48683489, 50704744, 52843174, 55073963, 57592884, 60364601, 63234605, 66285918, 69780257, 73675045, 78072378, 82984112, 88519865, 94882785, 102002488, 110078678, 119380588, 129882544, 141919720, 155486775, 170756262, 188092006, 207405073, 229036433, 252811742, 278001855, 303650210, 328383621, 350152720, 367202301, 378492417, 384114749, 384979608, 382590819, 378533288, 374128445, 370439502, 367613216, 365369028, 363354632]
3517C63354632k820704m703586p864589j1778328j6137984k0139518k2893341
3510B77016582k3939100k3622984k1966499j9449509j7130455j4806621j2740233
3503A43361181j1059440r632711q538557p395750o525336n775944n294760m675087
3495H4463596m248510l878660l586935l334419l057446k815917k616318k309633
3487E8615758k224890j999313j755660j763381j701984j422688j369251j412925
3479D4965666j242219j198938j080685j121677q95010q51860q02479o97662o95445
3470C6379691n20210m54317m67193m55716m98286l45708m24670k77469l63926
3461C2572196l05368k81431k91077k98808l16334l05724k37972k19391k26673
$$ y = [363354632, 360533928, 355830342, 347965753, 336187425, 320049441, 299909923, 277016582, 253077482, 229454498, 207487999, 188038490, 170908035, 156101414, 143361181, 132301741, 122669030, 114130473, 106734723, 100209387, 94433443, 89138683, 84463596, 80215086, 76336426, 72749491, 69415072, 66357626, 63541709, 60925391, 58615758, 56390868, 54391555, 52635895, 50872514, 49170530, 47747842, 46378591, 44965666, 43723447, 42524509, 41443824, 40322147, 39427137, 38575277, 37772798, 37075136, 36379691, 35859481, 35405164, 34937971, 34482255, 33983969, 33638261, 33213591, 32936122, 32572196, 32266828, 31985397, 31694320, 31395512, 31079178, 30773454, 30535482, 30316091, 30089418]
3452C0089418j86642j92926n7242r1586j43654q8044O151J8580O2531J06626J29840
3441B9653052K61202L00019K50892L24789M64080N87709O05705O12636O20860
3432C3680944O78792O99456P79662P22327O91923R28072R68251J068036R57202
3423D1174665J085854J081293J017093R44896Q72923R12323Q67234Q49063Q14282
3414D9619626R82736J185351J255769J190855J251849J269997J285630J305789
3406E9347602J332137J391745J563260J590813J756504K068028K283794K526428
3398G3860311K849908L284015L778023M171930M629033N219928N945771O588361
3390A10327280P543247Q512683R620202J0847928J2063178J3342065J4433247
$$ y = [30089418, 29902776, 29709850, 29652608, 29561022, 29417368, 29329324, 29335475, 29354055, 29416586, 29523212, 29653052, 29914254, 30214273, 30465165, 30789954, 31254034, 31841743, 32447448, 33060084, 33680944, 34359736, 35059192, 35838854, 36561181, 37253104, 38181176, 39149427, 40217463, 41174665, 42260519, 43341812, 44358905, 45303801, 46176724, 47089047, 47956281, 48805344, 49619626, 50602362, 51787713, 53043482, 54234337, 55486186, 56756183, 58041813, 59347602, 60679739, 62071484, 63634744, 65225557, 66982061, 69050089, 71333883, 73860311, 76710219, 79994234, 83772257, 87944187, 92573220, 97793148, 103738919, 110327280, 117870527, 126383210, 136003412, 146851340, 158914518, 172256583, 186689830]
3383A86689830J5237557J5597981J5218746J4159581J2253299J0087270Q301611
3376B77545875P219119P180548P813923R054160R920025J0535933J0253927Q904928
3368C48428438O462509K985226r87847m860372q264780j0747500j2019338j2589285
3360C08407051j2217932j1385879j0585219r835640r469090r584381j0136950
3353B35191960j1044052j2115508j3136083j3823507j4038921j3640477j2731690
3346A44661722j1457491j0192659r050189p794018o922300o158608n460457m862965
3338H2763035m343067l937673l502348l292015k893211k773996k608664k335428
3330E7076633k230251k037492j987603j760030j670368j572055j528341j304504
$$ y = [186689830, 201927387, 217525368, 232744114, 246903695, 259156994, 269244264, 277545875, 284764994, 291945542, 299759465, 308813625, 318733650, 329269583, 339523510, 348428438, 354890947, 357876173, 356888326, 352027954, 343763174, 333015674, 320996336, 308407051, 296189119, 284803240, 274218021, 264382381, 254913291, 245328910, 235191960, 224147908, 212032400, 198896317, 185072810, 171033889, 157393412, 144661722, 133204231, 123011572, 113961383, 106167365, 99245065, 93086457, 87626000, 82763035, 78419968, 74482295, 70979947, 67687932, 64794721, 62020725, 59412061, 57076633, 54846382, 52808890, 50821287, 49061257, 47390889, 45818834, 44290493, 42985989]
3322D2985989j273290j256755j120970j086064j018715r72633r83345r00286q74847
3313C3499084r61714r41341q84455q53212p85721p61523p37200p34657p00069
3304B6139192n63779o24680n55591o49692o35875o00496o30871n83347o27184
3295B0667677o86523o62440n45205n12787m49127m56899o01178n00688l25774
3286A5927056k36298l93348m15574m17714l40447l03706l43893k57792j79169
3277A3039115l21857k25796k07415j97940j94647Q196r773j16088m5776j24845
3267A1603174k9328k6555o6004j67123m6685j29765j99392j36174r9755j16455
3257A0585938n0929j62769j36606k28104j39134m8200j55008j93873k85957j60649
$$ y = [42985989, 41712699, 40455944, 39334974, 38248910, 37230195, 36257562, 35274217, 34373931, 33499084, 32537370, 31596029, 30711574, 29858362, 29072641, 28311118, 27573918, 26839261, 26139192, 25575413, 24950733, 24395142, 23745450, 23109575, 22509079, 21878208, 21294861, 20667677, 19981154, 19318714, 18773509, 18260722, 17811595, 17354696, 16753518, 16252830, 15927056, 15690758, 15297410, 14881836, 14464122, 14123675, 13819969, 13476076, 13218284, 13039115, 12717258, 12491462, 12284047, 12086107, 11891460, 11899656, 11889883, 11773795, 11728019, 11603174, 11573846, 11547291, 11481287, 11314164, 11267479, 11137714, 10938322, 10802148, 10702393, 10585938, 10535009, 10372240, 10235634, 10007530, 9868396, 9820196, 9665188, 9471315, 9185358, 9024709]
3247I024709j35546j94733j02499j45440k01551k18537k74319j20395k24560p7038
3237G330091j33488k21559j51192j15201k19188j26039p1630o4641q6397j38180
3227F002576q2905m8198j19870j43615L3781j1350j70680o4400k2452O9292o1988
3216E380191j18610k1551p8711j5439o8509N753M0237R7215l2492q7861M4318
3205E144541m14k334K2420p9481J23505O5448j24275RJ505j20905k20828j19680
3193D689511j02614k5249j06715l3863P3505r2032p1624j6688r4682p3554p4497
3182D071498j31362q5861p3057N9794l0564j55765p0135m6782p9765P543j11261
3171C354283n76o3838j04440j96878O0044k7197j49561p545k6407j05712L065
$$ y = [9024709, 8889163, 8694430, 8591931, 8446491, 8244940, 8026403, 7752084, 7631689, 7407129, 7330091, 7196603, 6975044, 6823852, 6708651, 6489463, 6363424, 6291794, 6227153, 6140756, 6002576, 5919671, 5871473, 5751603, 5607988, 5641769, 5630419, 5459739, 5395339, 5372887, 5442179, 5380191, 5261581, 5240030, 5161319, 5145880, 5077371, 5083124, 5123361, 5220576, 5188084, 5100223, 5144541, 5144127, 5141793, 5164213, 5084732, 5208237, 5273685, 5149410, 5149419, 5150924, 5030019, 4809191, 4689511, 4586897, 4561648, 4454933, 4421070, 4494575, 4402543, 4330919, 4314231, 4219549, 4145995, 4071498, 3940136, 3854275, 3781218, 3841012, 3810448, 3654683, 3584548, 3537766, 3458001, 3465544, 3354283, 3353707, 3289869, 3185429, 2988551, 3048595, 3021398, 2871837, 2864292, 2837885, 2732173, 2735238]
3160B735238p104K078j33417l4156O5363j6458j4893p8701r423J74948j7863n9601
3148B606011N5524n9221J8789K330K2009j05125P4141K9135L804J8370m0913K7707
3136B652561J26783M9301o1867L005J94542N3114j47092r693Q3506R3365R6391
3125C133916M5432N6766Q3753R5546N3957M2083K992N7549N7510Q2796J73201
3114C885501N0141M5771N7918K7395J16085j7066m8516N9429l2467J33106l29
3103D276968n510m9486o5100n5609j01977O55P3627K1563k9535j4699l0603n4542
3091C965752K9474M1129m6173J0095k0078J174p8623Q5766M6548N4618R805P3531
3079D173018l9549J19931k7636j2338l5128q7980j42312j06055O1219M2101j38533
$$ y = [2735238, 2728134, 2730212, 2596795, 2562639, 2628002, 2611544, 2596651, 2517950, 2508527, 2683475, 2665612, 2606011, 2661535, 2602314, 2621103, 2623433, 2645442, 2540317, 2614458, 2643593, 2647397, 2665767, 2624854, 2652561, 2779344, 2828645, 2766778, 2769783, 2964325, 3017439, 2870347, 2860654, 2944160, 3037525, 3133916, 3179348, 3236114, 3319867, 3415413, 3469370, 3511453, 3514445, 3571994, 3629504, 3712300, 3885501, 3935642, 3981413, 4039331, 4066726, 4182811, 4165745, 4117229, 4176658, 4144191, 4277297, 4276968, 4271458, 4221972, 4156872, 4101263, 3999286, 3999941, 4073568, 4095131, 4065596, 4050897, 4020294, 3965752, 3995226, 4036355, 3990182, 4000277, 3980199, 3981373, 3902750, 3988516, 4035064, 4089682, 4099487, 4173018, 4133469, 4253400, 4225764, 4213426, 4178298, 4090318, 3948006, 3841951, 3903170, 3945271, 3806738]
3068C806738p4368l6113P649L565N0903o1197J7733R6034M0207j7701o8704K6283
3056C791029M9585Q0069J27948N5268P2756J01125L0147J90436J80052K85543
3046D963958K02393L85022L86575N32894P39708R14302R88871R13636O83508M10554
3036A1121421m18651r32691j034034j077202p56453l70487k78141j47084m1208
3027F065470p2386j24415l4197M0511O0926N9331J95619L61024L25008L81202
3017G258093N53255O63880Q13301J055997J401682J692369J893716J518974J292007
3008A8143274J38069j637057k131265k258738k092727j242715q97018p62082m09789
2999F849952m21856l58268k06395k35871r7561n6544j13451r3349Q0620J21534
$$ y = [3806738, 3732370, 3696257, 3703906, 3707471, 3758374, 3697177, 3714910, 3810944, 3851151, 3833450, 3764746, 3791029, 3840614, 3920683, 4048631, 4103899, 4176655, 4277780, 4307927, 4498363, 4678415, 4963958, 5166351, 5551373, 5937948, 6470842, 7210550, 8124852, 9113723, 10027359, 10710867, 11121421, 10702770, 9770079, 8736045, 7658843, 6902390, 6531903, 6253762, 6106678, 6065470, 5993084, 5868669, 5834472, 5874983, 5935909, 5995240, 6190859, 6551883, 6876891, 7258093, 7811348, 8475228, 9288529, 10344526, 11746208, 13438577, 15332293, 16851267, 18143274, 18281343, 16644286, 14513021, 12254283, 10161556, 8918841, 8021823, 7259741, 6849952, 6428096, 6069828, 5863433, 5627562, 5530001, 5473457, 5360006, 5266657, 5347277, 5468811]
2989E468811J57696J70260K62290L72726L80026P41378P76666P93678N54343L80622
2979A0058496k56044q80313j101089j225918q53454n81412n30178k63738l25117
2970D041233l09981k50552j43399j23972j66110j75375j16617K9968r9859j72403
2960B512933m494j16593j02512J7677m2241K2228r717j60572j00711p416j4603
2949A993979k6804m0172M1818l2850L9110j3365K4096p0192p6704O0418j6321
2938A883013o0974o9755K3552o546M42P914R968M6324n8288r4893J28494k2098
2926A787153p6495N6783j08973J401n1252j66956m8892M19N907j27822K5687P2754
2914A369714M3014k1993o8019q6672q1932R2390o4190K5116K430q6926N5270k9303
$$ y = [5468811, 5626507, 5796767, 6059057, 6431783, 6811809, 7553187, 8329853, 9123531, 9677874, 10058496, 9802452, 8922139, 7821050, 6595132, 5741678, 5160266, 4630088, 4366350, 4041233, 3731252, 3480700, 3337301, 3213329, 3047219, 2871844, 2755227, 2785195, 2685336, 2512933, 2508439, 2391846, 2289334, 2307011, 2264770, 2286998, 2277281, 2116709, 2015998, 2008582, 1993979, 1967175, 1927003, 1968821, 1935971, 1975081, 1961716, 1985812, 1915620, 1838916, 1899334, 1883013, 1822039, 1752284, 1775836, 1769290, 1769732, 1777646, 1787614, 1833938, 1775650, 1680757, 1809251, 1787153, 1710658, 1767441, 1658468, 1659869, 1608617, 1441661, 1392769, 1393188, 1399095, 1271273, 1296960, 1369714, 1412728, 1390735, 1322716, 1236044, 1154112, 1246502, 1182312, 1207428, 1209858, 1122932, 1178202, 1148899]
2902A148899m0791M8507K8321j6385l9234j8646O3835m1519l106n4328k6605O0182
2890A109130M9666j4710n4148J6823l7071L3420j11864Q535m0690o8283j7684
2879H73124N602Q9223j10024M3014K5017m9780P0866M7692q3480l6360O7378K4898
2867I67170K6583r3955k0184K33L9249N5486j04048K3218L0165n4355L7520n6366
2855H50716J3364R611r367m5648J6305l8505p4205R6630n3096L164J05009j05476
2843G68502j0886l9813L3041Q9062p3653j9674K3955m7978K7249j3560p7167J06558
2831G65636N5336l0840l180n5707M1265R3203p0286o7263p4867j9685O6633J17871
2819H18116o1975O512Q8894j10915M838O5426r02l863j8377m7033J1626K1216
$$ y = [1148899, 1108108, 1156615, 1184936, 1168551, 1129317, 1110671, 1174506, 1132987, 1129881, 1075553, 1048948, 1109130, 1158796, 1144086, 1089938, 1106761, 1069690, 1103110, 991246, 999781, 959091, 890808, 873124, 878726, 967949, 857925, 900939, 925956, 876176, 947042, 994734, 911254, 874894, 942272, 967170, 993753, 899798, 879614, 879847, 919096, 974582, 870534, 893752, 923917, 869562, 907082, 850716, 864080, 873691, 864324, 818676, 834981, 796476, 722271, 818901, 765805, 768969, 873978, 768502, 757616, 717803, 750844, 839906, 766253, 746579, 770534, 722556, 749805, 736245, 659078, 765636, 820972, 790132, 786952, 731245, 772510, 865713, 795427, 728164, 653297, 633612, 700245, 818116, 756141, 762653, 851547, 740632, 745470, 810896, 809994, 806131, 787754, 740721, 752347, 773563]
2807G73563K5608n587p1444P2262J0078k8957J6903O4327j40551M4844k5692O8835
2795H04189j0764O3684j6252M794j4772j44944J45920l2592o971O1106L0977m7958
2783H36417O7971L6061j9476R869M4531l0306P140j9588k3232r0774J05359j0643
2771I13329n8450L3414j06307k166J06922Q4734o0273l0477n2329N9489r26K0557
2759I07517j5111J33870m2589m4427N8230n2469R388O977O0409K1786o8379p2023
2747I03179n6275k4817L3593L608n4311J0234J23489j17309R2751K3798n4429
2736H83511L9005J0450p1020L571M0627N5407M1261p4872K1025j6624m4499M6697
2724I34539l0181o9990J4666j2983k8391l2455K5274P3966J6751J7789L8813O3365
$$ y = [773563, 799171, 793584, 722140, 794402, 804480, 775523, 792426, 856753, 716202, 761046, 735354, 804189, 793425, 857109, 840857, 845651, 830879, 685935, 831855, 799263, 792292, 853398, 884375, 836417, 904388, 940449, 920973, 930842, 975373, 945067, 952207, 932619, 909387, 818613, 923972, 913329, 854879, 888293, 781986, 779820, 886742, 971476, 911203, 880726, 828397, 887886, 886960, 907517, 892406, 1026276, 983687, 939260, 997490, 945021, 954409, 961386, 1021795, 1043581, 975202, 903179, 846904, 822087, 855680, 859288, 804977, 815211, 938700, 821391, 914142, 937940, 883511, 922516, 932966, 861946, 865517, 906144, 961551, 1002812, 927940, 948965, 932341, 887842, 934539, 904358, 834368, 849034, 836051, 807660, 775205, 800479, 874445, 891196, 908985, 947798, 1011163]
2712A011163J47880J3731m9336J03113J8145N1535j884K04752J25506J16069P8820
2701A819494J4620J64920M3706N516j41374j23126k27865j67181j02368j96633
2691A089709l9392j74153n779N8228j57210o2846r9752k988m5625O5457j0777
2680F14872p2922o6940M5054K5540K7550m2675n5583Q8300l7300n0073m1843J32471
2668E66451K9287m2386q9012j9005j2352q717l9629Q725L1802M088p654k9243
2656C92355j0242O4503K4520j08448M8289o2857J7827k4339Q40n2308q9667N8883
2644B59356L0732m0527J9258Q8656m6539m4199K4910l6041j5173M5770J3453L8735
2632C38391K3739r2566Q2004l4334j33183q5458M1959J3498L2529N0566p7563
$$ y = [1011163, 1159043, 1172774, 1123438, 1226551, 1244696, 1296231, 1294347, 1499099, 1624605, 1740674, 1819494, 1834114, 1999034, 2042740, 2048256, 1906882, 1783756, 1555891, 1388710, 1286342, 1089709, 1050317, 876164, 870385, 928613, 771403, 708557, 608805, 605817, 560192, 625649, 614872, 541950, 475010, 520064, 545604, 573154, 530479, 474896, 563196, 525896, 475823, 433980, 566451, 595738, 553352, 464340, 445335, 432983, 424266, 384637, 393362, 425164, 429252, 421598, 392355, 382113, 446616, 471136, 362688, 410977, 348120, 365947, 341608, 342448, 290140, 200473, 259356, 290088, 249561, 268819, 357475, 310936, 266737, 291647, 255606, 240433, 286203, 299656, 338391, 362130, 269564, 351568, 317234, 184051, 98593, 140552, 154050, 186579, 237145, 159582]
2621A59582K5370L8317k5360k0751l376p452P0293j1083J7296l3468O7481m9642
2609B27207o8932o4296K6470P6905M1014o7205K2082N1506r2142J4593O1213M8979
2597B77394m7757p0321q4604M1982K9106J3343L2088J5151o4490N3097n067M1378
2585B31300K3568J6269k8286o3659Q6221J8209p3565P726K8668o4095j4035j1325
2573A56996N4537m3688l2920J7248K2108m1579l610N3840L369J03304o5668l2661
2561A91276k5364p6708Q7303k7800M9510k0564o3650K27K3117k0808J9225j0976
2549A24788J11282J1056J4629K662q1209R3964m6317n0950l9610l7334Q472p613
2537A03820M1014K9933k9383J2640m9054Q5328Q4824l3423q2726k4532m1046K9823
$$ y = [159582, 184952, 223269, 197909, 177158, 173782, 166330, 236623, 225540, 242836, 209368, 276849, 227207, 158275, 93979, 120449, 197354, 238368, 171163, 193245, 244751, 152609, 167202, 228415, 277394, 229637, 159316, 74712, 116694, 145800, 159143, 191231, 206382, 141892, 194989, 189922, 231300, 254868, 271137, 242851, 179192, 265413, 283622, 210057, 217783, 246451, 182356, 168321, 156996, 211533, 167845, 134925, 152173, 174281, 132702, 129092, 182932, 186301, 289605, 223937, 191276, 165912, 89204, 176507, 148707, 198217, 177653, 114003, 114230, 137347, 116539, 135764, 124788, 236070, 247126, 261755, 264417, 183208, 277172, 230855, 179905, 140295, 102961, 111433, 103820, 144834, 174767, 145384, 158024, 108970, 194298, 279122, 245699, 162973, 138441, 97395, 127218]
2525A27218R1307q6994r035L6610q534N4919j33310K7309K9369m885M7997M6598
2513B18569J7162k8713m1356k7699j41457L076P5149m1752N3177k2109M0925L3760
2501A38732M5918j63463o151N5L2606K6740j4764J7185O6716L3003n4139K6590
2489A49028R918j4495j9153M7584p9558K7125k5616J377P4857K0716M54o0430
2477A31807j03379M4626N0466J13556Q649k2639m2217m4999k0627R450n0663N5678
2465A29708K3913k1461L9004N3760N6597m6813m4179r7791J6652J3543j10755
2454A2178O5906J18750j2714m0275j20434M6810P7888m8053K5685j5455l1285
2443G9001Q0907J4552p483j12055L198n2576M9039J05085p930l0156m2734m8525
$$ y = [127218, 218525, 131531, 122496, 159106, 150572, 205491, 72181, 99490, 128859, 123974, 171971, 218569, 235731, 207018, 165662, 137963, -3494, -418, 74731, 32979, 86156, 64047, 104972, 138732, 184650, 21187, 15036, 15091, 47697, 74437, 59673, 76858, 143574, 176577, 122438, 149028, 158946, 144451, 125298, 172882, 93324, 120449, 94833, 96210, 171067, 191783, 192237, 131807, 28428, 73054, 123520, 237076, 245725, 223086, 180869, 135870, 115243, 124693, 74030, 129708, 153621, 132160, 171164, 224924, 281521, 234708, 190529, 92738, 109390, 122933, 12178, 78084, 196834, 184120, 143845, 23411, 70221, 148109, 100056, 125741, 110286, 79001, 159908, 174460, 166977, 54922, 58120, 5544, 54583, 159668, 151738, 121582, 78848, 30323]
2431C0323O5691l045n6146q8573O7969J2772M5458K0848l9795k0772P5404n4716
2419E5418K0479j2080K7359m3396o999O1771R702o3505k5470K1689j09043P3059
2407H984k19M3186J46376m1941j12371j6982R0055K5164m0563L6271l9776p9604
2395A8580J4170P8486q8646P332Q8004q536O1794k7721r800m8212k4449J17691
2383A78693p4089J5172p5148R3603n4197j3499M9382O2790j6973k9059N2303n9442
2371A29536j35672J9738O8097K1827o5683J4535Q7121n4097k4774J2812q3802
2360a0362J7476L7744R478N6680l767q4213Q2923k5002K2973J6043P1183r1955
2348I9201k9147P7174n7308r8225j419Q4379J6326O6488l9301K8102m0590j4607
$$ y = [30323, 96014, 92969, 36823, -51750, 16219, 28991, 74449, 95297, 55502, 34730, 110134, 55418, 75897, 63817, 91176, 47780, 40781, 102552, 112254, 48749, 23279, 44968, -64075, 8984, 8765, 51951, 198327, 156386, 44015, 27033, 117088, 142252, 101689, 137960, 98184, 18580, 32750, 111236, 22590, 29922, 117926, 109390, 171184, 143463, 133663, 85451, 61002, 178693, 104604, 119776, 44628, 138231, 84034, 70535, 119917, 182707, 165734, 136675, 188978, 129536, -6136, 13602, 81699, 103526, 37843, 52378, 139499, 85402, 60628, 73440, -10362, 7114, 44858, 54336, 111016, 107249, 23036, 105959, 80957, 103930, 119973, 191156, 99201, 70054, 147228, 89920, -8305, -9724, 74655, 90981, 157469, 118168, 146270, 105680, 91073]
2336I1073k6537J7579P814K7202n291j2240k2866r538R2203R7898j40706r4596
2324B1995j5975L8785L6103N7128j2642l5591M6060K8673j02697j7906Q3186n8442
2312F8677K4173M0428j25466J8503j5984l8409N2618L0552k1730m7580J15497
2301A01279L7544p1465n644m178j1514R0611L5115L0828L5343M9059m7127K873
2289B42724O5755r6753l6838m4183L3404K8529n7899l8709O5578n0214k7430M2952
2277A26916J0744P1950j0813p6578o3485J5201J1425Q6011p8903n1462J00211
2266A41217L636n5631O4096J382k783j03982K5045q135K1241P6069r1465Q1843
2254A52533L6219K502n9792p2748m2946K0564J7749K3520j2566l3120K7013p6
$$ y = [91073, 64536, 82115, 89929, 117131, 111840, 99600, 76734, 67196, 159399, 257297, 116591, 21995, 6020, 44805, 80908, 138036, 125394, 89803, 135863, 164536, 61839, 43933, 127119, 68677, 92850, 133278, 7812, 26315, 10331, -28078, 24540, 55092, 33362, -14218, 101279, 138823, 67358, 61714, 57536, 46022, 136633, 171748, 202576, 237919, 286978, 239851, 242724, 308479, 211726, 174888, 130705, 164109, 192638, 134739, 96030, 161608, 111394, 83964, 126916, 137660, 209610, 198797, 122219, 58734, 73935, 85360, 171371, 92468, 41006, 141217, 144853, 89222, 153318, 154700, 151917, 47935, 72980, 64845, 86086, 162155, 70690, 152533, 188752, 191254, 131462, 58714, 15768, 36332, 54081, 77601, 65035, 31915, 58928, 58852]
2242E8852l008P3099N7082j14104K7609J1553j07145J16406K4009M8250j65161
2231B7442L2815p0105O2372M3259K24k4083p5231N5058q6470R0284J6040j4437
2219E7168k133N0596l452O596n4063p5600L7897J9894J80981l002j65688k3657
2207B5537R416M6056J8602j9280m7463J1872J16162o9372j9374O9583o825m7019
2195H7895n8312J11707K9632K0704K4896q0125j37482k445m1526Q2616P4765N8640
2183A70965J2030k9009o8245N3435J06601q0467J5973n6631o3749j8013Q2489
2172A25379K1659n1515M6986L6761P603n734n5370O4346K194k6646o7023j2130
2160H6510R0886p8193m3728N1940M46L1721N7448R599l8807M4875O4349l3909
$$ y = [58852, 55844, 128943, 186025, 71921, 99530, 111083, 3938, 120344, 144353, 192603, 27442, 60257, -9848, 52524, 95783, 96007, 71924, -3307, 51751, -34719, 55565, 71605, 57168, 55035, 105631, 102179, 108775, 54712, -20888, 17009, 36903, 217884, 214882, 49194, 25537, 34953, 81009, 99611, 80331, 32868, 44740, 160902, 91530, 72156, 141739, 134914, 87895, 29583, 141290, 170922, 191626, 216522, 136397, -1085, -3530, -45056, 37560, 112325, 170965, 182995, 153986, 85741, 139176, 245777, 165310, 181283, 124652, 60903, 42890, 125379, 147038, 95523, 142509, 179270, 186873, 181139, 125769, 190115, 192309, 165663, 98640, 86510, 177396, 99203, 55475, 107415, 107861, 139582, 197030, 206629, 167822, 212697, 277046, 243137]
2148B43137J38563m2503j15814j9754l382L4701p2894l4471R7648j843j53l1036
2136A92199l134j1941p29M6615L0143k8411P7983R0917p9393k7982N4540r1215
2124B49592l7924J10789J33531r9264o183K5409j4430r272N7342L6753m882p0119
2112C71342j7846Q8912N73J12593k1117J1670R3187M3281k8756m4628P5870m076
2100F81005Q6462l2978r2385O0385J009l8958R3501K01421n011M9336J27044j23317
2088A007514O9600O7158Q0821L0328q5807R0242J14484R15R7618M5168J35073
2077A653114Q1478K5837J69405O0480Q6501R1309K58200J19945L32874K26617
2067C105760L05971L59332L73025M39311M92858N54127N27668N55175Q63773J101667
$$ y = [243137, 381700, 339197, 223383, 203629, 200247, 234948, 162054, 127583, 225231, 223388, 223235, 192199, 189065, 177124, 176395, 223010, 253153, 224742, 302725, 393642, 314249, 286267, 340807, 249592, 211668, 322457, 455988, 356724, 350541, 375950, 361520, 352248, 409590, 446343, 441461, 371342, 353496, 442408, 442981, 555574, 534457, 546127, 639314, 682595, 653839, 609211, 685081, 681005, 767467, 734489, 642104, 702489, 703498, 664540, 758041, 959462, 954451, 1003787, 1130831, 1007514, 1077114, 1144272, 1225093, 1255421, 1169614, 1259856, 1374340, 1375255, 1472873, 1518041, 1653114, 1734592, 1760429, 1929834, 1990314, 2076815, 2168124, 2426324, 2546269, 2879143, 3105760, 3411731, 3771063, 4144088, 4583399, 5076257, 5630384, 6158052, 6713227, 7577000, 8678667]
2057H678667J342116J754365K327244K605453L166144K608822J721371j692171
2049B2512011l622743l396376l328972k331820j637288j067902q42178n43929
2041E740803n00682l26516l93033k94945l37790l09706k09175l31663j82038j47299
2031B707956k27440j68937j53254m6781p5934q7974q7813p1366l3119m0566j94061
2020A520711N0708m8763j44993j05305k8914k2048J7008k08834m5013m5282l477
2009I35798p6948J2367k1824l0207n1715k2670j9143p0146R9682j5042o1611m698
1997F73843l5018J52413n3543j27673k1601m2900o5211k215L6285J53127l2507
1986F35000j22701N5189n7715j08583J4796Q4329J6589N449j44914M0445l4595
$$ y = [8678667, 10020783, 11775148, 14102392, 16707845, 19873989, 22482811, 24204182, 22512011, 18889268, 15492892, 12163920, 9832100, 8194812, 7126910, 6284732, 5740803, 5240121, 4913605, 4520572, 4225627, 3887837, 3578131, 3368956, 3037293, 2855255, 2707956, 2480516, 2311579, 2158325, 2111544, 2035610, 1947636, 1859823, 1788457, 1755338, 1714772, 1520711, 1571419, 1522656, 1377663, 1272358, 1243444, 1221396, 1238404, 1029570, 984557, 939275, 935798, 858850, 871217, 849393, 819186, 767471, 744801, 725658, 655512, 755194, 740152, 678541, 673843, 638825, 791238, 737695, 610022, 588421, 545521, 480310, 478095, 514380, 667507, 635000, 512299, 567488, 509773, 401190, 415986, 500315, 516904, 522353, 377439, 417884, 383289]
1975C83289q0141l5751K6938l286L4528o4243L1678L9594p1379m239R7167O2195
1963D16350m5246l4678j00463O998J00390K9393j9179k2756l4627l6688N0074
1952C09568j54962Q5548N3799k4574l3563j3560L1148n1284K4326k5591k2188
1941A78667K0587l4459L3120P1608k533M363J7717m9794o423k8325K4369K6859
1929B55756p1467J2764M5687l7098j11378O2342L7490K4712J1335k7213K2882
1918B25812p9533J9637O1308J8378j9640j4610K9532L9275r9673l0501J7250k783
1906A64452l8707L3240l432k3928r611r7847Q2556L5164K0545k3042n6045O8017
1894A51362L7908m4237l7793q6722J26505M0364p2768N2116n4625n4259J0624
$$ y = [383289, 303148, 267397, 294335, 291049, 325577, 261334, 293012, 332606, 261227, 256988, 354155, 416350, 371104, 336426, 235963, 242961, 343351, 372744, 353565, 330809, 296182, 259494, 309568, 154606, 240154, 293953, 269379, 235816, 222256, 253404, 202120, 226446, 200855, 178667, 199254, 164795, 197915, 269523, 266990, 271353, 289070, 239276, 232853, 204528, 228897, 255756, 184289, 197053, 242740, 205642, 94264, 156606, 194096, 218808, 230143, 202930, 225812, 146279, 165916, 227224, 245602, 225962, 211352, 240884, 280159, 180486, 149985, 167235, 164452, 125745, 158985, 155553, 131625, 122014, 24167, 106723, 141887, 162432, 139390, 83345, 151362, 189270, 145033, 107240, 20518, 147023, 187387, 114619, 166735, 112110, 57851, 68475]
1883F8475O9046J145q2954J4990N6613J3634n9922n0317Q5631K2073L9965o5177
1871A13202q1671Q2379p6270J8954M9875K8582p2268J7923l2878K7051R7623o239
1859A66263k3953k8257p5867N1417K8528L4301r6206o141L0790J8788l7942J787
1847F3508J2670L591j0580k1117K9914o7496l1362j961K1140P816L6020j7509
1835B4634L1331Q026p7800K7687K6989m0656J3768o71o1559N7132l80m1901P2496
1822C9096k2881k1787N2740N9001J8917O932k7997K73m2766K1017Q8239L2619
1810B03403Q5577m4164R992Q538j46985l5441j4005O2263l400L3903p1901r435
1798G8345j9996m860N7268k4491q0484K6307q9846j4201J51114Q6453o040p9282
$$ y = [68475, 137521, 138666, 55712, 70702, 127315, 140949, 81027, 30710, 116341, 138414, 178379, 113202, 31531, 113910, 37640, 56594, 106469, 135051, 62783, 80706, 47828, 74879, 172502, 166263, 142310, 114053, 38186, 89603, 118131, 152432, 56226, 50085, 80875, 99663, 61721, 63508, 76178, 79769, 69189, 48072, 77986, 10490, -20872, -22833, -1693, 6123, 42143, 24634, 55965, 63991, -13809, 13878, 40867, 211, 13979, 13308, -48251, 8881, 8501, -33400, 39096, 16215, -5572, 47168, 106169, 125086, 132018, 104021, 104294, 61528, 82545, 170784, 203403, 288980, 244816, 254808, 263346, 116361, 80920, 66915, 129178, 125778, 159681, 87780, 78345, 58349, 53489, 110757, 86266, 5782, 32089, -57757, -71958, 79156, 165609, 159569, 80287]
1786H0287j2607l8225O7564J00875p2978l762m8872j02834K5083M7152l2045m1937
1774c2299J1181M6344K9811q789n1350m2628L91J31909q4956j7106K9696n1055
1762c8851n0912Q4892m6420Q3308j5057j31041J17411Q8592M1717m2448M6653
1751A37844p1473n1090k0680l320m1894J04054M4241Q5961j04127m6299k2414
1740A0803j3804J03891m1668n4775q7975K2834O1737K9367M4312l5591q1574J5968
1728b6475p250P9382k6318l6452j49779J56364J4201n3435Q9593q8649L4767R3499
1716G9448J0898k4991k3447q9704N7564N2578m5690j068o1804j29097P6004P4840
1704b4469N176J2584J04525k0656k2138o5800Q6807O4639q2951n0065J03501q6904
$$ y = [80287, 67680, 29455, 97019, 197894, 124916, 121154, 72282, -30552, -5469, 41683, 9638, -32299, -21118, 25226, 55037, 46248, -5102, -47730, -47339, 84570, -386, -17492, 12204, -38851, -89763, -4871, -51291, 32017, 16960, -114081, 3330, 91922, 133639, 91191, 137844, 66371, 15281, -5399, -8719, -50613, 53441, 97682, 183643, 79516, 33217, 10803, -3001, 100890, 59222, 4447, -83528, -60694, 1043, 30410, 74722, 39131, -42443, -26475, -33725, 45657, 19339, -17113, -166892, -10528, 3673, -49762, 39831, -48818, -14051, 79448, 90346, 65355, 41908, -47796, 9768, 62346, 16656, 15588, -46216, -175313, -99309, -24469, -19293, -6709, 97816, 77160, 55022, -10778, 76029, 140668, 57717, 7652, 111153, 24249]
1692B4249o9849M330j6857Q073R9122j03397K9271O4413L5988K2804o9011j4119
1680A5017p0253j5502P3930K0025q1454Q025j3524P8908M6457l675o3902j2751
1668a8699L5938n0124J7796M9308L9965o2980p9464J3245Q3183m2807P099L6623
1656B9083o2668k00K7835l4189k5947O0775J4254k7853J742P2853K3931J5236
1644I4852j7785J0515j0678n8332N689P0386r4562p616O9057j08273J7466L2648
1632C367k5402J5792l8392K3958Q496O2253j2239q104l9709l5200k379L2404Q8124
1619G2969k5486o4265j1604L4451l4924m2702N1567K5627L3844p8820p5942Q8661
1607b6624O9179l7308J5392J3711l1440k8214K7996R857n778K5527j416m9349
$$ y = [24249, -45600, -41270, -58127, -50054, 49068, -54329, -25058, 39355, 75343, 98147, 29136, 15017, -55236, -70738, 3192, 23217, -58237, -50212, -63736, 15172, 61629, 57954, -5948, -18699, 17239, -32885, -15089, 34219, 74184, 11204, -68260, -55015, 28168, -14639, -7540, 29083, -33585, -33785, -5950, -40139, -66086, -5311, 8943, -18910, -17168, 55685, 79616, 94852, 77067, 87582, 76904, 18572, 24261, 94647, 85, -7531, 61526, -46747, -29281, 3367, -22035, -6243, -44635, -20677, -12181, 50072, 37833, 29729, -9980, -45180, -47559, -15155, 72969, 47483, -16782, -28386, 6065, -28859, -71561, -19994, 5633, 39477, -39343, -115285, -26624, 42555, 5247, 20639, 34350, 2910, -25304, 2692, 12549, 6771, 32298, 30882, -18467]
1595a8467l8749L1420n5776M6826J18771p8372n0036q5767L8919N2816P1651L6380
1583F9616o3777K8784N0318l2251m9092n1722o6710N6030Q6305J45r242K8155
1571D6559o4417m903o2745J6603K4475M3963q7894J04288L7693J7358M761J3508
1559H9249L7891n7070K0485k3259k4981n6528n7886L6018L7905O346L7973j8411
1547B7732K2151O6554p0042j66768Q1842M3438l4145M1294M5098n6564J8305o8445
1535d9550j2016o4449J05229k3434n8339R5140n4848j8499J80698K627m6621r8998
1523d3060L3885r99j7907O5976L941o3674M506L0275m3916q1008O3469Q6898l2172
1510F214J6271l1728m6768l239J9066K5743J81848l8083k5366p6744o5759J15870
$$ y = [-18467, -57216, -25796, -81572, -34746, 84025, 5653, -44383, -130150, -91231, -38415, 33236, 69616, 5839, 34623, 84941, 52690, 3598, -48124, -114834, -58804, 27501, 27646, 18404, 46559, -17858, -22761, -85506, -68903, -44428, -465, -88359, 15929, 53622, 70980, 75741, 89249, 127140, 70070, 90555, 67296, 42315, -14213, -72099, -36081, 1824, 8170, 46143, 27732, 49883, 116437, 46395, -120373, -38531, 4907, -29238, 12056, 57154, 590, 18895, -49550, -61566, -126015, -20786, -44220, -102559, -7419, -62267, -80766, 99932, 102559, 55938, -43060, -9175, -10174, -28081, 37895, 41836, -21838, -17332, 12943, -30973, -111981, -48512, 38386, 6214, 22485, -9243, -56011, -59250, -40184, -14441, 167407, 129324, 103958, 27214, -38545, 77325]
1498G7325j0647q4866O5452m5078N921m4974K4484o5274R5175l0418O7404J0954
1486F5458n2180K302P504R945j14669O8196K7446k7627r716j8854K9940M1324
1474B9069m6451o1074J5383O7830J06835l3744q6063L9518m4749j2797j237M106
1462b3374P9843M6865k2193n8817p958p7882M4886K6106N1202r604l2429l6467
1450a9822k5695L001k2131L0857M5142O85L83P865P2732K984k3110o9381j14291
1437a10781R041k8417N6795O3965o1043L3752L0901j9328J13068n4491k3021j6796
1425f355O2279L6186k1575R693N2344j9682R598j11702q4478O6908K0997n0200
1413c5987k6042k729N4850M1022l1115j1641K0070L261l6079o704J5899J15961
$$ y = [77325, 66678, -18188, 47264, 2186, 8107, -36867, -12383, -77657, 17518, -12900, 54504, 65458, 13278, 15580, 23084, 33029, -81640, -13444, 14002, -13625, -23341, -42195, -12255, 29069, -17382, -78456, -63073, 4757, 111592, 77848, -8215, 31303, -13446, -26243, -27480, -23374, 56469, 103334, 81141, 22324, 14366, -63516, -18630, 7476, 58678, 49074, 16645, -19822, -45517, -42516, -64647, -33790, 11352, 12037, 12420, 20285, 93017, 96001, 72891, 3510, -110781, -101740, -130157, -73362, -9397, -70440, -36688, -5787, -25115, 87953, 33462, 10441, -6355, 55924, 92110, 70535, 80228, 132572, 112890, 122488, 10786, -73692, -6784, 14213, -35987, -62029, -64758, -9908, 31114, -1, -11642, 8428, 11689, -24390, -31094, -15195, 100766]
1401A00766k7000j38286M5752l454k378j1820o887Q5840m539j64689Q8347Q3297
1389D4949p8696L9732l5292J6107L4961m1107k3645l934J9235l7752R3970j8903
1377I625L3843n2332P706M6921n9567l5780J5987J09385l528j0626K1149j0793
1365G1990j02446N9301o7852M5518K6901o5673k2862K2994O2891k8741k2702p9437
1353a00118L672K2657P3009L4169p1294j3181L4073o0131Q3332L2711J466J2831
1341E3196q1396J8298j8654P6156m7550k8924n057m1853J16437M9450q4521l0852
1329b5270l0967K8631K3314N103K3174L7306M314O2487j19242l2774N7317l1744
1317A649N298R780o2557R847P2032j5928m6917p1295Q3977q1337P6186L4081k5074
$$ y = [100766, 73766, -64520, -18768, -22222, -24600, -36420, -43307, 42533, 37994, -126695, -38348, 44949, -33747, 5985, -29307, -13200, 21761, -19346, -42991, -46925, -27690, -65442, 28528, 9625, 43468, -8864, -1158, 45763, -13804, -49584, -33597, 75788, 72260, 61634, 82783, 71990, -30456, 28845, -39007, 6511, 33412, -32261, -55123, -32129, 30762, 2021, -20681, -100118, -96446, -73789, -780, 33389, -37905, -51086, -17013, -77144, 6188, 38899, 40365, 53196, -28200, -9902, -28556, 47600, 50, -28874, -33931, -75784, 40653, 90103, 5582, -25270, -56237, -27606, -4292, 811, 23985, 61291, 65605, 128092, 8850, -23924, 33393, 1649, 6947, 16727, -45830, -35983, 36049, 20121, -26796, -98091, -14114, -95451, -19265, 14816, -10258]
1304a0258K9082n064o7763L9231N6153l8972J9751p850m6176K5234N8343Q81l0603
1291B1989n3651J07456q8508o2416L9238K7691K5640N536m0083j453L8201L3873
1279E3513p0557M285o8232k5362M8476P517L4032O1754j17196R894O0971L7006
1267C6101P1286k8694n650l4977j5574j17445J02465K7943K9436p0001K1433k3392
1255g069J9923n5619N6943P8760M63l1785l1525Q123o3614M5729j2275j1227j01251
1242a04424j2578L3690N7253m22O642o8814O6096O4911j9785J4395L4087q0203
1230i152K974J8410j3243O830N3136m5984r738O598k2160K5962o2496k3048N0456
1217b1455M5037m927L2396r7069J1746L7354m5713n9301P7746L3842L2058M5665
$$ y = [-10258, 18824, 13760, -54003, -14772, 41381, 2409, 22160, 14310, -31866, -6632, 51711, 52592, 21989, -31662, 75794, -12714, -75130, -35892, -8201, 17439, 22975, -17108, -18561, 19640, 53513, -17044, -12759, -80991, -106353, -57877, -50360, -16328, 45426, -71770, -61876, -905, 36101, 107387, 78693, 73043, 38066, 22492, -94953, 7512, 35455, 64891, -5110, 16323, -7069, 12854, -42765, 14178, 92938, 93401, 61616, 30091, 38214, -25400, 20329, 8054, -3173, -104424, -117002, -83312, -26059, -26481, -19839, -88653, -22557, 42354, 22569, 36964, 71051, -9152, -6178, 12232, -1011, 5819, 58955, 12971, 3233, 9831, -12329, 13633, -48863, -71911, -21455, 23582, 18655, 51051, -46018, -34272, 3082, -42631, -101932, -24186, 9656, 41714, 87379]
1205H7379o5648r0678K7335K8483N2490j09546K1470N5763k0963m237Q545M6347
1193C6740j01471N9692N9234o5076k3661M2555j694J7952P1390j608k2822m3736
1181B7495J441M772q2564j0630P1750M2155n7118j8605L7243j0397n216K8928
1169B9254J2451j6310o7229p5756L2897Q0321L678j0127J436J1385j7558P5421
1157E9863k7574N246o1135n0429M5174J4294r7876J26264O0713o8587n2529J7127
1145b9449O0198L1186l125m8009K4964m2359k6707J1652P5981k964k8413o358
1133A6597m6595M8847j4295k1793J47l9310L3419P5101R703n2050m4050K9829
1121d450M7951l5789P4993p6554J5262J4097k7735l1533M0218N1437K6015p2786
$$ y = [87379, 21731, -68947, -41612, -13129, 39361, -70185, -48715, 7048, -13915, -18152, -9607, 36740, -64731, -5039, 54195, -10881, -34542, 8013, 6319, 24271, 95661, 94053, 71231, 27495, 28936, 33708, -48856, -59486, 12264, 54419, -2699, -21304, 15939, 5542, 326, 29254, 41705, 25395, -41834, -117590, -84693, -4372, -694, -10821, -9385, 2000, -15558, 59863, 32289, 37535, -23600, -74029, -28855, -14561, -112437, 13827, 74540, 5953, -46576, -29449, 30749, 61935, 58810, 10801, 35765, -6594, -33301, -21649, 54332, 51368, 22955, 16597, -29998, 18849, 4554, -17239, -17092, -56402, -22983, 52118, 61821, 9771, -34279, -4450, 43501, 7712, 82705, 6151, 21413, 35510, 7775, -23758, 16460, 67897, 93912, 21126]
1109B1126o1732j244J0597l0663K2293J0370J03229o0095q0821n9544O4357J41719
1097G9592R239n4856l8725M370L7875j58383N6832Q0288r098Q501k2611J03103
1085I6127l1559o5192j4827l388L584R0638m3157o2457k4413K818k4925O0179
1073a6572k1549K3359m2294O9235p4424j20803O3928L7011J9696P1902K861j4132
1061a782p2021J7929K3186N4848o8298l5042m9259N4331L4715Q1349p701J7418
1049D9673L7256p2084k6827l1533L2298p3506N0381J02597k0407j24058M4735
1038c1475k2277J3194k2331o6427O7774J16642q1101l7736Q9718o0338l894J19537
1026H1286o3526o853m1856j8421J6658m0769O2285k4636J4550M3467R606j03646
$$ y = [21126, -40606, -41850, -31253, -61916, -39623, -29253, 73976, 13881, -66940, -126484, -62127, 79592, 88831, 33975, -4750, -380, 37495, -120888, -64056, 16232, 7134, 15635, -6976, 96127, 64568, -624, -15451, -18839, -15255, 75383, 32226, -30231, -54644, -51826, -76751, -16572, -38121, -14762, -57056, 12179, -62245, -183048, -119120, -82109, -62413, 9489, 12350, -1782, -73803, -55874, -32688, 22160, -46138, -81180, -130439, -76108, -41393, 39956, 32255, 49673, 86929, 14845, -11982, -43515, -11217, -84723, -34342, 68255, 47848, -76210, -31475, -53752, -40558, -62889, -129316, -61542, 55100, -26001, -63737, 25981, -34357, -38251, 81286, 17760, 10907, -30949, -49370, -32712, -73481, -11196, -35832, -21282, 22185, 31791, -71855]
1014g1855l7003J20362J2882K9573l4235j3570M7581o2462o3457J1316l8412P5920
1002b3360J1521J4139L2920k5251q6155m0160Q2479P4304P9594m5161j31184m6343
990a02657O2084K6246Q2241l3106K8358o3263r5288Q3313l815M3425R879j6219
978B1198L683k2144j30078j3012P0562Q5045L0385o0111n8390M0568J45311j34987
966b1970R562k6525K2823k7796q02M8518m3984M1354k7263l5651n0611M3841l053
953g1557J8694k3713q3353Q2409J47042l5464p9338m4349P082Q1949Q5139m6756
941C7785R627l647n0792M5040j9987m8678m6029R0804O4241j10029K0956M8447
929C7738j9282p0356l059M109N6535j3829n1038N9878J37089K782r5375J3888
$$ y = [-71855, -108858, 11504, 24386, 53959, 19724, 6154, 53735, -8727, -72184, -60868, -99280, -23360, -11839, 2300, 35220, 9969, -76186, -116346, -33867, 40437, 120031, 74870, -56314, -102657, -40573, -14327, 67914, 34808, 63166, -97, -95385, -12072, -15887, 27538, 37417, 21198, 24881, 2737, -127341, -140353, -69791, 15254, 45639, -14472, -72862, -32294, 113017, -21970, -12408, -38933, -16110, -43906, -44708, 3810, -40174, 1180, -26083, -61734, -112345, -68504, -71557, -52863, -76576, -159929, -77520, 69522, 34058, -45280, -89629, -82547, -598, 84541, 37785, 47412, 43765, -7027, 38013, 18026, -30652, -76681, 14123, 78364, -31665, -10709, 37738, 18456, -51900, -54959, -50850, 5685, -8144, -59182, 696, 137785, 140567, 45192, 59080]
917E9080L5510R077q1645L3103p1613L1657m0335l3783O4582L2210l9577J6256
905A4522k307m1835P9168J2650j25091J04683J1723j05780M4994Q9012j7630k9284
893C4825j08747q7484J05158j8200J71225q9151K8099k4428j26561N2591q593
882g1266N6880N2439P4789r8322M4224j5036j01393O2244L5319o699J6238o7157
870a7740n974j800j5556N2819J7474n5840q943R7503o6658m6475j5444O7336K6302
857B7004O095o8796J5128P3293M1340n5785K6463o1290l8755O9693Q9008o5026
845E8372n8986K094m1699r0425P2002l881j1860J3059Q7193M4493n6392P6554
833I0524j0433k2494j0161N285j6494Q9762l1590o3027k1395J41170k4137p714
$$ y = [59080, 94590, 103667, 22022, 55125, -16488, 15169, -25166, -58949, 5633, 37843, -1734, 14522, 12215, -29620, 49548, 62198, -62893, 41790, 53513, -52267, -7273, 81739, 64109, 34825, -73922, -161406, -56248, -74448, 96777, 7626, 35725, 11297, -115264, -62673, -71266, -14386, 38053, 112842, 14520, 58744, 43708, -57685, 4559, 39878, 33179, 49417, -17740, -23714, -25514, -41070, 11749, 29223, -26617, -35560, 61943, -4715, -51190, -66634, 702, 27004, 33099, -35697, -20569, 52724, 94064, 38279, 64742, 3452, -35303, 34390, 123398, 58372, -614, 1480, -40219, -130644, -58642, -62523, -74383, -61324, 25869, 70362, 13970, 90524, 80091, 57597, 47436, 52721, 36227, 125989, 94399, 31372, 9977, 151147, 127010, 119296]
821A19296m3479q5178p0091O1732P4667j38338m7772J38623l7957l6800M1390
810b3907q8598L5893J6094n1165o923L7803J546l9867M7550R6247m2188k6417
798d3932Q5645L5839K0814k01326J10217Q4212l2156M2721m0603K0275j8251l9605
786B3850j6592r07N0076J8326k3431J6829Q892L4758m5733p8151J6656J13580
774A18153l3489j01560K0048J6382L73K2037j02969P388O2880q996J9224P512
762B6983J9570j2315j14876K2710O2904o5404O2964L0339p8348M8219j3493J1489
750G42j2890k5859O3667j04861R6532J4509N293J9092o2394j0285q1779P2134
738b6099P5388M3908o0562p1301o6000j3315O1073N9655N5815k7418K6898l8512
$$ y = [119296, 75817, -9361, -79452, -17720, 56947, -81391, -129163, 9460, -28497, -65297, -23907, -112505, -76612, -60518, -111683, -118606, -80803, -79257, -119124, -71574, 24673, -17515, -43932, 41713, 77552, 98366, -102960, 7257, 91469, 59313, 102034, 61431, 81706, 63455, 23850, 7258, 6351, 56427, 74753, 51322, 68151, 77043, 111801, 66068, -12083, 4573, 118153, 84664, -16896, 3152, 19534, 19907, 41944, -61025, -53637, 9243, 247, 19471, 26983, 46553, 34238, -80638, -57928, 4976, -60428, 2536, 32875, -45473, 2746, -10747, 742, -12148, -38007, 25660, -79201, 17331, 31840, 37133, 56225, -6169, -16454, -98233, -26099, 49289, 93197, 32635, -38666, -104666, -117981, -56908, 2747, 58562, 31144, 58042, 19530]
726A9530m6025N0209N9286R338j14654m0824l8181O1296O6710n8798j04811K9118
714a07806L7459l7749m0122M4847J0400P9429J2356K6064L4424J4552O3961j02686
702C5129p1271j5040P4642M4707j02395m9299J10905r721j1552J8414o4826k580
690d2887R4244l4487p0394n5909m0918J09581L7588L1269o2097o0398L4662O4166
678D420j8185M57q012j12910J10105l7658j8945J15l9782O7081M3432K2954O2451
665G5523m2457l5361m7014J7530l4167l6933K5443Q056N9134j8777m1078J4003
653e6098K1700o9921J282N1794O1730l3664J8131L6467K8553j3865j05326J4184
641d5033n183j9017k4598M5842j0998j6989L2187o9452Q5161P0826r4652N5305
$$ y = [19530, -26495, 23714, 83000, 92338, -22316, -63140, -101321, -40025, 26685, -32113, -136924, -107806, -70347, -108096, -148218, -103371, -92971, -13542, -1186, 24878, 59302, 73854, 137815, 35129, -36142, -51182, 23460, 68167, -34228, -83527, 27378, 17657, 6105, 24519, -40307, -42887, 51357, 16870, -53524, -109433, -150351, -40770, -3182, 28087, -34010, -94408, -59746, 4420, -13765, -13308, -21320, -134230, -24125, -61783, -80728, -80613, -120395, -53314, -9882, 13072, 75523, 33066, -2295, -49309, -31779, -65946, -102879, -77436, -69380, -10246, -29023, -70101, -56098, -34398, -104319, -103037, -51243, 10487, -23177, -5046, 31421, 59974, 46109, -59217, -45033, -50216, -69233, -93831, -47989, -58987, -75976, -43789, -113241, -28080, 42746, -51906, 3399]
629C399O55j6771L9199k9439k2537n2354l472R9059j2501l927q0485k9221J05225
616c170L5998m4146Q511k1768k6035p59P24N7979O854P5010j19317j08912j9014
603a58045O5731L3087M9847k5787K8663j1269o4382K1315Q7926n1993k7708N3023
591D08o3371m9820Q2113K3963k7851Q4327m7660q6484n0182j1256O8012P2425
579e376J8821p5388P9181P7121O6677l9410q9187K2495r0133k5143K7658L2544
567a40K557l7954J5567K5708j4744m8736J6408O436k1842J9044J05028j07879
555d0547m8491Q5977J9002K5234j3749n0493N9335R0928m5255k2884q0134k6269
543d7346Q7943P7583j10095k2918O476L183k2264L3553L7239k0687j8037J5547
$$ y = [3399, 4054, -12717, 26482, -2957, -25494, -77848, -81320, 17739, 5238, 1311, -79174, -108395, -3170, 32828, -11318, -2807, -24575, -50610, -51369, -50645, 7334, 14188, 89198, -30119, -139031, -158045, -92314, -59227, -9380, -35167, -6504, -17773, -82155, -60840, 27086, -24907, -52615, 408, -62963, -112783, -30670, -6707, -34558, 49769, 2109, -84375, -134557, -145813, -77801, -5376, 13445, -61943, 17238, 94359, 161036, 121626, 32439, 54934, -35199, -60342, -32684, -140, 2417, -35537, -19970, 5738, -9006, -57742, -41334, -34898, -56740, -37696, 67332, -40547, -89038, -3061, 15941, 41175, 27426, -23067, 36268, 127196, 81941, 59057, -21077, -47346, 40597, 118180, 8085, -14833, -8357, -5174, -27438, 6115, 43354, 22667, 4630, 20177]
531B0177K4147J08012j32768N478K1475j06632J1399J3234J3598N7466J7666m4236
519I016j0156n6182K7853N6064p2463O1409l3898r3424L5409k9338K1220J19455
507C4965r1796o0109J5931O4937O0856k2238o4763K94n5894J35031M7207p7651
495a3230K7119j0670j4067K1237Q0381o0923k2801m5666L5943m8069o2595K8884
483h4457R6195l7726M0182k7934O1592J5758J8009o0857k5742K414J5904L4879
471D8217n6570l7126Q7888l2627j23522O4289k3444M4835M9354k1599m7008M8773
459A460j913l5218L2248q039k8399P9143l3028l5411L4683L1263m0207r7486R591
446i1313m30p884K1494O3313N3644r3131p4845r132P3310k0048k8120J14481j1313
$$ y = [20177, 44324, 152336, 19568, 25046, 46521, -60111, -48712, -35478, -21880, 35586, 53252, 9016, -1140, -57322, -29469, 26595, -45868, 15541, -18357, -111781, -76372, -105710, -84490, 34965, -56831, -116940, -101009, -36072, 24784, 2546, -62217, -61923, -117817, 17214, 64421, -13230, 13889, 3219, -10848, 10389, 90770, 29847, 7046, -38620, -2677, -50746, -113341, -84457, 11738, -25988, 14194, -13740, 47852, 63610, 81619, 20762, -4980, -2566, 13338, 48217, -8353, -45479, 42409, 9782, -113740, -49451, -72895, -28060, 21294, -305, -47313, 1460, -453, -35671, -3423, -11462, -39861, 39282, 6254, -29157, 5526, 36789, -3418, -100904, -91313, -91743, -99627, -78133, -14820, 38824, -54307, -129152, -138284, -64974, -85022, -113142, 1339, -9974]
433i974j2571N0180O2477r0836J1880l0416o0358k6404M1070L2283O6865O2785
421I6981r7679M290m6712J14373K7884q3464R49k1887n02l0866M7514N8649r3898
408b4368j3778Q0081j34227M759R7604j6338q488n7785l6689N1351J1376N2018
396E516K5034K9856L7077r8578m5609j5640p0696J30162k4563o6243K2660j4324
384h5348L6974K4012M5662K9631m3423M6513L9400n4286m9549O0700L1679n1484
372C0481K5212j38921R1588R8472m1687N0219j2415M6089j23205q8383J1045L497
360d8008j5453q2772L6347O4999J05224j2906k0222m5519p4125m3309J1040Q2742
348d1962K268J5410N5764j00729j5993N0322l008R81J1856N5159r9534Q5401O3543
$$ y = [-9974, -22545, 27635, 90112, -724, 11156, -19260, -79618, -106022, -64952, -32669, 34196, 96981, -698, 3592, -43120, 71253, 99137, 15673, 16622, -5265, -5767, -36633, 10881, 69530, -24368, -38146, 41935, -92292, -87533, 10071, -6267, -14755, -72540, -109229, -57878, -46502, 5516, 30550, 60406, 97483, -1095, -46704, -62344, -133040, -2878, -27441, -93684, -71024, -85348, -48374, -24362, 21300, 50931, 7508, 54021, 93421, 39135, -10414, 50286, 81965, 30481, 55693, -83228, 8360, 106832, 65145, 115364, 102949, 149038, 25833, -62550, -51505, -48008, -63461, -146233, -109886, -44887, 60337, 47431, 27209, -18310, -92435, -135744, -124704, -41962, -39694, -24284, 31480, -69249, -85242, -34920, -37928, -36947, -25091, 30068, -69466, 15935, 79478]
335G9478m9960j7986J4806k1618k8789M1814l4317o6517m0782Q0337l5245m013
323h2792l6093R1382l6763L0446m0551j8453J30844M4108o6075J6082r2691r820
311g0376N0955k4918m9128P7881O7757m7600J337J974J8375L1765R7037j09615
299D5444q2477N6045k1860m7380L2853Q621k73n4401L9364j092Q0029j8688m8199
286a2014L8049j06893N9465L514r9595k6570J18364O151o2587o791l0900P9353
274d0454p8742j0729R7899k846j8693K9645j5134l8040J47821J2730q3984M7710
262D7183m8101k496J1564k3636j6025P1595p7585o722n369j2241l3018N8897r928
249d5882J2826K6082n7315o097L1195L5195l455O2776o710n5660O6364P2309n6596
$$ y = [79478, 29518, 11532, 26338, 4720, -24069, 17745, -16572, -83089, -123871, -43534, -78779, -82792, -118885, -27503, -64266, -33820, -74371, -92824, 38020, 82128, 16053, 32135, -60556, -70376, -19421, -44339, -93467, -15586, 52171, 4571, 5908, 7882, 26257, 58022, 155059, 45444, -37033, 19012, -2848, -50228, -17375, -8754, -9027, -63428, -24064, -25156, 54873, 36185, -12014, 26035, -80858, -21393, -17879, -117474, -144044, -25680, -19529, -82116, -88907, -119807, -40454, -119196, -129925, -32026, -34872, -53565, -23920, -39054, -77094, 70727, 83457, -527, 47183, -918, -3414, 8150, -15486, -31511, 40084, -37501, -44223, -49592, -61833, -94851, -35954, -45882, -33056, -6974, -64289, -70386, -39191, -3996, -7451, 55325, 48615, -7045, 59319, 131628, 75032]
$$ [...]
##END NTUPLES=NMR SPECTRUM
##END=
