##TITLE=1H_EC-3254(5-2)
 CDCl3, 8 sc, 
 8.07.2021
##JCAMPDX= 6.0         $$ Bruker NMR JCAMP-DX V2.0
##DATA TYPE= NMR SPECTRUM
##DATA CLASS= NTUPLES
##ORIGIN= UXNMR, Bruker Analytische Messtechnik GmbH
##OWNER= root
$$ XWIN-NMR		Version 3.5
$$ Thu Jul  8 08:54:53 2021 Russian Standard Time (UT+4h)  she@DPX200
##.OBSERVE FREQUENCY= 200.131506
##.OBSERVE NUCLEUS= ^1H
##.ACQUISITION MODE= SIMULTANEOUS
##.ACQUISITION SCHEME= undefined
##.AVERAGES= 8
##.DIGITISER RES= 18
##SPECTROMETER/DATA SYSTEM= spect
##.PULSE SEQUENCE= zg30
##.SOLVENT NAME= CDCl3
##.SHIFT REFERENCE= (INTERNAL, CDCl3, 0, 17.4995)
##AUDIT TRAIL= $$ (NUMBER, WHEN, WHO, WHERE, WHAT)
$$ ##TITLE= Audit trail, XWIN-NMR		Version 3.5
$$ ##JCAMPDX= 5.01
$$ ##ORIGIN= Bruker BioSpin GmbH
$$ ##OWNER= she
$$ F:/spectra/data/she/nmr/H-F/1/pdata/1/auditp.txt
$$ ##AUDIT TRAIL=  $$ (NUMBER, WHEN, WHO, WHERE, WHAT)
(   1,<2021-07-08 08:53:16.31 +0400>,<she>,<DPX200>,
      <created by zg, POWCHK disabled, PULCHK disabled
       configuration hash MD5:
       00 E9 B6 7A A2 85 ED C7 34 08 36 98 17 FE 4E 26
       data hash MD5: 16K
       0A 06 45 65 77 0A 5D C0 34 C9 94 7F 4E 5D 98 4A>)
(   2,<2021-07-08 08:53:37.31 +0400>,<she>,<DPX200>,
      <Start of raw data processing
       efp BC_mod = 2 LB = 0.24 FT_mod = 6 PKNL = 1 PHC0 = -12439.43 PHC1 = 20.00101 SI = 16K 
       data hash MD5: 16K
       29 70 A6 AF F2 5B 79 19 02 81 26 F6 2C 04 60 BE>)
(   3,<2021-07-08 08:53:59.81 +0400>,<she>,<DPX200>,
      <pk PHC0 = 7.998141 PHC1 = -8.8 
       data hash MD5: 16K
       F4 C5 2C ED 54 3D 23 E8 8E 82 C9 37 D2 09 1E 50>)
(   4,<2021-07-08 08:54:03.65 +0400>,<she>,<DPX200>,
      <abs ABSG = 5 
       data hash MD5: 16K
       67 58 91 6C A7 DB DA 58 8F F6 61 B5 31 F1 CB 4A>)
(   5,<2021-07-08 08:54:26.51 +0400>,<she>,<DPX200>,
      <abs ABSG = 5 
       data hash MD5: 16K
       1E 04 A1 D3 CC 02 3A 9B F0 54 16 5F 25 97 71 33>)
$$ ##END=
$$ 
$$ hash MD5
$$ F6 DE 7F 3A 2B 94 87 B9 B1 16 6C 99 E9 C1 A2 74
##$RELAX= 
##$RELAX= 
##$RELAX= 
##$RELAX= 
##$RELAX= 
##$RELAX= 
$$ Bruker specific parameters
$$ --------------------------
##$DU= <F:/spectra>
##$EXPNO= 1
##$NAME= <H-F>
##$PROCNO= 1
##$TYPE= <nmr>
##$USER= <she>
##$AMP= (0..31)
100 100 100 100 100 100 100 100 100 100 100 100 100 100 100 100 100 100 
100 100 100 100 100 100 100 100 100 100 100 100 100 100 
##$AQSEQ= 0
##$AQ_mod= 1
##$AUNM= <au_zg>
##$AUTOPOS= <>
##$BF1= 200.13
##$BF2= 200.13
##$BF3= 200.13
##$BF4= 200.13
##$BF5= 200.13
##$BF6= 200.13
##$BF7= 200.13
##$BF8= 200.13
##$BYTORDA= 1
##$CFDGTYP= 0
##$CFRGTYP= 5
##$CHEMSTR= <none>
##$CNST= (0..31)
1 1 145 1 1 1 1 1 1 1 1 1 1 1 1 1 1 1 1 1 1 1 1 1 1 1 1 1 1 1 1 1 
##$CPDPRG= <>
##$CPDPRG1= <>
##$CPDPRG2= <>
##$CPDPRG3= <>
##$CPDPRG4= <mlev>
##$CPDPRG5= <mlev>
##$CPDPRG6= <mlev>
##$CPDPRG7= <mlev>
##$CPDPRG8= <mlev>
##$CPDPRGB= <>
##$CPDPRGT= <>
##$D= (0..31)
0 1.2 0 0 0 0 0 0 0 0.06 0 0.03 0 0 0 0 0.0002 0 0 0 0 0 0 0 0 0 0 0 0 
0 0 0 
##$DATE= 1625719995
##$DBL= (0..7)
$$ [...]
##$SUBNAM3= <"">
##$SUBNAM4= <"">
##$SUBNAM5= <"">
##$SUBNAM6= <"">
##$SUBNAM7= <"">
##$SUBNAM8= <"">
##$SUBNAM9= <"">
##$SW= 20.0188882624521
##$SWIBOX= (0..15)
0 0 2 0 0 0 0 0 0 0 0 0 0 0 0 0 
##$SW_h= 4006.41025641026
##$TD= 16384
##$TD0= 1
##$TE= 0
##$TE2= 300
##$TE3= 300
##$TEG= 300
##$TL= (0..7)
0 120 120 120 120 120 120 120 
##$TP= (0..7)
150 150 150 150 150 150 150 150 
##$TP07= 0
##$TPNAME0= <>
##$TPNAME1= <>
##$TPNAME2= <>
##$TPNAME3= <>
##$TPNAME4= <>
##$TPNAME5= <>
##$TPNAME6= <>
##$TPNAME7= <>
##$TPOAL= (0..7)
0.5 0.5 0.5 0.5 0.5 0.5 0.5 0.5 
##$TPOFFS= (0..7)
0 0 0 0 0 0 0 0 
##$TUNHIN= 0
##$TUNHOUT= 0
##$TUNXOUT= 0
##$USERA1= <user>
##$USERA2= <user>
##$USERA3= <user>
##$USERA4= <user>
##$USERA5= <user>
##$V9= 5
##$VALIST= <valist>
##$VCLIST= <CCCCCCCCCCCCCCC>
##$VD= 0
##$VDLIST= <DDDDDDDDDDDDDDD>
##$VPLIST= <PPPPPPPPPPPPPPP>
##$VTLIST= <TTTTTTTTTTTTTTT>
##$WBST= 1024
##$WBSW= 4
##$XGAIN= (0..3)
0 0 0 0 
##$XL= 0
##$YL= 0
##$YMAX_a= 87878
##$YMIN_a= -60131
##$ZGOPTNS= <>
##$ZL1= 120
##$ZL2= 120
##$ZL3= 120
##$ZL4= 120
##$ABSF1= 17.49955
##$ABSF2= -2.519489
##$ABSG= 5
##$ABSL= 3
##$ALPHA= 0
##$AQORDER= 0
##$ASSFAC= 0
##$ASSFACI= 0
##$ASSFACX= 0
##$ASSWID= 0
##$AUNMP= <proc_1d>
##$AZFE= 0.1
##$AZFW= 0.1
##$BCFW= 0
##$BC_mod= 2
##$BYTORDP= 0
##$COROFFS= 0
##$CY= -3
##$DATMOD= 1
##$DC= 0
##$DFILT= <>
##$DTYPP= 0
##$F1P= 0
##$F2P= 0
##$FCOR= 1
##$FTSIZE= 16384
##$FT_mod= 6
##$GAMMA= 0
##$GB= 0
##$INTBC= 1
##$INTSCL= 1.334414e-10
##$ISEN= 128
##$LB= 0.24
##$LEV0= 0
##$LPBIN= 0
##$MAXI= 10000
##$MC2= 0
##$MEAN= 0
##$ME_mod= 0
##$MI= 1.114404
##$NCOEF= 0
##$NC_proc= -9
##$NLEV= 6
##$NOISF1= 3.799351
##$NOISF2= 2.8
##$NSP= 0
##$NTH_PI= 0
##$NZP= 0
##$OFFSET= 17.49955
##$PC= 1
##$PHC0= -12431.43
##$PHC1= 11.20101
##$PH_mod= 1
##$PKNL= yes
##$PPARMOD= 0
##$PSCAL= 0
##$PSIGN= 0
##$REVERSE= no
##$SF= 200.130007019363
##$SI= 16384
##$SIGF1= 3
##$SIGF2= 2
##$SINO= 5.538805
##$SIOLD= 16384
##$SREGLST= <1H.CDCl3>
##$SSB= 0
##$STSI= 16384
##$STSR= 0
##$SW_p= 4006.41025641026
##$SYMM= 0
##$S_DEV= 0
##$TDeff= 16384
##$TDoff= 0
##$TI= <>
##$TILT= no
##$TM1= 0
##$TM2= 0
##$TOPLEV= 0
##$USERP1= <user>
##$USERP2= <user>
##$USERP3= <user>
##$USERP4= <user>
##$USERP5= <user>
##$WDW= 1
##$XDIM= 16384
##$YMAX_p= 308478795
##$YMIN_p= -899192
$$ End of Bruker specific parameters
$$ ---------------------------------
##NTUPLES= NMR SPECTRUM
##VAR_NAME=  FREQUENCY,     SPECTRUM/REAL,   SPECTRUM/IMAG
##SYMBOL=    X,             R,               I
##VAR_TYPE=  INDEPENDENT,   DEPENDENT,       DEPENDENT
##VAR_FORM=  AFFN,          ASDF,            ASDF
##VAR_DIM=   16384,         16384,           16384
##UNITS=     HZ,            ARBITRARY UNITS, ARBITRARY UNITS
##FACTOR=    0.24454680195387, 1,            1
##FIRST=     3502.18503746277, 0,            0
##LAST=      -504.225218947492, 0,           0
##MIN=       -504.225218947492, -899192,     0
##MAX=       3502.18503746277, 308478795,    0
$$ Real data points
##PAGE= N=1
##DATA TABLE= (X++(R..R)), XYDATA
$$ [...]
$$ plain form
6137 1412114 1262525 1227885 1450625 1375539 1333814 1224110 1246276 1052071 1340179 1242454
6127 1242454 1183872 1590197 1214167 1292623 1437744 1203099 1395136 1458780 1414797 1610339
6117 1610339 1370889 1321450 1550430 1603732 1849287 1980456 1925313 2099416 2147731 2213185
6107 2213185 2052843 2126606 2290961 2530657 2453359 2277650 2462699 2486737 2394588 2546870
6097 2546870 2435674 2425255 2550059 2636564 2656641 2561330 2781438 3531169 3480264 3299400
6087 3299400 3342965 3640235 3828682 3782211 3946804 4315752 4189504 4070654 4559342 4839821
6077 4839821 4690116 4983870 5235361 5626944 5634720 6094778 6239953 6276154 6669232 7025356
6067 7025356 7523264 7666923 8307925 8764816 9537648 9972296 10447767 10979351 11594632 12161254
$$ packed form
6137A412114j49589l4640K22740p5086m1725j09704K2166j94205K88108r7725
6127A242454n8582M06325l76030P8456J45121k34645J92037O3644m3983J95542
6117A610339k39450m9439K28980N3302K45555J31169n5143J74103M8315O5454
6107B213185j60342P3763J64355K39696p7298j75709J85049K4038r2149J52282
6097B546870j11196j0419J24804Q6505K0077r5311K20108P49731n0905j80864
6087C299400M3565K97270J88447m6471J64593L68948j26248j18850M88688K80479
6077D839821j49705K93754K51491L91583P776M60058J45175L6201L93078L56124
6067G025356M97908J43659O41002M56891P72832M34648M75471N31584O15281N66622
$$ plain form
6057 12161254 12761256 13437611 14136214 14519941 15248465 16188152 16982539 17803237 18376695
6048 18376695 18740293 19109231 19747476 20150302 20333043 20277212 20054358 19721707 19133720 18598829
6038 18598829 18146238 17547323 16594878 16025151 15548398 14625913 14025998 13248468 12459151
6029 12459151 11581350 10797853 10513042 9838233 9404514 8998746 8770556 8164425 7793199
6020 7793199 7407887 6904610 6922905 6635563 6164631 5934242 5913227 5722064 5441979 5339402
6010 5339402 5237008 4798773 4844644 4268667 4069143 4105677 4103253 3808820 3731684 3713788 3598565
5999 3598565 3671613 3794209 3419184 3294619 3508545 3387667 3220389 2651884 2855662 2847860
5989 2847860 2847814 2930043 2613618 2476036 2483062 2336495 2398021 2419847 2447899 2168760 2439095
$$ packed form
6057A2161254O00002O76355O98603L83727P28524R39687P94387Q20698N73458
6048A8376695L63598L68938O38245M02826J82741n5831k22854l32651n87987n34891
6038A8598829m52591n98915r52445n69727m76753r22485n99915p77530p89317
6029A2459151q77801p83497k84811o74809m33719m05768k28190o06131l71226
6020G793199l85312n03277J8295k87342m70932k30389k1015j91163k80085j02577
6010E339402j02394m38235M5871n75977j99524L6534k424k94433p7136j7896j15223
5999C598565P3048J22596l75025j24565K13926j20878j67278n68505K03778p802
5989B847860m6Q2229l16425j37582P026j46567O1526K1826K8052k79139K70335
$$ plain form
5978 2439095 2272294 2235516 2228151 1843681 2029662 1904250 1922713 1884826 1673379 1763441 1695892
5967 1695892 1790810 1617225 1399324 1614554 1647847 1621134 1334168 1365416 1266273 1067362
5957 1067362 1194313 1243233 1177146 1111473 1414876 1549149 1429709 1187750 1299000 1138886
5947 1138886 862304 1036940 1092650 1252559 1359095 1222736 885650 1155432 1061051 1116267
5937 1116267 1017944 814910 867180 845959 792748 1160879 1347428 1341371 1247923 819313 799503
5926 799503 522707 679572 988205 841007 905580 854007 604315 658631 753846 727551 742291
5915 742291 836138 665136 985781 941787 673777 613176 853189 817014 838878 1043427 1083957
5904 1083957 988821 874105 578012 388359 799425 839972 734326 685116 389215 657758
$$ packed form
5978B439095j66801l6778p365l84470J85981j25412J8463l7887k11447R0062o7549
5967A695892R4918j73585k17901K15230L3293k6713k86966L1248r9143j98911
5957A067362J26951M8920o6087o5673L03403J34273j19440k41959J11250j60114
5947A138886k76582J74636N5710J59909J06536j36359l37086K69782r4381N5216
5937A116267r8323k03034N2270k1221n3211L68131J86549o057r3448m28610j9810
5926G99503k76796J56865L08633j47198O4573n1573k49692N4316R5215k6295J4740
5915G42291R3847j71002L20645m3994k68010o0601K40013l6175K1864K04549M0530
5904A083957r5136j14716k96093j89653M11066M0547j05646m9210k95901K68543
$$ plain form
5894 657758 763417 752810 914917 738942 1020857 988048 728215 659214 858569 958075
5884 958075 962545 954750 662974 769409 851234 751070 583811 630711 954167 618429 566641
5873 566641 532493 704458 924052 762744 785093 1128407 1163670 1226595 1114946 1217011
5863 1217011 1116128 1119468 1030207 1063031 938928 781329 851457 787060 763844 714440 565217
5852 565217 423691 529054 686460 599467 347177 700566 822811 947189 644221 521021
5842 521021 725253 669232 686374 709284 621874 723580 797745 812308 536476 383489 519652
5831 519652 419620 550146 928460 833744 1104072 945410 843170 806699 651078 659036
5821 659036 463471 871898 963808 799502 713721 449016 753929 1064034 892714 1041065
$$ packed form
5894F57758J05659j0607J62107j75975K81915l2809k59833o9001J99355R9506
5884I58075M470p795k91776J06435Q1825j00164j67259M6900L23456l35738n1788
5873E66641l4148J71965K19594j61308K2349L43314L5263O2925j11649J02065
5863A217011j00883L340q9261L2824j24103j57599P0128o4397k3216m9404j49223
5852E65217j41526J05363J57406q6993k52290L53389J22245J24378l02968j23200
5842E21021K04232n6021J7142K2910q7410J01706P4165J4563k75832j52987J36163
5831E19652j00032J30526L78314r4716K70328j58662j02240l6471j55621P958
5821F59036j95565M08427R1910j64306q5781k64705L04913L10105j71320J48351
$$ plain form
5811 1041065 954472 809533 957863 1034200 1023411 947415 897606 897841 791195 821371 720458
5800 720458 947562 1093688 940158 783513 841855 862994 747885 756714 772871 843706 849937
5789 849937 748165 755049 616246 414346 667503 913602 974890 969801 826602 844767 764737
5778 764737 606155 1063083 1162456 1245894 1024248 1117045 1422540 1296126 1165955 1091127
5768 1091127 1191861 1301480 1086412 708529 473995 969080 1235517 1127577 961965 1225920
5758 1225920 985460 975983 1255063 1195752 1247092 973550 965553 1069247 1073348 886456 1057419
5747 1057419 1114611 1275262 1113476 1152557 1189852 1471892 1091741 1210432 1606365 1438249
5737 1438249 1539011 1609657 1418418 1271849 1297684 1466766 1171777 1136272 1306704 1576551
$$ packed form
5811A041065q6593j44939J48330P6337j0789p5996m9809K35j06646L0176j00913
5800G20458K27104J46126j53530j56645N8342K1139j15109Q829J6157P0835O231
5789H49937j01772O884j38803k01900K53157K46099O1288n089j43199J8165q0030
5778G64737j58582M56928R9373Q3438k21646R2797L05495j26414j30171p4828
5768A091127J00734J09619k15068l77883k34534M95085K66437j07940j65612K63955
5758A225920k40460r477K79080n9311N1340k73542p997J03694M101j86892J70963
5747A057419N7192J60651j61786L9081L7295K82040l80151J18691L95933j68116
5737A438249J00762P0646j91239j46569K5835J69082k94989l5505J70432K69847
$$ plain form
5727 1576551 1731970 1349301 1435923 1200658 1292627 1003846 1222592 1485582 1339817 1311995
5717 1311995 1228701 1347998 1436167 1414122 1487002 1714881 1522907 1532513 1669328 1605238 1709656
5706 1709656 1730008 1697042 1967550 1972734 1639549 1913555 1973730 1623772 2112899 2262208
5696 2262208 2360106 2353322 2200342 2227771 2186833 2287981 2187757 2507679 2575454 2635826 2708022
5685 2708022 2836916 2691378 2518560 2501187 2399697 2831038 3014621 2815581 2953946 3018775
5675 3018775 3160573 3163114 3579522 3504292 3609232 3909451 3545754 3695588 3798227 3880792
5665 3880792 4065884 4220614 4213577 4188805 4047465 4706517 4776688 4888519 4864305 5269357
5655 5269357 5639512 5818717 5810766 5376860 5673691 6515782 6773904 6942284 7431731 7509918
$$ packed form
5727A576551J55419l82669Q6622k35265R1969k88781K18746K62990j45765k7822
5717A311995q3294J19297Q8169k2045P2880K27879j91974R606J36815o4090J04418
5706A709656K0352l2966K70508N184l33185K74006O0175l49958M89127J49309
5696B262208R7898o784j52980K7429m0938J01148j00224L19922O7775O0372P2196
5685B708022J28894j45538j72818j7373j01490M31341J83583j99040J38365O4829
5675C018775J41798K541M16408p5230J04940L00219l63697J49834J02639Q2565
5665C880792J85092J54730p037k4772j41340O59052P0171J11831k4214M05052
5655E269357L70155J79205p951m33906K96831Q42091K58122J68380M89447P8187
$$ plain form
5645 7509918 7837994 8446180 9000227 9388906 9986039 11094171 11727658 12337575 13323824
5636 13323824 14517192 15555480 16485628 17795694 19466496 21442791 23180159 24703399
5628 24703399 25726769 26570774 26900842 26122082 24474076 22985370 21498914 20372926 19531866
5619 19531866 19026547 18721624 18723750 18613584 18877689 19911579 21033771 22090637 23709771
5610 23709771 24968145 26557026 28220080 30081993 32239729 34719837 37719347 41486911
5602 41486911 45217585 48302199 50188444 50109315 47725585 43799875 39122856 34746754
5594 34746754 31251783 28199719 26008415 24159822 22662327 21363694 20712645 20307425
5586 20307425 19978907 20022324 20044634 20472351 20750090 20956255 21563111 22200935 22997077 24010861
$$ packed form
5645G509918L28076O08186N54047L88679N97133J108132O33487O09917R86249
5636A3323824J193368J038288R30148J310066J670802J976295J737368J523240
5628B4703399J023370Q44005L30068p78760j648006j488706j486456j125988q41060
5619A9531866n05319l04923K126j10166K64105J033890J122192J056866J619134
5610B3709771J258374J588881J663054J861913K157736K480108K999510L767564
5602D1486911L730674L084614J886245p9129k383730l925710m677019m376102
5594C4746754l494971l052064k191304j848593j497495j298633o51049m05220
5586B0307425l28518M3417K2310M27717K77739K06165O06856O37824P96142J013784
$$ plain form
5576 24010861 25070699 26575529 27988883 28698102 28820123 27334273 25151701 22760306
5568 22760306 20696442 18684375 16828786 15360284 14420569 13285441 11958651 11292039
5560 11292039 10814752 10232331 9779178 9312910 8608430 8262497 8063250 7881343 7497730
5551 7497730 7166021 7144118 6562764 6209233 6148852 6051759 6010983 5992771 5916808 5783072 5370865
5540 5370865 5381643 5213565 5159130 5210782 5070280 4736686 4458503 4578993 4364604 4192200
5530 4192200 4165762 4246996 4301328 4192214 3907580 4120096 4061383 3866381 4012674 3872998
5520 3872998 4179924 3894078 3646880 3623475 3390534 3598202 4064121 3697011 3490578 3696819
5510 3696819 3674928 3611951 3321912 3401723 3272741 3438672 3564607 3370733 3341034 3125171
$$ packed form
5576B4010861J059838J504830J413354P09219J22021j485850k182572k391395
5568B2760306k063864k012067j855589j468502r39715j135128j326790o66612
5560A1292039m77287n82421m53153m66268p04480l45933j99247j81907l83613
5551G497730l31709k1903n81354l53531o0381r7093m0776j8212p5963j33736m12207
5540E370865J0778j68078n4435N1652j40502l33594k78183J20490k14389j72404
5530D192200k6438Q1234N4332j09114k84634K12516n8713j95002J46293j39676
5520C872998L06926k85846k47198k3405k32941K07668M65919l67110k06433K06241
5510C696819k1891o2977k90039P9811j28982J65931J25935j93874k9699k15863
$$ plain form
5500 3125171 3179618 3177363 2940560 2863952 2998054 2993554 3005471 2954498 3122383 3309796 3393593
5489 3393593 3290201 3144348 3507809 3524296 3196220 3637699 3754192 3459734 3626999 3418823
5479 3418823 3509264 3484050 3513388 3768198 3517305 3558188 3757631 3892027 4100102 4005227
5469 4005227 4147714 4273806 4305106 4426064 4453508 4516673 4290359 4129454 4314952 4348873
5459 4348873 4436691 4510523 4751676 4815127 4857335 5007139 5360565 5591675 5745461 5768678
5449 5768678 5951269 5789395 6003009 6144104 6287763 6588178 6931651 7161465 7486835 7339862
5439 7339862 7702944 8185422 8242097 8550046 9152729 9740130 10210615 11007267 11697503 12559931
5429 12559931 13452906 14644631 15268414 16698731 18470541 20305183 21960839 23942847
$$ packed form
5500C125171N4447k255k36803p6608J34102m500J1917n0973J67885J87413Q3797
5489C393593j03392j45853L63461J6487l28076M41479J16493k94458J67265k08176
5479C418823R0441k5214K9338K54810k50893M0883J99443J34396K08075r4875
5469D005227J42487J26092L1300J20958K7444O3165k26314j60905J85498L3921
5459D348873Q7818P3832K41153O3451M2208J49804L53426K31110J53786K3217
5449E768678J82591j61874K13614J41095J43659L00415L43473K29814L25370j46973
5439G339862L63082M82478N6675L07949O02683N87401M70485P96652O90236Q62428
5429A2559931Q92975J191725O23783J430317J771810J834642J655656J982008
$$ plain form
5421 23942847 26099916 28451969 29920202 30519946 30361492 29300840 27792141 26031169
5413 26031169 24528433 23112677 22090806 21267944 20699079 20157379 20390894 20505454 20567962
5404 20567962 21075691 21931814 23087475 24575323 25971100 27738136 29540157 32226964
5396 32226964 35088661 38127655 41608475 45134601 48384992 51515788 53527723 53897586
5388 53897586 53217306 50761715 47443893 43625082 39855683 36039018 32894099 30137809
5380 30137809 28008372 26220100 24875732 23789370 22842281 22183973 21723082 21754162 21980724
5371 21980724 22226343 22639005 23093988 23855935 24560345 25802478 27140301 28756852 29959572
5362 29959572 31320146 32617492 32934320 31613577 29610392 27577272 25042402 22594256
$$ packed form
5421B3942847K157069K352053J468233N99744j58454j060652j508699j760972
5413B6031169j502736j415756j021871q22862n68865n41700K33515J14560O2508
5404B0567962N07729Q56123J155661J487848J395777J767036J802021K686807
5396C2226964K861697L038994L480820L526126L250391L130796K011935L69863
5388E3897586o80280k455591l317822l818811l769399l816665l144919k756290
5380C0137809k129437j788272j344368j086362r47089o58308m60891L1080K26562
5371B1980724K45619M12662M54983P61947P04410J242133J337823J616551J202720
5362B9959572J360574J297346L16828j320743k003185k033120k534870k448146
$$ plain form
5354 22594256 20204926 18483133 17225485 16215159 14962056 14089111 12976034 12373553
5346 12373553 12061147 11530779 10889588 10472490 9943827 9503534 9577295 8819570 8208017 7756980
5336 7756980 7333921 7319280 7383623 6894468 6290994 6108117 5871220 5924374 5865453 5512969
5326 5512969 5467766 5613641 5629056 5582913 5516649 5459122 5184230 4933747 4927690 4911240 4655531
5315 4655531 4555679 4669410 4335329 4254482 4138797 3973948 4321119 4278678 4127490 4092182
5305 4092182 4076912 3758658 3578530 3581247 3631838 3526014 3539867 3763060 3726524 3431861 3491217
5294 3491217 3575492 3678395 3831070 3413346 3149228 3156120 3284665 3067096 3036138 3196488
5284 3196488 2925470 3195913 3249027 3237362 3417681 2979905 2898874 2900922 2556291 2540155 2749860
$$ packed form
5354B2594256k389330j721793j257648j010326j253103q72945j113077o02481
5346A2373553l12406n30368o41191m17098n28663m40293P3761p57725o11553m51037
5336G756980m23059j4641O4343m89155o03474j82877k36897N3154n8921l52484
5326E512969m5203J45875J5415m6143o6264n7527k74892k50483o057j6450k55709
5315D655531r9852J13731l34081q0847j15685j64849L47171m2441j51188l5308
5305D092182j5270l18254j80128K717N0591j05824J3853K23193l6536k94663N9356
5294C491217Q4275J02903J52675m17724k64118O892J28545k17569l0958J60350
5284C196488k71018K70443N3114j1665J80319m37776q1031K048l44631j6136K09705
$$ plain form
5273 2749860 2551880 2583115 2619620 2627718 2673682 2413667 2405019 2461316 2494417 2406096 2349625
5262 2349625 2125463 1898818 2078595 2120989 2078623 2387706 2356499 2327348 2081447 2206685
5252 2206685 2245513 2271076 2084576 1850294 2010046 1895218 2134565 2275397 1881784 1770845
5242 1770845 1626367 1548588 1574604 1858369 2025865 2187269 2174783 1805685 2131785 2005538
5232 2005538 2067349 2169313 2397615 2161741 1885027 1656729 1907670 1711597 1601801 1655360
5222 1655360 1505028 1535608 1602350 1704312 1687376 1652288 1644972 1648788 1674594 1848870 1993536
5211 1993536 1734013 1774388 1980628 1777016 2023850 1913982 1624561 1662833 1694144 1982591
5201 1982591 1956597 1697294 1690968 1897342 1834971 2009038 2024187 2077324 2354404 2022094 2230349
$$ packed form
5273B749860j97980L1235L6505Q098M5964k60015q648N6297L3101q8321n6471
5262B349625k24162k26645J79777M2394m2366L09083l1207k9151k45901J25238
5252B206685L8828K5563j86500k34282J59752j14828K39347J40832l93613j10939
5242A770845j44478p7779K6016K83765J67496J61404j2486l69098L26100j26247
5232B005538O1811J01964K28302k35874k76714k28298K50941j96073j09796N3559
5222A655360j50332L0580O6742J01962j6936l5088p316L816K5806J74276J44666
5211A993536k59523M0375K06240k03612K46834j09868k89421L8272L1311K88447
5201A982591k5994k59303o326K06374o2371J74067J5149N3137K77080l32310K08255
$$ plain form
5190 2230349 2353005 2446041 2243453 1795866 2177244 1956657 2042740 2305683 2239018 2195871
5180 2195871 2442939 2390023 2254318 2373764 2257289 1898841 2075133 2466812 2565546 2554961
5170 2554961 2663461 2678217 2929235 3203667 2814419 2913435 2904225 3042254 2877133 2798446
5160 2798446 2482044 2637479 2719141 2757356 2959271 3095181 3073497 3222944 3104813 2952736
5150 2952736 2886057 3181960 2795730 2787819 2862057 2772123 3101549 3218024 3393581 3320134 3099243
5139 3099243 3162404 3286411 3118410 3252834 3041228 3090895 3310149 3230592 3448290 3207608
5129 3207608 2949425 3089843 3133653 3398503 3614211 3620869 3905238 3932275 4361430 4457022
5119 4457022 4666498 4926376 4768121 4760527 4563592 4313156 4403071 4223035 4169143 4361004
$$ packed form
5190B230349J22656R3036k02588m47587L81378k20587Q6083K62943o6665m3147
5180B195871K47068n2916j35705J19446j16475l58448J76292L91679R8734j0585
5170B554961J08500J4756K51018K74432l89248R9016r210J38029j65121p8687
5160B798446l16402J55435Q1662L8215K01915J35910k1684J49447j18131j52077
5150B952736o6679K95903l86230p911P4238q9934L29426J16475J75557p3447k20891
5139C099243O3161J24007j68001J34424k11606M9667K19254p9557K17698k40682
5129C207608k58183J40418M3810K64850K15708O658K84369K7037M29155R5592
5119D457022K09476K59878j58255p594j96935k50436Q9915j80036n3892J91861
$$ plain form
5109 4361004 4481984 4360926 4281179 4655501 4882901 4807212 4489766 5073645 5387438 5494892
5099 5494892 5788208 6023746 6535487 6876240 7009994 7296843 7778870 8276977 8842560 9669289
5089 9669289 9760694 9807546 9460079 8774850 7949444 7705607 8147481 8305791 8183003 8096737
5079 8096737 8238238 8528520 8406144 8735113 9083264 9076139 9398417 9799590 9835383 10161944
5069 10161944 10676529 11204721 11808345 12272047 12841197 13087919 13854138 14666831 15159907
5060 15159907 15277683 14886105 14746898 14448849 14444117 14141959 14389546 14582418 14972686 15430013
5050 15430013 16100963 16522976 17108503 17905694 18670341 19358251 20063111 21484923 22564689
5041 22564689 23980174 25546450 27028249 28794396 31188189 34205994 36839335 40193969
$$ packed form
5109D361004J20980j21058p9747L74322K27400p5689l17446N83879L13793J07454
5099E494892K93316K35538N11741L40753J33754K86849M82027M98107N65583Q26729
5089I669289R1405M6852l47467o85229q25406k43837M41874J58310j22788q6266
5079H096737J41501K90282j22376L28969L48151p125L22278M01173L5793L26561
5069A0161944N14585N28192O03624M63702N69150K46722P66219Q12693M93076
5060A5159907J17776l91578j39207k98049m732l02158K47587J92872L90268M57327
5050A5430013O70950M22013N85527P97191P64647O87910P04860J421812J079766
5041B2564689J415485J566276J481799J766147K393793L017805K633341L354634
$$ plain form
5033 40193969 44147251 48639995 53440186 58365403 63774703 69722032 76394358 82730187
5025 82730187 88661899 94694180 100490848 104810408 107716769 109000024 108205500 106127771
5017 106127771 103781030 101221175 98909069 96676205 94885831 93775892 93014341 93109196
5009 93109196 93045244 94155315 95330814 95626165 96250970 96352003 95855212 93258490 89426969
5000 89426969 84870755 79832276 74611876 69395561 63862308 58954111 54152919 49566164
4992 49566164 45383211 41632361 38187349 35097664 32593082 30475469 28723673 26919954
4984 26919954 25264811 23955250 22480327 21556656 20685159 19585933 18751809 17862501 17357493
4975 17357493 16699455 16096916 15385266 14564923 14210945 13784411 13282421 12866250 12601656
$$ packed form
5033D0193969L953282M492744M800191M925217N409300N947329O672326O335829
5025H2730187N931712O032281N796668M319560K906361J283255p94524k077729
5017A06127771k346741k559855k312106k232864j790374j109939p61551R4855
5009I3109196o3952J110071J175499K95351O24805J01033m96791k596722l831521
5000H9426969m556214n038479n220400n216315n533253m908197m801192m586755
4992D9566164m182953l750850l445012l089685k504582k117613j751796j803719
4984B6919954j655143j309561j474923r23671q71497j099226q34124q89308n05008
4975A7357493o58038o02539p11650q20343l53978m26534n01990m16171k64594
$$ plain form
4966 12601656 12188639 11924660 11585675 11181652 10790434 10568051 10411016 10199348 9852687
4957 9852687 9350884 9038993 8763888 8417460 8306149 8359716 8238213 7808772 7731278 7708006
4947 7708006 7359247 7333448 7158320 6973701 7111374 6755354 6867867 6684244 6505680 6503338
4937 6503338 6439992 6710134 6625316 6217654 6122532 5786488 5520620 5633012 5323193 5275158
4927 5275158 5190755 5188574 5066450 5110887 5072244 5116585 5428477 5444707 5329758 5099710 4755126
4916 4755126 4928847 5174447 5005449 5409092 5560318 5598554 5631759 5467724 5524400 5641307
4906 5641307 5364169 4897125 5027535 5006831 4917913 4946135 4844473 4633512 4797268 4721072
4896 4721072 4852677 4857536 4874338 4550997 4737910 4964068 4850008 4811391 5028067 5022929 4977041
$$ packed form
4966A2601656m13017k63979l38985m04023l91218k22383j57035k11668l46661
4957I852687n01803l11891k75105l46428j11311N3567j21503m29441p7494k3272
4947G708006l48759k5799j75128j84619J37673l56020J12513j83623j78564k342
4937F503338o3346K70142q4818m07662r5122l36044k65868J12392l09819m8035
4927E275158q4403k181j22124M4437l8643M4341L11892J6230j14949k30048l44584
4916D755126J73721K45600j68998M03643J51226L8236L3205j64035N6676J16907
4906E641307k77138m67044J30410k0704q8918K8222j01662k10961J63756p6196
4896D721072J31605M859J6802l23341J86913K26158j14060l8617K16676n138m5888
$$ plain form
4885 4977041 5410202 5740971 5786415 5940550 6501229 6976218 7689887 8297329 8910830 9956944
4875 9956944 10704733 11806921 13220182 15344725 17753838 20713587 24167020 27152869
4867 27152869 27829745 24818322 21331534 17641842 14288040 11864074 10280263 9240453
4859 9240453 8286693 7489446 6942004 6519519 6270691 5791678 5399615 5078676 4912190 4821995
4849 4821995 4226331 4322351 4295552 4127117 4101776 4046631 3729875 3746924 3882602 3581571
4839 3581571 3288589 3453281 3380800 3165235 3252678 3108284 2952426 2964621 3152739 3110020
4829 3110020 2812921 2724121 2746944 2690879 2585418 2389350 2535472 2735059 2482160 2313882
4819 2313882 2605001 2502782 2684415 2753244 2706088 2563202 2552476 2605232 2402918 2376540
$$ packed form
4885D977041M33161L30769M5444J54135N60679M74989P13669O07442O13501J046114
4875I956944P47789J102188J413261K124543K409113K959749L453433K985849
4867B7152869O76876l011423l486788l689692l353802k423966j583811j039810
4859I240453r53760p97247n47442m22485k48828m79013l92063l20939j66486r0195
4849D821995n95664R6020k6799j68435k5341n5145l16756J7049J35678l01031
4839C581571k92982J64692p2481k15565Q7443j44394j55858J2195J88118m2719
4829C110020k97099q8800K2823n6065j05461j96068J46122J99587k52899j68278
4819B313882K91119j02219J81633O8829m7156j42886j0726N2756k02314k6378
$$ plain form
4809 2376540 2409536 2466554 2408841 2422891 2414889 2219572 2047190 2126448 2278224 2288307 2095638
4798 2095638 2226608 2273424 2236911 2068424 2003442 2124009 2342760 2172917 2064094 1974530
4788 1974530 2065263 2003830 1966634 1933327 2133798 2196193 2039905 1935958 2027925 2244065 2069321
4777 2069321 2008173 1747544 2134888 2566843 2276606 1924219 1732697 1710395 1877415 2048630
4767 2048630 2183815 2277553 2368172 2210904 2100535 2409483 2594996 2592154 2328013 2306958
4757 2306958 2537223 2462407 2329507 2453949 2459974 2414501 2384895 2384442 2541021 2269184 2570974
4746 2570974 2280915 2332694 2412842 2613411 2776141 2785342 2828215 2854372 2699714 2427782 2333464
4735 2333464 2716923 2601704 2604268 2816173 2849310 2758935 2794352 2570015 2365991 2656985
$$ packed form
4809B376540L2996N7018n7713J4050q002j95317j72382P9258J51776J0083j92669
4798B095638J30970M6816l6513j68487o4982J20567K18751j69843j08823q9564
4788A974530R0733o1433l7196l3307K00471O2395j56288j03947R1967K16140j74744
4777B069321o1148k60629L87344M31955k90237l52387j91522k2302J67020J71215
4767B048630J35185R3738R0619j57268j10369L08948J85513k842k64141k1055
4757B306958K30265p4816j32900J24442O025m5473k9606m53J56579k71837L01790
4746B570974k90059N1779Q0148K00569J62730R201M2873K6157j54658k71932r4318
4735B333464L83459j15219K564K11905L3137r0375L5417k24337k04024K90994
$$ plain form
4725 2656985 2812443 2457971 2557689 2655485 2480195 2106201 2050864 2068921 1999049 2108430
4715 2108430 2153785 2036375 1940564 1837795 2059886 2331526 2202837 2305968 1907241 2011837
4705 2011837 2229433 2045574 1800624 2024949 2116994 2057842 2194255 2346019 1990936 1919528
4695 1919528 1872842 2062779 2128402 2039281 1749849 1906523 1958687 2027954 1804324 2143146
4685 2143146 2152901 2242187 2478994 2549003 2473161 2165743 2327364 2365618 2264616 2365777 2376702
4674 2376702 2465208 2351190 2307236 2262693 2184145 2483626 2339383 2275917 2326953 2371993 2292404
4663 2292404 2283559 2130684 2097590 1927811 1900621 2042580 1944424 2093558 2442529 2263526
4653 2263526 2546765 2338053 2560089 2618798 2498770 2608939 2476056 2644078 2637183 2386655
$$ packed form
4725B656985J55458l54472R9718R7796j75290l73994n5337J8057o9872J09381
4715B108430M5355j17410r5811j02769K22091K71640j28689J03131l98727J04596
4705B011837K17596j83859k44950K24325R2045n9152J36413J51764l55083p1408
4695A919528m6686J89937O5623q9121k89432J56674N2164O9267k23630L38822
4685B143146R755Q9286K36807P0009p5842l07418J61621L8254j01002J01161J0925
4674B376702Q8506j14018m3954m4543p8548K99481j44243o3466N1036M5040p9589
4663B292404q845j52875l3094j69779k7190J41959r8156J49134L48971j79003
4653B263526K83239k08712K22036N8709j20028J10169j32883J68022o895k50528
$$ plain form
4643 2386655 2177462 2348369 2795148 2765665 2634711 2809094 2622383 2513377 2492682 2505843
4633 2505843 2444829 2261310 2109452 2117519 2313146 2287695 2122793 2250658 2245296 2560925 2522757
4622 2522757 2540230 2288885 2187846 2163043 2059210 2075282 2481767 2403088 2279050 2238288
4612 2238288 2390989 2329902 2192223 2430310 2539260 2672565 2603874 2392822 2451311 2583384
4602 2583384 2517386 2595555 2283514 2302201 2634567 2439569 2304680 2295297 2575527 2652895 2400380
4591 2400380 2511211 2311222 2514280 2942977 2940602 2680163 2748958 2539744 2852856 2969443
4581 2969443 2765635 2684311 2594829 2852239 3231318 3480346 2986767 2848131 3107530 2919849
4571 2919849 2873175 2963871 2972283 2888481 3317859 3420995 3519795 3386613 3446491 3350861 3139194
$$ packed form
4643B386655k09193J70907M46779k9483j30954J74383j86711j09006k0695J3161
4633B505843o1014j83519j51858Q067J95627k5451j64902J27865n362L15629l8168
4622B522757J7473k51345j01039k4803j03833J6072M06485p8679j24038m0762
4612B238288J52701o1087j37679K38087J08950J33305o8691k11052N8489J32073
4602B583384o5998P8169l12041J8687L32366j94998j34889r383K80230P7368k52515
4591B400380J10831j99989K03058M28697k375k60439O8795k09214L13112J16587
4581B969443k03808q1324q9482K57410L79079K49028m93579j38636K59399j87681
4571B919849m6674R0696Q412q3802M29378J03136R8800j33182N9878r5630k11667
$$ plain form
4560 3139194 3172871 3295072 3578129 3241155 3373829 3374004 3510983 3586420 3345710 3208145
4550 3208145 3327209 3401863 3674906 3569299 3387292 3097163 3318120 3680306 3456941 3349282
4540 3349282 3309890 3481958 3493785 3776891 4048848 3905768 3958204 4136291 4195713 3939037
4530 3939037 4285390 4374347 3943742 4068274 4088209 4220494 4340476 4394073 4205602 4144305
4520 4144305 4147462 4134775 4021536 4537453 4498420 4393912 4669358 4671507 4481746 4597225 4756918
4509 4756918 4736044 5016412 5195673 5220592 5382917 5407773 5454564 5676992 5814686 5753566
4499 5753566 6012411 6175019 6286623 6289872 6190354 6477572 6887052 6801155 6999715 7201736
4489 7201736 7626572 7820466 7953291 7836720 7805154 7957332 8098973 8284713 8485025 8750943
$$ packed form
4560C139194L3677J22201K83057l36974J32674J75J36979P5437k40710j37565
4550C208145J19064P4654K73043j05607j82007k90129K20957L62186k23365j07659
4540C349282l9392J72068J1827K83106K71957j43080N2436J78087N9422k56676
4530C939037L46353Q8957m30605J24532J9935J32285J19982N3597j88471o1297
4520D144305L157j2687j13239N15917l9033j04508K75446K149j89761J15479J59693
4509D756918k0874K80368J79261K4919J62325K4856M6791K22428J37694o1120
4499E753566K58845J62608J11604L249r9518K87218M09480q5897J98560K02021
4489G201736M24836J93894J32825j16571l1566J52178J41641J85740K00312K65918
$$ plain form
4479 8750943 8848645 9184091 9500346 9717943 10045255 10355785 10521173 11061644 11500538 11610254
4469 11610254 11682863 12258767 12716806 13215822 13654445 13946488 14262464 14810716 15597361 16378720
4459 16378720 16834882 17274049 17715724 18521902 19233417 19758441 20519614 21415275 22229217
4450 22229217 23135494 23929702 25024218 25723368 26436450 27306622 28384803 29462144 30706972
4441 30706972 31838773 32680467 34117707 35273826 36646519 37899576 38967504 40547747
4433 40547747 41721986 42565752 43628805 44895965 45935900 47109526 48836109 50876788
4425 50876788 53016376 55552548 57759457 60708057 63975224 67310374 70708882 74348762
4417 74348762 78039324 82305605 86598753 90440350 94275243 97877727 101416794 105507285
$$ packed form
4479H750943R7702L35446L16255K17597L27312L10530J65388N40471M38894J09716
4469A1610254P2609N75904M58039M99016M38623K92043L15976N48252P86645P81359
4459A6378720M56162M39167M41675Q06178P11515N25024P61173Q95661Q13942
4450B2229217R06277P94208J094516O99150P13082Q70172J078181J077341J244828
4441C0706972J131801Q41694J437240J156119J372693J253057J067928J580243
4433D0547747J174239Q43766J063053J267160J039935J173626J726583K040679
4425E0876788K139588K536172K206909K948600L267167L335150L398508L639880
4417G4348762L690562M266281M293148L841597L834893L602484L539067M090491
$$ plain form
4409 105507285 109973466 114693741 119127872 123345741 128624222 133993500 139313038 145524928
4401 145524928 151952718 158560046 165071191 170895275 176125026 180502635 184295014 187204014
4393 187204014 188372690 188092866 186442516 183425124 179044613 173537212 167743950 162024213
4385 162024213 157258961 152307620 148026875 143842804 139009372 133881997 127878305 121027363
4377 121027363 113907759 107323761 101236511 96391860 92639550 90174763 88806259 87737162
4369 87737162 86156366 83298277 79707030 75536896 70993455 66437444 62581773 59134232
4361 59134232 56846475 54350700 52060051 50092909 48272228 46739255 45534597 44290521
4353 44290521 43136732 42413203 41612271 40596001 39583516 38734321 37739728 36524123 35298187
$$ packed form
4409A05507285M466181M720275M434131M217869N278481N369278N319538O211890
4401A45524928O427790O607328O511145N824084N229751M377609L792379K909000
4393A87204014J168676k79824j650350l017392m380511n507401n793262n719737
4385A62024213m765252m951341m280745m184071m833432n127375o003692o850942
4377A21027363p119604o583998o087250m844651l752310k464787j368504j069097
4369H7737162j580796k858089l591247m170134m543441m556011l855671l447541
4361E9134232k287757k495775k290649j967142j820681j532973j204658j244076
4353D4290521j153789p23529q00932j016270j012485q49195r94593j215605j225936
$$ plain form
4344 35298187 34273484 32885595 31433462 30151566 29135809 28329471 27443840 26574712 25723869
4335 25723869 25092100 24598104 23884166 22938284 21933078 21176307 20731443 19651582 19355014
4326 19355014 18786007 17910938 17360380 16876618 16280843 16087213 15684484 15463492 15139721
4317 15139721 14534772 14468505 14294074 13785359 13547908 13499128 13100372 12857426 12722772 12546496
4307 12546496 12798098 12713636 12135255 12216250 11967434 11408046 11406140 11286004 11161181 11583756
4297 11583756 11524590 11200601 10928245 10767695 11064268 11237974 10902561 10768304 10296091 10596435
4287 10596435 10739414 10593320 10475871 10855983 10674648 10407928 10385449 10396573 10222521 10492874
4277 10492874 10476205 10209930 10165961 10717566 10787483 10361516 10253472 10674258 10977421 10826042
$$ packed form
4344C5298187j024703j387889j452133j281896j015757q06338q85631q69128q50843
4335B5723869o31769m93996p13938r45882j005206p56771m44864j079861k96568
4326A9355014n69007q75069n50558m83762n95775j93630m02729k20992l23771
4317A5139721o04949o6267j74431n08715k37451m8780l98756k42946j34654j76276
4307A2546496K51602q4462n78381Q0995k48816n59388j906j20136j24823M22575
4297A1583756n9166l23989k72356j60550K96573J73706l35413j34257m72213L00344
4287A0596435J42979j46094j17449L80112j81335k66720k2479J1124j74052K70353
4277A0492874j6669k66275m3969N51605O9917m25967j08044M20786L03163j51379
$$ plain form
4267 10826042 10855384 11117234 11359575 11139777 10841540 10538213 10611281 10614444 10801629 11024621
4257 11024621 11261303 11059366 11300036 11354688 11657843 11731119 11656909 11854125 12257295 12402000
4247 12402000 12473415 12599490 12862067 13291510 13566601 13681846 14182265 14316845 14583076 14945402
4237 14945402 15502985 15988279 15965501 15990949 16203862 16736534 17100491 17489847 17911331 18603029
4227 18603029 19264440 20146521 21273876 22127455 23157461 24783016 25565065 27257192 28914048
4218 28914048 30464327 32784333 35293667 37522916 39542815 41036502 42237402 42351875
4210 42351875 41730223 40704132 39453564 38294343 37078276 36443064 36164462 35734110 36104777
4201 36104777 36473733 36888357 37711791 38444113 39989224 41410310 43256727 44768533 46954691
$$ packed form
4267A0826042K9342K61850K42341k19798k98237l03327P3068L163J87185K22992
4257A1024621K36682k01937K40670N4652L03155P3276p4210J97216M03170J44705
4247A2402000P1415J26075K62577M29443K75091J15245N00419J34580K66231L62326
4237A4945402N57583M85294k2778K5448K12913N32672L63957L89356M21484O91698
4227A8603029O61411Q82081J127355Q53579J030006J625555P82049J692127J656856
4218B8914048J550279K320006K509334K229249K019899J493687J200900J14473
4210D2351875o21652j026091j250568j159221j216067o35212k78602m30352L70667
4201C6104777L68956M14624Q23434P32322J545111J421086J846417J511806K186158
$$ plain form
4192 46954691 49123024 51546904 54782613 58300842 61983184 66003990 70328897 74278489
4184 74278489 77814839 79316373 79017119 77352796 74718902 71589471 68621850 66370795
4176 66370795 64499487 63801411 63845645 64264681 64997093 66474315 68561586 71013881 74211859
4167 74211859 77658757 82130260 87488238 93501375 100766902 109334862 118998887 129750736
4159 129750736 142342622 157108217 174082864 193335084 214577357 236934860 259223162
4152 259223162 277946247 287745658 285883551 277455771 267290276 259047020 254206761 249708649
4144 249708649 240442582 223711094 201839713 179331096 158254396 140078822 125171828
4137 125171828 113276853 103559709 95581590 88485684 82253486 77116337 72361989 68111312
$$ packed form
4192D6954691K168333K423880L235709L518229L682342M020806M324907L949592
4184G4278489L536350J501534k99254j664323k633894l129431k967621k251055
4176F6370795j871308o98076M4234M19036P32412J477222K087271K452295L197978
4167G4211859L446898M471503N357978O013137P265527Q567960R664025J0751849
4159A29750736J2591886J4765595J6974647J9252220K1242273K2357503K2288302
4152B59223162J8723085R799411j862107q427780j0165495q243256m840259m498112
4144B49708649r266067j6731488k1871381k2508617k1076700j8175574j4906994
4137A25171828j1894975r717144p978119p095906o232198n137149m754348m250677
$$ plain form
4129 68111312 64151075 60878552 57783432 55075196 52819927 50623056 48382900 46826833
4121 46826833 45428433 43813881 42397069 40910464 39767880 38942632 37593635 36403951
4113 36403951 35563423 34997325 34174121 33961542 33261534 32413321 32264093 32059465 32181176
4104 32181176 32151974 32293778 32614483 32631038 33477224 34077658 34964516 35757099 36702602 37899508
4094 37899508 39234035 40778600 42336700 43863727 45081888 45480973 45134348 43466930
4086 43466930 41039535 38760195 36962970 35452914 34035063 32931556 31899250 31534125
4078 31534125 31425217 31412284 31879416 32839510 33504079 34446781 35392603 37027876 38912036
4069 38912036 40595912 42424012 44834450 48059793 51673998 55398902 58875902 60800461
$$ packed form
4129F8111312l960237l272523l095120k708236k255269k196871k240156j556067
4121D6826833j398400j614552j416812j486605j142584q25248j348997j189684
4113C6403951q40528n66098q23204k12579p00008q48213j49228k04628J21711
4104C2181176k9202J41804L20705J6555Q46186O00434Q86858P92583R45503J196906
4094C7899508J334527J544565J558100J527027J218161L99085l46625j667418
4086D3466930k427395k279340j797225j510056j417851j103507j032306l65125
4078C1534125j08908j2933M67132R60094O64569R42702R45822J635273J884160
4069C8912036J683876J828100K410438L225343L614205L724904L477000J924559
$$ plain form
4061 60800461 59957480 56883120 52728292 47550098 42425516 38387800 35103301 32739703
4053 32739703 31012190 29574674 28127285 27073854 26224788 25617396 25605117 25328350 25333228
4044 25333228 25619339 25992783 26185633 26771762 27789649 28798834 29804725 31334495 32501180
4035 32501180 33050308 32698101 31493914 29578965 27202692 24990389 23077889 21151445
4027 21151445 19685496 18505152 17400919 16329676 15509138 15028596 14713211 14187459 13375081
4018 13375081 12763805 12366584 12143874 11835833 11525389 11183253 10967184 10853320 10446727
4009 10446727 10172476 10057077 9851934 9702497 9413488 9297262 8943753 8972210 9163504 9061728
3999 9061728 8928973 8610508 8448692 8592808 8489999 8561807 8586316 8349166 8129848 8141792
$$ packed form
4061F0800461q42981l074360m154828n178194n124582m037716l284499k363598
4053C2739703j727513j437516j447389j053431q49066o07392j2279k76767M878
4044B5333228K86111L73444J92850N86129J017887J009185J005891J529770J166685
4035C2501180N49128l52207j204187j914949k376273k212303j912500j926444
4027B1151445j465949j180344j104233j071243q20538m80542l15385n25752q12378
4018A3375081o11276l97221k22710l08041l10444l42136k16069j13864m06593
4009A0446727k74251j15399k05143j49437k89009j16226l53509K8457J91294j01776
3999I061728j32755l18465j61816J44116j02809P1808K4509k37150k19318J1944
$$ plain form
3989 8141792 8326912 8120145 8212842 8209542 8295410 8383420 8029930 8138899 8427850 8500468 8315088
3978 8315088 8378183 8251662 8367120 8491713 8586516 8791290 8673588 8603175 8571279 8509098
3968 8509098 8021408 7782013 7836228 7693245 7632705 7733087 7874531 7503260 7203718 7164499
3958 7164499 7458771 7604032 7433691 7338232 7269499 7118116 7097528 6999254 7116523 7042657
3948 7042657 7037752 7092913 7233244 7158439 7415464 7631077 7227168 7137633 6925294 7328175
3938 7328175 7280434 7224965 7599102 7626867 7840666 7815116 7864564 7761530 7938526 8202432
3928 8202432 7966529 8043919 8369514 8531650 8598280 9057105 9187247 9322281 9734102 10012926
3918 10012926 10099180 10096887 10681972 11037516 11430249 11802526 12049421 12356076 12344597 12410349
$$ packed form
3989H141792J85120k06767R2697l300Q5868Q8010l53490J08969K88951P2618j85380
3978H315088O3095j26521J15458J24593R4803K04774j17702p0413l1896o2181
3968H509098m87690k39395N4215j42983o0540J00382J41444l71271k99542l9219
3958G164499K94272J45261j70341r5459o8733j51383k0588r8274J17269p3866
3948G042657m905N5161J40331p4805K57025K15613m03909q9535k12339M02881
3938G328175m7741n5469L74137K7765K13799k5550M9448j03034J76996K63906
3928H202432k35903P7390L25595J62136O6630M58825J30142J35034M11821K78824
3918A0012926Q6254k293N85085L55544L92733L72277K46895L06655j1479O5752
$$ plain form
3908 12410349 12771979 13103952 13767185 14448673 14732668 15239946 16360550 17398833 18189551
3899 18189551 19278810 20626686 22187747 24266413 26806817 29633998 32702366 34965429
3891 34965429 34976809 32862585 29616209 26726610 23969203 21562266 19928143 18983229 17728075
3882 17728075 16937030 16348718 15478625 15327085 14984322 15083009 14697663 14651717 14673470 14485089
3872 14485089 14053998 13947495 13714248 13526439 13367521 13399389 13031593 12814243 12715310 12767739
3862 12767739 13152934 13562941 13651341 13844068 13677923 13130981 12745127 12141546 11372196 10825727
3852 10825727 10901298 10808334 10483701 10319530 10405986 10166603 10167045 10256604 10030018 9906180 9856995
3841 9856995 9880537 9883740 9806309 10021671 9880785 9838857 9954848 10100132 9882484 9841329 10164679
$$ packed form
3908A2410349L61630L31973O63233O81488K83995N07278J120604J038283P90718
3899A8189551J089259J347876J561061K078666K540404K827181L068368K263063
3891C4965429J1380k114224l246376k889599k757407k406937j634123r44914j255154
3882A7728075p91045n88312q70093j51540l42763R8687l85346m5946K1753j88381
3872A4485089m31091j06503k33247j87809j58918L1868l67796k17350r8933N2429
3862A2767739L85195M10007Q8400J92727j66145n46942l85854o03581p69350n46469
3852A0825727P5571r2964l24633j64171Q6456k39383M42Q9559k26586j23838m9185
3841I856995K3542L203p7431K15362j40886m1928J15991J45284k17648m1155L23350
$$ plain form
3830 10164679 10456709 10391151 10152818 10374115 10525641 10517232 10564029 10606720 10710951 11155460
3820 11155460 11052810 10842161 11047676 11156434 11353503 11707388 11979250 12173471 12531932
3811 12531932 12477420 12393690 12407385 12800671 13378945 13427694 13568843 13623369 14068876 14351768
3801 14351768 14618636 14975073 15008484 15183723 15756589 15816643 16548672 16869452 16955700 17724813
3791 17724813 18133472 18284488 18703628 19354939 19707379 20209247 20678017 21261294 21787302
3782 21787302 22453328 23245990 24072302 24750192 25849265 26619047 27575576 28613155 29702732
3773 29702732 30796150 32033946 33531770 34850743 36259451 37773162 39436285 41052128
3765 41052128 42933537 44875162 46824314 48724270 50544616 53278207 55474600 58043783
$$ packed form
3830A0164679K92030o5558k38333K21297J51526q409M6797M2691J04231M44509
3820A1155460j02650k10649K05515J08758J97069L53885K71862J94221L58461
3811A2531932n4512q3730J3695L93286N78274M8749J41149N4526M45507K82892
3801A4351768K66868L56437L3411J75239N72866O0054P32029L20780Q6248P69113
3791A7724813M08659J51016M19140O51311L52440N01868M68770N83277N26008
3782B1787302O66026P92662Q26312O77890J099073P69782R56529J037579J089577
3773B9702732J093418J237796J497824J318973J408708J513711J663123J615843
3765D1052128J881409J941625J949152J899956J820346K733591K196393K569183
$$ plain form
3757 58043783 60508438 62738397 65340500 67728148 70244926 73146586 75415194 78049604
3749 78049604 80729862 83051964 85668998 87905746 90419723 93046153 95196914 97184184
3741 97184184 99217678 101344161 103549560 105490995 106928818 108547593 110044534 111345422
3733 111345422 112361107 113252855 113877863 114709514 115285483 115499186 115786538 116054672 116284370
3724 116284370 116340510 116709990 116824401 116627484 116037891 115486538 114524938 113482305 112412387
3715 112412387 111598148 110600851 110026408 108708655 107674772 106959399 105563121 104359075 103095453
3706 103095453 101820449 99972892 98294659 96736666 94855140 93101698 91432240 90015654
3698 90015654 88588683 87359739 85609658 84181969 82814843 81345890 80003866 78516852
$$ packed form
3757E8043783K464655K229959K602103K387648K516778K901660K268608K634410
3749G8049604K680258K322102K617034K236748K513977K626430K150761J987270
3741I7184184K033494K126483K205399J941435J437823J618775J496941J300888
3733A11345422J015685Q91748O25008Q31651N75969K13703K87352K68134K29698
3724A16284370N6140L69480J14411j96917n89593n51353r61600j042633j069918
3715A12412387q14239r97297n74443j317753j033883p15373j396278j204046j263622
3706A03095453j275004j847557j678233j557993j881526j753442j669458j416586
3698I0015654j426971j228944j750081j427689j367126j468953j342024j487014
$$ plain form
3690 78516852 77214240 75791600 74190461 72653496 70849870 69218464 67778921 66000016
3682 66000016 64189077 61918062 60031903 58414187 56531500 54497500 52341804 50961418
3674 50961418 49278939 47715072 46107091 44291735 42611649 40989376 39719638 38119234
3666 38119234 36533181 35540350 34718437 33366203 32658363 31880628 31048538 30398878 30258592
3657 30258592 29914785 29537478 29188117 28776113 28591610 28422002 28433272 28801524 28859191 28203968
3647 28203968 28326117 28475440 28642833 29197778 29287729 29557224 29938611 29917959 30489396 30531464
3637 30531464 30414090 30001002 29731562 29358932 28986233 29116466 28944409 28747079 28885623
3628 28885623 28924042 29131910 29421573 30070030 30356624 30613993 31490422 32427810 33413252 34385835
$$ packed form
3690G8516852j302612j422640j601139j536965j803626j631406j439543j778905
3682F6000016j810939k271015j886159j617716j882687k034000k155696j380386
3674E0961418j682479j563867j607981j815356j680086j622273j269738j600404
3666C8119234j586053r92831q21913j352234p07840p77735q32090o49660j40286
3657C0258592l43807l77307l49361m12004j84503j69608J1270L68252N7667o55223
3647B8203968J22149J49323J67393N54945Q9951K69495L81387k0652N71437M2068
3637C0531464j17374m13088k69440l72630l72699J30233j72057j97330J38544
3628B8885623L8419K07868K89663O48457K86594K57369Q76429R37388R85442R72583
$$ plain form
3618 34385835 35863549 37032820 38649301 40535929 41912334 43750904 45791938 47049792
3610 47049792 47874247 48262171 48032579 47110216 46347042 45307872 44244828 43111763 41956803
3601 41956803 41117961 40752319 40610568 40415773 40332275 40491076 41027132 42002482 42924123 44002450
3591 44002450 45164961 46614456 48210418 49969472 51834386 53852212 55910523 58750115
3583 58750115 61264494 63184862 64271896 64294895 63812081 62753198 60888311 59232058 57948509
3574 57948509 56337369 55198138 54432725 53831508 53547169 53920538 54226767 54755097 55263172
3565 55263172 56218311 57669971 59556585 61687410 63892642 66867021 70101818 73758852
3557 73758852 78184814 83202907 88807031 94893899 101491377 108508043 115739645 122955133
$$ packed form
3618C4385835J477714J169271J616481J886628J376405J838570K041034J257854
3610D7049792Q24455L87924k29592r22363p63174j039170j063044j133065j154960
3601D1956803q38842l65642j41751j94795q3498J58801N36056R75350R21641J078327
3591D4002450J162511J449495J595962J759054J864914K017826K058311K839592
3583E8750115K514379J920368J087034K2999m82814j058883j864887j656253j283549
3574E7948509j611140j139231p65413o01217k84339L73369L06229N28330N08075
3565E5263172R55139J451660J886614K130825K205232K974379L234797L657034
3557G3758852M425962N018093N604124O086868O597478P016666P231602P215488
$$ plain form
3549 122955133 131101148 140090503 149568915 159432028 169603842 178653589 185514050 190191631
3541 190191631 192236390 192005290 190256244 187789787 185430154 182958134 181026943 180064117
3533 180064117 179568484 178413417 177043507 174404876 169591260 162404853 153611030 143463744
3525 143463744 132488702 121644256 111676544 102657889 95048622 88174606 82176796 76791123
3517 76791123 71993847 67961704 64253436 61045869 58368856 55882796 53816352 52103916
3509 52103916 50115043 48551798 46996721 45937756 44564438 43608390 42520098 41561951
3501 41561951 41125646 40483274 39466955 38957217 38496912 37951916 37566596 37617232 37736516
3492 37736516 37039029 36275276 36548148 36348370 35726048 35588661 35867792 35731542 35543437
$$ packed form
3549A22955133Q146015Q989355R478412R863113J0171814R049747O860461M677581
3541A90191631K044759k31100j749046k466457k359633k472020j931191r62826
3533A80064117m95633j155067j369910k638631m813616p186407q793823j0147286
3525A43463744j0975042j0844446r967712r018655p609267o874016n997810n385673
3517G6791123m797276m032143l708268l207567k677013k486060k066444j712436
3509E2103916j988873j563245j555077j058965j373318r56048j088292r58147
3501D1561951m36305o42372j016319n09738m60305n44996l85320N0636J19284
3492C7736516o97487p63753K72872j99778o22322j37387K79131j36250j88105
$$ plain form
3483 35543437 35787421 36145447 36358733 36243781 36667129 36754342 36585552 37258635 37590600 38215716
3473 38215716 38646067 38944869 39765046 40491714 41433418 42289336 43520718 44555388 45618868
3464 45618868 47037624 48229885 49608486 50797456 52075245 53636770 55308670 56961428
3456 56961428 58522561 59935550 61508322 63279266 65077025 67283318 69157643 70695866
3448 70695866 72492022 73944183 74754570 76042203 76846843 77737767 78546987 79215619 79982075
3439 79982075 80882388 81950256 82812321 83202401 84040125 85015211 85870305 86733852 87249287
3430 87249287 87971951 89014368 89907232 90712095 92155192 93736801 95779044 98237379 100579256
3421 100579256 103616855 106606024 109888578 113355728 116792731 120765003 125495707 130080747
$$ packed form
3483C5543437K43984L58026K13286j14952M23348Q7213j68790O73083L31965O25116
3473C8215716M30351K98802Q20177P26668R41704Q55918J231382J034670J063480
3464D5618868J418756J192261J378601J188970J277789J561525J671900J652758
3456E6961428J561133J412989J572772J770944J797759K206293J874325J538223
3448G0695866J796156J452161Q10387J287633Q04640Q90924Q09220O68632P66456
3439G9982075R00313J067868Q62065L90080Q37724R75086Q55094Q63547N15435
3430H7249287P22664J042417Q92864Q04863J443097J581609K042243K458335K341877
3421A00579256L037599K989169L282554L467150L437003L972272M730704M585040
$$ plain form
3413 130080747 134828802 139900841 144467699 150106436 155849769 161770692 168158092 174890364
3405 174890364 181752944 189518089 198163479 206672428 215521213 224478462 233492485 241895204
3397 241895204 249183625 255630347 260495801 264445000 267951664 271694649 275891806 280711994
3389 280711994 286508697 292495950 298580928 303426869 306820595 308478795 308038951 305616207
3381 305616207 302035641 296848106 291105180 285825013 281315875 277624732 274697885 272362407
3373 272362407 270560774 268623432 266514178 264152516 261466957 258530423 255723998 253911487
3365 253911487 252536939 252485497 254175511 257335138 261773529 267253654 273256216 279004207
3357 279004207 283965256 287287922 288297121 287493139 284294827 280039311 275203944 270347908
$$ packed form
3413A30080747M748055N072039M566858N638737N743333N920923O387400O732272
3405A74890364O862580P765145Q645390Q508949Q848785Q957249R014023Q402719
3397B41895204P288421O446722M865454L949199L506664L742985M197157M820188
3389B80711994N796703N987253O084978M845941L393726J658200m39844k422744
3381C05616207l580566n187535n742926n280167m509138l691143k926847k335478
3373B72362407j801633j937342k109254k361662k685559k936534k806425j812511
3365B53911487j374548n1442J690014L159627M438391N480125O002562N747991
3357B79004207M961049L322666J009199q03982l198312m255516m835367m856036
$$ plain form
3349 270347908 265630343 260940221 256810392 253002781 248734172 243637153 236834004 228576325
3341 228576325 218107005 206729268 194631072 181737781 169125106 157257941 146641843
3334 146641843 137169064 128585385 121357376 114939706 109092027 104062710 99694759 95853075
3326 95853075 92241954 89331484 86426359 83644332 81090049 78558468 75814239 73772310
3318 73772310 71341521 68929981 66337421 64102725 62114938 60362212 58375095 56532698
3310 56532698 54712482 52986844 51643496 49885556 48324941 46644766 45279061 43728250
3302 43728250 42505882 40979520 39539385 38397137 37497141 36660570 35339756 34286240
3294 34286240 33345524 32365904 31456085 30497874 29978056 28888446 27858488 27283158 26469873
$$ packed form
3349B70347908m717565m690122m129829l807611m268609n097019o803149q257679
3341B28576325j0469320j1377737j2098196j2893291j2612675j1867165j0616098
3334A46641843r472779q583679p228009o417670n847679n029317m367951l841684
3326I5853075l611121k910470k905125k782027k554283k531581k744229k041929
3318G3772310k430789k411540k592560k234696j987787j752726j987117j842397
3310E6532698j820216j725638j343348j757940j560615j680175j365705j550811
3302D3728250j222368j526362j440135j142248q99996q36571j320814j053516
3294C4286240r40716r79620r09819r58211n19818j089610j029958n75330q13285
$$ plain form
3285 26469873 26001788 25755325 25106220 24643229 24098648 23567428 23210622 22501895 22156983
3276 22156983 21600069 20954476 20650848 20671533 20189977 20038709 19752918 19320576 18840081 18823965
3266 18823965 18325819 18125293 17945216 17628508 17323590 16935434 16302287 15783765 15750445 15146787
3256 15146787 14898455 14614638 14398836 14104619 13516301 13275815 13420955 13249495 12777983
3247 12777983 12293722 12375762 12132088 12050114 11703359 11613777 11564166 11234611 10964380 10397753
3237 10397753 10473550 10762902 10468423 10345177 10035438 9538879 9615998 9933569 10053972 9696627
3227 9696627 9641125 9547684 9256451 9297897 8980938 9125781 8940632 8716147 9216137 8869877
3217 8869877 8593337 8704957 8448051 8464280 8243973 8149587 8289591 8075735 7866628 7472804
$$ packed form
3285B6469873m68085k46463o49105m62991n44581n31220l56806p08727l44912
3276B2156983n56914o45593l03628K0685m81556j51268k85791m32342m80495j6116
3266A8823965m98146k00526j80077l16708l04918l88156o33147n18522l3320o03658
3256A5146787k48332k83817k15802k94217n88318k40486J45140j71460m71512
3247A2777983m84261Q2040k43674q1974l46755q9582m9611l29555k70231n66627
3237A0397753P5797K89352k94479j23246l09739m96559P7119L17571J20403l57345
3227I696627n5502r3441k91233M1446l16959J44843j85149k24485M99990l46260
3217H869877k76540J11620k56906J6229k20307r4386J40004k13856k09107l93824
$$ plain form
3207 7472804 7555624 7657069 7413134 7546329 7418902 7107480 7158044 7049949 7026900 7177727
3197 7177727 6949185 6605030 6648880 6771948 6763300 6695649 6620104 6454172 6272485 6512313
3187 6512313 6624947 6578422 6305636 6139225 6243692 5808843 5860499 6064823 5951827 5805051
3177 5805051 5989020 5822385 6131818 6140889 5784293 6039286 6020194 6083680 5822117 5789735
3167 5789735 5526478 5574287 5636260 5324748 5169798 5293425 5766396 5770608 5278032 5144773
3157 5144773 5325089 5161985 5449876 5654504 5480526 5452648 5382741 5447517 5824133 5678202
3147 5678202 5689941 5723173 5689517 5756988 6036394 5776489 5769833 6164146 6289410 6017511 5973818
3136 5973818 6097780 6170658 6190306 5830825 6113141 6407175 6166738 6210784 5898559 6086633
$$ packed form
3207G472804Q2820J01445k43935J33195j27427l11422N0564j08095k3049J50827
3197G177727k28542l44155M3850J23068q648o7651p5545j65932j81687K39828
3187F512313J12634m6525k72786j66411J04467m34849N1656K04324j12996j46776
3177E805051J83969j66635L09433R071l56596K54993j9092O3486k61563l2382
3167E789735k63257M7809O1973l11512j54950J23627M72971M212m92576j33259
3157E144773J80316j63104K87891K04628j73978k7878o9907O4776L76616j45931
3147E678202J1739L3232l3656O7471K79406k59905o656L94313J25264k71899m3693
3136E973818J23962P2878J9648l59481K82316K94034k40437M4046l12225J88074
$$ plain form
3126 6086633 6714004 6493528 6564862 6231065 6330153 6636636 6602495 6523334 6662460 6474028
3116 6474028 6400772 6299924 6564676 6684693 7025789 7141363 6821707 6663170 6795970 6958281
3106 6958281 7323875 7422656 7383775 7359834 7404628 7460231 7633211 8007652 8401426 8860289
3096 8860289 9148579 9304110 9903659 10502836 10513788 10758742 11136250 11834122 12190680 12821507
3086 12821507 13015350 12548873 11543234 10737167 10095526 9453728 9046972 8698993 8216702
3077 8216702 7571762 7623110 7468949 6949106 7120166 6985280 7206562 7103500 7137227 7598762
3067 7598762 7788330 8035378 8176283 8601123 9120245 9709308 10614721 11615701 12491649
3058 12491649 13321431 14061436 13152220 11981899 10760635 9676902 8746803 7991312 7526563
$$ packed form
3126F086633O27371k20476P1334l33797R9088L06483l4141p9161J39126j88432
3116F474028p3256j00848K64752J20017L41096J15574l19656j58537J32800J62311
3106F958281L65594R8781l8881k3941M4794N5603J72980L74441L93774M58863
3096H860289K88290J55531N99549N99177J0952K44954L77508O97872L56558O30827
3086A2821507J93843m66477j005639q06067o41641o41798m06756l47979m82291
3077H216702o44940N1348j54161n19843J71060j34886K21282j03062L3727M61535
3067G598762J89568K47048J40905M24840N19122N89063R05413J000980Q75948
3058A2491649Q29782P40005r09216j170321j221264j083733r30099p55491m64749
$$ plain form
3049 7526563 7045306 6683009 6743980 6578926 6323464 6364977 6049597 5891033 5476726 5379215
3039 5379215 5334081 5677066 5928198 5721415 5676826 6173780 6339594 6537507 7018604 7336674
3029 7336674 8160967 8101904 7622146 7267182 6639479 6268995 5780010 5378689 4976883 4772893
3019 4772893 4722649 4728054 4260633 4069675 3631953 3719215 3621922 3761555 3911288 3797302
3009 3797302 3513457 3141019 3160030 3567691 3435487 3116372 3316506 3210391 3127459 3002128
2999 3002128 3097971 3015532 2768169 2939783 2902661 2783356 2784467 2827861 2891808 2923393 2770754
2988 2770754 2635490 2760780 2608654 2741808 2556658 2606523 2430908 2373746 2307048 2451644
2978 2451644 2309874 2286687 2318051 2454237 2527194 2370972 2023776 2068002 2425902 2360931
$$ packed form
3049G526563m81257l62297O0971j65054k55462M1513l15380j58564m14307r7511
3039E379215m5134L42985K51132k06783m4589M96954J65814J97913M81097L18070
3029G336674Q24293n9063m79758l54964o27703l70484m88985m01321m01806k03990
3019D772893n0244N405m67421j90958m37722Q7262r7293J39633J49733j13986
3009C797302k83845l72438J9011M07661j32204l19115K00134j06115q2932j25331
2999C002128R5843q2439k47363J71614l7122j19305J111M3394O3947L1585j52639
2988B770754j35264J25290j52126J33154j85150M9865j75615n7162o6698J44596
2978B451644j41770k3187L1364J36186P2957j56222l47196M4226L57900o4971
$$ plain form
2968 2360931 2582988 2328125 2300420 2284848 2456823 2733316 2314267 2260826 2418714 2164218
2958 2164218 2088766 2052230 2081920 2447948 2575512 2231574 2085185 1901384 2054598 1965308
2948 1965308 1857223 2175682 2170992 2158079 2017232 1978248 1899477 1513782 1711735 1661425 1636399
2937 1636399 1768400 1921361 1951448 1653959 1670180 1817923 1782623 1514582 1627690 1423535
2927 1423535 1548533 1821686 1733123 1586317 1775625 1840787 1435875 1239016 1312429 1185510
2917 1185510 1342963 1435343 1432152 1579340 1486914 1746458 1553008 1502673 1567126 1568903 1673468
2906 1673468 1897307 1783553 1994468 2005137 1799539 1875010 1473777 1828151 1803413 1795149
2896 1795149 1536299 1334309 1674979 1797078 1713773 1996491 1880902 1849106 1984181 1607196
$$ packed form
2968B360931K22057k54863k7705j5572J71975K76493m19049n3441J57888k54496
2958B164218p5452l6536K9690L66028J27564l43938j46389j83801J53214q9290
2948A965308j08085L18459m690j2913j40847l8984p8771l85695J97953n0310k5026
2937A636399J32001J52961L0087k97489J6221J47743l5300k68041J13108k04155
2927A423535J24998K73153q8563j46806J89308O5162m04912j96859P3413j26919
2917A185510J57453R2380l191J47188r2426K59544j93450n0335O4453J777J04565
2906A673468K23839j13754K10915J0669k05598P5471m01233L54374k4738q264
2896A795149k58850k01990L40670J22099q3305K82718j15589l1796J35075l76985
$$ plain form
2886 1607196 1627070 1749854 1399225 1750461 1555283 1698988 1627732 1317006 1598352 1605851
2876 1605851 1839425 1735795 2014645 1994943 1880436 1927890 2033408 2071693 2071341 2044869 2125955
2865 2125955 1846209 1663526 1643027 1678122 1510041 1506382 1593474 1885765 1810714 1860589 1940126
2854 1940126 1857839 1789103 1912204 2183401 2188122 2333490 2224088 2008106 2408627 2514672
2844 2514672 2528857 2443075 2134654 2064033 2283238 2602945 2887132 2831006 2779625 2843522 3274649
2833 3274649 3366025 3605633 3893279 3930834 4324444 4001383 4081602 4137993 3696823 3741828
2823 3741828 3429789 3237319 3452656 3201945 3304023 3164116 3266756 3467634 3431184 3264704
2813 3264704 2869628 3135624 3126398 3055267 3413935 3377598 3547926 3798650 4312724 4317625 4436025
$$ packed form
2886A607196J9874J22784l50629L51236j95178J43705p1256l10726K81346P499
2876A605851K33574j03630K78850j9702j14507M7454J05518L8285l52k6472Q1086
2865B125955k79746j82683k0499L5095j68081l659Q7092K92291p5051M9875P9537
2854A940126q2287o8736J23101K71197M721J45368j09402k15982M00521J06045
2844B514672J4185q5782l08421p0621K19205L19707K84187n6126n1381O3897M31127
2833C274649R1376K39608K87646L7555L93610l23061Q0219N6391m41170M5005
2823C741828l12039j92470K15337k50711J02078j39907J02640K00878l6450j66480
2813C264704l95076K65996r226p1131L58668l6337J70328K50724N14074M901J18400
$$ plain form
2802 4436025 4914816 5236168 5549303 6019454 6350661 6545671 6213260 5676269 5391991 4771238
2792 4771238 4302490 4025485 3918971 3769312 3234547 3254867 3267501 3295116 2918539 2935661
2782 2935661 2753825 2828803 2755447 2983163 3008449 2647793 2625366 2800582 2971184 2948007
2772 2948007 3205124 3344635 3512289 3609535 3800823 3725306 3774331 3663526 3610952 3365000
2762 3365000 3169867 3065624 3088497 2613444 2691074 2328136 2434935 2477996 2279421 1891656
2752 1891656 1877351 1885402 1894713 1852976 1738623 1942353 1771181 1761012 1802726 1871002 1736601
2741 1736601 1786794 1456709 1522557 1606936 1570384 1369007 928820 1172448 1420214 1120387
2731 1120387 1290643 1318794 889197 847920 652997 1178398 1565890 1296257 1191529 1202393
$$ packed form
2802D436025M78791L21352L13135M70151L31207J95010l32411n36991k84278o20753
2792D771238m68748k77005j06514j49659n34765K0320J2634K7615l76577J7122
2782B935661j81836P4978p3356K27716K5286l60656k2427J75216J70602k3177
2772B948007K57117J39511J67654R7246J91288p5517M9025j10805n2574k45952
2762C365000j95133j04243K2873m75053P7630l62938J06799M3061j98575l87765
2752A891656j4305Q051R311m1737j14353K03730j71172j0169M1714O8276j34401
2741A736601N0193l30085O5848Q4379l6552k01377m40187K43628K47766k99827
2731A120387J70256K8151m29597m1277j94923N25401L87492k69633j04728J0864
$$ plain form
2721 1202393 1166436 917726 993194 998002 941977 982918 1322086 1158775 802944 600371 680452
2710 680452 813431 741368 1074819 975095 786244 632342 864889 950756 853231 839957 969575
2699 969575 821593 663637 618422 473281 659138 751290 849680 396676 233191 532623
2689 532623 678474 475081 495081 424531 778511 756297 312650 598614 440425 226872
2679 226872 355088 688365 674148 731398 846463 877392 782442 623417 793325 904047
2669 904047 862031 571927 421240 658961 591545 393856 369457 71569 389251 501415
2659 501415 655003 712560 759706 781126 905035 932158 673265 357037 152395 617016
2649 617016 701528 700403 960232 1012044 821707 441070 521823 552883 398091 239584 11531
$$ packed form
2721A202393l5957k48710P5468M808n6025M0941L39168j63311l55831k02573Q0081
2710F80452J32979p2063L33451r9724j88851j53902K32547Q5867r7525j3274J29618
2699I69575j47982j57956m5215j45141J85857R2152R8390m53004j63485K99432
2689E32623J45851k03393K0000p0550L53980k2214m43647K85964j58189k13553
2679B26872J28216L33277j4217N7250J15065L0929r4950j59025J69908J10722
2669I04047m2016k90104j50687K37721o7416j97689k4399k97888L17682J12164
2659E01415J53588N7557M7146K1420J23909K7123k58893l16228k04642M64621
2649F17016Q4512j125K59829N1812j90337l80637Q0753L1060j54792j58507k28053
$$ plain form
2638 11531 -35337 8782 365084 604773 475237 250267 120891 281811 342874 314401 369138
2627 369138 451561 582461 446187 453801 617689 577630 543350 496452 596878 212515 333157
2616 333157 486530 179243 349267 487399 505160 489920 442061 416768 372300 368578 331564
2605 331564 225754 225214 118643 226535 376196 328895 248258 454566 236582 362714 491215
2594 491215 334156 181577 243700 -17460 127991 240940 65305 -43144 11005 95554
2584 95554 137326 182838 147690 299867 396779 310910 459268 253563 220930 719927 774980
2573 774980 587763 254434 425287 179934 144142 209541 3034 210338 420288 569881
2563 569881 476524 492441 228735 -95412 170077 126108 239957 314733 394734 621639 643226
$$ packed form
2638A1531m6868M4119L56302K39689j29536k24970j29376J60920O1063k8473N4737
2627C69138Q2423J30900j36274P614J63888m0059l4280m6898J00426l84363J20642
2616C33157J53373l07287J70024J38132J7761j5240m7859k5293m4468l722l7014
2605C31564j05810n40j06571J07892J49661m7301q0637K06308k17984J26132J28501
2594D91215j57059j52579O2123k61160J45451J12949j75635j08449N4149Q4549
2584I5554M1772M5512l5148J52177R6912q5869J48358k05705l2633M98997N5053
2573G74980j87217l33329J70853k45353l5792O5399k06507K07304K09950J49593
2563E69881r3357J5917k63706l24147K65489m3969J13849P4776Q0001K26905K1587
$$ plain form
2552 643226 305734 103195 443538 53276 127685 105937 554840 544853 305372 271136 525325
2541 525325 686730 423372 455750 218452 175525 152859 152147 -57933 -222128 88389 322699
2530 322699 470149 580236 289940 445977 190447 252468 200743 393804 573230 361668
2520 361668 269900 552977 772823 582436 579119 490363 424744 111279 293844 542609 408396
2509 408396 260935 43175 -9082 103636 116628 266576 570441 441741 476722 519237
2499 519237 517329 348059 647577 647138 246024 319895 341753 335591 154989 -34151 430712
2488 430712 347414 425510 191566 228023 409859 306948 324309 335545 155293 132705 115174
2477 115174 208904 382945 128550 -278233 -309246 -187300 -87900 80390 308498 295656
$$ packed form
2552F43226l37492k02539L40343l90262P4409k1748M48903r987k39481l4236K54189
2541E25325J61405k63358L2378k37298m2927k2666p12k10080j64195L10517K34310
2530C22699J47450J10087k90296J56037k55530O2021n1725J93061J79426k11562
2520C61668r1768K83077K19846j90387l317q8756o5619l13465J82565K48765j34213
2509D08396j47461k17760n2257J12718J2992J49948L03865j28700L4981M2515
2499E19237j908j69270K99518m39m01114P3871K1858o162j80602j89140M64863
2488D30712q3298P8096k33944L6457J81836j02911J7361J1236j80252k2588j7531
2477A15174R3730J74041k54395m06783l1013J21946R9400J68290K28108j2842
$$ plain form
2467 295656 27189 290079 110498 153706 315590 204623 238834 471392 234641 209273
2457 209273 123091 62785 -78589 31750 171750 -55295 -196776 20389 150537 199613
2447 199613 187717 266309 231545 118727 361804 377010 336094 138605 -2216 -59787 248316
2436 248316 295778 307140 300237 139068 162627 97426 206593 95429 67813 274911 326330
2425 326330 519569 623247 480917 350116 -92545 -79219 -141471 -214238 16223 83776
2415 83776 14605 58995 240592 215058 137279 130790 2916 276167 188181 383620 285070
2404 285070 58432 -7507 28620 -43106 112012 308131 293452 26435 -71848 119847 50833
2393 50833 40633 -162874 -108334 64863 -15372 72733 23260 -209826 -135040 -16815 -210781
$$ packed form
2467B95656k68467K62890j79581M3208J61884j10967L4211K32558k36751k5368
2457B09273q6182o0306j41374J10339J40000k27045j41481K17165J30148M9076
2447A99613j1896P8592l4764j12818K43077J5206m0916j97489j40821n7571L08103
2436B48316M7462J1362o903j61169K3559o5201J09167j11164k7616K07098N1419
2425C26330J93239J03678j42330j30801m42661J3326o2252p2767K30461O7553
2415H3776o9171M4390J81597k5534p7779o489j27874K73251q7986J95439r8550
2404B85070k26638o5939L6127p1726J55118J96119j4679k67017r8283J91695o9014
2393E0833j0200k03507N4540J73197q0235Q8105m9473k33086P4786J18225j93966
$$ plain form
2382 -210781 -183175 112283 64446 -68992 305561 486711 396673 444289 450412 281110 5247
2371 5247 272748 -19637 -79141 -208355 -203323 -119493 138063 85556 -6884 271289 329654
2360 329654 247001 334191 352001 364111 345039 158225 -29066 145364 -97219 143778 386286
2349 386286 195295 61099 58682 -113029 -93986 65852 280706 178852 281487 35029
2339 35029 -34364 -201009 -281988 -78114 -61764 -152995 -253916 66630 127004 144465 58215
2328 58215 289172 157828 233789 395961 320588 239573 380214 470149 464420 138783 50888
2317 50888 -94355 -1297 126255 539996 480269 250146 448271 621831 615808 696775 451117
2306 451117 446917 547347 381022 444315 562568 201669 332925 329135 257380 1122 96974
$$ packed form
2382b10781K7606K95458m7837j33438L74553J81150r0038M7616O123j69302k75863
2371E247K67501k92385n9504j29214N032Q3830K57556n2507r2440K78173N8365
2360C29654q2653Q7190J7810J2110j9072j86814j87291J74430k42583K40997K42508
2349C86286j90991j34196k417j71711J9043J59838K14854j01854J02635k46458
2339C5029o9393j66645q0979K03874J6350r1231j00921L20546O0374J7461q6250
2328E8215K30957j31344P5961J62172p5373q1015J40641Q9935n729l25637q7895
2317E0888j45243R3058J27552M13741n9727k30123J98125J73560o023Q0967k45658
2306D51117m200J00430j66325O3293J18253l60899J31256l790p1755k56258R5852
$$ plain form
2295 96974 197889 132457 -167752 -292755 -355099 17609 118826 -183216 -101859 20479
2285 20479 219364 -87699 156847 320640 239716 226242 42923 -101985 74363 301178
2275 301178 625419 410626 212202 -119330 -118057 119247 400157 442634 159235 23340
2265 23340 169398 87131 -136201 12406 212871 21189 33451 314609 121458 66304
2255 66304 96602 475812 540514 94779 184805 -13122 243546 387244 572821 152340
2245 152340 57080 246082 415674 535973 309724 233772 368186 365119 547987 144430
2235 144430 161560 394336 382331 134502 271052 444376 624658 540322 689122 629501
2225 629501 290834 386901 536598 507583 587159 170620 151339 142563 -64228 42715 -245100
$$ packed form
2295I6974J00915o5432l00209j25003o2344L72708J01217l02042Q1357J22338
2285B0479J98885l07063K44546J63793q0924j3474j83319j44908J76348K26815
2275C01178L24241k14793j98424l31532J273K37304K80910M2477k83399j35895
2265B3340J46058q2267k23332J48607K00465j91682J2262K81158j93151n5154
2255F6304L0298L79210O4702m45735R0026j97927K56668J43698J85577m20481
2245A52340r5260J89002J69592J20299k26249p5952J34414l067J82868m03557
2235A44430J7130K32776j2005k47829J36550J73324J80282q4336J48800n9621
2225F29501l38667R6067J49697k9015P9576m16539j9281q776k06791J06943k87815
$$ plain form
2214 -245100 283462 383921 552138 309632 397064 593549 714455 474260 461029 419225
2204 419225 419149 220832 346966 462709 393552 557969 633376 432520 333479 352192 297033
2193 297033 448108 368167 372589 494725 468044 560805 150675 209874 464922 553029 502503
2182 502503 402377 345171 436790 485944 375139 257039 489480 805303 510354 448958
2172 448958 664141 504891 199483 358317 783098 814430 1066993 902847 775164 708396
2162 708396 728674 712165 715630 801885 645779 632437 896669 794952 620997 714666 870448
2151 870448 712370 1044010 1027944 1073494 1055301 1316571 1404508 1296133 1538426 1842958
2141 1842958 2102134 1928393 1677121 1378295 1665160 1645572 1950320 2269839 2013637 1906076
$$ packed form
2214b45100N28562J00459J68217k42506Q7432J96485J20906k40195j3231m1804
2204D19225p6j98317J26134J15743o9157J64417P5407k00856r9041J8713n5159
2193B97033J51075p9941M422J22136k6681R2761m10130N9199K55048Q8107n0526
2182E02503j00126n7206R1619M9154j10805j18100K32441L15823k94949o1396
2172D48958K15183j59250l05408J58834M24781L1332K52563j64146j27683o6768
2162G08396K0278j6509L465Q6255j56106j3342K64232j01717j73955R3669J55782
2151H70448j58078L31640j6066M5550j8193K61270Q7937j08375K42293L04532
2141A842958K59176j73741k51272k98826K86865j9588L04748L19519k56202j07561
$$ plain form
2131 1906076 2052219 1860434 1968047 2212422 2262694 1872512 2182597 2484930 2468264 2292950
2121 2292950 2300072 2503442 2346814 2637082 2581810 2373142 2625369 3250838 2976868 2745464
2111 2745464 3065189 3073688 3249073 3165955 3461453 3531520 3455755 3600169 3886628 4024534
2101 4024534 4292565 4430926 4407631 4216956 4206253 4566713 5288259 5659344 5752593 6213012
2091 6213012 6579166 6780811 6889417 7165449 7651007 8160961 8468759 8879019 9490259 10270581
2081 10270581 11541346 12514751 13865311 15258922 17247289 19136744 21142008 23375671
2073 23375671 26135969 29313046 32832713 36809816 42441851 49132164 57475807 67394878
2065 67394878 80033171 94585299 106417243 100939045 85463023 71469389 56406779
$$ packed form
2131A906076J46143j91785J07613K44375N0272l90182L10085L02333j6666j75314
2121B292950P122K03370j56628K90268n5272k08668K52227O25469k73970k31404
2111B745464L19725Q499J75385q3118K95498P0067p5765J44414K86459J37906
2101D024534K68031J38361k3295j90675j0703L60460P21546L71085R3249M60419
2091F213012L66154K01645J08606K76032M85558N09954L07798M10260O11240P80322
2081A0270581J270765R73405J350560J393611J988367J889455K005264K233663
2073B3375671K760298L177077L519667L977103N632035O690313Q343643R919071
2065F7394878J2638293J4552128J1831944n478198j5476022j3993634j5062610
$$ plain form
2058 56406779 45645395 37907745 32208554 27829518 24857507 22928273 21304090 19945305
2050 19945305 18930222 17718535 16417363 15411513 13955053 12393478 11721451 10967243
2042 10967243 10491380 9742583 9182944 8524409 8158488 7571567 7253433 6810505 6755286 6735578
2032 6735578 6374473 6097600 5881521 5759734 5207915 4818034 4761070 4796897 4640419 4393535
2022 4393535 4428658 4036481 3983580 4038408 3951555 3690589 3616824 3152171 3331884 3391352 2899942
2011 2899942 2699131 2507825 2353685 2093377 2280923 2529061 2450435 2478256 2413081 2364433
2001 2364433 2145346 2196851 1861759 1724014 2046968 1863231 1645071 1671731 1653929 1677218
1991 1677218 1743869 1734740 1671975 1538103 1437601 1226644 1289178 1043661 1221992 1263827 1285426
$$ packed form
2058E6406779j0761384p737650n699191m379036k972011j929234j624183j358785
2050A9945305j015083j211687j301172j005850j456460j561575o72027p54208
2042A0967243m75863p48797n59639o58535l65921n86921l18134m42928n5219j9708
2032F735578l61105k76873k16079j21787n51819l89881n6964L5827j56478k46884
2022D393535L5123l92177n2901N4828q6853k60966p3765m64653J79713N9468m91410
2011B899942k00811j91306j54140k60308J87546K48138p8626K7821o5175m8648
2001B364433k19087N1505l35092j37745L22954j83737k18160K6660j7802K3289
1991A677218O6651r129o2765j33872j00502k10957O2534k45517J78331M1835K1599
$$ plain form
1980 1285426 1515077 1326254 1395257 1335255 1186461 1199194 904858 935742 1167286 850545
1970 850545 834697 564961 559653 712282 694378 592944 1015961 974764 825008 572568 420499
1959 420499 474119 515910 649402 522068 743879 592862 819298 652279 283076 466309
1949 466309 493858 428069 498918 577287 659742 649150 655476 621461 738873 644433 559719 434127
1937 434127 562444 203283 443725 679345 450413 503743 608787 473873 496468 485424
1927 485424 516720 532776 284131 325275 204591 679151 571091 369161 417720 225774
1917 225774 338756 490271 515880 334865 314521 236940 522753 149169 584282 328439
1907 328439 196578 287510 264704 218862 -140321 11903 121826 4746 23603 85564 210508
$$ packed form
1980A285426K29651j88823O9003o0002j48794J2733k94336L0884K31544l16741
1970H50545j5848k69736n308J52629j7904j01434M23017m1197j49756k52440j52069
1959D20499N3620M1791J33492j27334K21811j51017K26436j67019l69203J83233
1949D66309K7549o5789P0849P8369Q2455j0592O326l4015J17412r4440q4714j25592
1937D34127J28317l59161K40442K35620k28932N3330J05044j34914K2595j1044
1927D85424L1296J6056k48645M1144j20684M74560j08060k01930M8559j91946
1917B25774J12982J51515K5609j81015k0344p7581K85813l73584M35113k55843
1907C28439j31861R0932k2806m5842l59183J52224J09923j17080J8857O1961J24944
$$ plain form
1896 210508 180572 157610 417378 151957 63713 23700 -80003 159151 414562 -21475
1886 -21475 -178755 -64887 134203 143035 137774 203876 202317 -110344 -57532 333414 241742
1875 241742 122787 146986 91475 -31282 144211 122396 234268 69353 322628 528774
1865 528774 311647 105391 299244 258527 -154662 -47259 208934 68160 -86343 10189
1855 10189 49987 -45757 -172239 -67202 -33856 -225013 -363475 -235501 499472 425797 19959
1844 19959 161395 54733 -7351 41794 1194 67151 428309 433434 538598 112901 161091
1833 161091 288572 406557 -20661 187053 192810 157997 256761 475422 352785 201917
1823 201917 518509 547644 764457 630605 694385 663251 539552 417993 401896 275612
$$ packed form
1896B10508k9936k2962K59768k65421q8244m0013j03703K39154K55411m36037
1886b1475j57280J13868J99090Q832n261O6102j559l12661N2812L90946r1672
1875B41742j18955K4199n5511j22757J75493k1815J11872j64915K53275K06146
1865E28774k17127k06256J93853m0717m13189J07403K56193j40774j54503R6532
1855A0189L9798r5744j26482J05037L3346j91157j38462J27974P34973p3675m05838
1844A9959J41436j06662o2084M9145m0600O5957L61158N125J05164m25697M8190
1833A61091J27481J17985m27218K07714N757l4813R8764K18661j22637j50868
1823B01917L16592K9135K16813j33852O3780l1134j23699j21559j6097j26284
$$ plain form
1813 275612 42088 168588 -157086 33005 144810 -66195 -39019 72457 -110396 -95038
1803 -95038 -161131 -153168 18649 48967 -38051 -170903 -31395 -169379 -465121 -335484 -119132
1792 -119132 -160594 -343983 -571605 -289778 -135634 120951 74015 -288985 -132209 -13426
1782 -13426 -319039 -142096 -68923 65131 -78475 -123042 -80122 -245807 -353746 -628697
1772 -628697 -241450 42257 -77475 163234 391543 239621 113203 34402 -89027 -65989
1762 -65989 -76363 137551 17598 -190442 318542 276159 66145 -19515 -24159 121640 28991
1751 28991 -9530 35940 79734 -235879 -201399 -246946 -332812 -214690 -257412 -80060 -141396
1740 -141396 -129562 16008 -151389 -151146 -24513 194248 269299 12046 5162 -8842 39052
$$ packed form
1813B75612k33524J26500l25674J90091J11805k11005K7176J11476j82853J5358
1803i5038o6093P963J71817L0318q7018j32852J39508j37984k95742J29637K16352
1792a19132m1462j83389k27622K81827J54144K56585m6936l63000J56776J18783
1782a3426l05613J76943P3173J34054j43606m4567M2920j65685j07939k74951
1772f28697L87247K83707j19732K40709K28309j51922j26418p8801j23429K3038
1762f5989j0374K13914j19953k08040N08984m2383k10014q5660m644J45799r2649
1751B8991l8521M5470M3794l15613L4480m5547q5866J18122m2722J77352o1336
1740a41396J1834J45570j67397K43J26633K18761P5051k57253o884j4004M7894
$$ plain form
1729 39052 172159 11468 -7614 -48511 -213275 -148331 -12374 183740 237846 128323 -95131
1718 -95131 -114439 -83994 12213 184750 -125797 -21245 -128299 -355631 -258884 -263573 -335651
1707 -335651 -97026 680 196375 -79953 -300481 -103123 72254 -8050 -311287 -103393
1697 -103393 -129595 -160949 -155323 -178877 -119331 -115098 158984 283004 211484 199415 -396560
1686 -396560 -255664 12356 -37885 -178049 -215609 55148 -294178 -219053 -151123 -142193 -206041
1675 -206041 -260190 -428649 -422101 -67452 107233 -183202 -180101 -51090 307945 180833 -38236
1664 -38236 15986 -232535 -185137 -388349 -480865 -264968 -120972 -166378 49414 119878 -40216
1653 -40216 172232 22335 -58380 142157 -23528 78627 -138722 -87872 -45124 -109791 92727
$$ packed form
1729C9052J33107j60691j9082m0897j64764O4944J35957J96114N4106j09523k23454
1718i5131j9308L0445R6207J72537l10547J04552j07054k27332R6747m689p2078
1707c35651K38625R7706J95695k76328k20528J97358J75377q0304l03237K07894
1697a03393k6202l1354N626k3554N9546M233K74082J24020p1520j2069n95975
1686c96560J40896K68020n0241j40164l7560K70757l49326P5125O7930Q930o3848
1675b06041n4149j68459O548L54649J74685k90435L101J29011L59035j27112k19069
1664c8236N4222k48521M7398k03212r2516K15897J43996m5406K15792P0464j60094
1653d0216K12448j49897q0715K00537j65685J02155k17349N0850M2748o4667K02518
$$ plain form
1642 92727 -69213 -14576 -103736 -184465 -265412 -346127 -90901 -371054 -69530 86364 47941
1631 47941 42893 -122975 250579 304200 -86929 -42172 -185593 -285075 34014 111205 -250679
1620 -250679 12263 97702 -110970 57866 348346 597807 334429 50920 16572 335998
1610 335998 118203 6351 104674 33002 19490 -163879 -45982 160983 105140 190518 127016
1599 127016 241845 256270 21277 146577 -34871 -124588 -240083 -175139 10844 97605
1589 97605 -75956 -303640 -147653 -262072 -110493 -56796 153814 347300 164545 184273
1579 184273 -6178 50901 37188 79945 475426 138970 -178415 33525 91126 -188305
1569 -188305 16250 -120539 -104399 297405 137183 -119198 -447284 -205138 16950 -128851
$$ packed form
1642I2727j61940N4637q9160q0729q0947q0715K55226k80153L01524J55894l8423
1631D7941n048j65868L73554N3621l91129M4757j43421r9482L19089P7191l61884
1620b50679K62942Q5439k08672J68836K90480K49461k63378k83509l4348L19426
1610C35998k17795j11852R8323p1672j3512j83369J17897K06965n5843Q5378o3502
1599A27016J14829J4425k34993J25300j81448q9717j15495O4944J85983Q6761
1589I7605j73561k27684J55987j14419J51579N3697K10610J93486j82755J9728
1579A84273j90451N7079j3713M2757L95481l36456l17385K11940N7601k79431
1569a88305K04555j36789J6140M01804j60222k56381l28086K42146K22088j45801
$$ plain form
1559 -128851 -185319 -9245 45745 127733 314400 119551 -174566 -118754 -235166 -265396 -372637
1548 -372637 -21395 37106 5651 103145 -112632 -227404 -224666 -186339 -81771 66942 258980
1537 258980 200633 191251 183358 -541364 -749163 -700662 -551379 -385917 -32273 117717 98512
1526 98512 12101 -131150 -62629 -188214 -161757 -83691 69068 -182141 -352488 -229977 -240109
1515 -240109 -296947 -451284 26068 88475 49695 -42438 -67199 -86199 -167470 -10952 337400
1504 337400 187363 -332066 -270797 -179888 47421 -115917 -291809 -378639 -340461 30079
1494 30079 1093 -290907 -432774 -380352 -351360 -248458 -203453 -260537 -11361 -97147 -93323
1483 -93323 10263 -13048 -479035 -251624 -177473 -370515 -188639 -259096 -87642 21113
$$ packed form
1559a28851n6468J76074N4990Q1988J86667j94849k94117N5812j16412l0230j07241
1548c72637L51242N8501l1455R7494k15777j14772K738L8327J04568J48713J92038
1537B58980n8347r382p893p24722k07799M8501J49283J65462L53644J49990j9205
1526I8512q6411j43251O8521j25585K6457P8066J52759k51209j70347J22511j0132
1515b40109n6838j54337M77352O2407l8780r2133k4761j9000q1271J56518L48352
1504C37400j50037n19429O1269R0909K27309j63338j75892q6830L8178L70540
1494C0079k8986k92000j41867N2422K8992J02902M5005n7084K49176q5786L824
1483i3323J03586k3311m65987K27411P4151j93042J81876p0457J71454J08755
$$ plain form
1473 21113 65173 -123561 -159990 -62194 -96807 -97557 -149506 99534 204190 -54557 158421
1462 158421 -60963 -108304 -137806 -106065 47280 -17317 175409 227423 50744 -19938 -76817
1451 -76817 -178032 -252171 -226236 -13908 -234745 -320154 -170615 -83122 -23516 -373778 -535311
1440 -535311 -192318 318428 87539 75344 125586 -84002 -23129 -71745 -267622 120131
1430 120131 4356 -28083 -62419 94834 144285 159398 105518 80416 -7729 -106117 -390009
1419 -390009 -285172 -57297 -35029 213688 -145439 -23780 22500 -389908 -411068 -44915
1409 -44915 -161917 -50026 -82256 -262076 -90991 -183123 -103362 -44334 34735 15107 -140137
1398 -140137 -243254 -394081 -24751 56253 -181175 -202623 -39556 -234978 153061 37514
$$ packed form
1473B1113M4060j88734l6429R7796l4613p50n1949K49040J04656k58747K12978
1462A58421k19384m7341k9502L1741J53345o4597J92726N2014j76679p0682n6879
1451g6817j01215p4139K5935K12328k20837q5409J49539Q7493N9606l50262j61533
1440e35311L42993N10746k30889j2195N0242k09588O0873m8616j95877L87753
1430A20131j15775l2439l4336J57253M9451J5113n3880k5102q8145r8388k83892
1419c90009J04837K27875K2268K48717l59127J21659M6280m12408k1160L66153
1409d4915j17002J11891l2230j79820J71085r2132P9761N9028P9069j9628j55244
1398a40137j03117j50827L69330Q1004k37428k1448J63067j95422L88039j15547
$$ plain form
1388 37514 -70524 4101 148469 60228 -76769 -141367 73216 -77492 -65041 -44731 71013
1377 71013 185743 21549 -60666 -49965 -15061 -30891 172221 -14572 -11038 -284517 -265165
1366 -265165 -323400 -141848 -11783 -124023 55264 97818 94073 -127620 108639 198750 253894
1355 253894 110963 202281 117504 -229119 -276659 -482015 -157414 218339 81108 -77198
1345 -77198 -39400 -12238 37749 -143389 -229495 -8140 35636 93399 -112960 145908 129138
1334 129138 -51031 -24804 243900 323682 81944 -15585 -282259 33169 -185815 -144670
1324 -144670 -149681 -218932 -191023 -49819 -265093 -245829 -170276 -26103 59596 173425 390722
1313 390722 96733 -124603 -104126 -79225 -374702 -236786 -307915 -336089 -115842 -340999
$$ packed form
1388C7514j08038P4625J44368q8241j36997o4598K14583j50708J2451K0310J15744
1377G1013J14730j64194q2215J0701L4904j5830K03112j86793L534k73479J9352
1366b65165n8235J81552J30065j12240J79287M2554l745k21693K36259R0111N5144
1355B53894j42931R1318q4777l46623m7540k05356L24601L75753j37231j58306
1345g7198L7798K7162M9987j81138q6106K21355M3776N7763k06359K58868j6770
1334A29138j80169K6227K68704P9782k41738r7529k66674L15428k18984M1145
1324a44670n011o9251K7909J41204k15274J9264P5553J44173Q5699J13829K17297
1313C90722k93989k21336K0477K4901k95477J37916p1129k8174K20247k25157
$$ plain form
1303 -340999 -471167 -247805 64971 83680 -95252 -369313 63837 -60522 -10523 13617
1293 13617 -314086 -246871 -235545 -27408 239722 -34787 -85193 90065 49773 15659 100564
1282 100564 -119304 -332663 -71299 -390853 -156794 -183144 -298745 -99674 -141479 -26436
1272 -26436 -123317 -268470 -304706 -209370 -171245 106600 17540 -298391 -153809 -430109 -100671
1261 -100671 141800 256371 -186490 -331351 -23403 -78812 -175065 -89263 -31362 -173201
1251 -173201 116298 118046 -240194 30054 -257888 -192011 -41312 -237184 -105950 -155922
1241 -155922 59992 -53784 -276060 -422270 -202906 -185267 -294823 -16743 -60704 -237120
1231 -237120 -62923 -193606 -354178 -122816 -173435 -303047 -309447 -480705 -289115 -8056
$$ packed form
1303c40999j30168K23362L12776J8709j78932k74061M33150j24359M9999K4140
1293A3617l27703O7215J1326K08137K67130k74509n0406J75258m0292l4114Q4905
1282A00564k19868k13359K61364l19554K34059k6350j15601J99071m1805J15043
1272b6436r6881j45153l6236R5336L8125K77845q9060l15931J44582k76300L29438
1261a00671K42471J14571m42861j44861L07948n5409r6253Q5802N7901j41839
1251a73201K89499J748l58240K70248k87942O5877J50699j95872J31234m9972
1241a55922K15914j13776k22276j46210K19364J7639j09556K78080m3961j76416
1231b37120J74197j30683j60572K31362n0619j29612o400j71258J91590K81059
$$ plain form
1221 -8056 -122169 -382837 10376 -16722 -26670 -4811 -289705 2707 -68067 -269116 -219859
1210 -219859 -126002 -2487 -295287 -618905 -622145 -467895 -424235 -164694 -155541 -101228 101795
1199 101795 27848 -14132 -178465 21549 411134 79292 -215241 -416338 -596145 -318409
1189 -318409 -43232 219568 -144541 -200169 -333660 -275148 -172535 109324 289363 292838
1179 292838 164173 105758 413244 283905 137566 -30521 95677 -62416 67289 14434
1169 14434 -4314 -88499 -76891 -458249 -289652 40560 198840 303309 -12306 -67340 -6505
1158 -6505 263392 261689 370167 330906 288027 242965 102834 127916 235856 293051 254611
1147 254611 200634 -129471 -281846 -165744 -38751 -90744 216179 152762 62050 -15566 -216779
$$ packed form
1221h056j14113k60668L93213k7098r948K1859k84894K92412p0774k01049M9257
1210b19859R3857J23515k92800l23618l240J54250M3660K59541R153N4313K03023
1199A01795p3947m1980j64333K00014L89585l31842k94533k01097j79807K77736
1189c18409K75177K62800l64109n5628j33491N8512J02613K81859J80039L475
1179B92838j28665n8415L07486j29339j46339j68087J26198j58093J29705n2855
1169A4434j8748q4185J1608l81358J68597L30212J58280J04469l15615n5034O0835
1158f505K69897j703J08478l9261m2879m5062j40131K5082J07940N7195l8440
1147B54611n3977l30105j52375J16102J26993n1993L06923o3417r0712p7616k01213
$$ plain form
1136 -216779 -258506 -403207 -246226 -215005 -182304 -147013 -1575 -146614 -94776 34508 168050
1125 168050 14774 -182173 -180208 -197535 -290687 -323748 -570604 -394490 -98309 -7228 70545
1114 70545 -18682 14143 -32326 99728 38656 60190 329113 -41946 -154581 251740 159993
1103 159993 -25848 35064 47967 -29131 -62370 -6734 -166391 -24886 -137710 -113049 -153066
1092 -153066 28888 33403 12174 64341 38002 -173735 -133 122173 -20865 -345632 -317419
1081 -317419 -116166 -14280 -52418 320728 165551 -276263 -145528 -104090 -113113 -221366
1071 -221366 -118127 -6225 236680 39387 113251 74220 -28572 -10385 195266 39211
1061 39211 137781 55714 -152295 -228465 -121308 -441032 -449317 -128888 -292120 -485701 -395703
$$ packed form
1136b16779m1727j44701J56981L1221L2701L5291J45438j45039N1838J29284J33542
1125A68050j53276j96947J965j7327r3152l3061k46856J76114K96181R1081P7773
1114G0545q9227L2825m6469J32054o1072K1534K68923l71059j12635M06321r1747
1103A59993j85841O0912J2903p7098l3239N5636j59657J41505j12824K4661m0017
1092a53066J81954M515k1229N2167k6339k11737J73602J22306j43038l24767K8213
1081c17419K01253J01886l8138L73146j55177m41814J30735M1438r023j08253
1071b21366J03239J11902K42905j97293P3864l9031j02792J8187K05651j56055
1061C9211R8570q2067k08009p6170J07157l19724q285L20429j63232j93581Q9998
$$ plain form
1050 -395703 -287037 196846 255441 75966 -3030 12119 71943 72612 -338272 -545194 -302559
1039 -302559 26212 146980 50113 -301158 -213973 -44283 -274068 -366522 -186849 108297
1029 108297 317018 178335 -369116 -39951 9337 82007 138327 224598 41548 -186053
1019 -186053 37752 140877 -159703 -285280 49727 146581 25385 -253707 -166202 22152
1009 22152 256737 6461 -201874 -54963 -71761 -34 106582 361031 130852 3429
999 3429 342012 192179 70348 34761 6242 289319 255364 69417 21588 185051 184693
988 184693 189185 -72098 -146808 -135823 -259973 -251987 -171863 24303 -1010 56844 -130699
977 -130699 -432774 -31958 -119761 -86801 -106280 -212269 -326692 -180603 -3598 -133010
$$ packed form
1050c95703J08666M83883N8595j79475p8996J5149N9824O69m10884k06922K42635
1039c02559L28771J20768r6867l51271Q7185J69690k29785r2454J79673K95146
1029A08297K08721j38683n47451L29165M9288P2670N6320Q6271j83050k27601
1019a86053K23805J03125l00580j25577L35007R6854j21196k79092Q7505J88354
1009B2152K34585k50276k08335J46911j6798P1727J06616K54449k30179j27423
999C429L38583j49833j21831l5587k8519K83077l3955j85947m7829J63463l58
988A84693M492k61283p4710J0985j24150P986Q0124J96166k5313N7854j87543
977a30699l02075M00816q7803L2960j9479j05989j14423J46089J77005j29412
$$ plain form
967 -133010 -166457 -116148 -172164 984 -68365 119284 583420 381708 107127 209706 348510
956 348510 -36789 -31444 -141008 -183897 -363599 -358598 -330444 174959 -113023 21835 44281
945 44281 73159 124780 -79572 -34150 -99458 -207890 -316917 -102562 -104701 -231912 -108199
934 -108199 -100764 -26467 128616 33634 138917 -6373 -143953 -25808 -113325 32780 -214459
923 -214459 -228814 22156 -236288 -58737 11483 57930 -282171 24028 -128578 -337055
913 -337055 -104286 -59446 -59145 214208 220343 7556 -217772 51305 36052 7978 315143
902 315143 134257 -1665 133883 225280 -125699 -446092 -291829 -262386 -95688 282331
892 282331 -13855 -93129 101641 117066 135410 278131 29345 74282 120373 -117907 -14614
$$ packed form
967a33010l3447N0309n6016J73148o9349J87649M64136k01712k74581J02579J38804
956C48510l85299N345j09564m2889j79702N001K8154N05403k87982J34858K2446
945D4281K8878N1621k04352M5422o5308j08432j09027K14355k139j27211J23713
934a08199P435P4297J55083r4982J05283j45290j37580J18145q7517J46105k47239
923b14459j4355K50970k58444J77551P0220M6447l40101L06199j52606k08477
913c37055K32769M4840L01K73353O135k12787k25328K69077j5253k8074L07165
902C15143j80886j35922J35548R1397l50979l20393J54263K9443J66698L78019
892B82331k96186p9274J94770J5425J8344J42721k48786M4937M6091k38280J03293
$$ plain form
881 -14614 -50426 -68283 -153841 -109881 63431 -71243 -254872 -148990 167847 -265666 -185802
870 -185802 -183544 -224746 -262292 -304122 -10311 34394 16836 5285 -51103 44849 142180 -129716
858 -129716 -157293 -148962 -254230 -171627 -99591 -106864 -37924 -28383 18523 48663 152507 -69223
846 -69223 -135480 -44037 104779 -103640 -374757 -319656 -39359 -14234 -59720 -56337 4877
835 4877 -141794 11206 106667 -225903 -297022 38944 -172894 -52896 -114301 -403618 -131984
824 -131984 -316279 -383919 -295734 16977 262200 109244 -127517 -298730 -33827 57680
814 57680 -39765 -14392 -160010 -40912 -75456 59353 259396 269713 211100 74618 159994
803 159994 100081 -68753 -289788 -100771 189492 34311 -4237 -152843 -108060 61048
$$ packed form
881a4614l5812j7857q5558M3960J73312j34674j83629J05882L16837m33513P9864
870a85802K258m1202l7546m1830K93811M4705j7558j1551n6388R5952R7331k71896
858a29716k7577Q331j05268Q2603P2036p273O8940R541M6906L0140J03844k21730
846f9223o6257R1443J48816k08419k71117N5101K80297K5125m5486L383O1214
835D877j46671J53000R5461l32570p1119L35966k11838J19998o1405k89317K71634
824a31984j84295o7640Q8185L12711K45223j52956k36761j71213K64903R1507
814E7680r7445K5373j45618J19098l4544J34809K00043J0317n8613j36482Q5376
803A59994n9913j68834k21035J89017K90263j55181l8548j48606M4783J69108
$$ plain form
793 61048 49273 171940 418170 52503 -241160 -46919 -341391 -94190 280330 -19696
783 -19696 192571 7545 309607 224761 162554 32320 378726 344313 184701 369495 155224
772 155224 354751 452886 143291 232497 162398 36173 -17980 -279929 -101827 -128996 -197936
761 -197936 -110235 73917 -14972 23389 -104060 -414541 16058 272289 -205362 43571
751 43571 101795 -134455 -66130 4490 -87532 -125790 -159864 30478 -189255 -123449 -4035
740 -4035 44616 49566 9224 114263 124347 157339 257098 67631 -22321 -237752 -164915 -99958
728 -99958 -13484 189300 -37690 165799 -52647 -915 79173 -39165 31944 202421 87191
717 87191 126771 -189103 -291886 -181852 127045 -27792 -181488 161405 203916 -183812
$$ packed form
793F1048j1775J22667K46230l65667k93663J94241k94472K47201L74520l00026
783a9696K12267j85026L02062q4846o2207j30234L46406l4413j59612J84794k14271
772A55224J99527R8135l09595Q9206p0099j26225n4153k61949J78102k7169o8940
761a97936Q7701J84152q8889L8361j27449l10481M30599K56231m77651K48933
751D3571N8224k36250O8325P0620r2022l8258l4074J90342k19733O5806J19414
740d035M8651M950m0342J05039J0084L2992R9759j89467q9952k15431P2837O4957
728i9958Q6474K02784k26990K03489k18446N1732Q0088j18338P1109J70477j15230
717H7191L9580l15874j02783J10034L08897j54837j53696L42893M2511l87728
$$ plain form
707 -183812 -264743 -199328 -82249 -221522 -354187 -140221 -11991 225842 151240 -84633
697 -84633 -14735 -32030 -25037 32393 272927 181378 -163914 54108 194695 308797 573066
686 573066 237908 399817 384305 180283 -27210 -310632 -96074 284523 165094 -31454
676 -31454 70567 46406 257955 11959 398995 435629 240105 -63616 -70414 -99846 -42137
665 -42137 -192469 40132 -18317 284550 -119758 -85034 -69620 -165082 -33563 -188693 -146279
654 -146279 -97084 33630 43183 270797 147962 -12837 14406 10590 241544 138378 -81408
643 -81408 -50554 -85165 -16195 -112476 99729 261501 86722 -103937 29705 250681 225966
632 225966 415592 265783 -83750 -116525 -231531 -156111 -290221 -100647 87703 308217
$$ packed form
707a83812q0931O5415J17079j39273j32665K13966J28230K37833p4602k35873
697h4633O9898j7295O993N7430K40534r1549l45292K18022J40587J14102K64269
686E73066l35158J61909j5512k04022k07493k83422K14558L80597j19429j96548
676c1454J02021k4161K11549k45996L87036L6634j95524l03721o798k9432N7709
665d2137j50332K32601n8449L02867m04308L4724J5414r5462J31519j55130M2414
654a46279M9195J30714R553K27614j22835j60799K7243l816K30954j03166k19786
643h1408L0854l4611O8970r6281K12205J61772j74779j90659J33642K20976k4715
632B25966J89626j49809l49533l2775j15006P5420j34110J89574J88350K20514
$$ plain form
622 308217 54951 -395222 -281594 -248795 -229535 121254 87797 199197 255336 321797 -61516
611 -61516 -149287 -148158 -128669 157437 -17813 -126840 176203 278012 93612 61185 314975
600 314975 47405 40893 254533 42354 88923 -33064 63802 -194155 -86455 -10686 -107319
589 -107319 -326162 -188795 -179807 -147424 137689 -17452 300889 455500 14793 88136 -54266
578 -54266 -8632 206980 92830 282546 2784 -233457 -93145 -286200 -117840 -71377
568 -71377 23827 125736 88591 149217 236532 349869 422098 242291 186768 439894 322253
557 322253 202399 296445 313481 -91672 70443 -156477 159106 26040 26368 135147 91714
546 91714 -9144 42259 99386 22098 -215205 155959 368902 34209 -49354 76075 191773
$$ packed form
622C08217k53266m50173J13628L2799J9260L50789l3457J11400N6139O6461l83313
611f1516q7771J129J9489K86106j75250j09027L03043J01809j84400l2427K53790
600C14975k67570o512K13640k12179M6569j21987R6866k57957J07700P5769r6633
589a07319k18843J37367Q988L2383K85113j55141L18341J54611m40707P3343j42402
578e4266M5634K15612j14150J89716k79762k36241J40312j93055J68360M6463
568g1377R5204J01909l7145O0626Q7315J13337P2229j79807n5523K53126j17641
557C22253j19854R4046J7036m05153J62115k26920L15583j33066L28J08779m3433
546I1714j00858N1403N7127p7288k37303L71164K12943l34693q3563J25429J15698
$$ plain form
535 191773 -59069 -121613 -413139 -319739 -289450 -391087 20622 -22084 -221568 133538 207916
524 207916 274403 273897 -79815 2152 300115 482463 458024 120064 196614 252526 307369
513 307369 242826 376894 294031 187979 45606 -6643 72007 132486 90381 33413 -8915
502 -8915 15241 19081 149887 -51251 -259431 47627 215402 -170817 -407717 -245972 3490
491 3490 116083 14178 282114 63212 103502 302702 272244 26448 -142624 -92537 128376
480 128376 211284 -170397 -258220 -152081 4878 71976 274587 337633 143394 60082 -150089
469 -150089 -81956 -199020 159398 65498 -152804 421418 481056 368940 101773 267588
459 267588 413542 75848 118677 -40377 -96539 -74975 -91329 -90249 -193605 66337 400887
$$ packed form
535A91773k50842o2544k91526R3400L0289j01637M11709m2706j99484L55106P4378
524B07916O6487n06l53712Q1967K97963J82348k4439l37960P6550N5912N4843
513C07369o4543J34068q2863j06052j42373n2249P8650O0479m2105n6968m2328
502h915K4156L840J30806k01138k08180L07058J67775l86219k36900J61745K49462
491C490J12593j01905K67936k18902M0290J99200l0458k45796j69072N0087K20913
480A28376Q2908l81681q7823J06139J56959O7098K02611O3046j94239q3312k10171
469a50089O8133j17064L58418r3900k18302N74222N9638j12116k67167J65815
459B67588J45954l37694M2829j59054n6162K1564j6354J080j03356K59942L34550
$$ plain form
448 400887 170110 354814 308249 -41539 -187153 -46896 73512 -212521 -190254 -99804
438 -99804 296939 309326 260075 90628 -57712 -70347 382408 232269 182186 153830 196252
427 196252 84645 18583 227537 112035 255648 159108 125979 94487 -279287 -177057 -43289
416 -43289 -287045 -27385 -155326 -431066 -284199 -407643 95495 437217 325975 313474
406 313474 237804 165064 45893 24281 -101234 -203334 -159325 39432 392343 352509 548375
395 548375 122862 269010 262025 27894 168487 213116 46230 49059 260823 140699 220525
384 220525 159432 311949 438090 354007 -16734 -170295 112980 242031 160714 222321 -106413
373 -106413 -60307 252086 303811 -51872 7748 112230 321556 316621 101493 117499 -8126
$$ packed form
448D00887k30777J84704m6565l49788j45614J40257J20408k86033K2267R0450
438i9804L96743J2387m9251j69447j48340j2635M52755j50139n0083k8356M2422
427A96252j11607o6062K08954j15502J43613r6540l3129l1492l73774J02230J33768
416d3289k43756K59660j27941k75740J46867j23444N03138L41722j11242j2501
406C13474p5670p2740j19171k1612j25515j02100M4009J98757L52911l9834J95866
395E48375m25513J46148o985k34131J40593M4629j66886K829K11764j20124P9826
384B20525o1093J52517J26141q4083l70741j53561K83275J29051q1317O1607l28734
373a06413M6106L12393N1725l55683N9620J04482K09326m935k15128J6006j25625
$$ plain form
362 -8126 74146 145605 -3470 -66658 -226022 22023 262612 212228 160571 152676 353104
351 353104 140415 214427 87323 339315 370719 329237 278870 53816 269456 87347 106455
$$ packed form
362h126Q2272P1459j49075o3188j59364K48045K40589n0384n1657p895K00428
351C53104k12689P4012j27104K51992L1404m1482n0367k25054K15640j82109J9108
$$ [...]
##END NTUPLES=NMR SPECTRUM
##END=
