##TITLE=1H_EC-3254(4-34)
 CDCl3, 8 sc, 
 6.07.2021
##JCAMPDX= 6.0         $$ Bruker NMR JCAMP-DX V2.0
##DATA TYPE= NMR SPECTRUM
##DATA CLASS= NTUPLES
##ORIGIN= UXNMR, Bruker Analytische Messtechnik GmbH
##OWNER= root
$$ XWIN-NMR		Version 3.5
$$ Tue Jul  6 10:06:26 2021 Russian Standard Time (UT+4h)  she@DPX200
##.OBSERVE FREQUENCY= 200.131506
##.OBSERVE NUCLEUS= ^1H
##.ACQUISITION MODE= SIMULTANEOUS
##.ACQUISITION SCHEME= undefined
##.AVERAGES= 8
##.DIGITISER RES= 18
##SPECTROMETER/DATA SYSTEM= spect
##.PULSE SEQUENCE= zg30
##.SOLVENT NAME= CDCl3
##.SHIFT REFERENCE= (INTERNAL, CDCl3, 0, 17.513)
##AUDIT TRAIL= $$ (NUMBER, WHEN, WHO, WHERE, WHAT)
$$ ##TITLE= Audit trail, XWIN-NMR		Version 3.5
$$ ##JCAMPDX= 5.01
$$ ##ORIGIN= Bruker BioSpin GmbH
$$ ##OWNER= she
$$ F:/spectra/data/she/nmr/H-F/1/pdata/1/auditp.txt
$$ ##AUDIT TRAIL=  $$ (NUMBER, WHEN, WHO, WHERE, WHAT)
(   1,<2021-07-06 10:05:00.01 +0400>,<she>,<DPX200>,
      <created by zg, POWCHK disabled, PULCHK disabled
       configuration hash MD5:
       00 E9 B6 7A A2 85 ED C7 34 08 36 98 17 FE 4E 26
       data hash MD5: 16K
       E8 DB 6E 20 D1 05 D4 68 90 FE D0 C6 B3 CB 4F 14>)
(   2,<2021-07-06 10:05:02.95 +0400>,<she>,<DPX200>,
      <Start of raw data processing
       efp BC_mod = 2 LB = 0.24 FT_mod = 6 PKNL = 1 PHC0 = -11915.83 PHC1 = 12.80099 SI = 16K 
       data hash MD5: 16K
       E2 FC 93 1A 0E 8E 95 06 14 B3 9A B3 60 5E 97 9D>)
(   3,<2021-07-06 10:05:22.14 +0400>,<she>,<DPX200>,
      <pk PHC0 = 0.1821126 PHC1 = 0 
       data hash MD5: 16K
       76 3C CD 5D AA EA 28 22 C5 FE 6E 05 4C AB 9E DC>)
(   4,<2021-07-06 10:05:25.23 +0400>,<she>,<DPX200>,
      <abs ABSG = 5 
       data hash MD5: 16K
       0A D1 39 23 60 4F 95 1F 70 83 B6 DF 4A DB 58 32>)
$$ ##END=
$$ 
$$ hash MD5
$$ 77 F4 51 AD C7 C5 FD 3B 6F 27 2E 74 46 C4 95 BF
##$RELAX= 
##$RELAX= 
##$RELAX= 
##$RELAX= 
##$RELAX= 
##$RELAX= 
$$ Bruker specific parameters
$$ --------------------------
##$DU= <F:/spectra>
##$EXPNO= 1
##$NAME= <H-F>
##$PROCNO= 1
##$TYPE= <nmr>
##$USER= <she>
##$AMP= (0..31)
100 100 100 100 100 100 100 100 100 100 100 100 100 100 100 100 100 100 
100 100 100 100 100 100 100 100 100 100 100 100 100 100 
##$AQSEQ= 0
##$AQ_mod= 1
##$AUNM= <au_zg>
##$AUTOPOS= <>
##$BF1= 200.13
##$BF2= 200.13
##$BF3= 200.13
##$BF4= 200.13
##$BF5= 200.13
##$BF6= 200.13
##$BF7= 200.13
##$BF8= 200.13
##$BYTORDA= 1
##$CFDGTYP= 0
##$CFRGTYP= 5
##$CHEMSTR= <none>
##$CNST= (0..31)
1 1 145 1 1 1 1 1 1 1 1 1 1 1 1 1 1 1 1 1 1 1 1 1 1 1 1 1 1 1 1 1 
##$CPDPRG= <>
##$CPDPRG1= <>
##$CPDPRG2= <>
##$CPDPRG3= <>
##$CPDPRG4= <mlev>
##$CPDPRG5= <mlev>
##$CPDPRG6= <mlev>
##$CPDPRG7= <mlev>
##$CPDPRG8= <mlev>
##$CPDPRGB= <>
##$CPDPRGT= <>
##$D= (0..31)
0 1.2 0 0 0 0 0 0 0 0.06 0 0.03 0 0 0 0 0.0002 0 0 0 0 0 0 0 0 0 0 0 0 
0 0 0 
##$DATE= 1625551499
##$DBL= (0..7)
120 120 120 120 120 120 120 120 
##$DBP= (0..7)
150 150 150 150 150 150 150 150 
##$DBP07= 0
##$DBPNAM0= <>
##$DBPNAM1= <>
##$DBPNAM2= <>
##$DBPNAM3= <>
##$DBPNAM4= <>
$$ [...]
##$SUBNAM3= <"">
##$SUBNAM4= <"">
##$SUBNAM5= <"">
##$SUBNAM6= <"">
##$SUBNAM7= <"">
##$SUBNAM8= <"">
##$SUBNAM9= <"">
##$SW= 20.0188882624521
##$SWIBOX= (0..15)
0 0 2 0 0 0 0 0 0 0 0 0 0 0 0 0 
##$SW_h= 4006.41025641026
##$TD= 16384
##$TD0= 1
##$TE= 0
##$TE2= 300
##$TE3= 300
##$TEG= 300
##$TL= (0..7)
0 120 120 120 120 120 120 120 
##$TP= (0..7)
150 150 150 150 150 150 150 150 
##$TP07= 0
##$TPNAME0= <>
##$TPNAME1= <>
##$TPNAME2= <>
##$TPNAME3= <>
##$TPNAME4= <>
##$TPNAME5= <>
##$TPNAME6= <>
##$TPNAME7= <>
##$TPOAL= (0..7)
0.5 0.5 0.5 0.5 0.5 0.5 0.5 0.5 
##$TPOFFS= (0..7)
0 0 0 0 0 0 0 0 
##$TUNHIN= 0
##$TUNHOUT= 0
##$TUNXOUT= 0
##$USERA1= <user>
##$USERA2= <user>
##$USERA3= <user>
##$USERA4= <user>
##$USERA5= <user>
##$V9= 5
##$VALIST= <valist>
##$VCLIST= <CCCCCCCCCCCCCCC>
##$VD= 0
##$VDLIST= <DDDDDDDDDDDDDDD>
##$VPLIST= <PPPPPPPPPPPPPPP>
##$VTLIST= <TTTTTTTTTTTTTTT>
##$WBST= 1024
##$WBSW= 4
##$XGAIN= (0..3)
0 0 0 0 
##$XL= 0
##$YL= 0
##$YMAX_a= 578382
##$YMIN_a= -895351
##$ZGOPTNS= <>
##$ZL1= 120
##$ZL2= 120
##$ZL3= 120
##$ZL4= 120
##$ABSF1= 17.49833
##$ABSF2= -2.520708
##$ABSG= 5
##$ABSL= 3
##$ALPHA= 0
##$AQORDER= 0
##$ASSFAC= 0
##$ASSFACI= 0
##$ASSFACX= 0
##$ASSWID= 0
##$AUNMP= <proc_1d>
##$AZFE= 0.1
##$AZFW= 0.1
##$BCFW= 0
##$BC_mod= 2
##$BYTORDP= 0
##$COROFFS= 0
##$CY= -3
##$DATMOD= 1
##$DC= 0
##$DFILT= <>
##$DTYPP= 0
##$F1P= 0
##$F2P= 0
##$FCOR= 1
##$FTSIZE= 16384
##$FT_mod= 6
##$GAMMA= 0
##$GB= 0
##$INTBC= 1
##$INTSCL= 1.334414e-10
##$ISEN= 128
##$LB= 0.24
##$LEV0= 0
##$LPBIN= 0
##$MAXI= 10000
##$MC2= 0
##$MEAN= 0
##$ME_mod= 0
##$MI= 1.114404
##$NCOEF= 0
##$NC_proc= -6
##$NLEV= 6
##$NOISF1= 3.799351
##$NOISF2= 2.8
##$NSP= 0
##$NTH_PI= 0
##$NZP= 0
##$OFFSET= 17.51299
##$PC= 1
##$PHC0= -11915.65
##$PHC1= 12.80099
##$PH_mod= 1
##$PKNL= yes
##$PPARMOD= 0
##$PSCAL= 0
##$PSIGN= 0
##$REVERSE= no
##$SF= 200.130004329637
##$SI= 16384
##$SIGF1= 3
##$SIGF2= 2
##$SINO= 5.538805
##$SIOLD= 16384
##$SREGLST= <1H.CDCl3>
##$SSB= 0
##$STSI= 16384
##$STSR= 0
##$SW_p= 4006.41025641026
##$SYMM= 0
##$S_DEV= 0
##$TDeff= 16384
##$TDoff= 0
##$TI= <>
##$TILT= no
##$TM1= 0
##$TM2= 0
##$TOPLEV= 0
##$USERP1= <user>
##$USERP2= <user>
##$USERP3= <user>
##$USERP4= <user>
##$USERP5= <user>
##$WDW= 1
##$XDIM= 16384
##$YMAX_p= 398622846
##$YMIN_p= -292843
$$ End of Bruker specific parameters
$$ ---------------------------------
##NTUPLES= NMR SPECTRUM
##VAR_NAME=  FREQUENCY,     SPECTRUM/REAL,   SPECTRUM/IMAG
##SYMBOL=    X,             R,               I
##VAR_TYPE=  INDEPENDENT,   DEPENDENT,       DEPENDENT
##VAR_FORM=  AFFN,          ASDF,            ASDF
##VAR_DIM=   16384,         16384,           16384
##UNITS=     HZ,            ARBITRARY UNITS, ARBITRARY UNITS
##FACTOR=    0.24454680195387, 1,            1
##FIRST=     3504.87495495621, 0,            0
##LAST=      -501.53530145405, 0,            0
##MIN=       -501.53530145405, -292843,      0
##MAX=       3504.87495495621, 398622846,    0
$$ Real data points
##PAGE= N=1
##DATA TABLE= (X++(R..R)), XYDATA
$$ [...]
6117A56573m6232M4226j0356J4019k054J37177j0210r8444L5295q5054L3161o9432
6105I8669M1031p4490m859k6852J6341J339J00288M8455m8670j4906J9122L6339
6093A91807k4741j0665m7012N9563J8728J2900j0951R697p082j4306r4917O2787
6081A45808J6648P364K7582K1547r1831m0459O2814m8485j12219P8626Q5576l7531
6069A15440L2644p0305M6728J4887J4612M5506K0646o7666n8292O7683J16950
6058B78833M8796j42361N6808N8618o8665j6096j7153j0996p8288R4053J22213
6047C25762n8421J08761o4061n360l1401p5353K4916o6852K7485p95q6374J5926
6035A14233P5908K0580J2627L6964m8666M6659j1745j2224Q4752J2976l9209p4016
$$ plain form
6117 156573 110341 154567 144211 158230 156176 293353 283143 184699 219994 134940 168101 98669
6105 98669 139700 65210 60351 33499 49840 51179 151467 199922 151252 136346 155468 191807
6093 191807 167066 156401 109389 168952 187680 200580 189629 199326 192244 177938 83021 145808
6081 145808 162456 169820 197402 218949 127118 86659 149473 100988 -11231 67395 152971 115440
6069 115440 148084 77779 124507 139394 154006 199512 220158 152492 94200 161883 278833
6058 278833 327629 185268 242076 300694 232029 215933 198780 187784 109496 203549 325762
6047 325762 267341 376102 312041 306681 275280 199927 224843 157991 185476 184681 98307 114233
6035 114233 190141 210721 223348 260312 211646 258305 246560 234336 319088 332064 292855 218839
6023B18839j2184J6592K8291k5823R6104j8978p9708j203J5744L1503M3862j09953
6011B03086K6371N5687j7986p6102j54755M0452M6540O3070N7781j29895j7714
6000I6535M1202J8977K5433l0642K5647M4684R4869L8592j96668L8341K7347M2680
5988B66997J5728p92L5618o5561r6905L5677n2583P6652J7856p2858L7000N088
5976B01917K8248J0510J36927n6927J31L2768q863p6380m691o7961j2169J72962
5964C56472k4403l8822n295j5470L3262Q9784o6771l2418m4746O5890N1304P9672
5952D48459l3815n5292P0000O2364J817p2035N8805K6074P3563L5734L0645j13147
5940E33172O9697K5678l476L9692j58128o6070m4362L8831n5916L1175O2636n3128
$$ plain form
6023 218839 206655 223247 251538 225715 321819 302841 223133 221930 237674 269177 313039 203086
6011 203086 229457 285144 267158 191056 36301 76753 123293 186363 244144 114249 96535
6000 96535 137737 156714 182147 151505 177152 221836 316705 355297 158629 196970 224317 266997
5988 266997 282725 281933 317551 251990 155085 190762 138179 214831 232687 159829 196829 201917
5976 201917 230165 240675 377602 320675 320806 353574 344711 268331 263640 195679 183510 356472
5964 356472 332069 293247 287952 272482 305744 395528 328757 296339 251593 317483 368787 448459
5952 448459 414644 359352 429352 491716 493533 421498 480303 506377 579940 615674 646319 533172
5940 533172 602869 628547 625071 664763 506635 440565 396203 435034 379118 410293 472929 419801
5928D19801q0217L7767l2017k0079N2380L7568K341n2520K5925n0959Q270j2703
5916C35557k8894O7440n9003J01401L4275n5969j02165Q4226K0151o4731J74953
5905E07241o0821k7607m7530N0780L8764M810l2102J064l1429J6424J7761L6110
5893D73465n2761l581n4359R2030j45030R9616J19316O0821j01944k14994R4929
5882C67508k6689r2374O8063p9116N0652J68431M034J27036l8480k3796M956K0863
5870E51088k7042n4548K4439k2912O5665k2032q644J38206M4671p1199k3794O1264
5858F55162M0791L131M4976M4513n2799K8684N2194N0337k9459j07667l5172L1146
5846G25837l3226Q5432r505k9283K6310J8712m6500l517Q5965j2406K1687N8046
$$ plain form
5928 419801 339584 377351 345334 325255 377635 415203 417544 365024 390949 339990 348260 335557
5916 335557 306663 374103 315100 416501 450776 394807 292642 376868 397019 332288 507241
5905 507241 446420 418813 371283 422063 460827 465637 433535 434599 403170 419594 437355 473465
5893 473465 420704 417123 362764 454794 309764 409380 528696 589517 487573 272579 367508
5882 367508 340819 248445 316508 237392 288044 456475 460509 587545 549065 525269 530225 551088
5870 551088 524046 469498 493937 471025 536690 514658 506014 644220 688891 617692 593898 655162
5858 655162 695953 699084 744060 788573 735774 764458 816652 866989 837530 729863 694691 725837
5846 725837 692611 778043 768538 739255 765565 784277 737777 734260 820225 807819 829506 887552
5834H87552j02085p3044J3700m463o7370L6405Q3762q3557q3529K5594l2328R1524
5822F92161j48468N9406O412l1377K9267j9092M6284L5740k9585Q5386n5431q8774
5810E81929k4605J1891J0554M7918N0825r5835l3497N6340K3703n7901l1818l5309
5798E04195R9331N5801k991r7782M9923q3889P8747J9492J6299N1543l9332O45
5786F51982K7691n3170j3357R8353m9921O9049N8422j4887j9533m9130O4826q6481
5774F83844K7109N6612m2011m5135K9797J1471j52984K0693K6192q1023J09441
5763F44006J732j0974k9362K5651O2336r547j1315N2277q417m1971O6824n9875
5751F81365J07985p8657j24183N1211j2966L3334n9741p6406k4423R5985J01783
$$ plain form
5834 887552 785467 712423 726123 721660 654290 690695 774457 690900 607371 632965 600637 692161
5822 692161 543693 603099 609511 578134 607401 588309 634593 670333 640748 726134 670703 581929
5810 581929 557324 569215 579769 627687 678512 582677 549180 605520 629223 571322 539504 504195
5798 504195 603526 659327 656336 558554 608477 524588 603335 622827 639126 690669 651337 651982
5786 651982 679673 626503 613146 711499 661578 730627 789049 774162 754629 705499 770325 683844
5774 683844 710953 767565 725554 680419 710216 721687 568703 589396 615588 534565 644006
5763 644006 645738 634764 605402 631053 693389 683842 672527 724804 716387 674416 741240 681365
5751 681365 789350 710693 586510 637721 624755 658089 598348 521942 497519 593504 695287
5740F95287J8014M4051Q0043O1791n4582J4741M7973l3560j05235j469L8352M4736
5728H50142o2021r019L4341p4278q3134J03632J778J29919k2518r934M1559P5986
5716I76453J7849K258l0017Q9951r027l7486R1881J04884j21992M8502J15975
5705A249231j1186l2148j07054M6042J2552N7876M4887k890Q514J79858l236R940
5693A452386L4169M4253J7500J49369j43478q5467J8580J79596J41527L9920P8838
5682A927193P807J74113J78404Q3743J53209J23203J3444J51523J13656l128J3666
5671B936833q3311j68388O3409j1426m6322Q4410n6812n7647J6181M5462k8292
5660B694097M0479N082J73655P1667P0726J63452R7568J02255K92115J77493L11596
$$ plain form
5740 695287 713301 757352 837395 899186 844604 859345 907318 873758 768523 767054 805406 850142
5728 850142 788121 779102 813443 739165 656031 759663 761441 891360 868842 858908 900467 976453
5716 976453 994302 996560 966543 1056494 1047467 1009981 1101862 1206746 1084754 1133256 1249231
5705 1249231 1238045 1205897 1098843 1144885 1157437 1215313 1260200 1257310 1265824 1445682 1442446 1452386
5693 1452386 1486555 1530808 1548308 1697677 1554199 1468732 1487312 1666908 1808435 1848355 1927193
5682 1927193 1935000 2109113 2287517 2371260 2524469 2647672 2661116 2812639 2926295 2923167 2936833
5671 2936833 2853522 2685134 2748543 2737117 2690795 2775205 2718393 2660746 2676927 2722389 2694097
5660 2694097 2734576 2739658 2913313 2984980 3055706 3219158 3316726 3418981 3711096 3888589 4200185
5649D200185K56403J18580J74110J22530K5472k1174j24636j56677k69347k35301
5639D090145j53490j93437j93409j55553R6387j31927j42727q0940l3930o307
5629C094812p6575r583L8822M2682k444N892K8402N5575J11950J22939J26316
5618C538788j26042j2209o206j51267p9790j5021j14945j55616r7390k1097j71164
5607B588041j72014q4662j4224r3624O8349P284j55308J637k1573p61j03143o5451
5595A954551n535l4822j05201N0898L3856k3629M164o9790j31850O073P5201J12936
5583A866852K2986k5732o0747J9981m0645M87L9096J21696l3389K6149M9202m1692
5571A944244m7607p0809R9110P2862k0073j25860Q7124o3232J2807J247P7800
$$ plain form
5649 4200185 4456588 4575168 4749278 4871808 4897280 4876106 4751470 4594793 4325446 4090145
5639 4090145 3936655 3743218 3549809 3394256 3490643 3358716 3215989 3135049 3101119 3094812
5629 3094812 3018237 3008654 3047476 3090158 3087714 3093606 3122008 3177583 3289533 3412472 3538788
5618 3538788 3412746 3400537 3394331 3243064 3163274 3148253 3033308 2877692 2780302 2759205 2588041
5607 2588041 2416027 2331365 2317141 2223517 2291866 2299150 2143842 2145479 2123906 2123145 2020002 1954551
5595 1954551 1949016 1914194 1808993 1859891 1893747 1870118 1874282 1804492 1672642 1678715 1753916 1866852
5583 1866852 1889838 1864106 1803359 1823340 1782695 1783182 1822278 1943974 1910585 1936734 1985936 1944244
5571 1944244 1896637 1825828 1924938 1997800 1977727 1851867 1938991 1875759 1888566 1889813 1967613
5560A967613m4994R1791m7676N1968Q4756p17J08077J0882q164j13234Q650Q8621
5548B197573R6375O500n0874J24618l0466q2230M5285j1446K1168l04K6403J90683
5536B533285N6387j04556r691J33363q2793K42396L3598p015R1468p0877k4896
5525B790669J31345K26656O8141M1642N1284M0569K7835J36931k8654m1941J29776
5514C574253J1522m8049O9500L9219K5812R6049J71603J31832o7305K9024J48511
5503D181971J1900J06830j3776O9007R2830J82192J24361M2450J45682J25613
5493E069060J13989J1169Q3115J47185J21074J86101Q8617J41392J43777J17847
5483F223326J99412J39316J15579K31893J23106L02986J77682L08717K67611J98973
$$ plain form
5560 1967613 1922619 2014410 1966734 2018702 2103458 2102741 2210818 2221700 2213536 2100302 2108952 2197573
5548 2197573 2293948 2300448 2249574 2374192 2343726 2261496 2306781 2295335 2316503 2316199 2342602 2533285
5536 2533285 2589672 2485116 2475425 2608788 2525995 2768391 2801989 2794974 2886442 2815565 2790669
5525 2790669 2922014 3148670 3216811 3258453 3309737 3350306 3378141 3515072 3486418 3444477 3574253
5514 3574253 3585775 3537726 3607226 3646445 3672257 3768306 3939909 4071741 4004436 4033460 4181971
5503 4181971 4193871 4300701 4286925 4355932 4448762 4630954 4755315 4797765 4943447 5069060
5493 5069060 5183049 5194218 5277333 5424518 5545592 5731693 5820310 5961702 6105479 6223326
5483 6223326 6422738 6562054 6677633 6909526 7032632 7335618 7513300 7822017 8089628 8288601
5473H288601L46018L55028M28437O16520O45612O50457P10338O11628Q42495Q48208
5463A4343342Q76922J046166R89466R25989O37574L83209J19653k08193m03596
5454A8710532n99734n71415n23456n85746k20263j86119j07629O0307J78050K26034
5444A6380561M90213M35446N76964P01903P94462J018927J005492J209225J149741
5435B3762934J283254J292778J351809J190458J149513Q44604O44190N02893J0895
5426C2033328k60583m99852o04911j001786q98422q48847q39061o89236o01251
5417B5789379m82459l39792K311J27534K00270M93727O04807Q37265J111143J364236
5407B9708421J539153J775468K152450K225436K556944K755973L146094L188379
$$ plain form
5473 8288601 8634619 8989647 9418084 10034604 10680216 11330673 12041011 12652639 13495134 14343342
5463 14343342 15220264 16266430 17255896 18181885 18819459 19202668 19322321 19114128 18710532
5454 18710532 18110798 17539383 17015927 16430181 16209918 16023799 15916170 15976477 16154527 16380561
5444 16380561 16870774 17306220 17883184 18585087 19379549 20398476 21403968 22613193 23762934
5435 23762934 25046188 26338966 27690775 28881233 30030746 30875350 31519540 32022433 32033328
5426 32033328 31772745 31272893 30667982 29666196 28767774 27918927 27079866 26390630 25789379
5417 25789379 25306920 24967128 24969439 25096973 25297243 25790970 26395777 27233042 28344185 29708421
5407 29708421 31247574 33023042 35175492 37400928 39957872 42713845 45859939 49048318
5399D9048318L147504K682202J882957N13088q91434j924438k686379l106402
5391D8665416k894819k445049k157640j772148j351303p71386n22037k05722K46121
5382C6791433N70268Q03458J131040J521961J900048K446966K644941L042768
5374E0852883L604338L934806L871144M226711M228387L660782K565211Q84307
5366G7828569j017342k843330m173405m912081n126315m793848m495919l791592
5358D6674737l183931k675635k226515j741666j309099r99896n40567m65369m1697
5349C3490362J69779M28847O61332R08340J059428J563002J532266J725464J842897
5340D3381717J632234Q37033r7914j115348k266479k976176l355874l213846k904404
$$ plain form
5399 49048318 52195822 54878024 56760981 57274069 56382635 54458197 51771818 48665416
5391 48665416 45770597 43325548 41167908 39395760 38044457 37273071 36751034 36545312 36791433
5382 36791433 37361701 38165159 39296199 40818160 42718208 45165174 47810115 50852883
5374 50852883 54457221 58392027 62263171 66489882 70718269 74379051 76944262 77828569
5366 77828569 76811227 73967897 69794492 64882411 59756096 54962248 50466329 46674737
5358 46674737 43490806 40815171 38588656 36846990 35537891 34537995 33997428 33532059 33490362
5349 33490362 33660141 34088988 34750320 35658660 36718088 38281090 39813356 41538820 43381717
5340 43381717 45013951 45850984 45753070 44637722 42371243 39395067 36039193 32825347 29920943
5331B9920943k653741k278557j925093j684537j486017j325377j071835j072400
5323A6423386q50612q07303p46455q79994n56853m61481m57484l94935m65264
5314A0803005n12720m47237r8370m10824k83193k59459j60777k48032k72125k98710
5304G811558j85523j4849j82757j75569j94134k03544j68782k40779j84087q8771
5294F172763j19699j50341k07934j10855j09064r1601n8706j44554j73205j30710
5284D876094j26741M0961o977o8452k2491j29678o5342M7866n7845m5755k77389
5273D164251k36024N4598j15766j41774j04344q8979l3252j27564p0649l3597
5263C266900j46687n2645J05631r9488o8303m3934R1852j30728j71901M6452m1850
$$ plain form
5331 29920943 27267202 24988645 23063552 21379015 19892998 18567621 17495786 16423386
5323 16423386 15572774 14765471 14019016 13139022 12582169 12120688 11663204 11268269 10803005
5314 10803005 10290285 9843048 9744678 9333854 9050661 8791202 8630425 8382393 8110268 7811558
5304 7811558 7626035 7611186 7428429 7252860 7058726 6855182 6686400 6445621 6261534 6172763
5294 6172763 6053064 5902723 5694789 5583934 5474870 5383269 5324563 5180009 5006804 4876094
5284 4876094 4749353 4790314 4783337 4714885 4692394 4562716 4497374 4545240 4487395 4441640 4164251
5273 4164251 3928227 3982825 3867059 3725285 3620941 3531962 3498710 3371146 3300497 3266900
5263 3266900 3120213 3067568 3173199 3073711 3005408 2961474 3053326 2922598 2750697 2797149 2755299
5252B755299l6433L9541l8202O9683K3975m5049m5536j86711Q32J62541j01480
5241B598460p307l4041k2182L4790p229o1427l1832J280o8056L0419j35450m4130
5229B253295r3058K5131j18959N8445m489k2106n9640J69144J4910j47369J36
5218B075440Q3993N886r3575j5493q9698m1338Q4100O0614l1548k7372O3837L7253
5206B112099j39267j6025L5833J4640j4059l1256N7967M7563o3245K5742Q4475
5195B114467P3943p5808K3841j5243j07703p7104Q6177n9589r217K9812J5824
5184A999400L892O0691J67301p8732J41042Q820j00258q792n820M5673K0531r2740
5172B161008M4495J7875j08518M5480N6662Q9707l3920m2615j5304n1896J0290
$$ plain form
5252 2755299 2718866 2758407 2720205 2789888 2813863 2768814 2723278 2536567 2537399 2699940 2598460
5241 2598460 2591153 2557112 2534930 2569720 2562491 2501064 2469232 2470512 2402456 2432875 2297425 2253295
5229 2253295 2160237 2185368 2066409 2124854 2120365 2098259 2038619 2207763 2222673 2075304 2075440
5218 2075440 2159433 2165319 2071744 2056251 1966553 1925215 2009315 2069929 2038381 2011009 2074846 2112099
5206 2112099 1972832 1956807 1992640 2007280 1993221 1961965 2019932 2067495 2004250 2029992 2114467
5195 2114467 2188410 2112602 2136443 2121200 2013497 1936393 2022570 1962981 1953764 1983576 1999400
5184 1999400 2003292 2063983 2231284 2152552 2293594 2302414 2202156 2193364 2187544 2233217 2253748 2161008
5172 2161008 2205503 2223378 2114860 2160340 2217002 2306709 2272789 2230174 2214870 2162974 2173264
5161B173264R1722J73212m650J87097J4684Q1778m7316J31132J2101r5174K01644
5150B919494J5120J14508q5361Q2236m7748J28662p5419k2378j16592M754n0237
5139B867039N8783P4774k9483j3375O088J8641P2795k8705j2203J20515K4964
5128C159833R0076N4634J19393k1619K4423l3868K6871j03400j8968Q6852J2466
5117C396693n7m3911k1504J11977Q523O4322J3057q652K628N399J53337J22980
5105C804792P7444M2204p0101K5824J2553N5545l0466O6535J02082M2479J72930
5094D301821L17308J61762R7543k6826R8001j34720r6918J9992P130l8523j58504
5083D548066N9894M4662L5835m8175J42181K08995P5500K4857M2374J78950K9189
$$ plain form
5161 2173264 2264986 2438198 2433548 2620645 2635329 2717107 2669791 2800923 2813024 2717850 2919494
5150 2919494 2934614 3049122 2963761 3045997 2998249 3126911 3051492 3029114 2912522 2917276 2867039
5139 2867039 2925822 3000596 2971113 2957738 2963826 2982467 3055262 3026557 3014354 3134869 3159833
5128 3159833 3249909 3304543 3423936 3402317 3426740 3392872 3419743 3316343 3297375 3384227 3396693
5117 3396693 3396636 3352725 3331221 3443198 3451721 3516043 3529100 3520448 3523076 3528475 3681812 3804792
5105 3804792 3882236 3924440 3854339 3880163 3892716 3948261 3917795 3984330 4086412 4128891 4301821
5094 4301821 4619129 4780891 4878434 4851608 4949609 4814889 4717971 4737963 4745093 4706570 4548066
5083 4548066 4607960 4652622 4688457 4640282 4782463 4991458 5066958 5091815 5134189 5313139 5342328
5072E342328P7497K63343K18533M6955J74322J59517J93003M0227J45046L31236
5062F992007J12398J77385Q6767K71109K01317J14156J05040K50138J15814J97750
5052H623881K19795K86964K86058K51682K95942L76975K10312M12220L81733N45123
5042A1890685M87169M78833M21002N68259N38748O29686Q05617O09589O02403
5033A7031991P16104Q18873R81060R68589J020468J219859J289119J622436J681219
5024B7349718J986572K224934K535659K965662L464333L743641M407526M903294
5016E3581339N277600N959872O604051P112976P477656P445477P316831O984383
5008A07760185O256556N148796L215008Q94422j935998m337779n783341o710977
$$ plain form
5072 5342328 5419825 5683168 5901701 5948656 6122978 6282495 6475498 6515725 6660771 6992007
5062 6992007 7104405 7281790 7368557 7639666 7840983 7955139 8060179 8310317 8426131 8623881
5052 8623881 8843676 9130640 9416698 9668380 9964322 10341297 10551609 10963829 11345562 11890685
5042 11890685 12377854 12856687 13277689 13845948 14384696 15014382 15819999 16429588 17031991
5033 17031991 17748095 18566968 19548028 20516617 21537085 22756944 24046063 25668499 27349718
5024 27349718 29336290 31561224 34096883 37062545 40526878 44270519 48678045 53581339
5016 53581339 58858939 64818811 71422862 78535838 86013494 93458971 100775802 107760185
5008 107760185 114016741 119165537 122380545 123274967 121338969 117001190 111217849 104506872
5000A04506872p228492p342435p257721p293755o855082o412890n858379m923315
4992E1334803m426371l987434l269798l049629k550671k097420j901216j735370
4984B8316894j565838j392230j212953j081972j082377q92082q98373q25984p19380
4975A8645705o83940n86814o60288o17489l81831l74652n27211m06857l35805
4966A4070818m00101m04490k24040k90934k17766l61857k21373j96418k05162
4957A1548677l25848k31890r4491j55627j08585k58210k45027j55623o6667r6517
4947I810192j86138k54494j35685k98270l05303k45077r6696k02718j83978r9161
4937G802672r0466j03418j04899J2200j22759p0458o5614m4919o0123r3400J04542
$$ plain form
5000 104506872 97278380 89935945 82678224 75384469 68529387 62116497 56258118 51334803
4992 51334803 46908432 42920998 39651200 36601571 34050900 31953480 30052264 28316894
4984 28316894 26751056 25358826 24145873 23063901 21981524 21089442 20191069 19365085 18645705
4975 18645705 17961765 17374951 16714663 16097174 15715343 15340691 14813480 14406623 14070818
4966 14070818 13670717 13266227 13042187 12751253 12533487 12171630 11950257 11753839 11548677
4957 11548677 11222829 10990939 10896448 10740821 10632236 10374026 10128999 9973376 9906709 9810192
4947 9810192 9624054 9369560 9233875 8935605 8630302 8385225 8288529 8085811 7901833 7802672
4937 7802672 7712206 7608788 7503889 7516089 7393330 7322872 7257258 7212339 7152216 7058816 7163358
4926G163358j05864j24063R265j10907j44792M2222o6099O8031j3140l0700l4369
4915F652942o9708o7601o8965m921M4718r2190j41941M0551R5453J19017J765
4904F509120J12208P6758J00761N9010J39369K70310J74151L23142K84868K97829
4894H347526N52743M12038N04727M23223M33803K93841K60595J497k46655n02193
4884A0481145o90468n94698m41035m67768l00305j37869j87637j61763m4332j08420
4874G346850k1993p838j36923j56116M1760P6086k6824k0875J12638J2630K5318
4863G244713J59515J02050N3405O2266N8047J04916J91572P5394J73435K09020
4853H434333R8337K18128J45469J96665K25474L20922L50027K98139K18496L00989
$$ plain form
4926 7163358 7057494 6933431 6942696 6831789 6686997 6729219 6663120 6731151 6718011 6687311 6652942
4915 6652942 6583234 6515633 6446668 6441747 6486465 6394275 6252334 6292885 6388338 6507355 6509120
4904 6509120 6621328 6698086 6798847 6857857 6997226 7267536 7441687 7764829 8049697 8347526
4894 8347526 8900269 9312307 9817034 10240257 10674060 10967901 11228496 11229993 10983338 10481145
4884 10481145 9790677 9195979 8754944 8287176 7986871 7849002 7661365 7499602 7455270 7346850
4874 7346850 7324857 7317019 7180096 7023980 7065740 7141826 7115002 7094127 7206765 7219395 7244713
4863 7244713 7404228 7506278 7559683 7621949 7679996 7784912 7976484 8051878 8225313 8434333
4853 8434333 8532670 8750798 8896267 9092932 9318406 9639328 9989355 10287494 10505990 10806979
4843A0806979L52126N39510M54535N49352M64020N38873N70790L20245K72828
4834A4869258M05614O61568N13890P07466R11407J057490J050003J229498J137777
4825B2543971J593216J695426J988396K405442L148262L550676M574780M917361
4817D6417530N585229O383601P608204P754374R301752J1164780J4911204J9686641
4809A28813315K5916628K5903811J7177637q382865k2675220k4638056k9330954
4802A12784296k2437149j5811907j0947619q619096o275635n061669l967476l439293
4794C6224452k490336k417428k135083j927535j683357j699514j117156j303322
4786B1450721r54779p65085q11201r14932n97263o70976o11119p62669p16368
$$ plain form
4843 10806979 11159105 11698615 12153150 12702502 13166522 13705395 14276185 14596430 14869258
4834 14869258 15274872 15936440 16450330 17157796 18069203 19126693 20176696 21406194 22543971
4825 22543971 24137187 25832613 27821009 30226451 33374713 36925389 41500169 46417530
4817 46417530 52002759 58386360 65994564 73748938 83050690 94215470 109126674 128813315
4809 128813315 154729943 180633754 197811391 189428526 166753306 142115250 112784296
4802 112784296 90347147 74535240 63587621 54968525 48692890 43631221 39663745 36224452
4794 36224452 33734116 31316688 29181605 27254070 25570713 23871199 22754043 21450721
4786 21450721 20495942 19730857 18919656 18004724 17407461 16736485 16125366 15362697 14646329
4777A4646329p05093l75399l89843l76360l03999j51827k39961l44217k37931
4768A1521699l26029l40277l83303l37668l10510l71330k39894k31158j13451
4759H868079l45920l16691q0404k74088k42716k71188k68555j19497K6506j08031
4749F867495p5292J715K9676l5123j09178o8755M7175P3346O4156l4132p992p0861
4737F682230j17646k41329j64199o8957l8809n7289j04272k14033r8479q3418
4727E493799j66936r1297N8385k09336r9406j13504k01358r3416p668N3908J05449
4716D728620m1513q628k8273j51920M9525n6231j54866j3884J4791k2167k16758
4705D098696P353p9807j62384m6034r664j98801j47753l3806J42721Q8187m5876
$$ plain form
4777 14646329 13941236 13565837 13175994 12799634 12495635 12343808 12103847 11759630 11521699
4768 11521699 11195670 10855393 10472090 10134422 9823912 9452582 9212688 8981530 8868079
4759 8868079 8522159 8205468 8125064 7850976 7608260 7337072 7068517 6949020 6975526 6867495
4749 6867495 6792203 6793918 6823594 6788471 6679293 6610538 6657713 6731059 6795215 6761083 6753091 6682230
4737 6682230 6564584 6323255 6159056 6090099 6051290 5994001 5889729 5675696 5577217 5493799
4727 5493799 5326863 5235566 5293951 5084615 4985209 4871705 4670347 4576931 4569263 4623171 4728620
4716 4728620 4687107 4678479 4650206 4498286 4547811 4491580 4336714 4322830 4337621 4315454 4098696
4705 4098696 4106049 4026242 3863858 3817824 3808160 3609359 3461606 3427800 3570521 3658708 3612832
4694C612832l4282K979p1727P3394N100N855j3947J225O4447m1715k610M1464
4682C643015R881j06294J8318M5938n2472M5573M5984J28826j2882q0992m3666
4671C641229l3092j55737j72671l4060J01575j4973p5916k4606Q3301J31840R4757
4660C541647M7463J79704P1832J6134r421K6026q4213p7364L1196r6087j3377
4649C633540q6469M2345O6581K0037J851p1916n2252J50606l115K4398J2394n973
4637C732027l8353K437Q8321l1204j36784R3243M0509r2560r577J7873n2729K3831
4625C637034L7892o2932q2185K1196j26954K45J02169L3994Q0552k8445j77446
4614C435120L1215J7903J699J23944J27638n5956j05506K7854l9891j7506n26
$$ plain form
4694 3612832 3578550 3581529 3509802 3583196 3588296 3594151 3580204 3581429 3645876 3604161 3601551 3643015
4682 3643015 3652896 3546602 3564920 3610858 3558386 3603959 3649943 3778769 3765887 3684895 3641229
4671 3641229 3608137 3452400 3279729 3245669 3347244 3332271 3256355 3231749 3315050 3446890 3541647
4660 3541647 3589110 3768814 3840646 3856780 3847359 3873385 3789172 3711808 3743004 3646917 3633540
4649 3633540 3547071 3589416 3655997 3676034 3677885 3605969 3553717 3704323 3701208 3725606 3738000 3732027
4637 3732027 3693674 3696111 3784432 3753228 3616444 3709687 3750196 3657636 3648059 3665932 3613203 3637034
4625 3637034 3674926 3611994 3529809 3551005 3424051 3424296 3526465 3560459 3641011 3612566 3435120
4614 3435120 3466335 3484238 3485937 3609881 3737519 3681563 3576057 3603911 3564020 3546514 3545988
4603C545988k090P0858n1568m3663N3304J9904p9622j6519J9883j12458K1431
4592C425448n6424m7795K1664K785J43539m3790j63980Q0317j9851j34189O8024
4581C275748J61554O0330K149R2070l3941j9948m477P091N7703L4921L5905P3084
4569C742189M7935J14223R5036l3381R4065P7483n3154l7211l3660k6311J17338
4558D104552J5125o0967R4268R1794O2920K00233J6939J2716L432Q7010P7594
4547D705616O2655J06073J45190J55533M8930J14929K39635R7110K26229J22627
4537F024527J12746K78895J10670R0552J87238K49124K5089L0304P4220j1967
4527G171398O6945J41054J38120J23069J25536J63951M05925K31775L13516K55165
$$ plain form
4603 3545988 3543898 3614756 3563188 3519525 3572829 3592733 3513111 3496592 3516475 3404017 3425448
4592 3425448 3369024 3321229 3342893 3345678 3489217 3445427 3281447 3361764 3341913 3207724 3275748
4581 3275748 3437302 3497632 3499781 3591851 3557910 3537962 3533485 3540576 3598279 3633200 3669105 3742189
4569 3742189 3790124 3904347 3999383 3966002 4060067 4137550 4084396 4047185 4013525 3987214 4104552
4558 4104552 4119677 4058710 4152978 4244772 4307692 4507925 4524864 4537580 4541012 4628022 4705616
4547 4705616 4768271 4874344 5019534 5175067 5223997 5338926 5578561 5675671 5901900 6024527
4537 6024527 6137273 6416168 6526838 6617390 6804628 7053752 7078841 7109145 7183365 7171398
4527 7171398 7238343 7379397 7517517 7640586 7766122 7930073 8335998 8567773 8881289 9136454
4517I136454Q5278R4365M2594j5663J52852J55754L3253J90997J47724J64925
4507A0188533L46504K50193L38747L22054L45417M88302L69329L53774M23491
4498A3426344N55170O25326O60133N83319Q50120P68162Q40648P35737O70449
4489A9715408N69003M62767J16984j79526m28909m57732n05748k50129m38956
4480A8603162k96917p4314j7182O7936L47735L02582K76888N42136N56139N89801
4470B0897966N25543N51665M96171O63717P19083O84110O65801O48809N03789
4461B6356654M01736M78393M68624L97052K61074K29421R9681k05101j14688k02106
4451B8170740l44123l09367j94562j12862K4116J24482K74964K68341K84533K48808
$$ plain form
4517 9136454 9221732 9316097 9358691 9343028 9495880 9651634 9684887 9875884 10023608 10188533
4507 10188533 10535037 10785230 11123977 11446031 11791448 12279750 12649079 13002853 13426344
4498 13426344 13981514 14606840 15266973 15850292 16700412 17468574 18309222 19044959 19715408
4489 19715408 20284411 20747178 20864162 20684636 20255727 19797995 19292247 19042118 18603162
4480 18603162 18306245 18231931 18214749 18282685 18630420 18933002 19209890 19752026 20308165 20897966
4470 20897966 21423509 21975174 22471345 23135062 23854145 24538255 25204056 25852865 26356654
4461 26356654 26758390 27236783 27705407 28102459 28363533 28592954 28692635 28487534 28372846 28170740
4451 28170740 27826617 27517250 27322688 27209826 27233942 27358424 27633388 27901729 28186262 28435070
4441B8435070L11474K93159L04439L32451N16353L84466M93064N12617O21787
4432C2204880N52666O17274P95662Q33160R02490J029552J173038J366883J554460
4423D1030065J573610J334451J012349R48874M76775K36501r2502j83968j81855
4414D6154300j67953J45205L70904M61141P98066J076531J412362J683098J819688
4405E3753342K270524K647951K970223L159202L363226L357418L439198L635244
4397G8596328L715938L976571M205268M117711M263229M156854M398173M495997
4389A11926069M764049N354630N622954N990359O180851O439183O096956N589567
4381A57964618M917480L981643K724271J225501o06403k686450m762062o793602
$$ plain form
4441 28435070 28746544 29039703 29344142 29676593 30192946 30577412 31070476 31583093 32204880
4432 32204880 32757546 33374820 34170482 35003642 35906132 36935684 38108722 39475605 41030065
4423 41030065 42603675 43938126 44950475 45899349 46376124 46612625 46520123 46336155 46154300
4414 46154300 45986347 46131552 46502456 46963597 47761663 48838194 50250556 51933654 53753342
4405 53753342 56023866 58671817 61642040 64801242 68164468 71521886 74961084 78596328
4397 78596328 82312266 86288837 90494105 94611816 98875045 103031899 107430072 111926069
4389 111926069 116690118 122044748 127667702 133658061 139838912 146278095 152375051 157964618
4381 157964618 162882098 166863741 169588012 170813513 170207110 167520660 162758598 155964996
4373A55964996q101378q402840p995236p088619n620763m309007l057837k458354
4365A08930962k797487l640445m973987o005199o547929o486294o041641n407420
4357F7030560m465802l780835l191740k838171k409767k119856j774966j625230
4349D4824193j377209j154243j146627r44399q71856r44653j059348j064203j020802
4340C5240853j241252j116801r50154j023366r91106r73935q35424p33372o85185
4331B6690258p22113p28503n14876n18857o74557o49195p35518p98293o52755
4322B0695591n30674o29532m44957o52488m97890m51033m48967m31901l88838
4313A6219311m27149k21694k11732k84385l00519k75253k12497j89158j78407
$$ plain form
4373 155964996 147863618 139460778 131465542 124376923 118756160 114447153 111389316 108930962
4365 108930962 106133475 102493030 97519043 91513844 84965915 78479621 72437980 67030560
4357 67030560 62564758 58783923 55592183 52754012 50344245 48224389 46449423 44824193
4349 44824193 43446984 42292741 41146114 40201715 39329859 38385206 37325858 36261655 35240853
4340 35240853 33999601 32882800 31932646 30909280 29918174 28944239 28108815 27375443 26690258
4331 26690258 25968145 25239642 24724766 24205909 23531352 22882157 22146639 21348346 20695591
4322 20695591 20164917 19535385 19090428 18437940 17940050 17489017 17040050 16608149 16219311
4313 16219311 15792162 15570468 15358736 15074351 14773832 14498579 14286082 14096924 13918517
4304A3918517j12666j34565j06254p4200k58764l15067j85907o9160j50002l1597
4294A2480335k78651j32966k2853k43723p1838l5777N465j61801j23517j18003
4284A1296671p7403j15198L0108Q8515l6523M9821m763R471J77610J37661q9015
4273A1466955M7603J90185J4228n1207j63226r6471O1449m261n9234n0873M2950
4262A1398098n3449O1874J22045J38674O3890J3743J48110J82488J06978l4423
4252A2148028K15658J74770J67153Q3690K41378K09776Q6800K34226J82804K89612
4242A4033895K27225J96567J81877K67385K83562K89461K88966L18971K69816
4233A6357725N37371M11504L49195L95071N36129M29106M79917O33523M68428
$$ plain form
4304 13918517 13805851 13671286 13565032 13490832 13232068 12917001 12731094 12661934 12511932 12480335
4294 12480335 12201684 12068718 12045865 11802142 11730304 11694527 11699992 11538191 11414674 11296671
4284 11296671 11219268 11104070 11134178 11222693 11186170 11235991 11231228 11240699 11418309 11555970 11466955
4273 11466955 11514558 11704743 11718971 11667764 11504538 11408067 11469516 11465255 11406021 11355148 11398098
4262 11398098 11344649 11406523 11528568 11667242 11731132 11744875 11892985 12075473 12182451 12148028
4252 12148028 12363686 12538456 12705609 12789299 13030677 13240453 13327253 13561479 13744283 14033895
4242 14033895 14261120 14457687 14639564 14906949 15190511 15479972 15768938 16087909 16357725
4233 16357725 16895096 17306600 17655795 18050866 18586995 19016101 19496018 20129541 20597969
4224B0597969O77168P75542Q02106J007242J073925J191188J255433J401693J417759
4215C0200025J326270J222278J022428N50709J96087R7716L691j38730J26935
4206C4607409K69242N65350P35454R74882J272481J644370J715753J828577K181853
4197D5795371K370668K793882L268763L726190L969693M431796M821381M945226
4189G6122970M685004L994555K767793J163362l94843j874728l250756l867815
4181G9345542l811377l404721k747283j865077j251679n49244q273O32754R91425
4172F7332067J436027J935371K227769K613786L133030L563649M140722M821690
4164I1204111N493466O177961O572547O466803N491554L499659P52045j842247
$$ plain form
4224 20597969 21275137 22050679 22852785 23860027 24933952 26125140 27380573 28782266 30200025
4215 30200025 31526295 32748573 33771001 34321710 34517797 34615513 34619204 34480474 34607409
4206 34607409 34876651 35442001 36177455 37152337 38424818 40069188 41784941 43613518 45795371
4197 45795371 48166039 50959921 54228684 57954874 61924567 66356363 71177744 76122970
4189 76122970 80807974 84802529 87570322 88733684 88338841 86464113 83213357 79345542
4181 79345542 75534165 72129444 69382161 67517084 66265405 65716161 65707888 66340642 67332067
4172 67332067 68768094 70703465 72931234 75545020 78678050 82241699 86382421 91204111
4164 91204111 96697577 102875538 109448085 115914888 121406442 124906101 125658146 123815899
4156A23815899m185514n162343n384552m981385l743757k588795j473058m36803
4148I5859692O76352J267826K169095L531366M462069N650692O800416P858931
4140A28276439R028093J0451438J1846758J3421952J5725718J8798159K1906663
4133B29455220K4143345K3168807J6234072K658881j2141970k2164030k7393859
4126B33960466k7871383k4776303k0422262j6400974j3044984j0547126q537104
4119A12360330p040424o010110n326333m956323m583262m358976m102398l794784
4111G2187720l273372k773438k460023k116831j938935j790828j670472j444273
4103E4719548j555463j466828j292404j164806q27470p96818o97554l98137k77646
$$ plain form
4156 123815899 119630385 114468042 109083490 104102105 100358348 97769553 96296495 95859692
4148 95859692 96536044 97803870 99972965 103504331 107966400 113617092 120417508 128276439
4140 128276439 137304532 147755970 159602728 173024680 188750398 207548557 229455220
4133 229455220 253598565 276767372 293001444 295660325 283518355 261354325 233960466
4126 233960466 206089083 181312780 160890518 144489544 131444560 120897434 112360330
4119 112360330 105319906 99309796 93983463 89027140 84443878 80084902 75982504 72187720
4111 72187720 68914348 66140910 63680887 61564056 59625121 57834293 56163821 54719548
4103 54719548 53164085 51697257 50404853 49240047 48412577 47615759 46918205 46520068 46242422
4094D6242422l24622l69028k56005p6771n3861o739K12911K54486L47306N28101
4084D6498200N48848P28663O74130M03201l3847l15755p81687r03021j008331
4075D5810401j155491q90249p30295n20753l31522j74046j46726j55888j48592
4066D1556839j45328j54611k73630k57472l50412l70472j25473R4406p6614j64602
4056C9732631l33054l46295j83271k98770P3378K81199L05780L98588L91078M11751
4046D0433015L56669M2579J5216q3514k85457k10647k35164m95887m25665o04709
4036C8506436p35800q06714q47394r36926p32122m85404n53220l89385k89987
4027C2729484k83517l23086k35621r7014K9211J17702K17918L37774M39325O12931
$$ plain form
4094 46242422 45917800 45548772 45292767 45215996 45162135 45155396 45368307 45622793 45970099 46498200
4084 46498200 47047048 47775711 48449841 48853042 48819195 48503440 47721753 46818732 45810401
4075 45810401 44654910 43764661 43034366 42513613 42182091 42008045 41861319 41705431 41556839
4066 41556839 41411511 41256900 40983270 40725798 40375386 40004914 39879441 39973847 39897233 39732631
4056 39732631 39399577 39053282 38870011 38571241 38644619 38925818 39231598 39630186 40021264 40433015
4046 40433015 40789684 40832263 40847479 40763965 40478508 40267861 40032697 39536810 39111145 38506436
4036 38506436 37770636 36963922 36116528 35179602 34447480 33962076 33408856 33019471 32729484
4027 32729484 32445967 32122881 31887260 31790246 31819457 31937159 32155077 32492851 32932176 33545107
4017C3545107O73460P51276O13941M01760M76027J35861j3174k26769n21704n91970
4007C5243815o26031p22821m14305l22645l18288r1176j25594M2577K13890K58622
3997C3138044K99722K72589M43268L32305K89752M47187L76877O19875P36721
3988C6956340Q24683R17483J117763J346995J481700J560743J853847K051145
3980D8110699K358310K848996L260823L647460M330101M966373N534361O293745
3972H1350868O927495P711694Q641420J0083269J2002567J4172807J6238103J6776641
3964A73904864J3363226M934725m743534j1687428j6002362j7224238j5634205
3957A26911048j2988696j0267060p823376o022734m487101l520550k688770k018189
$$ plain form
4017 33545107 34218567 34969843 35583784 35985544 36461571 36597432 36584258 36357489 35835785 35243815
4007 35243815 34617784 33894963 33480658 33158013 32839725 32748549 32622955 32665532 32879422 33138044
3997 33138044 33437766 33710355 34153623 34485928 34775680 35222867 35599744 36219619 36956340
3988 36956340 37781023 38698506 39816269 41163264 42644964 44205707 46059554 48110699
3980 48110699 50469009 53318005 56578828 60226288 64556389 69522762 75057123 81350868
3972 81350868 88278363 95990057 104631477 114714746 126717313 140890120 157128223 173904864
3964 173904864 187268090 192202815 187459281 175771853 159769491 142545253 126911048
3957 126911048 113922352 103655292 95831916 89809182 85322081 81801531 79112761 77094572
3949G7094572j639495j187881j064601j024459j083332r97328j110087j503193
3941F7484196j659190j692002j892023j935614j924639j988521j785186j660457
3933E2946564j612086j410925j223400j089122r16926q16398p55711p75053o05119
3924D3741824l41802l77591l60735r0870j45612k41426J1702J13262N0866J65891
3914D2525509J75819J50660K23769K85041L07967J60022j6803l41398k25517j80385
3904D3064684j60308J81606L58875L77134M36022N47361L92140M36892M27627
3895D6062033M57682L65554M82790O80750P41643P55782J005554J155260J367569
3886E3074617J542094J697512K038982K224187K263058K450708K174651K249380
$$ plain form
3949 77094572 75455077 74267196 73202595 72178136 71094804 70097476 68987389 67484196
3941 67484196 65825006 64133004 62240981 60305367 58380728 56392207 54607021 52946564
3933 52946564 51334478 49923553 48700153 47611031 46694105 45877707 45121996 44346943 43741824
3924 43741824 43400022 43022431 42661696 42570826 42425214 42183788 42195490 42308752 42359618 42525509
3914 42525509 42701328 42851988 43075757 43360798 43668765 43828787 43811984 43470586 43245069 43064684
3904 43064684 42904376 43085982 43444857 43821991 44258013 44805374 45197514 45634406 46062033
3895 46062033 46519715 46885269 47368059 48048809 48790452 49546234 50551788 51707048 53074617
3886 53074617 54616711 56314223 58353205 60577392 62840450 65291158 67465809 69715189
3878F9715189K515210K483686K367255K013712J342784J225805J333586J728471
3870H4725698K421746L185328M361125N828169P453856R069509J0041023Q553124
3862A35639578L635231l579344q800757j1399731j1830873j0298097q251882o384435
3854G8729690n187542m131961l299112k682563k241210j912542j745209j631890
3846E5897661j214471j299891j027331r20387o82117m38442k07490k78854j16100
3837D9712578j88879k25865k90398k87570j38744M1242J51481L92518N24874P96959
3827E0488196R56714J142771J601520J785386J984764K068065J989527J661038
3819F3677981J439146J431366J196372L23895k314374l164474l352751l571571
$$ plain form
3878 69715189 72230399 74714085 77081340 79095052 80437836 81663641 82997227 84725698
3870 84725698 87147444 90332772 94693897 100522066 107975922 117045431 127086454 135639578
3862 135639578 139274809 135695465 126894708 115494977 103664104 93366007 85114125 78729690
3854 78729690 73542148 69410187 66111075 63428512 61187302 59274760 57529551 55897661
3846 55897661 54683190 53383299 52355968 51435581 50753464 50315022 50107532 49828678 49712578
3837 49712578 49523699 49297834 49007436 48719866 48581122 48622364 48773845 49166363 49691237 50488196
3827 50488196 51444910 52587681 54189201 55974587 57959351 60027416 62016943 63677981
3819 63677981 65117127 66548493 67744865 68068760 65754386 62589912 59237161 55665590
3811E5665590k869801k251994j584084j370144j036100o60777n69733m99566k78886
3802D4544505k28512K8686j48632L4828K25415L42495N25595P81366Q18381N62159
3792D7486286K04053l28218r04602j143117j084413r29171o56877l34903l06171
3783D2002867k35013j56023L384J15669J30631J30607L21790N30294M58535N96100
3773D3898841Q07656P77469R77592J119667J136724J159833J541467J535347J494341
3764E4448937J178693J029693Q61976O69149M49091O09166Q42361J081708J375554
3755F2546328J671266J751547J889364K165128K323222K587284K531166K756365
3747H0221670K879276L159327L266338L161048L372415L608010L557471L582401
$$ plain form
3811 55665590 52795789 50543795 48959711 47589567 46553467 45892690 45322957 44823391 44544505
3802 44544505 44315993 44344679 44196047 44230875 44456290 44798785 45324380 46105746 46924127 47486286
3792 47486286 47690339 47362121 46457519 45314402 44229989 43300818 42643941 42309038 42002867
3783 42002867 41767854 41611831 41615215 41730884 41861515 41992122 42313912 42844206 43302741 43898841
3773 43898841 44706497 45483966 46461558 47581225 48717949 49877782 51419249 52954596 54448937
3764 54448937 55627630 56657323 57519299 58188448 58637539 59246705 60089066 61170774 62546328
3755 62546328 64217594 65969141 67858505 70023633 72346855 74934139 77465305 80221670
3747 80221670 83100946 86260273 89526611 92687659 96060074 99668084 103225555 106807956
3739A06807956L772172L747375L678560L707957L587732L664052L621209L521176
3731A36108189L421371L257248L125389K933975K607306K341510K048847J870479
3723A57714314J596274J362188R90686P95682O08141K21743p5868n47759p23779
3714A61941622j230026j575328j938394k141351k277112k403774k596034k756222
3706A45023381k925575l036670l160224l271107l505568l712771l827225l814687
3698A17769554l776768l634146l592522l498168l400792l440852l266600l230973
3690H9928733l241677l100245k945674k878869k854165k839701k431934k428177
3682F7208291k159749k135728k030689j753947j696819j597769j491164j277597
$$ plain form
3739 106807956 110580128 114327503 118006063 121714020 125301752 128965804 132587013 136108189
3731 136108189 139529560 142786808 145912197 148846172 151453478 153794988 155843835 157714314
3723 157714314 159310588 160672776 161663462 162459144 163067285 163289028 163213160 162665401 161941622
3714 161941622 160711596 159136268 157197874 155056523 152779411 150375637 147779603 145023381
3706 145023381 142097806 139061136 135900912 132629805 129124237 125411466 121584241 117769554
3698 117769554 113992786 110358640 106766118 103267950 99867158 96426306 93159706 89928733
3690 89928733 86687056 83586811 80641137 77762268 74908103 72068402 69636468 67208291
3682 67208291 65048542 62912814 60882125 59128178 57431359 55833590 54342426 53064829
3674E3064829j232667j131799p92420q75027p65405m81755m70310j73091p6258
3665D7066097K60433N34926Q28953R66027J205431J411045J685729K167526K525654
3656E8651821L202229M384474N603925O564122O216552L256708j291720n338029
3648H1250082p285674p950342o877430n539468l988245k941102k369455j783685
3640D2514681j313578j083459q78404o85406o58850n59280n15158k61212k23812
3631C6335522r8048J64542K01177K37361K85707M36490M59085N01060N80589L47715
3621C9451200N54418N60006P90736P49549M56676L02293K09406j68973l43736
3612D2561575l76093l53513k14264l18500o6028J04655L56479M65356O40151P67993
$$ plain form
3674 53064829 51832162 50700363 49907943 49032916 48267511 47785756 47315446 47142355 47066097
3665 47066097 47326530 47861456 48690409 49656436 50861867 52272912 53958641 56126167 58651821
3656 58651821 61854050 66238524 71842449 78406571 84623123 87879831 86588111 81250082
3648 81250082 73964408 66014066 59136636 53597168 49608923 46667821 44298366 42514681
3640 42514681 41201103 40117644 39239240 38553834 37894984 37335704 36820546 36559334 36335522
3631 36335522 36237474 36402016 36603193 36840554 37126261 37562751 38021836 38522896 39103485 39451200
3621 39451200 40005618 40565624 41356360 42105909 42562585 42864878 43074284 42905311 42561575
3612 42561575 42185482 41831969 41617705 41299205 41233177 41337832 41694311 42159667 42799818 43567811
3602D3567811R79374J152907J399891J666438J847224K047946K389178K860233
3594E7911002K988695L148209L525457L710851L823447L487675K771647J876297
3586H3243280R65479Q9187l17253o05296k89153K37489J000085J997580K527406
3577H8848804K570485J768676K30226j567803k824634l245747k834023k226921
3569H0719063j236937l02400N26488J222652J866148K278555K590291K962303
3561I0626163K809917K482021J506717J27766j143292k413353l266871l748717
3553H6980351l724637l289041k968479k491683j974959j495471j006565q68092
3545F9161424n43751m44041n0238j11542J39033K49888M72298P05034Q40621J066291
$$ plain form
3602 43567811 44547185 45700092 47099983 48766421 50613645 52661591 55050769 57911002
3594 57911002 60899697 64047906 67573363 71284214 75107661 78595336 81366983 83243280
3586 83243280 84208759 84297946 83980693 83375397 83086244 83323733 84323818 86321398 88848804
3577 88848804 91419289 93187965 93418191 91850388 89025754 85780007 82945984 80719063
3569 80719063 79482126 79179726 79706214 80928866 82795014 85073569 87663860 90626163
3561 90626163 93436080 95918101 97424818 97552584 96409292 93995939 90729068 86980351
3553 86980351 83255714 79966673 76998194 74506511 72531552 71036081 70029516 69161424
3545 69161424 68617673 68173632 68123394 68011852 68150885 68400773 68873071 69578105 70418726 71485017
3535G1485017J323536J346856J410746J301114Q62265J30587q52165j901564k833721
3526G2272671l527318l770356l794654l693076l220745k977777k454728k133458
3518D6700559j904384j610897j344814j289578j060457q55931o69939m45605n12791
3509C7006163m03028k25814j53562p2628J04957J77038J50746J00765q5683k11802
3499C6387152m88168p96843q93612r14380r37943p40817p08650q13293o24632
3490B9468814m05084l89040k90058l05155k37268j26336k27262r9431P550o6311
3480B7330419N7575M5761J8182J06668R6778K22374K46369J93318J79419L52574
3470B8849437L16658L05873M93284L69753N74827M83288L69412N84039Q18352
$$ plain form
3535 71485017 72808553 74155409 75566155 76867269 77729534 77860121 77007956 75106392 72272671
3526 72272671 68745353 64974997 61180343 57487267 54266522 51288745 48834017 46700559
3518 46700559 44796175 43185278 41840464 40550886 39490429 38634498 37964559 37518954 37006163
3509 37006163 36603135 36377321 36223759 36151131 36256088 36433126 36583872 36684637 36598954 36387152
3499 36387152 35898984 35102141 34208529 33294149 32356206 31615389 30906739 30093446 29468814
3490 29468814 29063730 28674690 28384632 28079477 27842209 27715873 27488611 27389180 27396730 27330419
3480 27330419 27387994 27433755 27451937 27558605 27655383 27877757 28124126 28317444 28496863 28849437
3470 28849437 29166095 29471968 29965252 30335005 30909832 31393120 31762532 32346571 33164923
3461C3164923P69290P10683Q68219J070670J049560J121756J181404J300341J398070
3452D2634916J589248J595379J706763J665401J659436J761727J742288J722222
3444E6077380J879091J762890J587475J639661J339365J458029J350605J199964
3436F8294460J110615R30812J035133J050769O21780N86381M86137M09625L10875
3427G4836587J67088K28108J38467J24482L40109L79725M40112N73914P34454
3418G7963046P40456J078205R24989J145126J590478J705203J900504K213356
3410H9261363K644053L004791L270540L725167M208892M457525M891084N275375
3402A20738790N672632O002510O340829O451054O812492P016073P353753P282471
$$ plain form
3461 33164923 33934213 34644896 35513115 36583785 37633345 38755101 39936505 41236846 42634916
3452 42634916 44224164 45819543 47526306 49191707 50851143 52612870 54355158 56077380
3444 56077380 57956471 59719361 61306836 62946497 64285862 65743891 67094496 68294460
3436 68294460 69405075 70335887 71371020 72421789 73043569 73629950 74116087 74525712 74836587
3427 74836587 75003675 75231783 75370250 75494732 75834841 76214566 76654678 77228592 77963046
3418 77963046 78703502 79781707 80706696 81851822 83442300 85147503 87048007 89261363
3410 89261363 91905416 94910207 98180747 101905914 106114806 110572331 115463415 120738790
3402 120738790 126411422 132413932 138754761 145205815 152018307 159034380 166388133 173670604
3394A73670604P204824P153424P022852O769939O516043O343774O209390O145393
3386B27036243N928731N890229N552551N144627M862163M396969L953195L578810
3378B66343518L225744K940654K635174K735900K722896K491740K663929K810926
3370B88570481K626389K734111K736405K596643K693231K615972K655561K851826
3362C10080619L182951L360405L905644M281457M674747M973098N181234N145259
3354C44785414M700402L975597L070152J694447L97745o76459j495328j838314
3346C54613656j766277j384858p03981J91073J098014J948381K578133K891175
3338C59465316L088645L292148L659668M141793M952470N329847N082174M728501
$$ plain form
3394 173670604 180875428 188028852 195051704 201821643 208337686 214681460 220890850 227036243
3386 227036243 232964974 238855203 244407754 249552381 254414544 258811513 262764708 266343518
3378 266343518 269569262 272509916 275145090 277880990 280603886 283095626 285759555 288570481
3370 288570481 291196870 293930981 296667386 299264029 301957260 304573232 307228793 310080619
3362 310080619 313263570 316623975 320529619 324811076 329485823 334458921 339640155 344785414
3354 344785414 349485816 353461413 356531565 358226012 358623757 357947298 356451970 354613656
3346 354613656 352847379 351462521 350758540 350949613 352047627 353996008 356574141 359465316
3338 359465316 362553961 365846109 369505777 373647570 378600040 383929887 389012061 393740562
3330C93740562L386535J495749o64176k787263m463737n251925n495510n394730
3322C74565505n026144m322049m438234m831401n869919p777300j0194361j2647837
3314C19458260j5099415j6749934j7652947j7715398j6876964j5606761j4157576
3307B05599265j2637461j1111402r930729q793437q050915p524484o717352o352536
3299A34480949o014751n481514n155126m866261m654688m355792m024684l877824
3291I6050309l756815l549297l354180l352238l321847l064983k925135k919166
3283F9806648k713802k523621k384130k302480k261404k081927j881877j729733
3275E1927674j768237j603459j558328j370162j352219j450098j307951j140207
$$ plain form
3330 393740562 397127097 398622846 397958670 395171407 390707670 385455745 379960235 374565505
3322 374565505 369539361 365217312 360779078 355947677 350077758 342300458 332106097 319458260
3314 319458260 304358845 287608911 269955964 252240566 235363602 219756841 205599265
3307 205599265 192961804 181850402 171919673 163126236 155075321 147550837 140833485 134480949
3299 134480949 128466198 122984684 117829558 112963297 108308609 103952817 99928133 96050309
3291 96050309 92293494 88744197 85390017 82037779 78715932 75650949 72725814 69806648
3283 69806648 67092846 64569225 62185095 59882615 57621211 55539284 53657407 51927674
3275 51927674 50159437 48555978 46997650 45627488 44275269 42825171 41517220 40377013
3267D0377013j157699j062819r66448j051817q71922q71324p11561p90643q85151
3258C2007629q49255p26306p21090o52831m81180o03032o66739n94592n22317
3249B6190287m59188m77821m63140m64821l48644l10831l43274m01476l63540
3240B2557552l02711m14202l63767l23711l18044l17043k79508k34228l92583
3231A9611755j77494r1297k47385j32633k08130j23426j24397p0769j54901j96580
3221A8084743j1926m2980m0920L5204n0384J26738J20926p301M9606Q0244J17577
3210A8461527K02639J94946K44215P0502J79819K08026J27719K56491L31911K48395
3200B0526190M31470M86278M51615P37615R46941Q80462J154072J161814J372238
$$ plain form
3267 40377013 39219314 38156495 37190047 36138230 35266308 34394984 33683423 32892780 32007629
3258 32007629 31158374 30432068 29710978 29058147 28576967 27973935 27307196 26712604 26190287
3249 26190287 25731099 25253278 24790138 24325317 23976673 23665842 23322568 22921092 22557552
3240 22557552 22254841 21840639 21476872 21153161 20835117 20518074 20238566 20004338 19611755
3231 19611755 19434261 19342964 19095579 18962946 18754816 18631390 18506993 18436224 18281323 18084743
3221 18084743 18072817 18029837 17988917 18024121 17973737 18100475 18221401 18214100 18263706 18343950 18461527
3210 18461527 18664166 18859112 19103327 19173829 19353648 19561674 19689393 19945884 20277795 20526190
3200 20526190 20957660 21443938 21895553 22633168 23580109 24460571 25614643 26776457 28148695
3191B8148695J711606K175489K378357L023615L489939L916095M587617N229354
3183E4660767N618800O002917O590554P781436R994470J2834803J4293800J1472377
3175A29249924R81312j0159380j3840510j5753250j4964399j1428256q374189
3168E5711252o417634m826120l928394l169661k649694k366611j977479j814053
3160B8561606j509146j318272j288021j156712q95158p94972o86954p38527n90199
3151A9583645m22697n31230o28139m71618m29973n57480n04014l02559k22496
3142A5513439l71704l25769k39045j05116k47706k28569k50518k01616k01407
3133A3341989j41927k58072k30861j14781j65303j38468o2169j01141j31726j53858
$$ plain form
3191 28148695 29860301 32035790 34414147 37437762 40927701 44843796 49431413 54660767
3183 54660767 60279567 66282484 72873038 80654474 90648944 103483747 117777547 129249924
3175 129249924 130231236 120071856 106231346 90478096 75513697 64085441 55711252
3168 55711252 49293618 44467498 40539104 37369443 34719749 32353138 30375659 28561606
3160 28561606 27052460 25734188 24446167 23289455 22394297 21599325 20912371 20173844 19583645
3151 19583645 19160948 18629718 18001579 17529961 17099988 16542508 16038494 15735935 15513439
3142 15513439 15141735 14815966 14576921 14471805 14224099 13995530 13745012 13543396 13341989
3133 13341989 13200062 12941990 12711129 12596348 12431045 12292577 12230408 12129267 11997541 11843683
3123A1843683j29751j17082j12548j59684Q7310O9969j44624r2092J15908n5114
3113A1305975N7157n1908M1772M8886L6578K55497K43214J95313n4193J55281
3103A2233572j02869k5935j0634m0754k8687q6107j16923N1571o805J42338P7844
3092A2086611M8733K7669M8309J95711K65914K60628M91724L91654K42525L96518
3082A4455996M37789O30122N57657O72410O39057O61452P81325R47243Q47823
3073B0630874J009100J134155J513488J874013J532725M79060j026101k055015
3065B5092299k274703k242435j823890j155137p17440p28184m51698n10114p23489
3056A4465209o81796n79236n25498l67610l18307l48081k85752o8980J9034j11189
$$ plain form
3123 11843683 11713932 11596850 11484302 11324618 11411928 11481897 11337273 11245181 11361089 11305975
3113 11305975 11363132 11311224 11352996 11401882 11438460 11693957 11937171 12132484 12078291 12233572
3103 12233572 12130703 12104768 12094134 12053380 12024693 11938586 11821663 11873234 11866429 12008767 12086611
3092 12086611 12135344 12163013 12211322 12407033 12672947 12933575 13425299 13816953 14059478 14455996
3082 14455996 14893785 15523907 16081564 16753974 17393031 18054483 18835808 19783051 20630874
3073 20630874 21639974 22774129 24287617 26161630 27694355 28173415 27147314 25092299
3065 25092299 22817596 20575161 18751271 17596134 16878694 16150510 15698812 15188698 14465209
3056 14465209 13783413 13204177 12678679 12311069 11992762 11644681 11358929 11289949 11308983 11197794
3046A1197794o688j96148j78744k59093k05786k41928k03193k41383L5434n5451
3036I644814j5124k3994K18900J98888J84632L13034M19525N17615M93662M55437
3026A2407389N72712P02704Q59914Q68976Q93751O01083M22078J13585J48315
3017A7590507J69690N01263P19408J184149J872626K105565J874080Q58008p57080
3008B6118216j826946k346028k448012j811301j472218q78619p90895n75192m15057
2999A3553948j62895k12027q5637j39873J72872J49373L46306J21722Q2842J10765
2989A3937396M4588J17785J78102J43588J86483L35473M39481M04453O00529R55545
2979A7343423Q06433Q84415J229852J196079J508811J867344K092847K495178
$$ plain form
3046 11197794 11191106 10994958 10816214 10557121 10351335 10109407 9906214 9664831 9700265 9644814
3036 9644814 9629690 9605696 9824596 10023484 10208116 10521150 10940675 11458290 11951952 12407389
3026 12407389 12980101 13682805 14542719 15411695 16305446 16906529 17328607 17442192 17590507
3017 17590507 17760197 18261460 18980868 20165017 22037643 24143208 26017288 26875296 26118216
3008 26118216 24291270 21945242 19497230 17685929 16213711 15335092 14544197 13969005 13553948
2999 13553948 13391053 13179026 13093389 12953516 13126388 13275761 13622067 13743789 13826631 13937396
2989 13937396 13981984 14099769 14277871 14421459 14607942 14943415 15382896 15787349 16387878 17343423
2979 17343423 18149856 19034271 20264123 21460202 22969013 24836357 26929204 29424382
2971B9424382K737341L289586L806495M222148M793264N223346N778377P101882
2963F6376821Q973076J1225984J3438441J3743028R141290k74930q877406j3203054
2955A00543250j4955316j4097277j1068210q356545o567710n052908m139327l411227
2947C2894730k824885k439890k020372j679336j686706j450515j285311j168733
2939A8338982r16439r02718o42909n45767o23296n12683p23872o83804m55572
2930A2331922l68546n27130m58360l11101j22833k76592j91104l01425j98204
2921I576627o6062j85613j71653k22199j96537k21387l20747k70554j27774m12097
2911G382004l28419k24840j55515k75234q7113k31195k63359l9907j45923j8233
$$ plain form
2971 29424382 32161723 35451309 39257804 43479952 48273216 53496562 59274939 66376821
2963 66376821 75349897 86575881 100014322 113757350 122898640 122623710 113746304 100543250
2955 100543250 85587934 71490657 60422447 52065902 45498192 40445284 36305957 32894730
2947 32894730 30069845 27629955 25609583 23930247 22243541 20793026 19507715 18338982
2939 18338982 17422543 16519825 15876916 15331149 14707853 14195170 13471298 12787494 12331922
2930 12331922 11963376 11436246 10977886 10666785 10543952 10267360 10076256 9774831 9576627
2921 9576627 9510565 9324952 9153299 8931100 8734563 8513176 8192429 7921875 7794101 7382004
2911 7382004 7053585 6828745 6673230 6397996 6310883 6079688 5816329 5776422 5630499 5612266
2901E612266j05080n8324m2918K813K009o9112o4827N1874k5575m8730j00983
2890E153413j31417k3532k3998J0285j24778j49835j19239j17013p6906j72044
2880D224936j55268k50414j62978M8327m8227j70809o6361r5525j25876k7339
2870C170466K3349p261q3728J727l1245m5033j40528m253J7985k8812r8978K0006
2858B793695k8827J0018k9149k3868j7168L9522o8812M2456j40449m4973o1472
2847B470973k5283m3937j20685J51198r8446J5083J4592j19228l4377J1172L9603
2836B260665p8196o6362m0546J3591O2979n1665k4838p2546N8216l9182J11169
2825B133285r5923k8677O7528j42515q0811q2026o678o8983j2098J00205j5935
$$ plain form
2901 5612266 5507186 5448862 5405944 5408757 5410766 5341654 5276827 5328701 5303126 5254396 5153413
2890 5153413 5021996 4998464 4974466 4984751 4859973 4710138 4590899 4473886 4396980 4224936
2880 4224936 4069668 3819254 3656276 3704603 3656376 3485567 3419206 3323681 3197805 3170466
2870 3170466 3193815 3186554 3102826 3104553 3073308 3028275 2887747 2883494 2901479 2872667 2773689 2793695
2858 2793695 2764868 2774886 2745737 2721869 2704701 2744223 2675411 2717867 2577418 2532445 2470973
2847 2470973 2445690 2401753 2281068 2432266 2333820 2348903 2363495 2244267 2209890 2221062 2260665
2836 2260665 2182469 2116107 2075561 2089152 2152131 2100466 2075628 2003082 2061298 2022116 2133285
2825 2133285 2037362 2008685 2076213 1933698 1852887 1770861 1764183 1695200 1683102 1783307 1767372
2814A767372q8794Q4409O4361m6296L4707K3120J35292J8666q5561l0624J80987
2803B057639n1998J6038r5156n0893R5626k931r5844l4755J08332J12859k4258
2792B034659m5829j7052l05l4743j9025N3913j98353m7254j5108l562J55748L1973
2780A895062j91395N4812L2945L4079L9462k2359n7272J10497N6944m5817j7049
2769A889909k3139K3052O4175j23287j4897o5038L6453K3479k223n9837r2151
2758A656496Q2932J5694l0142j49026J46561q1082q7957p407J2251J4459o6637
2747A506142l1151j0962o5168M1946l4455p9002K8404J7279L9264l5891p0704
2736A305702K0162J3401k9376O3698n1401J31009M802k14117L6924K9739p3067
$$ plain form
2814 1767372 1678578 1762987 1827348 1781052 1815759 1838879 1974171 1992837 1907276 1876652 2057639
2803 2057639 2005641 2021679 1926523 1875630 1971256 1968325 1872481 1837726 1946058 2058917 2034659
2792 2034659 1988830 1971778 1971473 1936730 1917705 1971618 1773265 1726011 1710903 1707341 1863089 1895062
2780 1895062 1703667 1758479 1791424 1825503 1864965 1842606 1785334 1895831 1952775 1906958 1889909
2769 1889909 1866770 1889822 1953997 1830710 1815813 1750775 1787228 1810707 1808484 1748647 1656496
2758 1656496 1739428 1755122 1724980 1575954 1722515 1641433 1553476 1546069 1558320 1572779 1506142
2747 1506142 1474991 1464029 1398861 1440807 1406352 1327350 1355754 1373033 1412297 1376406 1305702
2736 1305702 1325864 1339265 1309889 1373587 1322186 1453195 1457997 1243880 1280804 1310543 1237476
2725A237476m4908Q2350l2672j22244q4415J8963q0047J04049n057J4197O0946
2714A148638q6012Q04Q1175p2607j35143J28513L1283L4355j37271N8221J12638
2703A164594K9453J16695K5762O8547o2882j37460p7815m3465p8908k5815n0489
2692I28217r6009l6190n1406j6873O177R7462n6039n3935o6353k9802P3225M6050
2680G44524k2791n603j28867k2341N2074L1251L4614O907o6517J9539k6737l8639
2668E77414J613m2791L0413m4089o9866N4958j06194L219o7869J88336J19591
2657F44735j47863k4507R3054o2193J8839J08986j08303j1779j02079R5324P3065
2646E77279q5244o484j3609K3601M1902K8593P3831j27757m7562k5143K3549o892
$$ plain form
2725 1237476 1192568 1274918 1242246 1120002 1035587 1054550 974503 1078552 1073495 1087692 1148638
2714 1148638 1062626 1063430 1144605 1071998 936855 1065368 1096651 1131006 993735 1051956 1164594
2703 1164594 1194047 1310742 1336504 1405051 1342169 1204709 1126894 1083429 1004521 978706 928217
2692 928217 832208 796018 744612 727739 733916 831378 775339 721404 655051 625249 698474 744524
2680 744524 721733 716130 587263 564922 616996 648247 682861 689768 623251 642790 616053 577414
2668 577414 579027 536236 566649 522560 452694 507652 401458 404677 336808 525144 644735
2657 644735 496872 472365 565419 503226 522065 631051 522748 510969 408890 504214 577279
2646 577279 492035 485551 471942 495543 537445 566038 639869 512112 464550 439407 462956 456064
2634D56064m3853M2876r9217J6148Q4827p3910J6806K0499j9144n9319J18212
2623D59989K1649r5628o6719J10844p5386K6824N1966j4626l943R6278j45862
2612C65386j5354L9969M4217n2258r9352J19416n3733k287L2778J08108r9815
2601C87075N2138J1658n5108j73523M0182J57657p4982m7278r3766M3996J24094
2590C72143J7119k7575l0298K4647O704n1488J20410l6984M505p9969m8317n1608
2578B19289M0008j1372k0263O2477o4155p604o1896N5207M5639J042J3229n2039
2566B19562O7163J3291q3681O397Q421J986R5051q1947r3594R5826L3603m0788
2554B41290J92O2403r6671o0371J12631O6673j43846k0207o4003L4141P7400J9401
$$ plain form
2634 456064 412211 455087 355870 372018 456845 382935 399741 420240 401096 341777 459989
2623 459989 481638 386010 319291 430135 354749 381573 433539 418913 414970 511248 365386
2612 365386 350032 390001 434218 381960 282608 402024 348291 346004 378782 486890 387075
2601 387075 439213 450871 395763 222240 262422 420079 345097 297819 204053 248049 372143
2590 372143 389262 361687 331389 356036 362740 311252 431662 394678 399183 319214 270897 219289
2578 219289 259297 247925 227662 290139 225984 218380 156484 211691 257330 258372 271601 219562
2566 219562 286725 300016 216335 222732 231153 233139 328190 246243 152649 248475 282078 241290
2554 241290 241482 303885 207214 146843 259474 326147 182301 162094 98091 132232 209632 229033
2542B29033J6563L682l906J2527J09663k6059j71009n0997l5776k0735R1697L8993
2530A93676n7819O6627o457r5549Q692J55159K3876k3862m2794L2739n9507J4916
2518B09697J06936O6040q7930j03950N7279k394l6551j6557j8649j463L3920n8852
2506A47526J08269j3797j46115J23429j1907l1215j2710K3306P5130n1106j06047
2495A04763O2528O4616L8454m8245K4878p0350k6927n195j5674j0063m3061K4541
2483A00265L9266M7474l1778J7530j04959N6665k5853q185P4169j38337o9152
2472d2895J37930j8542P6312k650p7306j3754J722M8991O5259j19368r4806J68611
2460A29504M7688r1866k9698R065J32360m5908J3931k2745O4200q0541j39695
$$ plain form
2542 229033 245596 249278 245372 257899 367562 341503 170494 119497 83721 62986 154683 193676
2530 193676 135857 202484 196027 100478 109170 264329 288205 264343 221549 254288 194781 209697
2518 209697 316633 382673 294743 190793 248072 245678 209127 192570 173921 172458 206378 147526
2506 147526 255795 241998 95883 219312 207405 176190 163480 186786 261916 210810 104763
2495 104763 167291 231907 270361 222116 246994 176644 149717 144522 128848 118785 75724 100265
2483 100265 139531 187005 155227 172757 67798 124463 98610 90425 164594 26257 -42895
2472 -42895 95035 76493 152805 150155 72849 59095 60817 109808 175067 55699 -39107 129504
2460 129504 177192 85326 55628 64693 197053 151145 165076 142331 206531 125990 -13705
2449a3705Q7852P4994j780k3075l4433K5182R8016q7151k7422l9590O3142j02198
2437A9832j8941J30285K00679j56782m0872J8140m6821P1319J2002L5287l5620
2426A88508k229r994j10971l9563K7853M2363R248l265j06932M5330J20701j9340
2414A41709L5974l7995O0179O7485m3728o8185l0152l5938m780l2288q0147J8821
2402i045R896J28309O4811p6785o1882j39213O3790J5405O5768o6842L1355j0083
2390A5484Q559p2900J64153j19183O2629Q3204j40791l0446M4605j02664m5344
2379a32694J00743Q3812o1217L0229J5556p2313M1872P6931m7024L0334J52429
2368B18658j26901n494j35390Q6347J27143k9350k940K4107k2691j92729M8963
$$ plain form
2449 -13705 74147 149141 147361 124286 89853 115035 213051 125900 98478 58888 122030 19832
2437 19832 891 131176 331855 175073 134201 152341 105520 176839 188841 224128 188508
2426 188508 186279 176285 65314 25751 53604 95967 105215 101950 -4982 40348 161049 141709
2414 141709 177683 139688 199867 267352 223624 155439 125287 89349 84569 52281 -27866 -9045
2402 -9045 851 129160 193971 117186 55304 -83909 -20119 -4714 61054 -5788 25567 15484
2390 15484 24043 -48857 115296 -3887 58742 141946 1155 -29291 15314 -87350 -132694
2379 -132694 -31951 51861 -9356 20873 36429 -35884 5988 82919 35895 66229 218658
2368 218658 91757 86263 -49127 37220 164363 135013 132073 156180 133489 -59240 -10277
2357a0277O2686o9944k6378j0652J51542Q9961j59289l2649K4965J9276J50400
2346A89641k3145m1556j07861m4269K3072J40754M3247j07181p766M1610k2676
2335H3870m4193j955K4880j10611J78617j8489n2220l7278M2851N4126n2314j369
2323F5915n2981M469J49217q3549m1214j32831O7311L9878N8049m0789M270J6850
2311E4595r731Q9703k8995o4811l6201J6659M9123K577K8660M7988j15030q8144
2299e3607N0593j0167J15837K9662O124j7275K001R3651J1372N582L7825o5823
2287B05775j25619M3380O6553l2031l8748M2906o9330J09125n362j8578J8938
2276A97009q033j62669Q5278o6432R7627K3445j29440R230j09933l6375Q1744
$$ plain form
2357 -10277 52409 -17535 -43913 -54565 96977 186938 27649 -5000 19965 39241 189641
2346 189641 166496 124940 17079 -27190 -4118 136636 179883 72702 64936 106546 83870
2335 83870 39677 37722 62602 -48009 130608 112119 59899 22621 65472 119598 67284 65915
2323 65915 12934 17403 166620 83071 41857 -90974 -23663 16215 74264 33475 37745 54595
2311 54595 44864 134567 105572 40761 4560 21219 70342 72919 101579 149567 34537 -53607
2299 -53607 -3014 -13181 102656 132318 138442 121167 123168 216819 228191 233773 271598 205775
2287 205775 80156 123536 190089 158058 119310 162216 92886 202011 196649 178071 197009
2276 197009 188976 26307 111585 45153 142780 166225 36785 46015 -63918 -100293 -18549
2265a8549k1884R6332n5915R7338J6404j04618j02272L8380J47251Q4807j0166
2254A67108o8350j9752q3820N9633j8617m3755o3791j8852J1462J6788K741O0475
2242A270P3643P3708J2687p8742N2054L7022n1336O0835l9087m5625J72291q7510
2230A81210k3376q2578J743m3748o79M2931j1217o7246l657Q8516k5748N8163
2218A14314K558n4891K0351o1494P5224J67372j50925j5621q9286N3639N9086
2207A20327k9930j00431K2914L6722N734k3285M9391K6383p76L1226N0754q2860
2195A06169q4516N3464j4002Q526Q0338o4938J2780R0256N6477m650K7479j21728
2183A45655o1291K6515M2706q4843L3010L0439r350K11072r4387r1851p4347J5406
$$ plain form
2265 -18549 -40433 55899 -16 97322 113726 9108 -93164 -54784 92467 177274 167108
2254 167108 98758 79006 -4814 54819 36202 -7553 -71344 -90196 -78734 -61946 -59205 1270
2242 1270 74913 148621 161308 82566 134620 171642 120306 181141 142054 96429 268720 181210
2230 181210 157834 75256 76999 33251 32572 75503 64286 -2960 -6617 81899 56151 114314
2218 114314 116872 61981 82332 20838 96062 263434 112509 96888 7602 61241 120327
2207 120327 90397 -10034 12880 49602 55336 32051 81442 107825 107049 138275 189029 106169
2195 106169 21653 75117 61115 69641 149979 85041 97821 188077 244554 239904 267383 145655
2183 145655 84364 110879 153585 68742 101752 132191 122841 333913 239526 147675 73328 88734
2171H8734j0566m2484P4326K8552j7839N7764k3460M1542J8741p558k797M841
2159B09796m3848J7574K084O5427O8576k3899Q9984K9663r8869q6202O0739j505
2147B89520J29804m4277j40819R0837m2170q6319J26317R3999j79893l2397M1220
2136B45822N2296Q005P776j21090k6571O120M1790J59632J5330m6579k0880m9282
2124B72369P2918L0048O4505R0325N0710n932m2339n6791N4436J4398J0783N9351
2112F14781M2910j6832R7687J01223N5874j00408J6412P4757N657N4479p2388
2101H74152Q942j0076P2073K8686q1728R3957J45687K1314p1652o5963J40819
2090A156211N0323M520Q9600Q1350j4955J8501R3642J54124K5343O9319J22730
$$ plain form
2171 88734 78168 35684 110010 138562 120723 178487 155027 196569 215310 207752 204955 209796
2159 209796 165948 183522 185606 251033 319609 295710 385694 415357 316488 230286 291025 289520
2147 289520 419324 375047 234228 325065 282895 196576 322893 416892 236999 204602 245822
2136 245822 298118 306123 313899 192809 166238 172358 214148 373780 389110 342531 321651 272369
2124 272369 345287 375335 439840 530165 580875 574943 532604 475813 530249 544647 555430 614781
2112 614781 657691 640859 738546 839769 895643 795235 811647 886404 892061 946540 874152
2101 874152 883094 873018 945091 973777 892049 986006 1131693 1153007 1081355 1015392 1156211
2090 1156211 1206534 1211054 1300654 1382004 1367049 1385550 1479192 1633316 1658659 1727978 1850708
2079A850708J73468J10640N1981J2497N0479J71338L22475K05244K06253J82684
2069C337767K49862K43481M74725M76409N18552M13309O29423O70386P40555R31336
2059H685805J197075J192885J303720J650687K154667K762953L702917M507519
2051B7158228M015370k79324l747705l595454m566387l875143k584416j894321
2043A0630848j451191j016873q51267p13933m64727k48384l48233m73411l33135
2034D729694m00730m19315k29186k67438k33016r6641j61091j66260j14392j37037
2024B504588j65464p9598j00461q8703p0423j18501j1149j59506r2585j24090
2014A494108n1775N5543n6521k0919j5735j7638j82727m6726p6915N8112n1686
$$ plain form
2079 1850708 2024176 2134816 2186797 2199294 2249773 2421111 2743586 2948830 3155083 3337767
2069 3337767 3587629 3831110 4305835 4782244 5300796 5714105 6343528 7013914 7754469 8685805
2059 8685805 9882880 11075765 12379485 14030172 16184839 18947792 22650709 27158228
2051 27158228 31173598 30894274 27146569 23551115 18984728 15109585 12525169 10630848
2043 10630848 9179657 8162784 7311517 6597584 6132857 5884473 5536240 5062829 4729694
2034 4729694 4328964 3909649 3680463 3413025 3180009 3083368 2922277 2756017 2641625 2504588
2024 2504588 2339124 2259526 2159065 2070362 1999939 1881438 1870289 1710783 1618198 1494108
2014 1494108 1442333 1497876 1441355 1420436 1404701 1387063 1204336 1157610 1080695 1138807 1087121
2003A087121l8549k08449r775P1410r4073M0256j11215o2561j04627P3236M6457
1992F89231n3931j12300J63347q217k31068J41530J2799k1835K6528r3280o8013
1981D44791P4036k0042r6789j1390L2483o5502l2392J14971j09593k338J35699
1970D63934j32295j06636J33147K4656M5650j07842r7395P6364j10405M0944R6844
1959C26966j03506J8395j56033L4343R5509o301p7136M5501J05866m7043k8640
1948B07921m8978L4227K3457K5888k3795o2240l8725l6184J0822l1797k3849n8267
1936b1520J1561k1663N9655Q8660p2243l4618J45102L8754m1931P473n2032r9668
1924G530J97658m2264n3302l0421J730R2510q2426J32802r8250j27075M7967q7664
$$ plain form
2003 1087121 1048572 840123 830348 901758 807685 847941 736726 674165 569538 642774 689231
1992 689231 635300 523000 686347 678130 447062 588592 601391 579556 606084 512804 444791
1981 444791 518827 498785 401996 390606 423089 357587 325195 440166 330573 328235 463934
1970 463934 331639 225003 358150 382806 428456 320614 223219 299583 189178 230122 326966
1959 326966 223460 241855 85822 120165 215674 209373 132237 177738 283604 236561 207921
1948 207921 158943 193170 216627 242515 218720 156480 117755 81571 92393 60596 36747 -21520
1936 -21520 -9959 -31622 28033 116693 44450 9832 154934 193688 151757 159230 107198 7530
1924 7530 205188 162924 109622 79201 80931 173441 91015 223817 125567 -1508 46459 -41205
1912d1205Q2688K6102n4393J0637k3626N2161p2018K0037j5513J0665O3964J8465
1900G7964j8528J5846l187j03677k1091M2057N4156n7822j0165Q4835M5948p600
1888I8736q2789J26896k1266P0015j25267j23169M1325J7392n4204k82j3773N1533
1876a4853J4465K2557L6439L5967P779J2270r961p7035o2036N3717q4225m035
1864f8951J08014O3241l9031j45160Q3842N5926K822j05594M8312q850m2302K059
1852d5672J0743K7867n423l2382p0263N0471J91502p3973l4568N2314n3573j13689
1840i6646r246J01263j9001J0882o3495j0076L770M3718L3333J9885p538L1866
1828C8715R0307p2856o0147N9222l13J7667K1482O137j25219k807K2326l4386
$$ plain form
1912 -41205 41483 67585 13192 23829 203 52364 -19654 383 -15130 -4465 59499 77964
1900 77964 59436 75282 72095 -31582 -52673 -10616 43540 -14282 -24447 60388 106336 98736
1888 98736 15947 142843 121577 191592 66325 -56844 -15519 1873 -52331 -52613 -66386 -14853
1876 -14853 -388 22169 58608 94575 102354 114624 104663 27628 -34408 19309 -64916 -68951
1864 -68951 39063 102304 63273 -81887 1955 57881 60703 -44891 3421 -5429 -47731 -45672
1852 -45672 -34929 -7062 -12485 -44867 -115130 -64659 126843 52870 18302 70616 17043 -96646
1840 -96646 -105892 -4629 -23630 -12748 -76243 -86319 -82549 -38831 -5498 14387 6849 38715
1828 38715 129022 56166 -3981 55241 54928 72595 94077 100214 -25005 -27812 -5486 -39872
1816c9872Q9035Q1627l0030l411j8815J23140K4733r477k2492j16372O0565m725
1804A33906J4435m1502O07M522l2041j828m758m921L5328L5058j24353k9086K9197
1791A4564N6856j22576m93R2830m4181m3088N9445N2611j3034J5017p9358q9569
1779a00976O3854K4237j9666M6651M882J04865j50338n2380R9402J9368l0471
1768I428l3361o8963O59k2985N5298o9170M7160J16342k0274n7416L7710L9975
1756C4403j38777j2598Q3300J2043l0513O680J4086k6859M9679L3110k5429n5346
1744e6221K3147m8294N3970o5057n6512Q5539N3739o0535Q6132r8536j13072N4106
1732a41594j656m055L2482l6380R8783O2702r4726Q8852k009o0579K9962l2772
$$ plain form
1816 -39872 49163 130790 100760 97349 78534 201674 226407 216930 194438 78066 138631 133906
1804 133906 148341 106839 107446 111968 79927 78099 73341 68420 103748 138806 14453 -14633 14564
1791 14564 71420 -51156 -51649 41181 -3000 -46088 13357 65968 52934 67951 -11407 -100976
1779 -100976 -37122 -12885 -32551 14100 18982 123847 -26491 -78871 20531 39899 9428
1768 9428 -23933 -92896 -92237 -115222 -59924 -129094 -81934 34408 14134 -43282 -5572 34403
1756 34403 -104374 -116972 -33672 -21629 -52142 -45462 -31376 -58235 -8556 24554 -875 -56221
1744 -56221 -33074 -81368 -27398 -92455 -148967 -63428 -9689 -70224 15908 -82628 -195700 -141594
1732 -141594 -143250 -147305 -114823 -151203 -52420 10282 -84444 4408 2399 -58180 -28218 -60990
1720f0990o3996k0488M8275J01531l5890l5975J9349j5255L6389j8972J1388R8554
1708F3920j70782p0852J67058q7128j02747J30956M2175j6904O330K1988r7185
1697a13171o537J6460Q3211p7676j9331L6944r4171N3100o935j5852K9116M9134
1685f5708P264K6011K0383j57902K8116M0426N9622N2686l94K4806L2417n007
1673F2720N6733k3465k8055m6843j4918o3298o5733L2542L7458K05448j46050
1662F539q2496o962k143m2426P7716l2087R311J4800n955L5744q6487Q5883l2052
1649f0615m7105j9446l5428K9187j507O6898N6235l3253n9894L4718J15234j08579
1637f3555k1758O8867O3708j46868J40605m0952j22169R6009K238R782j32286
$$ plain form
1720 -60990 -124986 -145474 -97199 4332 -31558 -67533 -48184 -63439 -27050 -46022 -34634 63920
1708 63920 -106862 -177714 -10656 -97784 -200531 -69575 -27400 -44304 -37974 -15986 -113171
1697 -113171 -119708 -103248 -20037 -97713 -117044 -80100 -174271 -121171 -128106 -143958 -114842 -65708
1685 -65708 -58444 -32433 -12050 -169952 -141836 -101410 -41788 10898 10504 35310 67727 62720
1673 62720 119453 95988 67933 21090 6172 -57126 -122859 -90317 -52859 152589 6539
1662 6539 -75957 -82919 -85062 -127488 -49772 -81859 -72548 -57748 -63703 -27959 -114446 -28563 -60615
1649 -60615 -107720 -127166 -162594 -133407 -134914 -68016 -11781 -45034 -104928 -70210 45024 -63555
1637 -63555 -85313 -16446 47262 -99606 40999 47 -122122 -26113 -23875 -14093 -146379
1626a46379L9220O0482l1151J32350J9225m0296q9604M7587J34069p5777j68063
1615a18337j0346O2259O1554P214j2323K7654K0088l8959m729j09444J0127M8379
1603e6863Q0670j0593L6310j33855m0106M3682N3324k9157n0383M181J22185O2854
1591H2249k3270m8952j13296N8971K5869l202j0928L4486P2429m2848p9311o7835
1579a15638j6206Q5957P0822j5232n7923j3652q6721k4092P4776L5509r9358R3549
1567f8209n509J05847M3669q6334J8621n008j00003N9160p7714O9226k646J07399
1555E8499N147j84784J6194j04771J09452Q9000K2137R9468r0688o5318p7497
1544a23161J78579K2722r6093L2204o2015j65000J03190N956M7567Q5316O567
$$ plain form
1626 -146379 -107159 -46677 -77828 54522 73747 33451 -56153 -8566 125503 49726 -118337
1615 -118337 -128683 -66424 -4870 2344 -9979 17675 37763 -1196 -5925 -115369 -105242 -56863
1603 -56863 23807 13214 49524 -84331 -124437 -80755 -27431 -56588 -106971 -102790 19395 82249
1591 82249 58979 10027 -103269 -44298 -18429 -21631 -32559 1927 74356 31508 -47803 -115638
1579 -115638 -131844 -45887 24935 9703 -48220 -61872 -148593 -172685 -97909 -62400 -161758 -68209
1567 -68209 -73718 32129 75798 -10536 8085 3077 -96926 -37766 -115480 -46254 -48900 58499
1555 58499 63646 -121138 -104944 -209715 -100263 -11263 10874 110342 19654 -45664 -123161
1544 -123161 55418 78140 -17953 14251 -47764 -212764 -109574 -103618 -56051 29265 35832
1533C5832N7345n6800k33468p3907K15983O0310j15034j02128N4510o2374R2145
1522a27586J52115m3743j48344n1925J71693M012R1678j19783r959o9238m543
1511a55623L1197k7564k1243R8589L3839l3891O8869n715O0864p0696M2877l6439
1499a4936J7155k0163o7733q954N7620J1168m9777J9205O007j5915l9626j0099
1487a16048N0708o0182n8605k571J19344J4399m408r3345o2939L0916L7602Q9924
1475e5205J5808j7086R8636l1917q9930O4170l828L9061M3514j09535R168l2055
1463f9199O3107j7210n310J2182j6392K3031p5286o4712R0679l325m7705P4669
1451c5471r9963l5292P5106J5206P9019n0510L918o2196m9674K6179K061n0515
$$ plain form
1533 35832 93177 36377 -197091 -270998 -55015 5295 -109739 -211867 -157357 -219731 -127586
1522 -127586 24529 -19214 -167558 -219483 -47790 -43778 47900 -71883 -81842 -151080 -155623
1511 -155623 -124426 -151990 -173233 -74644 -40805 -74696 -5827 -11542 49322 -21374 21503 -14936
1499 -14936 2219 -17944 -85677 -94631 -37011 -25843 -75620 -56415 -50408 -66323 -105949 -116048
1487 -116048 -65340 -125522 -184127 -186698 -67354 -52955 -57363 -150708 -213647 -182731 -145129 -55205
1475 -55205 -39397 -56483 42153 10236 -79694 -15524 -19352 19709 63223 -46312 -37144 -69199
1463 -69199 -6092 -23302 -28612 -16430 -32822 -9791 -85077 -149789 -59110 -62435 -110140 -35471
1451 -35471 -135434 -170726 -95620 -80414 -1395 -51905 -47987 -110183 -159857 -133678 -131617 -182132
1439a82132L8431J14596l7433R9917l4325J9117J55967j05563j38391j6765K3072
1428f3509K6935k4731r307P0364P4003j31671j23727j7926J35651R4220K2607
1417E2909j08607j33643J47625m8440j0387K7592r517Q1978m4776j3832L3774
1406b5324j9908P6799q2507L2178K9059L0449n0656k7347L0687n7881p8077Q2234
1394f0294l2484m6529P5349N7318o5849J0325j1836M0325L4997r3147N1696n9963
1382a00092Q9301m4407q8018K9273P575J8513p6177M8055N0386l7685J0280j5926
1370a08922N8913M3967L2910r8350J0505N5490J2958M6956m1831l6439n9343K9309
1358e3877J10982j70229J0898K9880O0181K4903m7661K5178r4375l9496L1626
$$ plain form
1439 -182132 -143701 -29105 -66538 33379 -946 18171 174138 68575 -69816 -86581 -63509
1428 -63509 -36574 -61305 -70612 -248 73755 -57916 -181643 -199569 -63918 30302 52909
1417 52909 -55698 -189341 -41716 -90156 -100543 -72951 -82468 -490 -45266 -59098 -25324
1406 -25324 -45232 31567 -50940 -18762 10297 40746 -9910 -37257 -6570 -64451 -142528 -60294
1394 -60294 -92778 -139307 -63958 -6640 -72489 -62164 -74000 -33675 1322 -91825 -40129 -100092
1382 -100092 -10791 -55198 -143216 -113943 -106368 -87855 -164032 -115977 -65591 -103276 -92996 -108922
1370 -108922 -50009 -6042 26868 -71482 -60977 -5487 7471 54427 12596 -23843 -83186 -53877
1358 -53877 57105 -113124 -102226 -72346 -12165 12738 -34923 -9745 -104120 -143616 -111990
1347a11990P321J6413N593j4252m8511O2880L9916m610k6350J04532n7196K8991
1335B737L0493l623j7867M9020N2076p3357l8075r187j01511O4861Q512j6819
1323e2740J20674r2773N1710R68j2044K4829n6321J5162R2406o1365l7544m8949
1311e5987Q9234m2501N7856M2820n4128K5377J6618j53069L1745P6602j0057n587
1299A8923j05772J16780k4405k1880N1926r9685N460l5383j277K0158R9908J18127
1287A42880o6511q0587q57J47376j07533k8166m7778q1608L9542M4853L3303p1390
1275g6476q325l0785m3641J14189R214M808p6400p4051N7651R4627J1337n1413
1263f9265K6679J618l1434Q2871P7465M4165j30863m2005n3087o2366M8963J82290
$$ plain form
1347 -111990 -104669 -88256 -82663 -96915 -145426 -82546 -42630 -47240 -73590 30942 -26254 2737
1335 2737 33230 29607 11740 60760 112836 39479 1404 -7783 -109294 -44433 -35921 -52740
1323 -52740 67934 -24839 26871 27839 15795 40624 -15697 -535 91871 30506 -7038 -55987
1311 -55987 33247 -9254 48602 91422 37294 62671 79289 -73780 -42035 34567 24510 18923
1299 18923 -86849 29931 5526 -16354 35572 -64113 -58653 -94036 -95313 -75155 24753 142880
1287 142880 76369 -4218 -5075 142301 34768 6602 -41176 -122784 -83242 -38389 -5086 -76476
1275 -76476 -84801 -115586 -159227 -45038 -35824 -31016 -107416 -181467 -123816 -29189 -17852 -69265
1263 -69265 -42586 -40968 -72402 10469 87934 132099 1236 -40769 -93856 -156222 -107259 75031
1251G5031M1128l7788r1701o5435R5852o3965M3642m2589L8824L7327k1390J9482
1239B8418K5743M273j05297J4073O2529r0716j5479J12507K9444j04068q1762
1228a20335P0325R1787j9122j4720k5245N1211L011J21501j05740j39172L9581
1217d6918N5733K7949j3094j6893k4248L4503N5680q0585k3941p6920o8490K29901
1205E2677k2942j07876j5432N6741J00639M0647n5470k167M1489n3222l4117o7125
1193f6158n9265J35637J83890r2253m5305J7210o4948L648j38205O0414M1663
1182b3672l6310J24711j35049k7659J54892k6175j19403Q5517Q3464j4622Q0075
1171A45769n7538r0240P181J9950j02315j3619J25156p4021L10q6381P9154R0574
$$ plain form
1251 75031 116159 78371 -13330 -78765 17087 -46878 -3236 -45825 -7001 30326 8936 28418
1239 28418 54161 58434 -46863 -32790 29739 -60977 -76456 36051 65495 -38573 -120335
1228 -120335 -50010 41777 22655 7935 -17310 33901 36912 158413 52673 -86499 -46918
1217 -46918 8815 36764 23670 6777 -17471 17032 72712 -7873 -31814 -108734 -177224 52677
1205 52677 29735 -78141 -93573 -36832 63807 104454 48984 46817 88306 35084 967 -66158
1193 -66158 -125423 10214 194104 101851 56546 73756 8808 12456 -125749 -65335 -23672
1182 -23672 -59982 64729 -70320 -97979 56913 30738 -88665 -3148 80316 65694 145769
1171 145769 88231 -2009 5172 25122 -77193 -90812 34344 -39677 -39367 -125748 -46594 43980
1159D3980r1939p4608L9761n461o8519N1257k0796Q242N2160m4191Q0236j0344
1147d0222m5273K885M9425J9280n6470p8256P025N9159P8895n4835n4112m0770
1135a53269J46331Q9140o1683j3899P1019L410p2762o1799k2234O0682k8800k059
1123d5923J04571R6083N2378P990j4380k5453j08838m3315q4508l6864O2921N6454
1111B1116p2126j857n4166m7263M4785P7170j06243J1331m1455P4992J00276p1631
1099f5071J0635L1198j12926k1582L8207j0565L893M3080n2411J14968Q6914r5861
1087b9521r7903L2029J006M4460Q4373o5488m7735J6156N3723M4637K1600m0497
1075A6840J21220Q613j68891L105K0446n6638m3598j5966M4404Q3161K9984p7602
$$ plain form
1159 43980 -47959 -122567 -82806 -88267 -156786 -105529 -126325 -118083 -65923 -110114 -29878 -40222
1147 -40222 -85495 -82610 -33185 -13905 -70375 -148631 -141606 -82447 -3552 -58387 -112499 -153269
1135 -153269 -6938 82202 20519 6620 77639 81049 8287 -53512 -75746 -15064 -43864 -45923
1123 -45923 58648 154731 207109 215099 200719 175266 66428 23113 -61395 -98259 -35338 21116
1111 21116 -51010 -52867 -107033 -154296 -109511 -32341 -138584 -127253 -168708 -93716 6560 -65071
1099 -65071 -54436 -23238 -136164 -157746 -119539 -130104 -126211 -83131 -135542 -20574 66340 -29521
1087 -29521 -127424 -95395 -94389 -49929 34444 -31044 -78779 -62623 -8900 35737 57337 16840
1075 16840 138060 146673 -22218 -19113 1333 -55305 -98903 -114869 -70465 12696 42680 -34922
1063c4922p0619Q0015L6034o1433P613M0046p9941J07862j8821n251P9122N798
1051H5503o0089o1410j34864J13925J7825k0034l8974j4423J28848p9984n526
1040f9203O3329Q2683o0922o3592o064R678k1688m0237J72824J63549j39421j05949
1028a5013p0183K3937q382O3622L3338N99l2753j05750J22173k8067j328R8242
1016H0435j85750L3144J58477m7450j2875P8613j20975N1460J1910R329p4594
1005a8276M5888r0877l7153n342l5157O7188N1607Q205J6854M8804r7979L1899
993a4339j1557q8970p0754K764R8575l772K1005N7656P0951m5081m3160O0434
981C3752n6626M8119l0435p8897L7000r4320K783J88192k935M889R3027m5903
$$ plain form
1063 -34922 -105541 -25526 10508 -50925 -43312 -3266 -83207 24655 5834 583 79705 85503
1051 85503 25414 -35996 -170860 -56935 -39110 -59144 -98118 -112541 16307 -63677 -69203
1040 -69203 -5874 76809 15887 -47705 -53769 -44091 -65779 -106016 66808 230357 90936 -15013
1028 -15013 -85196 -61259 -69641 -6019 27319 27918 -4835 -110585 11588 -16479 -17807 80435
1016 80435 -105315 -72171 86306 38856 25981 104594 -16381 35079 46989 56318 -18276
1005 -18276 27612 -63265 -100418 -105760 -140917 -73729 -22122 -13917 2937 51741 -46238 -14339
993 -14339 -25896 -114866 -185620 -182856 -84281 -88053 -67048 -9392 61559 16478 -26682 33752
981 33752 -22874 25245 -5190 -84087 -47087 -141407 -138624 49568 46633 51522 144549 98646
969I8646q8586o6665k9522N6760N4058j06332n140n4536R058J42165M8092L5665
957I3663j43826Q7246n843K6389n787k4943k0157J3468L7799p1818p4799K1509
945f7099K883K5912L4826j19952j5274K1751P9454J6765N8733J9243J7015n3292
933B0965m1944L5445K6157j10058Q8370M7832m3271N2759k1558m0273l9879n4239
921g9694J04689K5198K8116n7418M9656m0333j16854P7491P205q8347o0329Q8564
909f2056l1250k371J7260M6487Q414P6115m0130j2629K4603q1384O2313k9897
897b4525j2809M6254o0926m3313L0776M8366m5038l8775M2692J1460k4776L9679
885c0935O2659j09031J5834O1810P2066m9329q6190J46588k805p7151k7029J3070
$$ plain form
969 98646 10060 -56605 -86127 -29367 24691 -81641 -86781 -141317 -132259 9906 57998 93663
957 93663 -50163 37083 31240 57629 51842 26899 6742 20210 58009 -13809 -88608 -67099
945 -67099 -64216 -38304 -3478 -123430 -138704 -116953 -37499 -20734 37999 57242 74257 20965
933 20965 -20979 14466 40623 -69435 18935 66767 23496 76255 54697 14424 -25455 -79694
921 -79694 24995 50193 78309 20891 70547 30214 -86640 -9149 -1944 -90291 -150620 -62056
909 -62056 -93306 -95677 -78417 -31930 -23516 52599 12469 -160 24443 -56941 5372 -24525
897 -24525 -37334 8920 -52006 -95319 -64543 -16177 -61215 -99990 -57298 -45838 -70614 -30935
885 -30935 31724 -77307 -61473 337 72403 23074 -63116 83472 80667 3516 -23513 -10443
873a0443l4534Q0894q2693O0032N778r8623l7158j8976J14175O0153m834M7348
861H1119p537J46478o1419p3607j8718j30778J087J91532j13786q0020Q2042j10062
849i3669k5340M0956O9391N5097m6583r8645Q478J34283o1267K5074R4554o2318
837D0011L512P6576r6936j55469K5123n05J16404M1964O0152k3594j30619M4649
825A268Q5071K2693j60752k0715J22794j4189k6852m4616J33730l6676j8532j6403
813B6821j1624p9995R2669j9238o1335j0936l8136R4418O6990p5300p9081K8936
801f5811j4591P8233r2959l7967J20351R5116k3568j8523p5477J84867j35903
790A3768j27286O8605m0271k0682N1763R7514P356j14740J8301K5060n8460P9028
$$ plain form
873 -10443 -44977 35917 -46776 13256 19034 -79589 -116747 -135723 -21548 38605 33771 81119
861 81119 73582 220060 158641 85034 66316 -64462 -63375 128157 14371 -65649 16393 -93669
849 -93669 -119009 -78053 -8662 46435 -148 -98793 -90315 43968 -17299 7775 102329 40011
837 40011 43523 120099 23163 -132306 -107183 -107688 8716 50680 110832 87238 -43381 1268
825 1268 86339 109032 -51720 -72435 50359 36170 9318 -35298 98432 61756 43224 26821
813 26821 15197 -64798 27871 8633 -52702 -63638 -101774 -7356 59634 -15666 -94747 -65811
801 -65811 -80402 -2169 -95128 -133095 -12744 82372 58804 40281 -35196 149671 13768
790 13768 -113518 -44913 -85184 -105866 -54103 43411 50767 -63973 -45672 -20612 -79072 -44
778d4K1476j6732j7129j9299r321j1993P6653N4845j56931K0008J25282n1482
766A5333k3972J35167j63956R52J41674m438j01868Q0662R7883q0441p8929p6575
754e8508J18732l7417J3017J04915o5993J4831j5839j6061m0695n2545L2429r8099
742a01233l3354M2357O8452o736j7411J12452K722J7183o1505k1057L4791q132
730B8529r0623k4387R892o753J65352R9199o3114n6940q4632K7352J38554k7083
718A15346o8127L774m9405n28o1992Q447L222Q7343n0074j0281n0231J35120q946
705E3668P6461j06589k9855J39222n2455O8283n4578L1896M346j02095r868O8707
693H7143N4514n5624m362k5348l0043q8182P9198M3499o9282J26232N3060l6904
$$ plain form
778 -44 21432 4700 -12429 -31728 -41049 -53042 23611 78456 -78475 -58467 66815 15333
766 15333 -8639 126528 -37428 -36476 105198 100760 -1108 79554 177437 96996 18067 -58508
754 -58508 60224 22807 35824 140739 74746 89577 73738 57677 16982 -35563 -3134 -101233
742 -101233 -134587 -92230 -23778 -30514 -47925 64527 67249 84432 22927 1870 36661 28529
730 28529 -62094 -86481 -76589 -83342 82010 181209 118095 61155 -23477 3875 142429 115346
718 115346 47219 50993 1588 1060 -60932 -52485 -49263 38080 -11994 -22275 -72506 62614 53668
705 53668 130129 23540 -6315 132907 80452 148735 94157 126053 130399 28304 18436 87143
693 87143 141657 86033 81671 56323 26280 -61902 17296 60795 -8487 117745 170805 133901
681A33901j39006J4398j2090N2931o0655n0584k5979O4878O3628l5845N9962N1176
669A16715j28388J3056K4059K2195j22866R2103J6968N0025M7639k5207q9156
658A7143m6200L6596M5251k680m0193J08748j0783o325n1960N7417N45r8185J50426
645A59800r8120j39169P850J17986O8812j861p2040k3153J04017j43194k4367
634d3439J30862q875o6851k0374Q6217j64053N0921R0960O746n7126K9355j7788
622A6555j16821J28705R0506l6658j53809N6826l371O9313K9567l838M9972K8685
610A55632o1444j3551r4612R8263J07806o7072j56348P8428L1245j44306J20546
599E4587j6799J55702j38421j09287q429K2856J49764l8720n1145K0982n6168
$$ plain form
681 133901 -5105 9293 -2797 50134 -10521 -61105 -87084 -22206 41422 5577 65539 116715
669 116715 -11673 1383 25442 47637 -75229 16874 33842 83867 131506 106299 17143
658 17143 -29057 7539 52790 50110 9917 118665 107882 101557 49597 107014 107559 9374 159800
645 159800 61680 -77489 -69639 48347 117159 115298 43258 20105 124122 -19072 -43439
634 -43439 87423 78548 11697 -8677 77540 -86513 -35592 55368 62114 4988 34343 16555
622 16555 -100266 28439 118945 82287 -71522 -14696 -18067 51246 80813 76975 126947 155632
610 155632 94188 80637 -13975 84288 192094 125022 -31326 47102 78347 -65959 54587
599 54587 37788 193490 55069 -54218 -62647 -39791 109973 71253 20108 41090 -15078
588a5078L7419K3325J1490k6730j30294N3887N3940O4440Q0454K4673o9452Q3102
576A91176m2622o9795O4310m5591j42179R1615j21118l3322P1645J1829Q8788
565F4736p4322P770L2964k5250O9118l8359L1064J13058j12254q8253m8945J12673
553D4000R4432j68832K9629O8453n1883K6645L5190K7966j22672P8316O4202q1200
541D4246l575J38142j44359m8178J53570j28582m2594L6624M2835k9753M748k7221
529d097J08000Q9070k8973K8487j67197j36268J22842M1830o4957k6966l9414
518g7643L8550P2625J1583M0384n3219K7385j7962q0756K7320L6801r417O3187
506G8838O8608l2759l364n5040j37982M1262P3012J39229k7316k8319m8168l6717
$$ plain form
588 -15078 22341 45666 57156 30426 -99868 -45981 7959 72399 152853 177526 108074 191176
576 191176 148554 78759 143069 97478 -44701 46914 -74204 -107526 -35881 -24052 64736
565 64736 -9586 -1816 31148 5898 75016 36657 67721 180779 68525 -19728 -68673 44000
553 44000 138432 -30400 -771 67682 15799 42444 77634 105600 -17072 61244 125446 44246
541 44246 40671 178813 34454 -13724 139846 11264 -31330 5294 48129 18376 23124 -4097
529 -4097 103903 192973 164000 192487 25290 -110978 11864 53694 -11263 -38229 -77643
518 -77643 -39093 33532 45115 85499 32280 59665 41703 -39053 -11733 25068 15651 78838
506 78838 147446 114687 111323 56283 -81699 -40437 32575 171804 144488 116169 68001 31284
494C1284J16249k7709J9908p7414j18995k3769J97185M8235r9245r2402j1802
483c8475j6700N2960R0715l80N3442p2237n291O9253j00614l8123J10053p790
471I6813k1165M5693M4945p3909l2265j293R817p9205P10M6233r871L3706K4767
458H4976M060m0112r508K8400p7617p7280N7918J22753m7736o0810n2193R327
446e7822j7264O9894P4191J0162N201p7044K5432p079K9447j03218P0080J00243
434A22223o1461n983l7794N8800N7596m2416P1791j361p5124N3815l2429q5220
422B2437P8355L0827l8071o204m2004q2744K6339p9308o4407P6044J0871J44183
410G6318J0463r6972K7708O8496k2463o1700N6485Q8086k8129o3638O5889r4658
$$ plain form
494 31284 147533 119824 139732 62318 -56677 -80446 116739 164974 65729 -26673 -38475
483 -38475 -55175 -2215 88500 88120 141562 69325 64034 133287 32673 -5450 104603 96813
471 96813 75648 121341 166286 92377 60112 58819 68636 -10569 -9859 36374 26503 60209 84976
458 84976 89036 48924 39416 67816 -9801 -87081 -29163 93590 45854 -14956 -67149 -57822
446 -57822 -75086 -5192 68999 79161 84362 7318 32750 25671 55118 -48100 21980 122223
434 122223 60762 54779 16985 75785 133381 90965 162756 161395 86271 140086 107657 22437
422 22437 100792 131619 93548 87344 45340 -37404 -11065 -90373 -154780 -78736 -67865 76318
410 76318 86781 -10191 17517 86013 63550 1850 58335 146421 118292 54654 120543 25885
398B5885J28532M9348p2988l7181L885K1330k1320j11595L1657P5494k9138J38914
386B02823J02894m2818r2351l1582M5595q3702J4451j6481n2945p638M2303k458
374G8091L9673J505J2485O0169p1633j402K8131l3294r2102J7455L9813o2172
362A6719N385M8213j1703n2038o060N9898j9323o6917Q9112j0984K1937M7587
350A21826r406q0234j5306O0881N7246j1598L0334k4925j16327N2797o4918l1067
338c0697q2591M8924R3387p564l183Q5686L876l5507J14943j1151k4340j19697
326C2086O6584J7805k1756K7934k348k7689o0736O5584q9358N310M5351Q371n9934
313G204J22982N2438O5915p1717K6307J0588o0189O3089j7609m5037R162j85919
$$ plain form
398 25885 154417 203765 130777 93596 97481 118811 97491 -14104 17553 93047 63909 202823
386 202823 305717 262899 170548 138966 184561 100859 115310 98829 45884 38246 80549 78091
374 78091 117764 119269 131754 191923 120290 118888 147019 113725 21623 39078 78891 16719
362 16719 22104 70317 58614 6576 516 60414 41091 -25826 63286 52302 74239 121826
350 121826 112420 32186 16880 77761 135007 123409 153743 128818 12491 65288 370 -30697
338 -30697 -113288 -64364 29023 21459 18276 103962 107838 72331 187274 176123 151783 32086
326 32086 98670 116475 94719 122653 120305 92616 31880 97464 8106 13416 58767 67138 7204
313 7204 130186 182624 248539 176822 203129 213717 153528 216617 199008 153971 163133 -22786
301b2786N0242J50598p4454m6218k4116N2476J6068o8211O7307m046l5611K1044
289H2293M4382L5964l5792m9259p7250l7541P8040J38024L236p9376N5483m1077
277A17127j5216k8896K0582P4574J6030j950o6964n3682R5347j287n6691K2290
265A21264P2700l9067l9019N025j7169O6194K725o0744o4734j9613O6648k8491
253F5719k0945P9870m8848O9400j9757o0272L866l9376m92R1017Q3609L7451j45694
240I5548k25J863N3553j2270k8779J5743j4781N7291l2604k6736l7570K2965r4858
227h60K6559L7139k4812M2637k734J30452O924q5878M112p8093J5839M8061L8379
214A57725k5846p0402k4457R630l598l4899k0403Q0230R3259j43055l3560K4692
$$ plain form
301 -22786 27456 178054 103600 57382 33266 85742 101810 33599 100906 96860 61249 82293
289 82293 126675 162639 126847 77588 338 -37203 40837 178861 182097 102721 158204 117127
277 117127 101911 73015 93597 168171 184201 182251 115287 61605 156952 155665 98974 121264
265 121264 193964 154897 115878 120903 103734 169928 172653 111909 47175 27562 94210 65719
253 65719 44774 124644 75796 145196 125439 65167 69033 29657 29165 120182 203791 241242 95548
240 95548 95323 97186 150739 138469 109690 125433 110652 167943 135339 108603 71033 93998 -860
227 -860 25699 62838 38026 80663 77929 208381 215305 129427 133539 55446 71285 119346 157725
214 157725 131879 61477 37020 46650 43052 8153 -12250 67980 161239 18184 -15376 9316
202I316J6437M3415P0478K5617l0373l4259O5761L3253k6569j16246K4134l3160
190D7804Q1875J8952k9290O345n5364n6724J1784n623j6038P9376M2490j13816
178A1771o6437J65686L4897p6693M5433j2783n839L1783j48214q999J15802k4706
166F1701n5133q2779Q4872M792O8441Q0241k28M9248j2586j25223r787k615l959
153E6985O2495M7955M470QN2665L2455k0657k0515k6950n5290k6836L935n7239
140E3481m5553Q5511M1300L5562n1155L1863J4769q1725J7004P1536l8781M7897
128A81709r4355R5710k650m9825K6773K5306n4695K1482K3365l2196K5380k2069
116A43935J0194r293l5287J430k0774O2465O7795q9946p4349N8493M6842j15411
$$ plain form
202 9316 25753 69168 139646 165263 134890 100631 166392 199645 173076 56830 80964 47804
190 47804 129679 148631 119341 125686 70322 13598 25382 19759 3721 83097 125587 11771
178 11771 -54666 111020 145917 69224 114657 101874 96035 127818 -20396 -29395 86407 61701
166 61701 6568 -76211 8661 13453 81894 162135 161907 211155 198569 73346 63559 60944 56985
153 56985 119480 167435 171905 171913 224578 257033 236376 215861 188911 133621 106785 110720 53481
140 53481 7928 93439 134739 170301 119146 151009 165778 84053 101057 172593 133812 181709
128 181709 87354 183064 180414 130589 157362 182668 127973 149455 172820 140624 166004 143935
116 143935 154129 144836 109549 110979 90205 152670 220465 130519 56170 114663 161505 46094
104D6094O4779L3440n1487J0929L8025M0905p2350j6225L3462p0068o3516n085
$$ plain form
104 46094 110873 144313 92826 103755 141780 182685 110335 94110 127572 57504 -6012 -11097
$$ [...]
##END NTUPLES=NMR SPECTRUM
##END=
